##TITLE=1H_Pr 5-4-Pr-i
 CDCl3, 8 sc, 
 25.10.2019
##JCAMPDX= 6.0         $$ Bruker NMR JCAMP-DX V2.0
##DATA TYPE= NMR FID
##DATA CLASS= NTUPLES
##ORIGIN= UXNMR, Bruker Analytische Messtechnik GmbH
##OWNER= root
$$ XWIN-NMR		Version 3.5
$$ Fri Oct 25 14:41:19 2019 Russian Standard Time (UT+4h)  she@DPX200
##.OBSERVE FREQUENCY= 200.1315
##.OBSERVE NUCLEUS= ^1H
##.DELAY= (6, 6)
##.ACQUISITION MODE= SIMULTANEOUS
##.ACQUISITION SCHEME= undefined
##.AVERAGES= 8
##.DIGITISER RES= 18
##SPECTROMETER/DATA SYSTEM= spect
##.PULSE SEQUENCE= zg30
##.SOLVENT NAME= CDCl3
##.SHIFT REFERENCE= (INTERNAL, CDCl3, 0, 15.7039)
##AUDIT TRAIL= $$ (NUMBER, WHEN, WHO, WHERE, WHAT)
$$ ##TITLE= Audit trail, XWIN-NMR		Version 3.5
$$ ##JCAMPDX= 5.01
$$ ##ORIGIN= Bruker BioSpin GmbH
$$ ##OWNER= she
$$ F:/spectra/data/she/nmr/H-F/1/audita.txt
$$ ##AUDIT TRAIL=  $$ (NUMBER, WHEN, WHO, WHERE, WHAT)
(   1,<2019-10-25 14:40:23.60 +0400>,<she>,<DPX200>,
      <created by zg, POWCHK disabled, PULCHK disabled
       configuration hash MD5:
       00 E9 B6 7A A2 85 ED C7 34 08 36 98 17 FE 4E 26
       data hash MD5: 16K
       5B B5 63 13 A8 50 99 D7 97 FB AA 9F 3D 33 5C 3C>)
$$ ##END=
$$ 
$$ hash MD5
$$ B3 C0 B4 CF E9 B2 E6 FE B6 9C 5B A3 15 01 30 47
##$RELAX= 
##$RELAX= 
##$RELAX= 
##$RELAX= 
##$RELAX= 
##$RELAX= 
$$ Bruker specific parameters
$$ --------------------------
##$DU= <F:/spectra>
##$EXPNO= 1
##$NAME= <H-F>
##$PROCNO= 1
##$TYPE= <nmr>
##$USER= <she>
##$AMP= (0..31)
100 100 100 100 100 100 100 100 100 100 100 100 100 100 100 100 100 100 
100 100 100 100 100 100 100 100 100 100 100 100 100 100 
##$AQSEQ= 0
##$AQ_mod= 1
##$AUNM= <au_zg>
##$AUTOPOS= <>
##$BF1= 200.13
##$BF2= 200.13
##$BF3= 200.13
##$BF4= 200.13
##$BF5= 200.13
##$BF6= 200.13
##$BF7= 200.13
##$BF8= 200.13
##$BYTORDA= 1
##$CFDGTYP= 0
##$CFRGTYP= 5
##$CHEMSTR= <none>
##$CNST= (0..31)
1 1 145 1 1 1 1 1 1 1 1 1 1 1 1 1 1 1 1 1 1 1 1 1 1 1 1 1 1 1 1 1 
##$CPDPRG= <>
##$CPDPRG1= <>
##$CPDPRG2= <>
##$CPDPRG3= <>
##$CPDPRG4= <mlev>
##$CPDPRG5= <mlev>
##$CPDPRG6= <mlev>
##$CPDPRG7= <mlev>
##$CPDPRG8= <mlev>
##$CPDPRGB= <>
##$CPDPRGT= <>
##$D= (0..31)
0 1.2 0 0 0 0 0 0 0 0.06 0 0.03 0 0 0 0 0.0002 0 0 0 0 0 0 0 0 0 0 0 0 
0 0 0 
##$DATE= 1572000023
##$DBL= (0..7)
120 120 120 120 120 120 120 120 
##$DBP= (0..7)
150 150 150 150 150 150 150 150 
##$DBP07= 0
##$DBPNAM0= <>
##$DBPNAM1= <>
##$DBPNAM2= <>
##$DBPNAM3= <>
##$DBPNAM4= <>
##$DBPNAM5= <>
##$DBPNAM6= <>
##$DBPNAM7= <>
##$DBPOAL= (0..7)
0.5 0.5 0.5 0.5 0.5 0.5 0.5 0.5 
##$DBPOFFS= (0..7)
0 0 0 0 0 0 0 0 
##$DE= 6
##$DECBNUC= <off>
##$DECIM= 24
##$DECNUC= <off>
##$DECSTAT= 4
##$DIGMOD= 1
##$DIGTYP= 9
##$DL= (0..7)
0 120 120 120 120 120 120 120 
##$DP= (0..7)
150 150 150 150 150 150 150 150 
##$DP07= 0
##$DPNAME0= <>
##$DPNAME1= <>
##$DPNAME2= <>
##$DPNAME3= <>
##$DPNAME4= <>
##$DPNAME5= <>
##$DPNAME6= <>
##$DPNAME7= <>
##$DPOAL= (0..7)
0.5 0.5 0.5 0.5 0.5 0.5 0.5 0.5 
##$DPOFFS= (0..7)
0 0 0 0 0 0 0 0 
##$DQDMODE= 0
##$DR= 18
##$DS= 0
##$DSLIST= <SSSSSSSSSSSSSSS>
$$ [...]
##$SUBNAM2= <"">
##$SUBNAM3= <"">
##$SUBNAM4= <"">
##$SUBNAM5= <"">
##$SUBNAM6= <"">
##$SUBNAM7= <"">
##$SUBNAM8= <"">
##$SUBNAM9= <"">
##$SW= 24.0689530833862
##$SWIBOX= (0..15)
0 0 2 0 0 0 0 0 0 0 0 0 0 0 0 0 
##$SW_h= 4816.95568400771
##$TD= 16384
##$TD0= 1
##$TE= 0
##$TE2= 300
##$TE3= 300
##$TEG= 300
##$TL= (0..7)
0 120 120 120 120 120 120 120 
##$TP= (0..7)
150 150 150 150 150 150 150 150 
##$TP07= 0
##$TPNAME0= <>
##$TPNAME1= <>
##$TPNAME2= <>
##$TPNAME3= <>
##$TPNAME4= <>
##$TPNAME5= <>
##$TPNAME6= <>
##$TPNAME7= <>
##$TPOAL= (0..7)
0.5 0.5 0.5 0.5 0.5 0.5 0.5 0.5 
##$TPOFFS= (0..7)
0 0 0 0 0 0 0 0 
##$TUNHIN= 0
##$TUNHOUT= 0
##$TUNXOUT= 0
##$USERA1= <user>
##$USERA2= <user>
##$USERA3= <user>
##$USERA4= <user>
##$USERA5= <user>
##$V9= 5
##$VALIST= <valist>
##$VCLIST= <CCCCCCCCCCCCCCC>
##$VD= 0
##$VDLIST= <DDDDDDDDDDDDDDD>
##$VPLIST= <PPPPPPPPPPPPPPP>
##$VTLIST= <TTTTTTTTTTTTTTT>
##$WBST= 1024
##$WBSW= 4
##$XGAIN= (0..3)
0 0 0 0 
##$XL= 0
##$YL= 0
##$YMAX_a= 85978
##$YMIN_a= -169267
##$ZGOPTNS= <>
##$ZL1= 120
##$ZL2= 120
##$ZL3= 120
##$ZL4= 120
##$ABSF1= 10
##$ABSF2= 0
##$ABSG= 5
##$ABSL= 3
##$ALPHA= 0
##$AQORDER= 0
##$ASSFAC= 0
##$ASSFACI= 0
##$ASSFACX= 0
##$ASSWID= 0
##$AUNMP= <proc_1d>
##$AZFE= 0.1
##$AZFW= 0.1
##$BCFW= 1
##$BC_mod= 2
##$BYTORDP= 1
##$COROFFS= 0
##$CY= 11.3945322036743
##$DATMOD= 1
##$DC= 2
##$DFILT= <>
##$DTYPP= 0
##$F1P= 19.5091578491511
##$F2P= -0.509923556040331
##$FCOR= 0.5
##$FTSIZE= 0
##$FT_mod= 4
##$GAMMA= 1
##$GB= 0.15
##$INTBC= 1
##$INTSCL= 1
##$ISEN= 128
##$LB= 0.24
##$LEV0= 0
##$LPBIN= 0
##$MAXI= 10000
##$MC2= 0
##$MEAN= 0
##$ME_mod= 0
##$MI= 1.114404
##$NCOEF= 0
##$NC_proc= 0
##$NLEV= 6
##$NOISF1= 3.799351
##$NOISF2= 2.8
##$NSP= 1
##$NTH_PI= 0
##$NZP= 0
##$OFFSET= 15.70392
##$PC= 1
##$PHC0= -9576.549
##$PHC1= 23.40083
##$PH_mod= 1
##$PKNL= yes
##$PPARMOD= 0
##$PSCAL= 0
##$PSIGN= 0
##$REVERSE= no
##$SF= 200.130013532006
##$SI= 16384
##$SIGF1= 3
##$SIGF2= 2
##$SINO= 400
##$SIOLD= 16384
##$SREGLST= <1H.CDCl3>
##$SSB= 0
##$STSI= 0
##$STSR= 0
##$SW_p= 3612.71676300578
##$SYMM= 0
##$S_DEV= 0
##$TDeff= 0
##$TDoff= 0
##$TI= <>
##$TILT= no
##$TM1= 0
##$TM2= 0
##$TOPLEV= 0
##$USERP1= <user>
##$USERP2= <user>
##$USERP3= <user>
##$USERP4= <user>
##$USERP5= <user>
##$WDW= 1
##$XDIM= 8192
##$YMAX_p= 0
##$YMIN_p= 0
$$ End of Bruker specific parameters
$$ ---------------------------------
##NTUPLES= NMR FID
##VAR_NAME=  TIME,          FID/REAL,        FID/IMAG
##SYMBOL=    X,             R,               I
##VAR_TYPE=  INDEPENDENT,   DEPENDENT,       DEPENDENT
##VAR_FORM=  AFFN,          ASDF,            ASDF
##VAR_DIM=   8192,          8192,            8192
##UNITS=     SECONDS,       ARBITRARY UNITS, ARBITRARY UNITS
##FACTOR=    0.0002076,     1,               1
##FIRST=     0,             0,               0
##LAST=      1.7004516,     0,               0
##MIN=       0,             -169267,         0
##MAX=       1.7004516,     85978,           0
$$ Real data points
##PAGE= N=1
##DATA TABLE= (X++(R..R)), XYDATA
0 0 0 0 0 0 0 0 0 -8 8 -8 8 -8 16 -16 24 -24 32 -40 48 -56 64 -72 86 -97 113 -129 146 -169 190 -215 242
31 242 -271 303 -340 380 -425 473 -522 582 -644 714 -789 876 -968 1072 -1190 1322 -1472
48 -1472 1644 -1844 2079 -2362 2707 -3144 3711 -4482 5602 -7385 10673 -18786 81883 62068
62 62068 -101996 -16459 69676 60310 11644 41045 27707 -31195 -32435 58858 85978 17578
74 17578 -46640 -33666 -363 29993 43624 21092 -27152 -26925 5629 2143 -23587 766 25654
87 25654 -19161 -61402 -8304 52409 21636 -27622 -6604 10759 -29616 -30109 48740 69805 -18875
100 -18875 -66575 634 52095 16414 -8737 13215 -842 -40451 -5796 69056 56707 -25697
112 -25697 -49105 531 33712 25110 10372 -7095 -25049 -9310 26939 24698 -7554 -10639 1030
125 1030 -15009 -16870 28279 40699 -20127 -47141 13918 48478 -7824 -42839 6855 34429
137 34429 -14873 -36558 13539 33313 -13813 -31709 6103 13130 -18295 -14626 15813 5032
149 5032 -24205 -12125 11003 -1331 -14613 -2196 -2617 -23391 -13079 19814 11536 -25771 -22034
162 -22034 11052 9505 -9959 302 10071 -13378 -18859 20759 32536 -9847 -27336 7983 21537
175 21537 -4841 -4405 22377 8782 -26746 -8196 35965 21698 -24195 -19307 15207 9098 -12732
188 -12732 810 14329 -9480 -25122 -996 13291 -5954 -14989 -2483 -5886 -18267 -4315
200 -4315 13668 -4096 -25292 -9490 7225 -8353 -15594 7257 10047 -21395 -23501 11733 17240
213 17240 -13830 -16019 8696 2516 -18825 -2257 23314 2812 -26867 -9068 18442 3327
225 3327 -16940 -352 12080 -10812 -20686 6441 16524 -8917 -19340 -477 3977 -9778 -5235
238 -5235 6905 -3936 -17820 -5491 6713 -4437 -11007 1164 665 -16140 -10097 12924 6481
251 6481 -19919 -13483 11755 3216 -17793 -5244 14451 -2954 -22070 -2064 17226 -2382 -20310
264 -20310 -2166 12721 -4234 -14609 2059 9124 -7181 -10387 5723 5535 -8724 -5155 7487
277 7487 1755 -7122 1013 6724 -3801 -5066 9031 7480 -7986 -4436 12803 7973 -9178 -1573
291 -1573 15128 4492 -11965 1320 17301 3101 -12318 3168 15689 -728 -10834 5767
303 5767 14127 -2258 -9587 4768 10016 -2210 -3981 6300 4607 -5837 -2039 8044 4070 -4379
317 -4379 244 4048 -1747 -1405 7632 4027 -7247 -3430 8855 4715 -5993 -339 8383 -258 -8757
332 -8757 2584 12242 -344 -10848 935 10171 -875 -7393 3584 6796 -4911 -6875 4639
345 4639 6138 -3885 -4749 2700 1426 -4597 -968 4132 -1288 -6057 -542 2771 -2609 -3650 2222
360 2222 296 -7000 -2964 4866 -120 -7645 -2793 3455 -2675 -7310 349 4361 -4529 -8863 312
375 312 4583 -4315 -7327 1220 2855 -5390 -5707 2431 1939 -5902 -4668 1947 472 -3908 -2039 1255
391 1255 -1416 -3427 -246 1129 -1991 -2528 1015 111 -3312 -1258 2593 -232 -4273 177 3447 -472
407 -472 -3552 1428 3251 -944 -2160 2097 3555 -881 -1560 3042 3904 -461 -423 3789 3493 -500 531
424 531 3999 2802 390 1163 3277 2051 885 2031 2193 1316 1122 1474 1352 970 1170 958 -175 -268
442 -268 909 1188 -924 -1673 362 1528 -902 -1570 467 396 -956 -630 505 358 -461 -1080 297 1360
460 1360 402 -1178 151 1679 1131 -471 -145 976 989 159 491 1299 262 -1392 -336 1866 298
477 298 -2457 -1464 1171 -503 -2683 -932 -663 -2268 -2956 -715 -933 -3064 -3591 -1385 -1009 -3229 -3365
494 -3365 -1772 -2579 -3668 -1569 -217 -3506 -5300 -899 371 -3602 -4575 -545 -352 -4201 -3196 468
510 468 -689 -4834 -2575 1998 -169 -4859 -2614 1627 -846 -4020 -445 1765 -2505 -3557 1678
525 1678 2012 -3056 -2669 2320 2024 -2369 -905 2678 1096 -2416 1270 4594 -155 -3090 2608 5129
541 5129 -841 -2426 3438 3858 -1911 -492 4895 2077 -3655 49 5617 1288 -4120 112 4484
556 4484 -503 -3696 2119 4212 -2146 -3762 3474 4280 -3334 -2859 4687 3051 -3447 -498 5794 2040
572 2040 -2569 1868 5666 181 -1581 5032 6168 -1611 -1877 6258 6153 -1652 165 7138 3148 -3531
588 -3531 2329 9108 1664 -5653 1735 7585 966 -3909 2265 4602 -2557 -3198 4765 3412 -5409
603 -5409 -3368 5108 1759 -5870 -1251 4834 -1442 -6517 1565 5183 -3477 -5964 3461 4852 -4545
618 -4545 -4700 4737 3753 -4956 -2076 5262 732 -5034 2264 7933 -2238 -7791 3145 8506 -1786
633 -1786 -5445 3664 5197 -4172 -2515 8077 4473 -7593 -3770 8390 5476 -4447 -1892 4881
647 4881 -93 -2732 5602 6376 -5037 -5431 7332 7415 -4248 -3050 7014 2831 -5954 1011 10663
662 10663 879 -9207 1095 10868 1071 -7370 2148 8464 -1606 -5082 5101 5961 -4747 -2161
676 -2161 8355 3351 -7689 -560 10233 2794 -6791 836 8420 -415 -4201 6897 8761 -5138
690 -5138 -6187 9353 10958 -2916 -4323 6718 4254 -3329 4140 10792 -1044 -10052 3336 13212
704 13212 1495 -7570 2264 6696 -3427 -4132 8200 5870 -9202 -6864 8376 5739 -7166 -4102
718 -4102 5414 -739 -7655 1541 6690 -5230 -8719 3715 5943 -7860 -7926 6741 5213 -9746
732 -9746 -6822 7128 2681 -9353 -2566 8127 -1588 -12348 -251 9923 -1251 -10146 -881
745 -881 3963 -4874 -3931 6033 1503 -11666 -5520 8719 3193 -10125 -4684 5634 -2943 -9397 2590
760 2590 7628 -7060 -12818 2910 8331 -5741 -9128 2963 2795 -7957 -4825 6493 542 -11095
774 -11095 -3022 8086 -931 -9887 -255 6717 -4088 -8276 3014 5259 -6483 -5873 5929 3049
788 3049 -8908 -3960 7682 1804 -8518 -1178 7338 -2011 -8244 3818 8610 -5224 -8876 6014
802 6014 9317 -5503 -7182 6722 6210 -6128 -3035 8441 2617 -7567 -946 8885 1306 -6123
816 -6123 1584 6419 -2243 -4007 5990 4420 -6912 -3830 8687 4093 -8164 -2183 8974 1125
830 1125 -8386 1222 9279 -2224 -9489 3168 9487 -3040 -8355 3660 6461 -5263 -5018 6171
844 6171 3736 -7096 -2862 6980 1266 -6311 -60 5992 -2476 -5910 3473 5636 -4781 -5241 4981
859 4981 3946 -7131 -3375 7434 1361 -9356 -1895 8411 19 -9206 45 7121 -3457 -8823
873 -8823 3052 6890 -4666 -8047 3386 5162 -5165 -4784 4270 1161 -7568 -2076 6084 -369
887 -369 -7440 -60 4572 -3414 -5269 4503 3655 -7372 -5400 6426 4089 -7195 -3801 6012 1072
902 1072 -7624 -90 8177 -948 -9224 673 7629 -1492 -6021 3057 4977 -4674 -4310 6058 4571
917 4571 -5212 -3025 5171 2094 -4291 1044 6252 -1662 -5686 3079 7266 -2172 -4218 4714 4370
932 4370 -4856 -2028 7846 3905 -6572 -2313 7426 3170 -5164 1023 6915 -1066 -6137 3321 8139
947 8139 -1034 -4963 2951 4719 -2635 -1592 6088 2727 -5879 -1394 6708 2038 -4277 737 4964
962 4964 -2225 -4668 4321 6063 -3377 -5690 3507 4936 -3965 -2365 5296 1352 -6884 -746 7430
977 7430 1205 -6405 -809 4619 -1706 -4592 2917 4758 -4129 -5846 3195 4185 -3512 -3368 2957 328
993 328 -5817 -273 5752 -417 -6877 -410 3854 -2253 -4259 2387 2652 -5468 -5110 3709 3337 -4893
1009 -4893 -3975 2951 556 -5262 -966 5155 -1195 -7048 -705 4176 -1571 -4195 1337 2005 -4713
1024 -4713 -3514 4018 2629 -4805 -3281 3166 786 -4041 -108 4222 -1339 -5537 1185 5367 -1098
1039 -1098 -4098 1537 2604 -3119 -1720 4507 2543 -4614 -2108 4807 2151 -3074 605 4194 -833
1054 -833 -3394 2778 5394 -975 -3431 2641 3786 -1531 -767 4661 2190 -3474 -456 5091 1994
1069 1994 -2629 535 3826 -137 -2361 2879 4570 -1470 -3025 2579 3808 -1366 -1140 3137 1556
1084 1556 -3078 9 4342 832 -3138 78 3250 -390 -1949 2142 2989 -2299 -2423 3062 3240 -1966
1100 -1966 -1460 2768 1486 -2853 -305 3875 245 -3297 -15 3041 -461 -2414 1104 1766 -2406
1115 -2406 -2524 2017 1739 -2634 -2443 1711 282 -3047 -369 2279 -1262 -3668 -304 1901 -1031 -2733
1131 -2733 44 580 -2259 -2018 1720 453 -3080 -1913 1549 347 -2626 -828 1042 -1227 -2783
1146 -2783 102 1862 -1113 -2991 481 1096 -1319 -1544 939 626 -1735 -1097 1706 293 -1874 -112
1162 -112 1668 -698 -1644 672 1881 -982 -1292 982 1585 -766 -330 1642 723 -1508 -274 1777
1178 1777 1072 -656 191 1662 122 -521 1167 2037 -419 -875 1640 1702 -182 -11 1367 1169 -485
1195 -485 730 1564 841 -341 428 1750 945 133 1039 1237 309 557 1909 1246 55 321 1437 907
1213 907 -126 655 1717 537 -423 594 1231 490 29 780 1241 181 -143 678 839 -266 -184 680
1231 680 257 22 195 151 -366 -347 -150 354 -303 -307 -904 -201 -296 -112 -623 -561 -625 -213 -229 -651 -607 -595 -514 -391
1255 -391 -457 -685 -733 -503 -675 -731 -350 -484 -527 -826 -448 45 -576 -1348 -367 65 -474 -934 -381 137 -326
1276 -326 -1092 -224 109 -798 -672 410 215 -1318 -876 669 131 -939 -27 516 -482 -913 335 539
1294 539 -324 -1325 477 800 -121 -444 755 265 -811 101 1207 257 -1212 57 1484 416 -1031
1311 -1031 823 1453 -267 -392 1305 1529 -482 -569 1754 1526 -1025 -292 1658 1199 -813 510 2025
1328 2025 -94 -869 1173 2138 -650 -1024 1772 1827 -447 -491 1327 1012 -1369 -293 2231 556 -1827
1345 -1827 -65 2266 190 -1838 456 1192 -1205 -1382 1909 1394 -2263 -1630 2266 1033 -2108 -1148
1361 -1148 1868 -77 -2448 -43 1809 -630 -2791 386 1771 -1159 -2106 776 710 -2139 -1427 1420
1377 1420 52 -3013 -899 1835 -313 -3331 -602 2244 -1383 -3249 378 1693 -2404 -2776 1413
1392 1413 1081 -2845 -2024 2130 506 -3160 -1212 1923 -656 -2906 88 2207 -1479 -3634 755
1407 755 2388 -1469 -3161 1319 1703 -2608 -1437 2568 499 -3073 -866 2658 467 -2641 268
1422 268 2363 -697 -2569 1811 2554 -1680 -2125 2549 2486 -2557 -1440 3430 1479 -2844 -183 3803
1438 3803 578 -2677 893 3601 -185 -2235 1708 3154 -1131 -1657 3089 2552 -1970 -692 3207
1453 3207 1542 -2683 239 4120 866 -2874 739 3414 -464 -2019 2123 2899 -2033 -1758 3533
1468 3533 2725 -2526 -1260 3210 951 -2704 266 3823 -134 -3631 870 3823 -779 -2990 1237
1483 1237 2628 -2101 -2008 2601 1815 -2805 -1879 3017 847 -2940 -399 2676 -944 -3665 934 3223
1499 3223 -1878 -3380 1286 2008 -3175 -2251 2613 994 -3587 -2017 2885 563 -3613 -504 2530
1514 2530 -1578 -4018 1113 2852 -1810 -3709 817 1810 -2417 -1962 2122 829 -4022 -1479 3207
1529 3207 269 -3368 -904 1662 -1245 -3016 1638 2906 -2373 -3690 1747 2556 -2118 -1432 2715
1544 2715 718 -3807 -637 4058 632 -3620 -76 3062 -290 -2439 1814 2746 -2019 -2657 2489
1559 2489 2882 -1869 -1131 2941 577 -2935 729 4349 -50 -3510 695 3781 -298 -2206 2328
1574 2328 2655 -2606 -2111 3272 3241 -2016 -1613 2939 1181 -2151 1112 4257 -265 -3456 1111 4026
1590 4026 -59 -1868 2060 2294 -2466 -1221 3750 2306 -3016 -1696 2906 1070 -2272 1263 3580
1605 3580 -1303 -3898 1535 4017 -810 -2827 1323 1773 -2643 -1502 3344 1732 -3813 -1929 2770
1620 2770 1212 -2442 59 2224 -1669 -3378 1699 3362 -2043 -3453 1351 1247 -2539 -1467 3141
1635 3141 479 -4208 -1420 3518 632 -3408 -680 2507 -1461 -3215 1720 2839 -2818 -3733 1318
1650 1318 2047 -2438 -1519 2153 51 -3887 -841 3928 413 -3545 -607 2055 -1183 -2226 1782
1665 1782 2269 -3093 -3353 2593 2472 -2402 -1526 2562 8 -3534 253 3999 219 -4025 76 2857
1681 2857 -101 -2225 1962 2390 -2270 -2071 2907 2819 -2382 -1373 2493 1072 -2097 992 3613 -717
1697 -717 -3107 1167 3688 -234 -2190 2136 2110 -2072 -1362 3599 2404 -2624 -996 3440 1650 -2146
1713 -2146 662 3400 -751 -3100 1555 3890 -463 -2004 1528 2242 -1714 -1037 3142 1364 -3369
1728 -3369 -1168 3371 1122 -2090 165 2820 -1040 -2542 1612 2812 -1628 -2688 1621 1819 -2124
1743 -2124 -1140 2420 499 -3094 -910 2808 284 -2928 -168 2001 -1210 -2712 1144 2409 -2129
1758 -2129 -2744 1524 1603 -2249 -1415 1848 -176 -3428 -630 2544 -266 -3435 -248 2112 -1064 -2560
1774 -2560 1045 1518 -2512 -2482 1796 1564 -2445 -1600 1567 195 -2553 -390 2163 -611 -2844 60
1790 60 2311 -614 -2382 1146 1335 -2114 -1986 1941 1759 -2479 -1326 2063 651 -1610 -98 2232
1806 2232 -207 -2214 675 2538 -653 -1739 1102 1619 -1162 -785 2382 1301 -2325 -738 2696
1821 2696 995 -1749 281 2382 -239 -1574 1455 2532 -1071 -1493 1524 2239 -1059 -849 2207 925
1837 925 -1606 -210 2593 1063 -1604 402 2709 -171 -1437 1252 2234 -742 -1395 1447 1610 -980
1853 -980 -766 1703 979 -1633 -230 2164 797 -1825 328 1828 -529 -1708 846 1417 -1343 -1735
1869 -1735 1437 1350 -1376 -1248 1041 287 -1667 -496 1287 -503 -2156 -111 1468 -548 -1955 399
1885 399 979 -1651 -1806 973 530 -1819 -1263 1211 462 -1632 -648 911 -578 -1993 -71 1064 -1087
1902 -1087 -1716 356 551 -1298 -841 736 513 -1449 -1117 1238 226 -1722 -499 1099 -620 -1135
1918 -1135 12 896 -683 -1637 482 740 -936 -812 745 299 -1237 -317 1465 379 -845 -133 1193
1935 1193 131 -917 458 1032 -370 -740 967 1276 -354 -349 849 947 -581 150 1484 426 -620
1952 -620 352 948 325 -174 345 1074 -185 14 1185 967 -278 -96 679 867 -88 243 889 605 -870
1971 -870 310 1464 1 -194 376 905 -24 -208 768 691 -303 -532 664 598 -12 -375 688 232 -401
1990 -401 -19 815 -207 -644 46 679 -263 -212 216 232 -652 -460 109 -11 -283 -341 286 159 -521 -101 -181
2011 -181 -555 -540 -644 -316 -204 -564 -269 -620 -736 -484 -580 -172 -647 -586 -280 33 -459 -521 -115 -273 -553
2032 -553 -527 -196 -337 -624 -518 -146 -183 -18 -424 -238 -278 -129 -462 119 -209 -524 -173 64 77 -101 -126 184
2054 184 108 -306 57 255 186 -247 31 335 303 -148 382 601 60 -157 809 754 -73 7 394 517 -428 219
2076 219 644 264 -479 362 777 496 -132 279 968 293 -96 715 1256 -140 -138 698 797 -140 -111 821 571
2097 571 -298 450 1406 155 -726 487 1105 3 -449 697 767 -403 -182 830 694 -499 -105 864
2115 864 98 -304 119 588 -363 -656 300 1043 -434 -853 348 519 -913 -735 535 347 -1141 -644
2133 -644 575 -146 -1208 -537 567 -197 -1030 -43 595 -533 -1153 275 162 -1031 -656 452 212 -1418
2151 -1418 -694 930 -2 -1677 -310 514 -319 -1343 -144 688 -547 -1202 501 435 -892 -560 573
2168 573 104 -1311 -317 604 -32 -1104 -140 782 -172 -1219 304 739 -911 -891 816 844 -396 -753
2186 -753 968 491 -657 -198 1046 221 -1119 142 1354 123 -890 702 1278 -795 -922 1109
2202 1109 1059 -1051 -362 1288 496 -810 146 1411 215 -748 364 1481 -96 -558 1114 1386 -341
2219 -341 -513 1433 1094 -712 -266 1531 456 -933 -23 1688 -67 -773 756 1405 -230 -1172 992
2236 992 1007 -747 -749 1513 1113 -1021 -213 1533 183 -1163 -75 1300 -66 -1317 440 1174 -646
2253 -646 -1549 855 642 -1493 -1065 992 338 -1401 -739 751 -38 -1696 15 1567 -558 -1586 78
2270 78 531 -1020 -1355 618 630 -1461 -1175 1062 234 -1796 -636 833 -474 -1847 -305 1557 -744
2287 -744 -1702 389 1137 -1256 -1418 762 685 -1826 -1113 1241 319 -1728 -279 1518 19 -1729 -45
2304 -45 1637 -630 -1609 795 1335 -787 -1036 1393 846 -1327 -530 1699 652 -1597 -195 1883 254
2321 254 -1425 934 1748 -399 -1079 1314 1739 -881 -794 1429 1111 -1236 -68 1999 691 -1391 -187
2338 -187 1907 115 -1369 638 1949 -52 -1234 988 1609 -1101 -860 1836 1151 -1227 -82 2128
2354 2128 399 -1601 404 2001 298 -1484 637 1696 -890 -1334 1366 1572 -1216 -974 1592 716
2370 716 -1562 -572 1651 130 -2155 -64 1974 -494 -1810 509 1247 -923 -1316 1097 1356 -1554
2386 -1554 -1051 1247 427 -1672 -672 1498 60 -1980 108 1573 -641 -1996 -193 1400 -1186
2401 -1186 -1457 962 799 -1821 -1290 1343 399 -1566 -847 1102 -56 -2029 260 1488 -761 -1978
2417 -1978 292 1240 -1008 -1503 743 865 -1772 -1075 1563 745 -1801 -550 1524 111 -1670 286
2433 286 1497 -981 -1834 536 1801 -1210 -1138 1003 591 -1401 -882 1631 527 -1441 -412 1876
2449 1876 29 -1564 802 2106 -619 -1644 1276 1679 -669 -1186 1348 1013 -1246 -543 1901 702
2465 702 -1513 238 2180 -62 -1156 532 1702 -553 -1404 1299 1767 -550 -1016 1399 970 -1259
2481 -1259 -258 2002 753 -1404 32 1729 1 -1469 505 1586 -595 -1389 1271 1339 -955 -1192
2497 -1192 1313 849 -1112 -331 1340 233 -1378 297 1526 -184 -1643 455 909 -1045 -1305 871
2513 871 1001 -1537 -1390 1168 501 -1629 -259 1196 -405 -1561 -255 1314 -433 -1640 41 1023
2529 1023 -1067 -1423 869 928 -1846 -1257 1363 453 -1630 -618 1030 -321 -1944 -113 1239 -589
2545 -589 -1678 442 919 -908 -1247 933 500 -1496 -689 1195 516 -1540 -332 1273 86 -1607
2561 -1607 249 1370 -482 -967 574 1142 -658 -830 991 850 -1228 -218 1503 987 -1187 28
2577 28 1672 46 -1093 621 1292 -397 -1113 683 1397 -471 -765 1377 863 -693 -213 1647 588
2594 588 -884 -78 1463 360 -855 505 1215 -192 -827 1354 1227 -644 -733 1006 630 -873 175
2611 175 1285 446 -810 171 1098 109 -748 496 898 -234 -745 880 984 -747 -669 895 666 -1122
2629 -1122 -212 1017 -3 -1104 -306 969 -296 -1246 -63 752 -532 -618 173 789 -1163 -926 907
2646 907 489 -1163 -567 614 -282 -1268 -78 628 -659 -1062 43 367 -392 -886 309 329 -865 -740
2664 -740 413 297 -1006 -396 866 59 -1042 -22 959 -624 -813 -188 789 -377 -732 548 412
2681 412 -773 -612 530 108 -685 -673 593 144 -617 -251 611 -26 -469 170 689 -392 -555 260 424
2700 424 -569 -248 622 503 -284 -136 1044 300 -357 200 731 -82 -358 600 969 -376 -302 584 542 -453
2720 -453 -198 538 557 -191 44 616 594 -457 181 929 36 -147 107 514 208 67 355 596 56 93 409
2741 409 396 151 60 552 89 -403 151 286 107 -330 468 305 -330 -199 128 133 -175 -5 108 81 -378 -52
2763 -52 144 -151 -347 62 -45 -32 -417 -274 412 -263 -294 -8 -86 -615 -206 -76 -437 -180 8 -18 -330 -325
2785 -325 -116 -479 -307 -447 -174 67 -283 -394 -297 -268 -271 -265 -5 -3 -172 -208 -129 -156 -87 49 -54 34 -103 67
2809 67 -168 5 -266 -136 27 64 -1 -176 -64 263 -33 -10 235 257 -143 -102 83 238 -90 -21 -72 176 104
2832 104 177 139 -40 -51 247 150 237 347 224 347 411 -9 251 301 310 9 374 268 93 429 378 213 70
2855 70 133 211 323 382 156 123 78 -123 627 377 69 29 348 298 -195 -67 566 191 -9 97 562 -191 -152
2878 -152 195 122 -48 -127 121 66 -199 -219 114 40 -418 -305 464 -298 -341 11 126 -110 -515 -15 137 -302
2900 -302 -335 155 13 -195 -336 -21 47 -414 -502 -53 -353 -427 -149 -8 -508 -663 -32 -6 -405 -657 259 49
2922 49 -488 -65 235 -219 -394 -233 300 -137 -525 -62 245 -100 -277 189 345 -745 -492 478 49 -613
2942 -613 -190 279 113 -396 135 446 -71 -229 305 333 332 -203 351 287 -567 0 544 197 -385 197 733
2963 733 -49 -391 245 820 5 -396 284 591 -104 -133 677 647 -314 41 501 452 -586 240 988 271 -422
2984 -422 529 518 178 -414 665 613 -227 -243 698 552 -396 77 1140 467 -404 123 972 -5 -753 380
3004 380 782 -291 -734 612 551 -372 -313 471 579 -525 -226 704 178 -603 77 497 -342 -857 -42 610
3024 610 -388 -871 279 403 -917 -946 753 170 -786 -572 714 40 -1167 -241 533 -314 -989 175
3042 175 648 -235 -918 430 206 -892 -537 431 101 -1105 -70 835 -356 -874 2 474 -242 -1033
3060 -1033 -40 450 -648 -491 264 80 -814 -603 552 402 -918 -124 869 -17 -677 -69 788 -235
3078 -235 -640 280 688 -228 -434 534 506 -261 -71 479 517 -743 286 843 330 -536 338 1075 -141 -519
3098 -519 495 842 8 -127 759 609 -619 -125 1167 297 -486 190 789 -80 -713 385 1021 -119
3116 -119 -659 512 749 -494 -339 901 466 -660 -383 895 325 -443 91 1032 186 -1003 369 691
3134 691 -535 -968 538 735 -561 -596 770 546 -741 -455 640 99 -860 -40 806 -34 -839 403
3152 403 908 -678 -735 718 588 -744 -414 766 -59 -1151 -639 999 -64 -966 -156 1054 -107
3169 -107 -958 -69 613 -746 -1098 267 431 -823 -595 578 186 -833 -156 713 -62 -1069 -290 564
3187 564 -183 -636 330 444 -396 -822 620 640 -789 -461 1012 423 -750 -13 901 212 -1203 67
3205 67 864 -273 -589 280 616 -339 -506 930 871 -406 -430 854 446 -840 84 846 -153 -926 117
3224 117 1223 -104 -936 390 1077 -195 -363 942 674 -641 -241 980 487 -505 -109 1077 160
3241 160 -828 697 994 -406 -488 440 963 -385 -296 704 299 -833 -573 1226 422 -870 -243 860
3259 860 176 -769 210 868 -362 -865 592 712 -567 -520 377 323 -532 -640 802 261 -758 -124 655
3278 655 -280 -1032 178 548 -726 -1131 220 701 -725 -735 487 300 -697 -437 482 221 -920 -397
3296 -397 703 -503 -1033 233 407 -716 -698 456 521 -704 -715 175 232 -857 -299 861 -188 -728
3314 -728 -290 460 42 -1010 195 459 -612 -432 584 582 -311 -483 542 284 -554 -189 682 305 -556
3333 -556 55 837 -112 -470 458 721 -344 -395 480 544 -580 -185 804 410 -371 -268 1186 282 -763
3352 -763 149 1053 -79 -369 227 601 -86 -482 719 824 -197 -99 769 562 -330 75 907 -172 -508
3371 -508 190 736 2 -679 289 897 -119 -504 451 354 -576 -348 584 269 -595 -56 622 -4 -418 408
3391 408 467 -46 -484 473 628 -499 -494 314 389 -422 -191 232 146 -873 -151 534 -158 -720 -281 559 -367
3412 -367 -775 563 145 -416 -509 351 283 -246 -390 101 199 -589 -343 212 -252 -545 -30 272 -9 -493 264
3433 264 -40 -801 -414 253 -82 -513 -147 161 -15 -447 -82 410 61 -438 195 291 -316 -376 80 237 -418
3454 -418 -80 176 100 -189 102 356 316 -27 -253 237 -106 -260 81 461 -62 -130 162 182 -238 -87 685
3475 685 182 -225 69 600 27 -34 29 428 -4 -225 433 524 178 -47 274 217 127 -235 536 416 -103 26
3497 26 486 -134 -320 280 175 -236 -236 449 311 28 -255 36 475 -214 -69 132 206 -193 61 359 126
3518 126 -89 214 361 -145 99 312 -212 -406 -275 192 53 -136 -92 85 -13 1 -4 83 -133 -217 -47 -278
3540 -278 -648 -33 6 -58 -286 -128 128 23 -143 -258 67 -412 -272 -126 22 -154 -497 -5 -124 -28 -9
3561 -9 -3 121 -130 -18 -74 -212 -20 -119 99 -288 -51 -195 -122 -69 -254 -18 156 -119 -271 -113 -77 140 -146
3584 -146 213 194 -219 168 -147 27 -210 31 35 105 14 160 480 -171 375 302 203 32 54 20 97 171 176 389
3608 389 403 86 109 42 327 95 290 225 -106 183 120 -72 34 -95 -111 363 -55 228 41 255 314 37
3630 37 -22 236 32 -87 -22 406 220 -48 -81 287 -49 -103 4 -75 -38 -61 -17 -46 23 -134 -55 43 -60 -174
3654 -174 -28 -36 -166 78 135 -30 -312 3 -30 -333 -191 -325 -437 -91 -147 315 159 -525 -379 -90 -74 -323
3676 -323 -279 -273 65 -375 -238 403 -139 -225 -66 68 -240 -382 -198 -114 -85 -173 109 -43 -282 -204 67 287 -250
3699 -250 149 165 -242 -540 -55 39 -428 -100 89 186 -224 -78 138 181 -357 -136 228 4 -300 212 523
3720 523 -101 -171 41 234 -61 -326 186 81 288 76 332 157 -50 277 430 438 -128 263 415 60 -408
3741 -408 248 258 -396 109 566 67 -138 65 599 187 -198 -130 473 44 39 61 408 84 -516 90 320 -142
3763 -142 -254 209 233 -55 -411 208 228 -168 -29 271 296 -468 -3 244 -504 -104 294 291 -269 -205 283 351
3785 351 -222 94 321 54 -447 -38 339 -277 -319 -191 111 -76 -420 101 97 -159 -368 421 208 -598 -533
3806 -533 278 86 -642 -122 495 -392 -705 -14 42 -107 -459 51 296 -396 -211 70 130 -587 36 507 12
3827 12 -301 25 396 -323 -391 72 170 -152 -230 317 404 -135 -100 95 229 -508 -341 754 184 -145 131 243
3849 243 33 -335 118 416 -383 -213 71 247 -247 14 701 407 -536 -7 579 89 -274 60 388 -31
3869 -31 -67 470 459 -22 -166 610 437 -282 -347 639 394 -679 266 600 -1 -213 266 697 201 -261 461
3890 461 532 -250 -284 663 553 -234 -306 556 242 -531 -148 510 38 -888 -178 130 -463 -582 237 394 -212
3911 -212 -726 175 318 -455 -456 143 -104 -438 -217 476 -131 -575 -259 444 -306 -416 18 225 -410 -481 139
3932 139 293 -819 -623 274 -174 -437 -68 256 -26 -701 -113 544 -254 -620 117 585 -578 -430 467
3951 467 162 -573 -420 643 101 -556 -73 522 52 -397 53 722 -396 -409 402 359 -75 5 384 506
3971 506 -383 -208 499 185 -452 -72 317 -132 -148 343 463 -82 -409 264 356 -169 72 516 452 -234 42
3992 42 599 143 -348 291 510 53 -181 221 596 -171 -295 277 502 -200 -268 774 212 -145 74 333
4012 333 323 -271 54 570 372 -336 257 366 -217 -443 131 401 -461 -307 336 307 -328 -149 288 92 -322
4033 -322 50 263 -16 -313 226 21 -813 -451 332 479 -293 -611 34 170 -389 -1 376 -170 -554 144
4053 144 246 65 -322 -35 607 -171 -286 398 30 -333 -281 344 -44 -488 -9 257 -131 -596 -68 636
4073 636 -161 -380 242 194 -428 -202 141 84 -214 -67 230 -153 -478 -184 123 -72 0 -100 261 78 -274
4094 -274 268 339 -203 -8 118 141 -371 -188 444 216 -361 144 642 52 -514 343 307 -60 -71 386 433 -326
4116 -326 -266 384 579 -241 -109 464 313 -301 -251 271 160 -307 179 206 -288 -233 460 182 -361 -200 450
4137 450 263 -220 15 487 207 -301 -189 316 -15 -468 -247 350 -121 126 421 123 -294 -78 430 184
4157 184 -284 67 209 -393 -485 -280 160 1 -306 -105 35 -152 -204 241 166 -267 -290 190 18 -606 -25
4178 -25 201 -126 -141 -98 198 -368 -411 11 392 -545 -284 33 -46 -308 -48 100 -128 -372 -179 68 -301 -161
4200 -161 174 94 -167 26 182 108 -471 -192 189 98 -581 -316 37 -172 -346 155 165 34 -460 -126 64
4221 64 228 -311 346 177 -223 24 379 -20 18 -60 205 292 -316 94 58 26 -71 408 208 -177 -279 341
4243 341 100 -93 -396 420 389 -43 -50 102 348 -263 255 236 -60 -251 146 161 -119 80 285 295 -57 43
4265 43 216 23 -195 -4 139 -17 1 138 78 -56 200 221 132 -81 -65 30 -7 -75 149 26 344 -336 -31
4288 -31 101 146 -7 -49 255 -176 -190 -190 144 -63 33 276 26 -260 52 -38 13 -364 27 44 36 -204 -167 121
4312 121 -267 -249 76 21 61 -208 -141 -103 64 -25 -309 -63 60 -50 106 -260 -216 -340 94 -150 -397 -335 -83
4335 -83 -121 75 127 -43 110 -176 -253 288 -166 115 270 -150 -205 -15 4 290 68 100 -29 50 109 -107 -223
4358 -223 64 22 26 114 51 74 204 169 372 258 154 296 127 -21 293 233 199 111 -129 -119 0 38 387 -21
4382 -21 211 96 -119 39 445 43 151 434 43 285 -95 334 45 -99 108 206 -17 114 -102 145 74
4403 74 148 -122 72 129 83 239 -150 -20 98 46 287 243 155 91 -22 36 -55 189 -276 156 71 -135 -217 -234
4427 -234 -86 -52 36 4 -276 -74 111 56 -65 -288 -140 40 -200 -272 -189 -20 -85 55 -276 -76 12 -236 21
4450 21 74 -28 418 170 387 -312 -11 22 -115 8 -237 -44 -376 57 -147 150 -116 -50 223 7 -55 -254
4472 -254 148 -98 -344 39 -116 -5 -72 252 174 -24 -91 151 -9 82 -147 21 -55 -110 269 247 274 -23 241
4495 241 226 -63 -128 115 145 -67 0 233 131 101 271 606 -113 -77 251 370 -261 143 105 30 350 -144 197
4518 197 226 -157 -21 134 3 -9 -99 -9 209 -228 85 156 -79 -16 174 107 2 -177 259 149 -207 -259 149
4541 149 -37 -448 -143 246 -180 71 -103 148 -107 -309 -261 363 -519 -350 138 -19 -297 -345 15 -192 -49
4562 -49 -339 145 -62 -342 -213 171 -226 -131 363 181 -224 -268 128 -158 -262 179 66 -33 -538 -263 73
4583 73 -208 -314 -137 47 -135 -229 4 33 -464 -333 56 125 -40 99 139 -226 -294 -42 153 156 -162 275 631
4606 631 49 -200 -275 194 -122 -242 265 537 -441 15 267 288 -11 167 103 -147 -132 -39 400 26 83 284
4628 284 365 -229 183 400 246 -164 -24 366 102 -343 38 285 171 190 138 259 99 -238 244 167 -288
4649 -288 -205 236 212 -182 -26 318 -198 -325 45 200 -96 -299 128 111 -51 -450 116 -30 -282 -194 37
4670 37 -26 -171 -222 318 -21 -129 -285 202 -174 -431 229 55 -116 -242 69 73 -14 -276 198 -223 -419 -139
4692 -139 74 -134 -78 -287 150 -111 -336 148 76 -182 -198 21 114 -231 -229 181 16 -404 -57 472 -154 -241
4714 -241 -110 402 -110 -244 142 98 -348 -80 310 11 -356 -79 120 304 -253 55 253 -72 -266 7
4734 7 112 -169 -70 -39 275 -196 -440 396 265 90 -226 60 104 -298 -257 294 90 -131 182 303 305 -76 396
4757 396 77 -75 -79 358 332 -127 -114 415 26 -138 204 289 31 -284 100 167 95 -323 414 108 -24 -261
4779 -261 310 13 -278 -125 187 103 -173 97 123 113 -74 -117 196 51 -15 41 134 -192 -347 74 -29 -527
4801 -527 -179 196 85 -111 43 379 -129 -192 217 95 76 -271 110 221 -379 127 -35 43 -441 -660 3
4822 3 158 -90 -86 74 -342 -153 30 -102 -274 -62 -4 -81 -451 -90 -213 -10 -391 -283 362 -150 -442 -32
4844 -32 -7 -195 -88 458 95 -215 -188 214 192 -141 -33 166 -21 -166 -133 124 -29 57 -70 341 -101 -232
4866 -232 323 137 -33 -78 344 189 -53 -37 268 -95 -143 287 376 37 7 36 236 -49 -157 356 97 -76
4888 -76 -78 339 165 132 -48 238 158 -116 117 413 -442 -66 -74 105 -76 -420 100 -60 92 -114 -9 171
4910 171 -176 -167 235 60 -215 -58 213 -19 -330 42 102 -363 -78 35 242 27 8 417 43 -287 -67
4931 -67 2 -94 -423 -47 159 -9 -368 50 -117 -262 -348 103 58 -318 -236 173 115 -527 -206 -117 218 -210 5
4954 5 43 -153 -230 39 -89 -276 -229 327 -7 -264 28 220 -36 -408 -126 92 -333 -143 104 165 -158 16
4976 16 137 261 -49 -34 5 -24 -203 -105 286 1 -256 89 182 40 -214 63 288 24 -125 258 28 -118
4998 -118 -34 20 125 -236 -256 109 157 -215 126 105 -29 -129 126 -10 -141 183 113 87 9 127 281 25 14
5021 14 354 155 -253 28 51 -65 283 -187 479 -187 127 249 106 -56 -188 -183 -185 323 -177 -340 123 224
5043 224 -173 285 289 116 -365 -15 300 -120 15 -60 64 -222 -258 9 -150 -240 -168 182 -185 -209 80 -69
5065 -69 -134 -177 -224 -15 -323 -203 152 -143 -13 54 160 86 -205 94 -136 -19 -519 -149 -23 -370 -67 100
5087 100 -79 -187 -345 26 -87 -67 64 97 -296 -43 -197 -191 252 -22 -50 -133 -155 -153 32 185 -40 48 -142
5110 -142 102 240 -208 163 295 -125 57 27 -76 -187 72 160 203 2 162 176 183 218 -101 264 -330 235
5132 235 61 89 6 30 -47 248 -180 222 -96 -48 160 -17 -97 105 75 77 78 93 241 -17 47 -161 192 109 -132
5157 -132 32 -137 -29 292 -495 -62 -49 50 146 156 204 -195 -275 127 59 2 172 82 181 -206 57 -352 129
5180 129 170 -156 -88 -84 238 -42 -115 56 -165 -118 136 -124 229 39 81 31 -223 340 178 -131 48 -155 36
5203 36 -250 118 -207 -60 -83 91 -155 -33 -46 -340 -513 -386 -195 140 -116 -303 -219 83 -38 89 21 89
5225 89 -51 147 -25 -25 183 -245 37 -218 -279 -123 -146 94 -173 -179 64 3 287 -88 42 -16 121 256 -61
5248 -61 214 -13 200 -217 119 -110 188 -9 -135 143 87 249 -126 -164 -30 -52 20 -243 174 86 172 115 129
5271 129 194 3 5 109 288 -157 227 196 107 -342 -75 200 -157 -130 -138 -67 76 -7 232 29 -26 157 129 67
5295 67 -329 -171 128 14 -247 -144 119 -69 50 121 -28 263 -197 88 269 -258 -32 11 118 101 -122
5316 -122 160 169 -264 -44 -3 -109 100 82 -59 56 -350 -201 35 142 -8 -34 145 -115 -62 80 -241 46
5338 46 284 185 -43 -189 114 187 48 70 210 -164 -279 -323 132 141 -146 213 82 -35 -169 -207 -31 16 -31
5361 -31 303 -300 -346 24 103 -46 -190 70 161 90 -113 92 42 -72 -227 216 55 66 6 147 -44 221 81
5384 81 299 111 -46 -121 246 157 -80 88 153 169 160 -105 -4 70 -68 55 199 37 -380 166 314 -264 -92
5407 -92 -60 125 -294 -103 221 -92 72 -26 466 -294 160 122 294 46 -196 236 -167 117 294 370 282 -384
5429 -384 46 361 -233 -467 -31 138 143 11 227 456 124 -244 179 17 -89 -103 485 -105 -95 -29 -111 -97
5451 -97 95 30 28 -127 105 -132 -83 -318 -92 265 161 -425 -214 -103 -290 -366 222 214 63 4 -259 128 79
5474 79 -99 -104 195 -269 -471 -4 89 -105 107 508 -43 -186 -89 208 -249 -375 192 -58 77 -539 82 -97
5496 -97 -50 122 132 235 -14 -75 157 -32 25 64 14 99 4 185 78 -4 -257 68 -177 -5 -61 305 -157 -348
5520 -348 103 449 -45 -191 192 65 246 235 -98 287 102 25 -104 -107 -87 74 211 -5 -220 23 369 -20
5542 -20 -117 214 168 335 -17 217 230 92 3 -21 -140 61 83 200 -208 -1 10 92 -67 3 -116 46 74 -85
5566 -85 301 -74 -272 192 109 -105 -168 -25 14 -58 -117 -79 27 357 -129 30 -1 -88 -207 58 87 -13 -91 157
5590 157 81 -137 -204 -34 8 132 112 -23 246 -323 -274 34 -396 -253 559 -127 -365 -243 -108 204 -93 76
5612 76 54 -121 -131 123 207 310 -61 27 129 43 -84 77 174 -201 -373 54 220 -199 62 142 273 -50 204
5635 204 -25 -40 -162 237 128 17 -67 415 -41 -280 82 198 234 -389 -52 211 -2 111 152 119 224 -123
5657 -123 161 346 43 223 198 -6 -30 19 628 21 43 -166 216 108 -193 167 241 5 -2 52 210 -61 222
5680 222 -48 16 -111 -176 90 -70 -264 88 -30 14 -168 27 103 -259 -248 4 10 -309 18 88 84 7 124 13
5704 13 3 -97 -203 -45 -76 -203 128 -22 -14 -302 32 71 -207 -99 124 -91 -142 -100 279 -155 -330 104 207
5727 207 -138 -339 -140 22 -309 75 314 -161 108 -6 -43 21 -96 39 -1 -20 -278 -84 218 121 19 191
5749 191 84 179 -44 -84 -88 -200 -104 -57 -191 -114 -203 141 -20 -45 95 -289 78 1 254 30 259 -258 70
5772 70 -3 241 25 47 504 43 39 66 -115 -135 120 100 -43 -300 271 -249 -62 -113 96 -175 -284 205 -2
5795 -2 -42 150 135 97 -126 -149 41 145 51 6 -25 105 202 210 237 8 20 -263 -155 2 -62 -60 -79 48 84 -276
5821 -276 -181 -87 -140 182 -153 -185 69 -171 -38 -170 -209 71 -221 38 -38 10 -51 -196 -62 -130 179 95 -119
5844 -119 -70 -142 -104 120 -31 -81 -21 205 -176 -202 -125 100 22 -312 230 109 163 -62 185 -104 15 -91 -201
5867 -201 92 -222 -249 34 28 -172 -53 -146 -57 -170 -7 -193 212 -117 139 149 77 71 68 28 167 -195 28 42
5891 42 28 2 129 -229 -218 113 86 -46 24 166 126 -247 -151 168 -156 -4 40 285 27 -23 73 96 -63 147
5915 147 79 -80 -100 -85 -172 118 -162 52 -33 36 8 -242 167 -72 96 184 57 -106 -277 226 425 -135 32
5938 32 -20 -33 -204 -147 -106 136 45 65 -319 -112 -327 315 151 -135 17 220 -207 -185 -24 -290 41 170 188
5961 188 -107 315 -94 -169 -63 100 -218 50 199 -68 -98 -68 248 -107 -162 14 -66 359 -97 -341 -11 -118
5983 -118 39 109 99 227 -175 -129 165 127 -296 -75 -63 -123 -87 -111 -26 -98 -199 -190 -61 -163 -44 -99 110 164 115
6008 115 156 169 -1 96 100 225 39 -162 6 7 108 -78 476 32 6 -18 67 15 204 98 350 211 -111 -5
6032 -5 -92 163 129 133 -89 -284 -35 -56 -38 178 221 460 -18 -108 21 -122 10 222 134 147 -253 -23 178 -195
6056 -195 36 129 372 443 134 26 -278 -161 17 38 -23 223 58 118 166 401 -212 279 -151 -111 225 109
6078 109 -322 -185 211 116 -24 86 -16 -301 -50 155 158 -57 -212 -88 86 -208 69 -151 -263 61 34
6099 34 96 60 -74 -135 -152 148 11 -233 -405 266 78 -4 10 99 -247 213 238 17 -136 37 128 14 35 -207
6123 -207 -221 2 -1 -46 70 -75 -59 151 355 96 -272 272 172 -6 404 12 160 181 57 75 -353 -118
6145 -118 3 212 -117 -46 170 53 -143 228 220 -58 -33 103 245 41 -15 66 95 -47 -153 220 43 -48 -71
6168 -71 102 -113 31 181 -41 192 35 -16 30 212 72 4 16 -95 -94 144 -57 74 59 76 97 -60 83
6191 83 41 6 231 315 160 192 -78 54 -17 -16 -100 172 -78 -214 -95 83 132 82 220 -74 -188 -101 52 -102
6215 -102 -108 -327 -285 84 -303 -120 200 -165 21 42 33 12 -143 -48 210 -293 39 159 -104 -179 226 131 -212
6238 -212 -299 145 -109 -147 -116 -148 -2 56 -71 -177 90 -248 -148 227 98 -87 -6 464 336 -139 46 134
6260 134 -21 26 147 27 37 91 -86 127 -75 -335 108 -266 115 -304 44 187 52 -146 144 36 -4
6281 -4 42 -284 -74 151 142 141 77 -41 170 286 -27 -265 55 9 -137 59 428 8 -187 183 346 -154 310
6304 310 -113 -64 -133 -220 241 216 -28 211 81 -116 -57 115 -99 -216 40 96 -31 -157 -176 10 -190 56
6326 56 -69 317 95 -91 -73 125 37 50 53 172 -39 95 -39 226 247 -125 4 -47 -24 25 -55 -124 -47 -299
6350 -299 6 43 318 -113 105 -323 33 -139 175 300 50 -172 -127 -1 52 33 166 -388 92 28 141 37
6372 37 62 -121 -229 -315 -283 285 -70 -9 -44 -20 -135 -132 196 -190 -183 -126 33 116 -147 -47 203 -7 75 -65 195
6397 195 272 68 -26 300 184 -71 -84 213 -64 -10 350 205 -14 174 155 218 -57 179 73 111 238 25
6419 25 37 3 -118 169 -99 -119 74 -29 239 87 10 91 -373 -174 215 305 -103 -325 85 -142 116 -263
6441 -263 80 160 55 8 27 29 -93 -175 55 -25 -199 -305 -19 46 80 -39 -79 -103 38 148 114 -255 -126 136
6465 136 -41 -7 -210 -33 -194 -99 -71 -60 -59 -58 -186 -148 -88 -208 264 -23 21 52 -23 -192 -152 52 58 -364 46
6490 46 -383 122 150 -93 71 179 -199 -42 123 -12 -302 -170 -107 -290 63 164 232 -110 28 152 -74
6511 -74 -133 -220 64 -88 106 160 86 183 62 93 160 -255 23 21 219 139 -140 307 -15 33 -76 35 258 290
6535 290 -50 269 -266 -49 -97 60 -85 231 423 52 21 -124 -44 -59 98 -64 100 -144 -36 -255 79
6556 79 103 -108 219 207 197 298 35 141 107 55 -15 -89 -423 -100 2 -47 -109 -44 131 10 311 188 203 26
6580 26 -211 -81 77 24 -218 23 -59 -126 -209 347 -91 -452 -15 -53 92 -10 69 205 -55 -130 -73 -196 283
6603 283 -86 -187 -19 -208 237 129 -341 150 243 -1 -14 -20 43 -182 57 -192 -52 164 12 -188 -68 255
6625 255 -122 -36 80 37 -200 106 153 -6 4 453 407 -122 -8 -111 -125 -184 57 91 -123 -266 -4 -113 220
6648 220 -168 143 -107 15 -339 -75 -42 81 -28 43 228 -62 -177 164 12 -239 128 -35 -34 -38 -246 330
6670 330 133 -225 78 198 -120 120 -210 50 -91 4 133 26 -266 -308 -111 -14 -25 -84 -112 66 41 -13 95
6693 95 -168 -217 136 273 -203 -111 159 16 -379 -338 -355 -78 -4 293 102 179 62 197 184 139 -5 -117 48
6716 48 -136 -73 146 -167 -245 138 248 -77 81 207 73 -231 -123 154 -145 -126 -3 -178 -434 24 94 -47
6738 -47 18 -122 131 -356 -59 -160 -326 -161 -24 -134 -176 -47 -340 42 -199 -169 155 164 -21 -106 173 -162
6760 -162 66 -89 67 -145 102 173 66 -104 5 139 -114 -117 59 -32 -112 15 -7 69 -26 -28 226 46 -203
6783 -203 -15 -75 -34 116 -145 40 21 173 51 25 12 -93 30 78 -33 171 -107 167 -56 -57 -76 -86 -118 -85
6807 -85 39 126 79 -29 69 258 296 -47 -169 34 33 31 21 240 -25 -182 117 -49 -24 -66 -40 104 -52 -118 -14
6832 -14 -129 21 -13 -58 185 78 114 222 125 83 -155 -46 -200 184 11 11 -25 55 -106 -107 -9 60 32 -67 -110 326
6858 326 -86 11 246 16 -171 98 283 -342 -137 -84 179 -121 149 -76 -18 -145 -172 -74 126 232 -23 144
6880 144 -25 94 101 -79 110 -41 169 -106 -82 -122 -46 137 151 -357 31 70 24 -182 -44 108 -259 149 106
6903 106 -275 -314 141 2 -101 35 -124 71 179 152 118 53 -32 10 171 104 -278 -157 135 95 2 127 30
6926 30 -110 22 73 77 -26 186 -33 31 92 36 150 72 78 -259 18 -229 -12 166 258 -103 132 396 -397 97
6950 97 40 110 146 57 -13 98 30 -154 155 -36 392 -309 -31 -5 -97 126 -66 143 122 -49 65 33 -102 41
6974 41 86 -135 -163 73 123 6 69 -70 48 -25 -59 123 198 -160 -39 240 -157 -103 19 116 42 -219 -86 208
6998 208 42 534 32 -166 -20 236 207 37 96 -35 -58 -90 -267 185 71 2 -122 125 -9 -211 123 -101
7020 -101 -7 -36 133 40 20 -310 -219 279 48 -157 -367 -154 -272 19 94 58 -145 -300 -172 193 -2 -308
7042 -308 153 -23 -59 170 70 -179 -175 4 -204 -187 -165 45 145 74 -202 220 406 164 -25 122 -95 213
7064 213 19 365 -75 -314 248 -61 -113 -59 202 -41 -236 17 140 116 52 -170 38 8 -206 -159 52 291
7086 291 72 76 150 210 44 259 80 -15 183 46 -190 -30 -100 137 -47 -42 -365 78 -278 -93 60 -186 105
7109 105 -144 221 96 -20 -27 111 45 -18 -51 -45 22 147 28 -80 -149 -406 70 92 -120 -176 382 -97 -65 -85
7133 -85 63 -60 -330 -1 -176 -202 28 -8 -83 -134 -113 -18 29 349 262 -4 -141 -174 -206 -45 1 -76 -64 -56 -28 -277
7159 -277 -212 407 289 113 -3 -192 144 -172 384 34 -75 33 170 -251 -95 -63 77 -121 -164 13 -125
7180 -125 -79 6 -81 146 -55 -57 -58 63 -151 120 58 123 123 244 297 -51 -298 -237 157 185 -150 -152 228 -343 21
7205 21 44 286 -237 51 -59 195 83 285 -208 -33 -106 110 399 42 43 -51 -99 -56 -21 118 100 126 190 -155
7229 -155 -154 -151 -14 22 75 -106 -8 358 -115 -49 -158 19 86 -116 118 107 -127 -307 -12 -112 243 56 -2 107
7253 107 62 46 170 109 111 100 -289 68 -304 132 -214 -106 27 16 11 8 107 -163 183 -43 251 -33 124 273
7277 273 95 -109 183 -137 -77 18 -130 74 347 -190 81 224 128 -114 -90 218 -122 -25 -58 -79 -60 -23 -57
7300 -57 -264 -68 -39 167 26 292 188 21 6 116 -175 -37 126 118 -160 -107 145 75 -26 33 60 -183 -39
7323 -39 290 47 -66 -49 -96 50 235 222 -26 -237 -98 -176 200 -129 -248 61 -75 1 104 146 -197 6
7345 6 51 217 -81 -288 17 -78 90 -315 191 139 -160 -12 69 38 -6 116 119 -69 280 169 79 82 -210 -309 -93
7370 -93 -110 -166 173 98 -113 71 -224 155 -105 -205 -27 -54 -113 -17 9 31 121 59 43 -51 103 21 103 19 5 79
7396 79 231 -78 304 166 -88 18 -171 132 -76 115 -1 33 189 136 -48 97 -95 -343 -13 -125 -431
7417 -431 -160 -149 88 129 213 -7 -115 -19 -4 434 -26 -61 -174 -6 293 -2 120 -116 -89 186 395 -88
7439 -88 104 -77 242 87 339 2 129 110 -128 86 69 197 14 -12 347 12 82 270 -62 -60 77 28 173
7462 173 -161 56 -333 -151 65 -54 -57 -141 -39 -6 -85 -87 -199 317 61 83 183 -46 186 -37 182 -57 24
7485 24 230 -54 -79 -104 -168 110 5 275 24 106 -270 -361 4 -25 -140 -311 47 -42 -145 -131 -153 -266 -226 -181
7509 -181 -143 -29 -27 -76 -99 70 -191 371 -70 31 171 -28 88 -53 -139 1 -19 -348 -2 163 -26 -63 -12
7532 -12 142 146 71 16 116 242 -305 -198 66 131 97 173 -117 8 -189 311 -42 111 -183 181 -137 148 -25
7555 -25 -4 -20 -11 164 52 162 85 92 -159 139 -115 -19 337 322 -162 28 321 -268 177 236 -59 58 45 380
7579 380 -431 -98 -174 -81 75 75 273 84 -192 -71 32 80 -19 -173 -170 -224 361 143 -45 -12 -119 -78 14 252
7603 252 -211 61 8 -96 -96 104 248 -92 -35 -39 -276 80 -42 216 -166 -71 -244 -90 151 -262 -18 -3 134
7626 134 252 8 -176 -79 -38 -92 -84 167 -87 57 -14 -134 -60 -269 222 -8 -153 17 55 219 -72 224 41
7649 41 -87 110 113 55 136 -45 113 52 138 121 -215 -89 -56 -132 245 -57 171 83 160 -151 -90 -106 -142 38 312
7674 312 93 84 -33 2 63 -73 16 -110 40 -108 228 -151 -50 21 284 199 17 122 -12 106 -34 -52 -102
7697 -102 105 275 79 110 36 -22 -25 -235 266 124 204 193 45 53 -121 261 -236 -81 -38 -45 -324 -70 -31 -133
7721 -133 -263 -63 -19 179 -60 -168 262 -79 -101 78 280 394 -24 228 -63 44 -172 12 85 -380 -156
7742 -156 83 154 85 28 173 -198 -9 -100 -148 118 438 -161 -96 130 -107 -317 -243 -385 13 -60 240 -48 -36
7765 -36 96 103 216 -2 -339 -50 128 -57 135 24 -40 34 -230 31 46 -134 203 78 55 96 114 74 190
7788 190 141 -193 53 -39 88 35 51 -221 234 -36 -22 203 -312 12 -72 35 -29 -184 25 302 -152 -103 81
7811 81 162 -22 -135 250 154 -123 106 261 156 -58 -111 -92 50 -99 194 180 3 -46 -300 -158 -57 243
7833 243 73 85 -227 -139 -81 -148 9 78 -67 -146 -29 -91 22 -132 -67 158 -177 -19 -88 52 77 22 -13 -34
7857 -34 22 -127 289 297 31 41 -54 86 118 -166 -37 -100 77 3 -46 -100 146 -153 -1 48 -248 -70 193 -10
7881 -10 -89 -100 28 90 32 181 -166 -84 -56 122 -143 -22 56 -76 24 -254 149 -169 -2 120 -197 130 -191
7904 -191 -62 56 -204 -46 -15 114 -51 -132 -50 -163 -4 -57 -104 43 -137 -133 27 183 -91 229 -55 -8 91
7927 91 -40 214 45 462 -140 164 -118 -216 -204 -208 -38 -75 -24 90 38 -306 -96 210 -248 -7 154 -172 -155
7950 -155 206 31 12 112 17 -11 89 -47 130 13 -114 -94 44 -78 53 -29 -91 9 -76 -218 -24 71 44
7973 44 23 -139 -124 247 295 7 231 -360 -38 -65 167 -130 -1 -264 41 247 143 -94 -99 -33 -163 -32 70
7996 70 245 -4 -175 -166 -66 -30 57 -236 -16 38 208 -71 -152 -188 -99 28 -63 6 -98 -231 -180 201 -137 -44
8020 -44 173 -95 -258 66 120 -229 47 176 13 56 320 -92 -148 -293 -223 297 -100 174 -64 -107 -34 95
8042 95 27 6 104 -252 -389 68 -276 10 94 -303 59 84 289 -303 -209 254 -8 -144 -58 -15 44 26 -189 -52
8066 -52 21 -13 25 67 22 444 -125 -104 -92 23 173 -5 -182 -171 93 99 -147 -10 78 -240 -81 148 -4 350
8090 350 25 123 21 12 107 -76 -3 -202 84 -108 -212 -297 -126 23 74 -70 18 -92 27 -128 14 -48 -207
8113 -207 -190 -67 -260 -108 -4 292 27 -452 135 25 385 99 49 -155 -17 54 162 -131 -19 110 219
8134 219 99 153 -141 30 167 52 71 -12 -49 -6 273 188 153 -78 -51 -69 -122 25 113 -33 46 39 -100 -160 -178
8159 -178 23 25 15 -108 23 -68 117 126 40 -40 253 136 -225 245 301 142 46 -33 -90 156 54 104 -55 145
8183 145 138 -17 -317 139 236 -82 339 91
8191I1
$$ Imaginary data points
##PAGE= N=2
##DATA TABLE= (X++(I..I)), XYDATA
0 0 0 0 0 0 0 0 0 0 0 0 0 8 -8 8 -8 8 -9 16 -16 16 -24 24 -30 32 -40 41 -49 57 -64 72 -80 88 -101 111 -125
35 -125 139 -153 171 -190 209 -232 258 -284 316 -349 387 -432 481 -540 608 -690 787 -911 1071
54 1071 -1286 1586 -2047 2828 -4400 8797 -44232 -169267 -51976 68777 37820 -34043 -15501
67 -15501 -3678 -42583 -31499 50570 61804 -22940 -74529 -30591 24057 38333 27271 -4331
79 -4331 -42530 -33267 8760 10291 -18868 -5615 17241 -18049 -50060 2225 54989 11258 -48463
92 -48463 -26241 7010 -19553 -23994 36997 44332 -43544 -79553 2217 56675 6104 -34376 -7860
105 -7860 -1836 -27435 2277 60774 33155 -50744 -57385 11753 44755 16370 -10743 -18165 -20056
118 -20056 -1238 28781 19334 -18309 -20903 1197 -2287 -6181 24757 29666 -25513 -45411 17221
131 17221 49027 -10058 -45547 7817 39930 -8280 -31840 18589 39525 -9622 -28720 14035
143 14035 27777 -5924 -7156 23566 15377 -14926 -3729 22432 10052 -9358 1711 7683 -7903
156 -7903 -2133 24391 13510 -23620 -18284 17308 15937 -10624 -6851 6870 -9447 -15710 16683
169 16683 24541 -17851 -33233 7163 24712 -4994 -11650 14638 7593 -22405 -4064 36234 19470
182 19470 -26494 -16904 24702 20747 -6939 1792 18728 -1301 -15186 9109 24530 1815 -11171
195 -11171 3761 5778 -6182 2780 16778 -948 -21894 -5429 13886 -1509 -14117 4344
207 4344 8378 -19462 -21229 12944 17057 -16883 -21414 6326 5579 -16159 -4291 18983 33
220 33 -27921 -7940 22032 6399 -17500 -1941 14059 -5090 -15267 10213 20304 -7245 -17557
233 -17557 5005 12769 -2312 -2718 9547 1224 -11684 228 13643 2131 -7764 3321 6638
246 6638 -7906 -4146 16482 9319 -15918 -9259 17191 9789 -13084 -2456 17794 2291 -16600
259 -16600 2543 21667 1558 -17348 1823 18620 971 -11943 4685 13248 -3254 -8277
271 -8277 7792 9000 -6155 -4495 8795 4289 -6545 398 7260 -2008 -5049 7013 7060 -8091
285 -8091 -5210 11309 7270 -9431 -3684 13052 4396 -12049 -21 16205 2425 -13196 1819
298 1819 15547 166 -11537 4634 14090 -2933 -10863 4717 11085 -2714 -6417 4661 4092
311 4092 -6438 -3088 7354 2668 -7523 -2958 3367 -1709 -3662 3550 874 -9411 -5925 6784
325 6784 2838 -9250 -4461 4705 -2185 -10443 -251 8759 -3340 -13801 -1166 8710 -2261 -10047
339 -10047 418 5404 -6309 -8507 3473 5273 -5606 -7114 1672 1750 -4415 -2406 3118 -1353
353 -1353 -6305 -539 3558 -1754 -3797 1933 1121 -5272 -1828 5865 1657 -6337 -1497 5641 163
368 163 -5084 1511 6198 -2389 -6356 3071 7444 -1626 -5478 3368 5678 -2618 -3328 5013 5089 -3183
384 -3183 -2379 5208 3551 -1775 9 3735 1363 -799 2298 3949 568 -445 2894 2786 -437 856
400 856 4247 1733 -2085 1500 5314 1109 -2278 1966 4694 -100 -1968 2870 3921 -781 -1836
415 -1836 2658 3186 -1193 -1615 3011 3050 -1305 -578 3063 2332 -992 130 2583 1469 -39 954 1738
432 1738 784 636 1309 1550 852 716 946 529 191 1143 1038 -994 -1313 772 1249 -1466 -2096 -476 -176
451 -176 -2174 -2021 -1188 -1435 -2764 -2655 -1862 -1215 -2351 -3835 -2615 -969 -1586 -3190 -2776 -1408 -1162 -1719
469 -1719 -1623 -677 -1319 -2310 -955 1288 -106 -2464 -904 2126 373 -1459 30 1460 -353 -568 1257
486 1257 1356 -936 -1002 1414 1691 -450 -939 1087 569 -1014 520 1938 -677 -2369 1638 3358 -1252
503 -1252 -2321 2080 2583 -1140 -772 3081 1716 -2174 -309 4295 2367 -2410 -197 4351 1843 -1898
519 -1898 1107 3741 359 -1510 3157 4103 -1106 -1511 3677 3411 -1343 -246 3942 1955 -1382 1461
535 1461 4674 688 -2258 3092 5712 116 -2341 3718 5036 -655 -275 5771 3386 -2238 896
550 896 6457 2502 -2942 880 5358 746 -3209 2076 4538 -1804 -4146 3196 3840 -4141 -4382 2569
566 2569 1305 -5702 -3462 2749 -891 -6435 -2381 1557 -3280 -5973 16 1364 -5493 -6225 1796
581 1796 2056 -5879 -4706 2764 85 -6704 -1397 5724 -1279 -8216 -662 6162 -828 -6169 243
596 243 3694 -3240 -4340 3378 2646 -5914 -4523 4048 1574 -6718 -3023 4080 -1467 -7088 -258 4058
612 4058 -4629 -7786 1527 3296 -6124 -6761 2705 2415 -6469 -4979 3098 -442 -6808 -382 5253 -3515
628 -3515 -8982 1645 7363 -3300 -8199 2122 4843 -4122 -3803 5802 3014 -7795 -3977 7879
642 7879 4434 -6343 -3381 4948 1171 -3161 3473 4874 -5061 -5767 6833 7273 -5148 -4911 6085
657 6085 3764 -5703 152 9377 693 -9084 1020 11097 779 -8603 1282 8747 -1234 -6262
671 -6262 3910 5651 -4766 -4121 6348 2684 -8484 -2157 8392 1132 -9470 -1910 6699 -1397
685 -1397 -7225 2346 5147 -7555 -8739 6421 8077 -7112 -8769 3523 3430 -5270 -61 6564 -3400
700 -3400 -11076 2017 11738 -592 -10604 13 6978 -2826 -5158 6160 4935 -9137 -6501 8588
714 8588 6496 -7713 -5442 5629 801 -7205 765 6339 -4222 -8575 3522 6244 -6766 -8136
728 -8136 5970 5582 -9382 -7665 7171 3736 -9278 -3686 7919 -802 -11438 477 10732
741 10732 -719 -10806 -300 6744 -1774 -3862 5658 3065 -8833 -3091 10998 5502 -8552
754 -8552 -3151 8551 1675 -6242 4228 9522 -4270 -9298 6503 11949 -3235 -7570 5330 7263
768 7263 -4097 -2234 8950 3774 -7555 -607 11149 2509 -7722 1639 9888 -421 -6228 4995
782 4995 8162 -3615 -4343 7597 5803 -6034 -2306 9550 4279 -6930 -422 8867 860 -6473
796 -6473 3839 9230 -3915 -8039 6742 9835 -5231 -7713 6514 7126 -5499 -3916 7701 3394
810 3394 -7677 -1204 8669 1788 -7383 449 7182 -1302 -4906 4581 4749 -6125 -3850 8090 3897
825 3897 -8533 -2980 8432 1218 -8859 -263 8379 -2128 -10034 2105 8647 -3849 -9677 2358
839 2358 6583 -5323 -6800 4596 3216 -7801 -4502 6027 873 -7895 -1808 5079 -2289 -7305
853 -7305 2017 4874 -5260 -6371 4204 4029 -6861 -4334 6109 1647 -9306 -2462 8266 293
867 293 -9374 -519 7887 -1937 -8161 3134 7409 -4197 -7916 3846 6552 -4421 -4949 4668 3047
882 3047 -5830 -1339 7102 907 -6736 615 6411 -1267 -4772 4292 5099 -5300 -4401 7460 5619
897 5619 -6110 -3628 7115 2951 -6297 316 9162 -3 -8445 1369 9650 65 -5953 2657 6200
912 6200 -3042 -3712 6361 5319 -4840 -3429 6168 3534 -3909 340 5706 -786 -5492 3182 7456
927 7456 -2002 -5298 3717 4961 -3779 -2392 6992 3460 -7353 -2559 7622 3241 -6115 -750 5999
942 5999 -919 -6208 2589 6955 -2156 -6944 1761 4929 -2747 -3229 4319 1492 -6658 -2173 6003
957 6003 1551 -5709 -1263 4065 -1807 -5027 2972 4991 -4675 -6901 3172 4709 -4412 -4377 3729
972 3729 1021 -7107 -1794 6575 533 -7970 -1955 4759 -1108 -5051 1544 3713 -4907 -6155 3368
987 3368 4521 -4189 -4369 2672 1019 -5066 -840 5446 -398 -7083 -244 5001 -827 -4360 1796
1002 1796 3293 -4024 -3766 4748 4394 -3867 -3848 3695 2391 -3682 -244 5253 -195 -5508 618 6122
1018 6122 336 -3881 1644 3386 -2702 -1928 4841 3624 -4240 -2548 4599 2578 -3130 63 4815
1033 4815 -314 -4560 2371 6116 -597 -3990 2041 4050 -1816 -1500 4475 2458 -4083 -1360 5067
1048 5067 2453 -2918 -213 3795 -162 -3233 2069 5305 -1607 -4001 2212 3988 -1810 -1763 3611
1063 3611 1913 -4016 -932 4948 1400 -3703 -441 3361 -295 -3306 1721 3631 -2380 -3955 2035
1078 2035 3578 -2452 -2870 1802 598 -3592 -1091 3251 -314 -4362 -1310 2411 -914 -3172 414
1093 414 1477 -2825 -3382 1716 1995 -3359 -3280 1470 460 -3661 -1190 2370 -728 -4247 -855 2490
1109 2490 -850 -3267 287 1378 -2611 -2382 1818 1639 -2835 -2391 1837 595 -2550 -562 1884 -834
1125 -834 -3312 118 2729 -481 -2583 167 1248 -1422 -1357 1937 1083 -2600 -1338 2130 1428 -2014
1141 -2014 -255 2313 68 -1923 1078 2549 -382 -2040 1114 2457 -357 -950 1717 1118 -1127
1156 -1127 -243 2145 1059 -1088 -3 2275 353 -844 1100 2326 -30 -1124 1793 2258 -125
1171 -125 -252 1873 1547 -864 198 2230 1152 -964 109 1663 167 -680 1069 1854 -487 -1054
1187 -1054 1681 1773 -607 -843 913 497 -708 -52 866 -356 -1150 -342 716 -291 -1241 -394 424 -832
1205 -832 -799 205 153 -1343 -1184 138 -383 -1303 -827 27 -856 -1545 -504 -247 -772 -1281 -474 -267 -1096
1224 -1096 -783 -199 -269 -1257 -960 -325 -375 -1204 -825 -387 -1082 -849 -534 -190 -850 -1033 -883 -578 -341 -338 -1011
1245 -1011 -760 -770 -358 -706 -354 -642 -545 -418 -549 -259 -203 -415 -504 175 -473 -364 115 170 -399 130 473
1266 473 37 -299 76 508 -53 -381 286 640 450 -225 323 937 -8 255 1210 1022 -301 -13 1375
1285 1375 1080 -99 377 1303 715 2 1045 1512 325 -147 947 1431 274 -61 1026 1004 25 531
1303 531 1436 788 -620 651 1949 616 -1128 828 1615 -195 -329 1369 1599 -807 -563 1490 1217
1320 1217 -571 -661 1273 879 -1127 -159 1436 -71 -1537 993 1656 -752 -1828 958 1414 -1127
1336 -1127 -1646 768 744 -1404 -645 1536 153 -2446 -273 1770 -108 -2159 -136 1311 -1076 -1865
1352 -1865 1047 732 -2522 -1649 1434 917 -2585 -1676 1798 127 -2559 -655 1755 -487 -3048 164
1368 164 2039 -1294 -2618 423 1273 -1883 -1264 1608 444 -2610 -698 2154 -381 -2822 -97 2767
1384 2767 -365 -2798 695 2523 -776 -1765 1486 1766 -2107 -1468 2919 1462 -2258 -757 2680 467
1400 467 -1919 810 3182 -202 -2613 1384 3724 -934 -2561 2043 2606 -1088 -987 3167 1750 -2383
1416 -2383 -114 3419 1081 -2332 612 3106 -17 -1964 1941 2986 -1067 -2115 2918 3127 -1847
1431 -1847 -1640 3437 1754 -2435 -476 3780 1075 -2653 240 3439 -288 -2576 1550 3203 -1527
1446 -1527 -2514 2069 2317 -2083 -1660 2695 1158 -2891 -792 3544 206 -3555 -146 3119 -962 -2838
1462 -2838 1196 2162 -2237 -2749 2294 1484 -3301 -2315 2536 938 -3503 -799 2894 -715 -4434 142
1478 142 3209 -1437 -4029 429 1919 -2211 -2593 2123 1469 -3519 -2217 2314 842 -3018 -991 2257
1494 2257 -731 -3777 567 2670 -1693 -3845 1270 2241 -2234 -2360 2497 1274 -3508 -1818 3201
1509 3201 1113 -3389 -925 2738 -659 -3320 1225 3376 -1331 -3029 1790 3368 -1610 -1737 2721
1524 2721 1543 -3070 -1063 3769 1533 -2911 -146 3069 -67 -2067 1972 3425 -1798 -2665 2446
1539 2446 3757 -1764 -1592 3158 1461 -2812 -138 4476 1214 -3545 123 3815 362 -2000 1760
1554 1760 3089 -1685 -2349 2941 3448 -1769 -1496 2594 1706 -2538 413 4170 -128 -4051 494 3901
1570 3901 98 -2708 1390 2392 -2527 -2181 2992 2752 -2782 -2249 2282 1099 -2552 -140 3192 -876
1586 -876 -4196 629 3695 -768 -3151 1000 1933 -2408 -1934 2741 1349 -3953 -2588 2769 990 -2868
1602 -2868 -542 2245 -1507 -4063 743 3320 -1658 -3846 505 2112 -2620 -2081 2511 654 -4275
1617 -4275 -2083 2982 986 -3060 -1119 1856 -1421 -3295 1193 3121 -2227 -3934 1229 2128 -2388
1632 -2388 -1635 2565 592 -3936 -1376 3861 866 -3616 -1019 2598 -707 -2899 1933 3184 -2206
1647 -2206 -3374 1959 3106 -1552 -1579 2347 698 -3027 -29 4014 897 -3488 -265 3159 -69
1662 -69 -1892 2300 2568 -2112 -2200 3043 3324 -2078 -1598 2669 1241 -2406 217 4393 217 -3650 351
1679 351 4181 281 -2338 1694 2663 -1693 -1954 2934 2932 -1940 -2061 2482 1771 -2155 361 3210 -299
1696 -299 -3085 1118 3817 -398 -2979 1179 1832 -1997 -1724 2997 1923 -3305 -1961 2904 1285 -2563
1712 -2563 -480 2644 -824 -3196 1080 3302 -1345 -3406 777 1791 -1869 -1682 2153 854 -3421
1727 -3421 -1914 2761 426 -3269 -810 1956 -1292 -3129 1051 2572 -2062 -3162 1261 2068 -2276
1742 -2276 -1888 1812 329 -3249 -997 2870 92 -3353 -776 2327 -706 -2794 951 2029 -1714
1757 -1714 -2626 1402 2075 -1818 -1784 1448 649 -2678 -286 2942 170 -2722 -96 2598 -312 -2124
1773 -2124 1276 2206 -1626 -1853 2197 2140 -1734 -1546 2225 1281 -1682 -23 2738 -26 -2271 1295
1789 1295 3136 -216 -1927 1461 2353 -1162 -1267 2364 2066 -1660 -1235 2642 1357 -1587 194 2595
1805 2595 291 -2027 1185 2762 -578 -1529 1331 2097 -1010 -1049 2368 1476 -1984 -754 2992 1186
1821 1186 -1989 114 2223 -353 -1612 1119 2225 -1013 -1818 1108 1777 -1252 -1378 1576 893 -1911
1837 -1911 -794 2090 404 -2422 -340 1647 -126 -2096 40 1279 -1461 -1976 830 1245 -1637
1852 -1637 -1717 638 334 -1964 -781 1645 -328 -2450 -452 1432 -666 -2170 96 966 -1261 -1814
1868 -1814 1076 794 -1920 -1955 930 450 -1592 -763 1379 -444 -1900 -227 1747 -497 -2179 -55
1884 -55 1119 -1013 -1424 1388 718 -1633 -1137 1407 605 -1304 -268 1310 91 -1384 172 1612
1900 1612 -198 -1439 652 1555 -224 -727 1410 928 -1221 -387 1601 816 -986 -270 1454 267
1916 267 -809 608 1433 -235 -859 1012 1360 178 -487 1210 1064 -765 -199 1743 589 -1079 31
1933 31 1590 470 -409 709 1256 50 -617 1139 1380 -209 -130 971 926 -367 -151 1128 459 -992
1951 -992 233 1367 275 -635 540 780 -338 -552 620 523 -349 -748 311 524 -876 -290 505 89
1969 89 -921 -485 674 -399 -1159 21 287 -403 -953 19 323 -944 -897 186 83 -858 -744 -109 -530
1988 -530 -843 -283 221 -362 -1128 -166 279 -485 -566 -265 -370 -354 -704 43 -220 -456 -853 -151 442 -427 -147
2009 -147 -116 -435 -458 -334 204 -500 -292 -118 139 -250 -185 306 -46 -400 -27 -16 168 -38 -253 119 -4
2030 -4 72 62 117 175 -268 -86 122 565 411 135 415 297 238 293 381 276 -25 -2 771 774 249 194 598 379
2054 379 329 500 661 350 -302 485 813 469 20 534 793 40 290 584 538 -32 -273 628 808 -249
2074 -249 67 621 244 -374 12 972 237 -533 -200 489 5 -740 385 603 -572 -385 387 569 -142
2093 -142 -341 727 -117 -994 -340 677 -62 -879 47 312 -202 -826 -125 167 -726 -738 499 123 -813
2112 -813 -998 257 38 -1302 -376 413 -379 -1332 7 468 -444 -1124 -56 457 -644 -964 370 328
2130 328 -1032 -1073 883 168 -1113 -387 734 -442 -943 -220 879 -711 -1108 232 563 -678 -780
2147 -780 767 56 -1071 -480 1054 302 -1154 -504 1072 -338 -794 343 1144 -195 -803 606 1299
2164 1299 -396 -655 634 671 -709 -316 1302 486 -652 -141 1451 214 -813 670 1299 -245 -470
2181 -470 1208 950 -322 -457 1483 808 -700 -527 1410 508 -806 459 1407 218 -920 682 1357
2198 1357 -48 -760 935 991 -684 -409 1129 424 -768 -212 1303 99 -1056 498 1490 -274 -1569
2215 -1569 737 1046 -765 -999 958 700 -1223 -296 1000 457 -1612 -633 770 -42 -1590 -322 958
2232 958 -636 -1469 412 594 -1401 -1399 923 267 -1383 -884 1091 -215 -1761 -539 881 -155 -1595
2249 -1595 119 902 -706 -1196 700 950 -1133 -1111 932 612 -1724 -943 1106 -127 -2012 -305 1253
2266 1253 -362 -1966 196 1137 -962 -1166 782 1030 -1152 -765 1297 667 -1545 -587 1278 212
2282 212 -1474 224 1501 -296 -1394 619 1726 -250 -892 976 1189 -1020 -689 1537 826 -1273
2298 -1273 -298 1882 267 -1086 643 1927 -25 -1022 963 1765 -207 -696 1400 1118 -745 -570
2314 -570 2188 578 -1127 47 1822 388 -1349 322 1731 -52 -1086 932 1691 -430 -1123 1458
2330 1458 1078 -1265 -717 1745 752 -1454 -216 1609 11 -1558 -73 1882 -758 -1542 725 1511
2346 1511 -1168 -1337 1174 549 -1590 -636 1678 216 -2235 -286 1510 -161 -1804 59 1369 -863
2362 -863 -1714 868 1305 -1836 -1537 1121 729 -1646 -1199 1226 -273 -1940 -187 1464 -631 -2078
2378 -2078 166 1343 -1014 -1536 1001 803 -1464 -1596 1099 724 -1727 -881 1597 23 -1957 -28
2394 -28 1604 -450 -1995 516 1326 -1055 -1608 1285 1039 -1306 -1231 1455 669 -1512 -720 1609 520
2411 520 -1767 213 1672 -305 -1844 814 1473 -702 -848 1241 1167 -969 -757 1777 834 -1500 -49
2428 -49 1829 495 -1223 560 1988 -98 -1246 962 1832 -773 -912 1442 951 -1249 -431 2028
2444 2028 816 -1429 -70 1850 269 -1277 379 1902 -301 -1638 1327 1829 -1058 -1247 1445
2459 1445 970 -1019 -710 1813 333 -2032 -235 1853 -151 -1404 340 1488 -801 -1508 1203 1253
2475 1253 -1138 -1295 884 630 -1155 -877 1266 -36 -1595 -524 1554 90 -1633 -306 956 -828
2491 -828 -1865 535 1325 -1278 -1947 1167 909 -1206 -1150 1128 -84 -2002 -335 1311 -418 -1906
2507 -1906 -237 944 -745 -1490 444 1092 -1812 -1355 1019 594 -1346 -872 1316 26 -1652 -70
2523 -70 1413 -327 -1571 333 1131 -342 -945 587 925 -1221 -1054 1310 959 -1266 -405 1431 346
2540 346 -1345 242 1765 305 -1339 554 1265 -481 -796 1367 1230 -1008 -278 1499 750 -1004
2556 -1004 -93 1293 503 -1190 72 1739 -119 -1025 750 1312 -546 -592 1085 925 -893 -432 1490
2573 1490 647 -997 -31 1408 551 -735 336 1723 -376 -1235 1043 1292 -597 -1001 812 953 -1174
2590 -1174 -401 1384 724 -1306 -58 1327 -36 -1156 180 826 -364 -1403 814 840 -1006 -1401
2606 -1401 975 668 -1080 -553 985 255 -1223 -568 742 -53 -1087 -454 548 -835 -1007 608 605
2623 605 -990 -1334 446 279 -1086 -605 919 -111 -1322 -397 822 48 -1286 -1 609 -531 -975
2640 -975 385 799 -1307 -1038 662 710 -952 -442 603 -89 -978 49 700 -92 -696 175 786 -240
2658 -240 -594 455 830 -529 -112 804 360 -700 42 854 107 -666 109 719 26 -740 342 882 -238
2677 -238 -680 771 691 -260 -293 1004 465 -187 3 1077 532 -220 335 1011 -160 -744 477 809 109
2696 109 -344 619 541 -172 199 675 513 -336 -111 771 230 -323 16 802 150 -264 379 374 -531 -183 384
2717 384 309 -405 -158 305 251 -395 -309 470 229 -357 -23 470 123 -485 246 202 -704 -254 76 111 -383 -404
2739 -404 259 -184 -722 -362 41 -341 -475 -247 129 -476 -494 -419 189 -482 -386 -218 -17 -293 -462 86 -193
2760 -193 -400 -403 105 -330 -465 166 246 -341 -542 -212 45 -169 -124 156 33 -198 -102 -61 -49 10 -110 -175 84
2783 84 -222 319 -39 -387 -306 -311 264 42 -55 124 133 -19 -24 180 338 -6 297 292 309 238 166 -41 78 239 293
2808 293 113 -159 184 227 287 -302 337 183 332 239 171 289 271 631 88 104 154 399 270 -47 41 470 -74
2831 -74 118 152 393 -82 -129 206 314 110 164 244 12 132 152 752 -130 53 61 -179 -220 61 319 221 -41
2854 -41 -84 207 -75 -217 -148 128 -69 -314 133 95 -235 -470 -83 -8 -390 -311 -113 -431 -519 -58 -104 -340 -413
2877 -413 -148 82 -112 -161 -185 -275 -229 -373 197 -216 -756 -295 171 -268 -510 -205 399 -284 -373 -105 -83 -257
2899 -257 -554 -82 146 -534 -150 329 46 -440 73 130 -103 -378 47 470 -108 -271 -295 331 -275 -293 113
2920 113 51 -322 450 394 84 -279 419 505 259 16 370 603 -77 -197 583 739 -284 11 386 294 -335
2941 -335 -36 436 109 -113 391 734 48 -17 444 696 178 -133 369 444 -133 -221 745 -35 -441 -29 822
2962 822 -131 -577 537 609 -6 33 424 572 -40 -204 662 53 -367 -175 864 333 -620 81 882 -142
2982 -142 -773 -72 434 -371 -665 235 183 -574 -770 436 396 -669 -603 468 46 -854 -426 688 -221 -789
3002 -789 -325 690 -392 -785 189 312 -723 -580 212 253 -947 -666 296 177 -895 -382 604 -288 -791
3021 -791 34 383 -531 -701 -37 609 -675 -610 321 268 -516 -605 647 54 -824 -200 578 -473 -957 419
3041 419 676 -308 -492 412 882 -449 -366 731 331 -754 -249 968 -103 -1044 81 779 -162 -935
3059 -935 132 1070 -211 -511 765 669 -477 -142 1144 665 -379 -250 926 37 -758 274 1054 5
3077 5 -796 90 889 -99 -387 621 490 -513 -539 656 606 -604 188 845 186 -629 432 1073 -112
3096 -112 -817 522 889 -422 -516 748 436 -673 -287 942 847 -1133 135 770 -89 -1004 279 627
3114 627 -549 -996 -109 638 -617 -786 441 260 -1032 -532 612 286 -929 -421 846 -54 -998 49
3132 49 570 -615 -1098 371 560 -645 -709 580 173 -1087 -569 904 22 -1300 -546 696 -227 -1034
3150 -1034 37 1121 -450 -904 204 628 -644 -812 686 129 -861 -379 1139 130 -991 -19 1071
3167 1071 121 -874 158 825 -393 -591 701 803 -567 -569 878 495 -859 -265 1086 278 -770 162
3185 162 814 227 -635 531 985 -194 -462 862 965 -682 -571 590 465 -458 -49 857 322 -880
3203 -880 183 1177 84 -862 213 987 -674 -375 936 909 -664 -256 787 613 -531 68 663 178
3221 178 -1184 490 1186 -175 -583 324 899 -478 -548 432 575 -869 -681 880 616 -666 -324 865
3239 865 35 -771 164 681 -448 -867 133 693 -420 -708 591 95 -706 -525 562 290 -979 -504
3257 -504 543 -494 -906 -97 880 -298 -1011 472 574 -625 -711 398 202 -818 -722 415 50 -788
3275 -788 -142 709 14 -881 -59 790 -688 -730 311 869 -893 -760 570 425 -608 -240 608 34 -674
3294 -674 -9 884 13 -449 77 673 -281 -562 625 742 -566 -392 684 537 -433 -17 854 297 -720
3313 -720 -37 1020 1 -728 210 770 -193 -556 764 744 -628 -516 997 597 -579 45 1125 -24
3331 -24 -782 203 928 168 -676 371 788 -77 -504 422 763 -404 -476 688 478 -643 -53 930 382
3350 382 -574 175 656 -164 -647 349 520 44 -485 455 641 -647 -518 580 27 -692 -246 579 -369
3369 -369 -677 22 678 -314 -725 -11 413 -421 -644 117 356 -368 -497 402 -73 -403 -226 224 -333 -564
3389 -564 -162 305 -109 -763 168 208 -526 -327 128 188 -745 -572 283 147 -341 -547 519 -92 -511 93
3409 93 187 -429 -561 181 306 -281 -283 141 229 -430 -25 368 -101 -397 -371 229 125 -15 111 632 -81 -336
3431 -336 368 339 -192 -341 487 193 -340 -120 802 444 -248 55 657 128 -437 208 517 218 -5 393
3451 393 112 -305 122 555 443 -203 205 204 22 -48 337 564 108 -273 282 412 -47 -351 160 156 -131 129
3473 129 594 12 -88 329 649 481 -100 317 578 -136 -147 215 469 -126 -158 180 474 -428 -462 403 71
3494 71 -78 144 198 -186 -269 -311 259 -72 -419 14 171 -332 -248 190 -205 -282 -85 64 -165 -308 -18 -260
3516 -260 -28 -367 -256 -116 -294 -197 194 -169 -332 -80 16 -196 -453 -62 266 -24 -37 127 60 70 -117 -46
3538 -46 364 15 -371 283 -25 -32 -165 0 -54 -103 106 173 291 -337 81 174 77 -154 197 324 208 162 38
3561 38 -23 38 150 -19 -40 181 208 552 116 207 -35 61 200 87 255 288 -84 127 372 616 149 -85 -69
3584 -69 339 182 -57 117 187 12 235 339 20 -5 403 319 239 176 -105 100 160 242 143 115 24 77 155 157 -94
3609 -94 -37 94 -47 31 -292 -128 259 -54 101 -38 77 -11 -235 -86 -92 96 96 284 -238 -167 35 -45 -66 -168
3633 -168 82 79 -86 -144 -105 -263 -38 -87 51 232 -266 -210 -324 -285 -244 -146 -183 -103 -129 -425 170 -522 -356 -278
3657 -278 133 59 -477 -73 294 -167 -183 -57 -106 117 23 -91 -22 -277 -124 101 -119 -239 -115 73 230 -239
3679 -239 -156 185 -98 -176 269 219 -192 -193 173 175 -238 190 413 238 43 222 500 231 -27 236 369 -13
3701 -13 -448 86 349 -271 -70 446 244 -104 -42 203 356 162 86 357 128 65 -126 595 210 -457 313
3722 313 407 -75 -103 255 142 -261 -274 349 259 -157 -24 517 23 -229 1 271 52 -184 131 418 -258
3743 -258 -233 209 382 -81 -297 332 234 -229 -99 291 -109 -553 -228 377 -487 -386 40 -80 -148 -283 194
3764 194 261 -335 -277 -246 -38 -565 -42 407 52 -208 -219 439 -107 -582 -19 215 -411 -226 393 362 -536 -193
3786 -193 197 -94 -319 159 359 -111 -256 183 270 -73 -432 282 161 -87 -298 207 259 -548 -9 432 129
3807 129 -176 210 464 94 -569 306 179 -220 -74 376 519 -35 110 442 300 -498 55 352 122 -165
3827 -165 -9 504 348 -613 206 779 -119 -136 218 788 -143 -293 544 373 -267 -196 563 -20 -178 5 476
3848 476 102 -292 486 305 -65 -419 323 348 -599 -231 452 509 -608 -5 468 11 -393 -80 534 61
3868 61 -440 219 550 -110 -489 248 350 -376 -280 246 49 -485 -187 141 -45 -886 -329 291 -333 -310 43
3889 43 467 -473 -667 116 54 -423 -446 334 92 -519 -264 -9 -324 -544 -202 214 -112 -829 182 73 -449
3910 -449 -487 320 496 -631 -213 207 -106 -399 -283 93 33 -408 200 480 -184 -392 -105 216 -204 -629
3930 -629 126 320 -626 -404 478 207 -406 79 587 -13 -513 -84 580 -77 -384 599 283 -73 -378 868
3950 868 252 -189 -277 623 437 -455 94 406 177 -40 42 501 -98 -509 567 614 -404 -312 703 261
3970 261 -316 11 765 264 -448 19 788 -29 -456 276 565 -67 -382 255 257 -94 -130 256 97 -381 -5
3991 -5 560 346 -272 10 339 -103 -396 324 499 -194 -623 234 565 -385 -121 456 97 -305 -260 474 -61
4012 -61 -386 -154 586 -233 -489 107 263 -549 -556 186 167 -598 -437 554 254 -444 -156 240 198 -436 61 103
4034 103 -54 -566 254 89 -416 -69 148 442 -360 -259 135 -36 -784 192 312 -111 -522 149 276 -120
4054 -120 -294 242 325 -321 9 427 322 -415 -336 532 225 -449 -158 603 1 -425 -76 693 -155 -463 93
4075 93 586 78 -216 187 244 -18 -274 573 92 49 -215 474 189 -119 520 514 -47 -705 302 578 -34
4096 -34 215 380 322 -406 -67 497 233 -423 354 469 -197 -41 173 261 110 -415 289 344 -590 -141 259
4117 259 456 -477 -185 69 -5 -262 -206 353 -148 -576 -56 166 -400 -343 275 204 -386 -251 283 -129 -82 -40
4139 -40 334 133 -420 -116 250 -262 -61 137 108 -322 -195 573 285 -476 -82 88 -44 -438 -172 221 -154
4160 -154 -634 4 74 -71 -156 1 307 -137 -369 192 43 -395 -97 420 33 -190 24 200 -66 -255 -70
4181 -70 190 -24 -307 81 99 -10 -340 222 -13 -58 -118 216 132 61 124 270 -3 -270 -204 501 1 -496 248
4204 248 428 -393 -180 351 262 -158 -52 366 87 -119 179 496 36 -227 0 307 -324 -219 363 223
4224 223 -176 -206 310 236 -72 -215 233 -70 -216 332 384 159 -46 229 110 -226 -272 356 1 -43 -214 86
4246 86 11 -224 -97 567 177 -244 84 158 -110 -389 208 193 -49 -299 -61 -12 -192 -162 22 -144 -266 16
4268 16 366 -182 -425 -107 -33 -182 -27 261 11 -212 -324 135 219 -323 -441 254 -254 85 -259 -169 -296
4289 -296 -323 1 -73 -357 -211 -7 124 -349 -455 128 -146 -318 43 59 -2 -187 18 -56 68 -247 -148 140
4311 140 -133 -209 167 -103 -82 -3 29 33 -213 -191 62 40 24 -79 509 65 -124 -134 84 365 -205 396 311 133
4335 133 256 198 77 -35 240 311 204 -304 226 66 26 390 29 23 43 -47 259 -120 290 -284 65 -145
4357 -145 -164 86 74 68 -71 -108 -7 75 -125 90 -118 -89 68 68 184 -135 -381 -143 -35 -139 2 -220 -25
4380 -25 86 -45 -39 -84 98 -51 -2 -32 -121 -162 -262 -165 30 -223 -63 -294 18 -156 -268 -109 -332 -233 -34
4403 -34 -42 -216 -319 -191 35 112 -303 -204 126 -95 -209 -146 -5 97 96 -18 -80 -49 82 -164 -206 -475 256 203
4427 203 -321 47 -46 24 -88 -168 234 -5 5 160 -22 157 40 94 355 61 176 133 -22 -89 220 -24
4449 -24 301 -114 76 178 195 -64 -202 -19 128 7 -145 213 29 128 26 -38 -43 -8 359 69 32 24 348
4472 348 45 -33 -112 112 25 -130 -89 103 -79 181 109 146 -204 -12 502 237 25 150 231 -57 -249 -123
4494 -123 -15 121 -366 173 177 331 91 56 146 -273 111 376 -53 -114 43 3 120 -283 15 91 -244 -247 -64
4517 -64 -32 -243 -232 307 -78 -187 -161 265 -244 -214 -330 184 -222 -283 197 -261 -108 38 132 143 -376 -459 -115
4540 -115 -289 -237 -192 216 305 238 -12 61 -187 -234 9 -7 -299 -214 150 143 -293 -100 302 -146 -371 -29 37 -85
4564 -85 -279 -120 493 -73 -279 92 177 -56 -98 -4 19 -55 -75 313 -49 -258 37 583 199 -380 22 233
4586 233 334 -138 123 464 -3 -75 120 207 -29 -207 200 111 -43 92 726 -131 -241 66 36 -35 26 335
4608 335 288 15 -216 486 164 -175 103 747 114 27 -163 300 163 -97 -77 469 131 -131 188 540 -27
4629 -27 -212 258 236 64 -219 221 -124 -464 -244 -84 -387 -407 -140 444 -88 -273 2 73 -231 -89 -43 130
4651 130 113 -72 61 150 -390 -84 57 253 -230 -3 280 -196 -317 -149 213 -136 -142 151 29 -368 -150
4672 -150 39 -69 -184 128 170 -148 -248 137 237 -82 -322 168 256 49 -46 -31 -6 -305 -109 184 -143 -189
4694 -189 -48 485 -133 -49 222 338 76 -269 351 237 -235 121 291 36 -398 -16 327 78 -324 285
4714 285 194 -124 -112 -213 165 -145 -167 306 362 -98 -151 108 235 14 144 410 -41 -18 105 138 -100 -217
4736 -217 60 61 65 -226 473 3 -207 96 41 197 -27 108 86 -70 -264 185 302 -191 -703 -65 276 -458
4758 -458 48 124 -47 -305 -101 -66 256 -187 -120 97 91 -393 164 535 27 -286 256 168 -33 -80 197 111 -278
4781 -278 -337 8 110 -222 -169 3 -104 -224 82 -81 -38 -16 -173 254 -74 -103 110 226 -246 -131 58 5
4803 5 -348 139 102 -9 -282 353 298 -326 -344 -234 -7 -178 -24 48 7 -344 77 38 181 -188 111 477 168
4826 168 -233 333 212 -343 -123 157 147 -104 -197 552 146 -286 -17 56 52 -185 195 598 -40 -42 -53 153 36
4849 36 -102 94 342 -67 27 237 56 -56 -164 412 -106 -71 -33 301 15 25 351 322 -199 86 389 118
4871 118 -55 73 188 -135 -205 -112 94 -11 -414 187 146 -294 15 106 208 -247 -99 186 63 -60 -317
4892 -317 226 115 -481 325 204 -44 -341 22 -13 -57 -283 -124 349 98 -256 366 -27 -558 -150 226 -227
4913 -227 -252 -89 136 -212 -218 -72 -113 -13 -189 77 267 -255 -359 69 27 -302 -469 -128 -330 -187 -234 242
4935 242 10 -249 -12 -83 86 -374 -59 -93 45 -210 207 286 -436 -109 299 -48 -376 -68 202 -176 -174 417
4957 417 35 -71 41 -46 215 -98 274 335 -101 50 132 486 127 -186 316 -49 49 38 -128 40 191 -153
4979 -153 284 178 -44 115 219 57 -108 -115 168 -27 -173 285 159 -90 103 -109 64 173 -220 307 -14
5000 -14 -146 -1 327 -77 -214 33 122 35 -179 84 14 193 -180 -16 -214 -160 -183 -160 132 60 0 50 211
5023 211 -413 -25 193 -146 96 -486 46 -270 -222 206 -64 -198 130 200 -154 -23 -141 -111 -72 98 -32
5044 -32 88 -67 -227 182 0 -65 -447 -71 -71 -161 -331 47 -171 -319 -277 -75 -104 -127 115 296 -365 -127 117
5067 117 3 40 -177 53 -2 -55 -178 -154 68 -80 -4 21 -176 -214 33 2 -36 417 203 -155 -240 -183 329 -19
5091 -19 -112 -17 115 -64 83 66 184 34 3 175 395 -167 90 12 -366 -73 69 339 259 -96 221 -30
5113 -30 -40 63 51 -129 189 13 260 76 -59 -212 141 -1 -63 197 168 -40 -238 -10 -36 237 107 79
5135 79 109 338 -45 128 111 -66 -164 -169 -10 68 -511 85 278 203 57 -56 -94 -154 -27 12 238 -113 -181 -146
5159 -146 -218 50 145 -241 339 -314 -139 81 76 57 -412 65 -477 -27 -163 10 -288 -256 -103 -159 113 2
5181 2 113 19 -136 19 -468 150 -100 175 122 25 18 -141 102 105 103 122 19 48 -169 -64 4 -77 129 -13 296
5206 296 -76 111 248 -4 -171 220 182 -13 8 -235 -216 93 -158 -187 44 1 -103 -128 -245 -32 156 -132
5228 -132 16 240 6 -53 -8 16 187 141 117 339 15 55 282 -11 73 62 280 16 166 79 -272 38 73
5251 73 437 52 110 92 -141 -52 -116 220 123 12 113 -7 -79 -142 -24 28 -99 -91 78 55 105 10 -235 75 -30
5276 -30 -94 -333 111 -140 -377 383 -12 -65 -162 -129 169 -94 -206 -141 -236 147 -215 92 -161 -220 152 -98 14
5299 14 -215 -145 146 110 -219 107 -120 -131 -130 -167 -125 -59 -20 28 119 4 105 166 -85 147 14 73 -37 134 -31
5324 -31 76 -294 -199 -62 -234 123 -37 17 -100 182 161 39 124 -177 28 37 189 70 199 0 -168 -253 179
5347 179 -145 30 306 65 51 304 225 62 181 -202 406 -156 -46 87 89 44 -203 158 341 -20 -77 346
5369 346 -19 -156 -207 218 73 174 -93 291 80 -403 349 258 181 31 -51 82 -92 -291 -126 -80 -115 221
5391 221 -46 -44 263 -301 161 126 -213 12 21 125 -3 221 -111 -173 244 287 -129 -106 -212 51 -29 -154 56
5414 56 -52 -127 -159 -203 12 -60 -137 207 190 -239 -18 -65 171 -134 -145 273 -85 -243 -12 484 -99 -170 -43
5437 -43 13 147 -159 189 0 83 23 -213 -254 -269 -45 -70 -92 -53 -16 53 92 -189 -328 -86 -277 -148 -53 14 -93
5462 -93 38 337 118 -128 165 97 -163 -181 318 204 69 113 101 1 -222 -85 289 399 -159 125 251 105
5484 105 182 7 541 427 47 250 278 -21 3 48 174 29 -530 184 -65 -22 129 61 339 -63 -15 134
5506 134 66 -327 116 28 139 -27 233 31 -211 -105 -177 38 62 225 380 -264 -216 597 19 -57 100 29
5528 29 -10 -156 85 122 -65 -2 81 119 -81 -304 -35 266 75 -194 -24 -91 -193 -114 146 479 -190 -53 19
5551 19 -132 -212 -314 -10 17 -115 241 402 142 -283 -180 146 -40 -230 42 -71 -324 -413 189 156 31 152
5573 152 240 262 -305 -17 -42 -169 -102 -50 73 233 -104 -93 246 -151 -144 -12 164 -158 -47 297 102 -204 -152
5596 -152 406 -354 -73 86 112 -6 -66 216 177 27 -250 220 -69 -309 90 109 200 21 -189 302 15 -7
5618 -7 133 45 -152 72 -9 1 -62 83 154 25 -230 172 44 312 -320 -173 -85 109 -119 -226 318 -298 -211
5641 -211 -70 -410 -102 -77 -87 295 -211 -133 114 145 -77 -120 312 -75 147 176 -33 -75 -186 49 128 -132 -160
5664 -160 241 -139 -17 33 -104 -106 62 -97 -38 243 -323 -309 -99 6 -44 -144 191 -195 27 -54 -153 -316 -280
5687 -280 101 28 -197 97 -183 96 -323 106 222 -123 -62 77 -24 -617 -61 9 204 -10 -43 -106 -93 -208
5709 -208 -222 433 -132 -45 246 -174 -71 -204 151 138 -7 59 103 119 26 -124 189 -180 -190 207 196 -178 -42
5732 -42 197 302 -265 51 42 319 168 -88 112 162 163 258 -61 -15 -30 11 -73 35 31 195 159 -15 321 209 177
5757 177 66 62 115 -86 100 -12 383 120 -48 21 290 81 77 306 574 -123 -363 -117 221 19 157 333
5779 333 -173 -137 115 -82 -374 -17 -211 84 81 203 207 72 -109 -60 -72 -68 138 -124 -168 -77 26 -230 -39 6
5803 6 -52 -81 199 -173 -148 179 -191 -20 64 -87 -65 -189 -71 -97 24 -249 66 -112 -106 -60 -310 -160 115 -255
5827 -255 14 159 -33 186 -147 -43 -86 -77 52 125 149 -66 288 -114 -115 93 200 68 58 194 70 -188 -91
5850 -91 405 -73 88 288 373 26 -2 -54 -62 185 267 -128 172 36 79 192 -74 96 -33 20 30 39 -14 -38 324
5875 324 -8 216 -105 136 310 -138 164 -152 263 -174 29 -132 -102 121 27 58 -215 -10 164 138 -151
5896 -151 -35 -214 153 -243 23 13 -15 242 -28 -164 -9 -17 72 -72 49 190 -72 -370 -4 -131 -17 17
5918 17 244 120 -179 36 -184 8 94 -119 140 -225 -84 -63 4 40 -162 -14 -153 -105 90 -182 -105 -103 173
5941 173 -187 95 113 135 37 161 -96 202 253 21 -135 233 170 -142 -57 25 97 205 -256 -162 -177 271 -143
5964 -143 -137 44 48 -197 -96 -150 43 -211 -363 293 -108 -378 35 154 -94 -103 91 -222 127 165 164 150 115 49
5988 49 -116 -41 -88 -25 -139 29 -54 -32 -33 43 -186 -113 -17 58 -49 11 91 106 -3 59 -66 235 308 -14 -107 82
6014 82 23 427 288 -3 12 23 -96 -281 -171 156 -247 48 -37 55 69 -351 -57 -53 -97 65 -165 -229 231 -174
6038 -174 102 -130 -56 -31 -100 -15 -51 182 56 -90 60 114 -303 2 -1 67 -28 160 160 -235 40 -398 47 122
6062 122 -119 -36 -219 -39 -43 -7 -195 49 160 -236 -83 -50 -17 79 57 -186 -151 189 116 -27 -9 215 81 -331
6086 -331 -51 82 174 -20 -262 -281 62 8 185 253 -73 232 210 -18 -377 32 -143 -194 9 35 178 210 -165
6109 -165 24 42 141 99 -435 150 -41 -71 -10 150 -224 -168 -114 163 -294 232 169 -63 99 -87 180 172 -369
6132 -369 85 56 -293 -20 60 321 77 -93 190 -253 -386 29 -9 -127 -33 204 41 -60 -147 138 -159 -16
6154 -16 -205 -92 241 84 111 102 -93 -296 237 -243 58 -234 -130 300 -133 -72 -227 117 -311 -58 65 123
6176 123 50 -99 134 -85 -146 96 -196 -256 89 37 -46 157 -169 -182 101 68 -151 -55 31 49 45 -118 -219 -216 -207
6201 -207 -21 -70 19 -76 -358 -72 -132 276 237 35 30 161 32 -84 -190 103 -265 -191 -172 290 103 1 -4 210
6225 210 -31 -303 -139 -40 69 209 127 186 27 83 63 191 165 27 -147 -69 -112 52 62 -1 -22 321 132 55
6249 55 -102 204 89 24 229 221 -70 -36 23 104 191 197 172 147 -57 -166 -3 253 -159 -93 106 -25 -127 26
6273 26 181 -12 -234 -215 92 33 -276 -63 41 89 -146 -212 -152 49 -125 -86 -207 -27 200 72 146 -244 -129
6296 -129 -117 19 -202 53 26 -157 -213 217 -60 56 -192 -173 -14 -130 32 205 -36 -52 -125 42 48 -66 -198
6319 -198 125 -34 47 -150 -251 -120 -69 40 75 -105 -153 -179 101 -39 154 111 23 -318 -24 17 -147 341 -259
6342 -259 -23 -374 266 -292 57 56 65 -48 -37 21 -102 92 -127 -1 104 204 221 78 137 -7 -299 -75 109
6365 109 210 67 -228 33 168 80 8 178 -73 74 78 46 234 -196 -117 -70 -218 -180 130 -109 -1 63 -94
6388 -94 -64 -37 194 -10 -12 -16 45 -86 -116 -65 278 229 -250 -219 248 -60 248 7 149 -187 -171 83 -103 -57 -163
6413 -163 -176 278 -219 -111 -34 -98 -213 190 311 -114 -177 66 184 -130 -460 272 -119 -56 -86 73 -15 -215
6435 -215 -414 -268 163 -1 292 229 99 132 267 252 119 -207 -246 -97 -315 -82 90 139 -10 -77 35 93
6457 93 -127 4 30 308 64 177 256 117 60 114 246 -131 85 248 42 11 37 -195 -9 19 -58 254 224
6480 224 164 -122 -5 -125 236 220 -332 -156 -190 -19 -132 39 227 100 425 -73 74 333 16 164 -53
6501 -53 -18 -169 -33 -184 121 186 7 69 151 275 -51 198 -95 13 -10 241 66 -48 -38 75 383 -281
6523 -281 -129 -31 -192 11 103 -79 -154 3 -142 357 212 339 18 77 115 -93 38 -350 93 -174 -337 -143
6545 -143 -230 -56 144 221 149 -28 -21 10 102 184 -274 31 23 -107 -181 -197 -94 -13 -94 -131 -259 60 91 -179 20
6570 20 -295 -176 187 -170 -93 132 -52 183 322 -149 -52 -56 -99 39 -146 137 -161 -39 -20 -96 -43 5 151
6593 151 -74 51 -150 -224 26 -281 -59 139 -70 102 69 -106 -89 256 -197 -168 -100 199 127 269 57 -93
6615 -93 179 13 -50 234 -14 -12 42 411 136 -18 -18 66 337 -184 -214 37 24 -114 34 30 59 55 69 13 84 -45
6641 -45 -224 88 328 117 151 134 177 154 11 -71 -12 -153 172 119 -153 217 -69 -5 -79 228 -10 206 156 -75
6665 -75 -35 -35 139 -105 200 -17 -85 247 -92 -430 -55 122 -123 -195 -43 -312 -63 -135 97 50 -164 -106 1
6688 1 -143 126 112 -34 182 32 -333 -244 -15 76 86 -379 -148 -267 75 -366 -21 -293 -60 -281 -65 -97
6710 -97 20 -294 -285 26 -81 -16 -52 -189 110 -133 -241 50 80 -213 -78 -112 130 -167 -13 -80 -259 -117 163
6733 163 88 48 123 -407 -275 -167 -132 3 -103 79 336 238 26 -65 101 -329 33 197 97 231 -171 143
6755 143 -124 273 112 59 -36 -415 -128 -112 -77 -4 -118 283 43 61 222 -27 -156 56 -128 72 98 -28
6777 -28 4 -229 113 40 77 60 126 67 -98 -1 189 100 103 -134 148 -7 108 -59 -12 -34 -33 172 -123 -229 -142
6802 -142 -168 -92 -9 -5 107 262 -20 -270 -312 0 46 -82 -257 203 146 -15 151 -14 -195 214 -159 77 -337
6825 -337 -9 103 -58 162 -84 89 -397 91 -118 -30 153 -90 55 168 -96 -121 -103 -188 -109 13 -116 318
6847 318 -147 17 -217 49 254 -66 173 -358 -299 288 32 235 237 92 -69 -117 176 352 -107 76 -103
6868 -103 -73 -21 31 -14 -275 -30 57 161 266 93 369 -139 181 21 -31 -425 34 -194 115 51 -174 181
6890 181 162 135 -84 -64 -139 -52 -68 -191 106 140 199 280 -66 160 4 213 -107 53 -202 47 162 -201 106
6913 106 -68 -176 80 168 113 -200 69 -15 -285 -20 -29 12 -2 83 -16 -17 -83 115 -444 309 147 -88 5 348
6937 348 -31 -215 180 -54 -229 31 197 15 -176 240 -24 119 -63 3 -176 -33 -7 27 51 30 -227 -120
6959 -120 103 202 -111 275 84 -112 102 -246 139 -157 -244 128 116 -107 -12 132 -59 -14 96 123 -81 8
6981 8 180 -29 -70 -144 31 -220 288 -49 151 -27 -230 89 329 -54 -23 264 222 -222 234 -4 -65 -121 -133
7004 -133 1 -115 140 -68 -277 305 278 -13 -7 -324 100 51 -13 -74 -19 -71 -143 -76 120 -85 -17 -16 -142 -101 48
7029 48 -154 70 -28 -86 -5 289 0 -165 -48 -81 131 62 65 -32 273 -16 -61 58 174 -189 77 42 -85 86
7053 86 44 101 -171 -287 66 220 -65 104 209 -160 -150 -195 5 28 14 335 -236 -17 -23 -115 -148 9 93 -69
7077 -69 11 -183 217 -6 -44 -28 -146 -24 36 -101 215 381 19 -33 55 -256 -224 -84 -32 -103 38 75 -56 40
7101 40 -279 -34 77 -193 -17 -316 -48 -133 92 -38 -292 -407 -191 245 -304 71 -57 155 168 -250 -93
7122 -93 -54 -113 -36 199 -193 -139 140 335 -27 -262 116 147 -377 117 47 -335 -94 271 112 -31 -19 151 -76
7145 -76 11 18 -109 461 -231 -212 98 -74 -20 -115 292 -227 96 -185 72 425 9 -188 128 173 400 -36 9
7168 9 -106 -93 220 191 -187 -141 240 14 -265 142 0 44 219 -175 -119 -11 -173 -156 55 -152 298 -10 79
7191 79 -91 163 -41 224 -175 -265 239 125 -21 -168 57 81 -221 179 -193 -128 -146 -54 -141 120 68 183 -147
7214 -147 -185 -95 -6 20 -72 -54 -99 -121 -153 154 85 32 244 130 24 -223 -97 176 -117 33 -65 -363 -68 178
7238 178 179 241 52 -447 -58 39 55 111 -145 113 141 54 -65 64 75 -125 -323 171 -12 77 317 -231 -80
7261 -80 34 25 -65 -1 321 235 230 -8 -106 173 144 271 -110 473 11 -22 152 122 114 -276 -35 91 -425 3 37
7286 37 -129 130 109 219 -11 106 -34 47 -163 -30 14 62 -44 66 267 108 -127 -134 106 -125 62 -19 142
7309 142 2 -30 -104 108 -95 140 -93 36 -232 -287 -41 8 3 -238 -180 -117 -47 20 247 213 63 -30 -133 152
7333 152 256 122 -21 -25 -121 -33 -205 -228 7 -214 99 -91 -270 -245 93 122 262 -4 -216 65 -320 -27
7355 -27 -7 -5 -58 -53 43 68 -75 188 62 221 -1 3 169 122 22 -53 81 141 -260 -54 113 55 -109 -230 -244
7380 -244 -239 -24 -99 -62 459 93 163 -259 245 0 -23 231 103 -1 22 -51 224 -192 -291 104 -41 -87 75
7403 75 -139 -133 23 111 173 324 -179 110 49 -343 -198 47 118 -95 358 -203 -3 -160 131 -213 -80 92
7425 92 306 -6 -5 126 -238 38 239 -81 62 -69 75 -190 -174 -185 -194 -51 35 -5 -16 -224 221 473 -107
7448 -107 -264 -114 -33 5 -68 202 153 -9 262 64 -302 149 128 -53 70 -65 -239 272 189 78 27 -62 -169
7471 -169 -33 4 -19 -87 -101 -175 -2 -50 -4 -133 4 -88 152 -143 107 61 46 226 -1 -23 38 206 -42 -195
7495 -195 -127 24 125 18 -31 -29 23 20 -10 -238 -230 -135 -60 192 -73 83 -209 212 65 -217 -196 -106 163 8 -246
7520 -246 182 95 -140 126 128 5 38 87 77 -276 226 46 -66 -162 -66 128 -78 -186 -174 117 79 29 183 -36
7544 -36 149 121 -2 180 77 -55 80 85 74 -13 68 -70 2 -42 15 106 13 -38 -30 206 -132 462 9 115 13
7569 13 -203 -101 -124 -252 -280 13 194 -43 76 -50 133 -72 -100 -59 -36 80 248 -136 -136 -74 -48 -135 -180 -62
7593 -62 -87 -157 -84 14 -70 -47 -266 39 -100 74 -244 73 -49 -268 -58 -6 -384 37 -182 49 125 74 91 -192
7617 -192 -261 -24 156 -55 272 170 121 -53 -254 51 -26 120 -175 136 300 -173 293 162 32 134 -76
7638 -76 -197 36 -110 217 -150 228 119 -442 88 156 63 -113 110 -236 -172 -159 44 176 98 -150 321 127
7660 127 -159 67 45 40 -4 -82 -374 212 -80 54 135 -10 7 117 95 145 -82 53 53 208 106 -44 -262 -216
7684 -216 78 -98 39 -3 63 290 -214 69 -87 -29 -73 182 -128 160 -168 -113 -128 -214 60 -57 87 -251
7706 -251 -96 -304 -347 -74 96 99 -47 183 -318 34 -115 -187 -122 36 178 77 -174 -157 85 -136 79 -271
7728 -271 66 141 -75 -206 -15 -37 -62 331 204 -55 -203 84 -92 -47 -177 -47 -145 -128 4 -73 -32 -27 78
7751 78 88 74 -127 121 92 163 -128 86 248 -81 45 4 -49 -132 270 -209 -290 -95 64 55 -79 -12 -132 146
7775 146 -9 -20 -237 -108 -3 215 3 47 -8 5 135 19 -25 73 108 285 248 -82 45 -81 233 15 -233
7798 -233 -58 -35 -76 -29 119 -103 103 90 275 111 53 -33 46 -53 116 115 39 -144 7 -305 326 -54 20 -72
7822 -72 25 -109 191 -258 -264 73 -59 -4 -257 -114 151 169 -81 56 201 35 -40 -124 -370 -189 -78 76 50
7845 50 -210 153 -81 62 -149 -300 -110 3 53 191 -62 57 -63 -47 -344 -48 229 171 -57 247 -148
7866 -148 75 -62 -124 16 -288 53 -44 36 32 -30 34 195 -27 -26 -140 -125 -195 9 109 -23 -151 -35 -137 138
7890 138 -339 63 117 -164 362 -31 -163 175 -194 13 -105 -138 63 -83 57 43 -346 -3 3 50 -169 -77
7912 -77 111 -115 -195 -66 17 118 -61 -344 -82 -40 -4 -81 100 62 267 -151 121 -70 130 75 90 -244 218
7935 218 193 -131 32 -122 7 17 -314 -278 142 -426 18 133 -113 -290 189 47 -22 232 119 -80 80
7956 80 -120 -153 185 21 -172 -276 55 90 -110 215 105 -143 141 -162 78 -25 -46 -124 3 56 181 11
7978 11 194 2 -323 131 -89 -16 -132 -479 159 -56 -135 -87 117 -149 -225 27 29 -129 -99 110 -95 45 -156
8001 -156 21 -34 -44 7 155 -12 -128 167 -34 186 -97 -28 194 25 -134 -271 206 -154 -133 20 145 228
8023 228 -295 179 -64 -45 43 -247 41 -160 55 41 -21 -78 -14 54 16 301 -4 -121 8 120 161 -302 139
8046 139 -71 -193 -138 -166 -267 0 177 -89 128 10 -22 63 15 123 -71 -58 110 229 -134 -22 78 -18
8068 -18 -9 62 65 -10 -33 -232 -10 4 56 -339 264 -132 42 -90 -218 -159 370 225 169 19 83 14 -141 21 150
8093 150 -192 -135 -37 15 -439 101 103 18 110 105 8 0 -285 -42 112 -366 11 -259 16 -159 140 -134 236 -22
8117 -22 40 -155 -191 -108 -180 128 75 -44 -194 245 -40 -13 -35 -140 4 47 102 94 243 269 -97 152 28 -328
8141 -328 31 29 -60 -43 -92 -363 -126 274 311 99 190 256 48 90 -203 -214 -37 -166 11 49 53 253 -4 119
8165 119 43 75 -52 -187 -145 47 134 -13 -144 -31 161 -59 -93 156 82 171 137 41 203 56 39 90 -9 103
8189 103 118 -33
8191c3
##END NTUPLES=NMR FID
##END=
