##TITLE=1H_Pr 5-4-H
 D2O, 8 sc, 
 2.7.2019
##JCAMPDX= 6.0         $$ Bruker NMR JCAMP-DX V2.0
##DATA TYPE= NMR FID
##DATA CLASS= NTUPLES
##ORIGIN= UXNMR, Bruker Analytische Messtechnik GmbH
##OWNER= root
$$ XWIN-NMR		Version 3.5
$$ Tue Jul  2 15:56:57 2019 Russian Standard Time (UT+4h)  she@DPX200
##.OBSERVE FREQUENCY= 200.13155
##.OBSERVE NUCLEUS= ^1H
##.DELAY= (6, 6)
##.ACQUISITION MODE= SIMULTANEOUS
##.ACQUISITION SCHEME= undefined
##.AVERAGES= 8
##.DIGITISER RES= 18
##SPECTROMETER/DATA SYSTEM= spect
##.PULSE SEQUENCE= zg30
##.SOLVENT NAME= D2O
##.SHIFT REFERENCE= (INTERNAL, D2O, 0, 15.7039)
##AUDIT TRAIL= $$ (NUMBER, WHEN, WHO, WHERE, WHAT)
$$ ##TITLE= Audit trail, XWIN-NMR		Version 3.5
$$ ##JCAMPDX= 5.01
$$ ##ORIGIN= Bruker BioSpin GmbH
$$ ##OWNER= she
$$ F:/spectra/data/she/nmr/H-F/1/audita.txt
$$ ##AUDIT TRAIL=  $$ (NUMBER, WHEN, WHO, WHERE, WHAT)
(   1,<2019-07-02 15:55:56.57 +0400>,<she>,<DPX200>,
      <created by zg, POWCHK disabled, PULCHK disabled
       configuration hash MD5:
       00 E9 B6 7A A2 85 ED C7 34 08 36 98 17 FE 4E 26
       data hash MD5: 16K
       8D 74 83 F6 41 E8 BA 06 D4 70 D0 C6 C9 24 76 31>)
$$ ##END=
$$ 
$$ hash MD5
$$ 71 11 91 87 8C 46 2D 9F 2A 21 93 E2 4F 0D 17 7F
##$RELAX= 
##$RELAX= 
##$RELAX= 
##$RELAX= 
##$RELAX= 
##$RELAX= 
$$ Bruker specific parameters
$$ --------------------------
##$DU= <F:/spectra>
##$EXPNO= 1
##$NAME= <H-F>
##$PROCNO= 1
##$TYPE= <nmr>
##$USER= <she>
##$AMP= (0..31)
100 100 100 100 100 100 100 100 100 100 100 100 100 100 100 100 100 100 
100 100 100 100 100 100 100 100 100 100 100 100 100 100 
##$AQSEQ= 0
##$AQ_mod= 1
##$AUNM= <au_zg>
##$AUTOPOS= <>
##$BF1= 200.13
##$BF2= 200.13
##$BF3= 200.13
##$BF4= 200.13
##$BF5= 200.13
##$BF6= 200.13
##$BF7= 200.13
##$BF8= 200.13
##$BYTORDA= 1
##$CFDGTYP= 0
##$CFRGTYP= 5
##$CHEMSTR= <none>
##$CNST= (0..31)
1 1 145 1 1 1 1 1 1 1 1 1 1 1 1 1 1 1 1 1 1 1 1 1 1 1 1 1 1 1 1 1 
##$CPDPRG= <>
##$CPDPRG1= <>
##$CPDPRG2= <>
##$CPDPRG3= <>
##$CPDPRG4= <mlev>
##$CPDPRG5= <mlev>
##$CPDPRG6= <mlev>
##$CPDPRG7= <mlev>
##$CPDPRG8= <mlev>
##$CPDPRGB= <>
##$CPDPRGT= <>
##$D= (0..31)
0 1.2 0 0 0 0 0 0 0 0 0 0.03 0 0 0 0 0 0 0 0 0 0 0 0 0 0 0 0 0 0 0 0 
##$DATE= 1562068555
##$DBL= (0..7)
120 120 120 120 120 120 120 120 
##$DBP= (0..7)
150 150 150 150 150 150 150 150 
##$DBP07= 0
##$DBPNAM0= <>
##$DBPNAM1= <>
##$DBPNAM2= <>
##$DBPNAM3= <>
##$DBPNAM4= <>
##$DBPNAM5= <>
##$DBPNAM6= <>
##$DBPNAM7= <>
##$DBPOAL= (0..7)
0.5 0.5 0.5 0.5 0.5 0.5 0.5 0.5 
##$DBPOFFS= (0..7)
0 0 0 0 0 0 0 0 
##$DE= 6
##$DECBNUC= <off>
##$DECIM= 24
##$DECNUC= <off>
##$DECSTAT= 4
##$DIGMOD= 1
##$DIGTYP= 9
##$DL= (0..7)
0 120 120 120 120 120 120 120 
##$DP= (0..7)
150 150 150 150 150 150 150 150 
##$DP07= 0
##$DPNAME0= <>
##$DPNAME1= <>
##$DPNAME2= <>
##$DPNAME3= <>
##$DPNAME4= <>
##$DPNAME5= <>
##$DPNAME6= <>
##$DPNAME7= <>
##$DPOAL= (0..7)
0.5 0.5 0.5 0.5 0.5 0.5 0.5 0.5 
##$DPOFFS= (0..7)
0 0 0 0 0 0 0 0 
##$DQDMODE= 0
##$DR= 18
##$DS= 0
##$DSLIST= <SSSSSSSSSSSSSSS>
##$DSPFIRM= 0
$$ [...]
##$SUBNAM2= <"">
##$SUBNAM3= <"">
##$SUBNAM4= <"">
##$SUBNAM5= <"">
##$SUBNAM6= <"">
##$SUBNAM7= <"">
##$SUBNAM8= <"">
##$SUBNAM9= <"">
##$SW= 24.9336996594482
##$SWIBOX= (0..15)
0 0 2 0 0 0 0 0 0 0 0 0 0 0 0 0 
##$SW_h= 4990.01996007984
##$TD= 16384
##$TD0= 1
##$TE= 0
##$TE2= 300
##$TE3= 300
##$TEG= 300
##$TL= (0..7)
0 120 120 120 120 120 120 120 
##$TP= (0..7)
150 150 150 150 150 150 150 150 
##$TP07= 0
##$TPNAME0= <>
##$TPNAME1= <>
##$TPNAME2= <>
##$TPNAME3= <>
##$TPNAME4= <>
##$TPNAME5= <>
##$TPNAME6= <>
##$TPNAME7= <>
##$TPOAL= (0..7)
0.5 0.5 0.5 0.5 0.5 0.5 0.5 0.5 
##$TPOFFS= (0..7)
0 0 0 0 0 0 0 0 
##$TUNHIN= 0
##$TUNHOUT= 0
##$TUNXOUT= 0
##$USERA1= <user>
##$USERA2= <user>
##$USERA3= <user>
##$USERA4= <user>
##$USERA5= <user>
##$V9= 5
##$VALIST= <valist>
##$VCLIST= <CCCCCCCCCCCCCCC>
##$VD= 0
##$VDLIST= <DDDDDDDDDDDDDDD>
##$VPLIST= <PPPPPPPPPPPPPPP>
##$VTLIST= <TTTTTTTTTTTTTTT>
##$WBST= 1024
##$WBSW= 4
##$XGAIN= (0..3)
0 0 0 0 
##$XL= 0
##$YL= 0
##$YMAX_a= 91103
##$YMIN_a= -70051
##$ZGOPTNS= <>
##$ZL1= 120
##$ZL2= 120
##$ZL3= 120
##$ZL4= 120
##$ABSF1= 10
##$ABSF2= 0
##$ABSG= 5
##$ABSL= 3
##$ALPHA= 0
##$AQORDER= 0
##$ASSFAC= 0
##$ASSFACI= 0
##$ASSFACX= 0
##$ASSWID= 0
##$AUNMP= <proc_1d>
##$AZFE= 0.1
##$AZFW= 0.1
##$BCFW= 1
##$BC_mod= 2
##$BYTORDP= 1
##$COROFFS= 0
##$CY= 11.3945322036743
##$DATMOD= 1
##$DC= 2
##$DFILT= <>
##$DTYPP= 0
##$F1P= 18.9103706918063
##$F2P= -1.10871071338519
##$FCOR= 0.5
##$FTSIZE= 0
##$FT_mod= 4
##$GAMMA= 1
##$GB= 0.15
##$INTBC= 1
##$INTSCL= 1
##$ISEN= 128
##$LB= 0.24
##$LEV0= 0
##$LPBIN= 0
##$MAXI= 10000
##$MC2= 0
##$MEAN= 0
##$ME_mod= 0
##$MI= 1.114404
##$NCOEF= 0
##$NC_proc= 0
##$NLEV= 6
##$NOISF1= 3.799351
##$NOISF2= 2.8
##$NSP= 1
##$NTH_PI= 0
##$NZP= 0
##$OFFSET= 15.70392
##$PC= 1
##$PHC0= -8662.264
##$PHC1= 13.60097
##$PH_mod= 1
##$PKNL= yes
##$PPARMOD= 0
##$PSCAL= 0
##$PSIGN= 0
##$REVERSE= no
##$SF= 200.130013532006
##$SI= 16384
##$SIGF1= 3
##$SIGF2= 2
##$SINO= 400
##$SIOLD= 16384
##$SREGLST= <1H.CDCl3>
##$SSB= 0
##$STSI= 0
##$STSR= 0
##$SW_p= 3612.71676300578
##$SYMM= 0
##$S_DEV= 0
##$TDeff= 0
##$TDoff= 0
##$TI= <>
##$TILT= no
##$TM1= 0
##$TM2= 0
##$TOPLEV= 0
##$USERP1= <user>
##$USERP2= <user>
##$USERP3= <user>
##$USERP4= <user>
##$USERP5= <user>
##$WDW= 1
##$XDIM= 8192
##$YMAX_p= 0
##$YMIN_p= 0
$$ End of Bruker specific parameters
$$ ---------------------------------
##NTUPLES= NMR FID
##VAR_NAME=  TIME,          FID/REAL,        FID/IMAG
##SYMBOL=    X,             R,               I
##VAR_TYPE=  INDEPENDENT,   DEPENDENT,       DEPENDENT
##VAR_FORM=  AFFN,          ASDF,            ASDF
##VAR_DIM=   8192,          8192,            8192
##UNITS=     SECONDS,       ARBITRARY UNITS, ARBITRARY UNITS
##FACTOR=    0.0002004,     1,               1
##FIRST=     0,             0,               0
##LAST=      1.6414764,     0,               0
##MIN=       0,             -70051,          0
##MAX=       1.6414764,     91103,           0
$$ Real data points
##PAGE= N=1
##DATA TABLE= (X++(R..R)), XYDATA
$$ [...]
2810B358J355n95k009k395j950n01J376K884K768J154j343l537l420j171K038
$$ 2358 3713 3118 1109 -1286 -3236 -3737 -2361 523 3291 4445 3102 -435 -3855 -5026 -2988
2825b988L755L246O91k109l418k534n36J514K389K321J157n43j941k548k102k09
$$ -2988 767 4013 4704 2595 -823 -3357 -3893 -2379 10 2331 3488 2945 1004 -1544 -3646 -3855
2841c855J936L482K703J98k564l867k626J84K835L609K070m32k287k849j852j04
$$ -3855 -1919 1563 4266 4464 1900 -1967 -4593 -4409 -1574 2035 4105 3673 1386 -1463 -3315 -3419
2857c419J415K218K191J212n51k432l157j909N45K991L725K058j053l413l558
$$ -3419 -2004 214 2405 3617 3066 634 -2523 -4432 -3887 -896 2829 4887 3834 421 -3137
2872c137j334J272K815K899J229p64k072k254j587l13J332K457K620R55j226l095
$$ -3137 -4471 -3199 -384 2515 3744 2980 908 -1346 -2933 -3246 -1914 543 3163 4118 2892 -203
2888b03l373j109J864L680L071O50j972l458k658k94J639K502K108Q63n92j917
$$ -203 -3576 -4685 -2821 859 3930 4580 2608 -850 -3508 -3802 -2163 339 2447 3310 2718 801
2904H01k459j780j06J799L125K670K28k375l718k565J20K677L565K109m18k354
$$ 801 -1658 -3438 -3544 -1745 1380 4050 4278 1903 -1815 -4380 -4260 -1583 1982 4091 3673 1319
2920A319k770j720m1J399K290J925Q99p18k100k768j786O08K723L458J849r66
$$ 1319 -1451 -3171 -3212 -1813 477 2402 3301 2583 483 -2285 -4071 -3463 -740 2718 4567 3601
2936C601l119l476j472J278L040K739J112q27k206k367j315J2J302K360K340Q18
$$ 3601 482 -2994 -4466 -3188 -148 2591 3703 2876 670 -1697 -3012 -3000 -1698 662 3002 3820
2952C820j275k946k827j185J500L516L018Q08j956l259k577m99J713K655K044
$$ 3820 2545 -401 -3228 -4413 -2913 603 3621 4429 2473 -786 -3363 -3862 -2149 506 2550
2967B550O17p96j834k153j517j0J785K709K284K67k087l475k525P9K564L450K145
$$ 2550 3167 2371 537 -1616 -3133 -3143 -1358 1351 3635 3902 1815 -1660 -4185 -4106 -1542 1908 4053
2984D053l65k441k902j623J56J586K269J778P06q64k010k464j601M21K561L253
$$ 4053 3688 1247 -1655 -3278 -3122 -1536 733 2511 3217 2353 343 -2121 -3722 -3301 -740 2513
3000B513J807p63k918l378j543J172K916K849J092j012k185k200j284K16J429
$$ 2513 4320 3557 639 -2739 -4282 -3110 -194 2655 3747 2735 550 -1650 -2934 -2718 -1289
3015a289K133J902P21j149k687k661j033J364L216K974Q10j823l355k536m50J728
$$ -1289 844 2746 3467 2318 -369 -3030 -4063 -2699 517 3491 4301 2478 -877 -3413 -3863 -2135
3031b135K692K001N87j082j846j981j348J60J652K570K039L25j891l210k523j6
$$ -2135 557 2558 3145 2063 217 -1764 -3112 -2952 -1300 1270 3309 3634 1743 -1467 -3990 -4006
3047d006K369L416K086l24k296k915j669K99J738K200J594M12q61j961k087j331
$$ -4006 -1637 1779 3865 3541 1245 -1670 -3339 -3040 -1302 898 2492 2904 2043 82 -2005 -3336
3063c336M09K229K997J752o67k849l225j564J050K939K860J130j064k402k235
$$ -3336 -2927 -698 2299 4051 3384 535 -2690 -4254 -3204 -265 2595 3725 2661 259 -1976
3078a976j050L36J593J985J565N95j048k429k415j030J252K998K843Q61j706l094
$$ -1976 -3026 -2690 -1097 888 2453 3048 2000 -429 -2844 -3874 -2622 376 3219 4080 2374 -720
3094g20k589m81J768K661K100M09j225j922j802r43L41J507K229J801K49j789
$$ -720 -3309 -3790 -2022 639 2739 3148 1923 1 -1801 -2744 -2403 -896 1333 3134 3383 1594
3110A594k861k337j51K200L299K113k36k424k921j679L93J871K202J480K57j054
$$ 1594 -1267 -3604 -3755 -1555 1744 3857 3621 1197 -1724 -3403 -3010 -1139 1063 2543 2800 1746
3126A746j784j928j108M24K034K664J702n20k603l033j596Q97K865K783J111j038
$$ 1746 -38 -1966 -3074 -2650 -616 2048 3750 3230 627 -2406 -4002 -3105 -240 2543 3654 2616
3142B616k342k254r83N40J613J916J354L47j114k092k201r20J035K862K708Q78
$$ 2616 274 -1980 -2963 -2423 -810 1106 2460 2807 1693 -399 -2600 -3520 -2485 377 3085 3963
3158C963j495l087k663m49J720K767K021L73j402j919j734p72L54J545K017J588
$$ 3963 2468 -619 -3282 -3731 -2011 756 2777 3150 1748 -171 -1905 -2677 -2323 -778 1239 2827
3174B827K00j569k660k224j83K060L066K086j04k246k826j727L62J856K281J373
$$ 2827 3027 1458 -1202 -3426 -3609 -1549 1517 3603 3499 1253 -1573 -3300 -2938 -1082 1199 2572
3190B572J3j091j688j756q52N14J849K390J476l94k371k986j545Q62K716K769
$$ 2572 2585 1494 -194 -1950 -2802 -2288 -439 1951 3427 3033 662 -2324 -3869 -3007 -291 2478
3206B478J177j013k416k268r35O71J631J853J194J49j013j981j905q47J032K443
$$ 2478 3655 2642 226 -2042 -2977 -2306 -675 1178 2372 2521 1508 -473 -2378 -3225 -2193 250
3222B50K553R00j411k833k511n25J590K668K080K83j277k187j524o84O44J517
$$ 250 2803 3703 2292 -541 -3052 -3577 -1987 681 2761 3044 1767 -420 -1944 -2628 -1984 -467
3238d67J776J428n8j379k369k039k03J800K965K081j17k185k778j750K96J928
$$ -467 1309 2737 2679 1300 -1069 -3108 -3311 -1511 1454 3535 3418 1233 -1545 -3295 -2999 -1071
3254a071K337J323o4j203j792j420p06M82J729K091J440l94k164k647j543O62
$$ -1071 1266 2589 2525 1322 -470 -1890 -2596 -2114 -385 1706 3146 2752 588 -2059 -3602 -2940
3270b940K502K751J221r53k398k286q19P07J708J847R84k1j134j780j614o83R70
$$ -2940 -438 2313 3534 2581 183 -2103 -2922 -2215 -507 1340 2324 2303 1169 -611 -2225 -2908 -1938
3287a938K181K268R25j171k660k418p41J536K679K117K90j329k090j662m99O81
$$ -1938 243 2511 3436 2265 -395 -2813 -3554 -2018 661 2778 3068 1739 -351 -2013 -2512 -1831
3303a831J438J687J104L5j230k230j845k17J682K663J988M2j973k756j687K40
$$ -1831 -393 1294 2398 2433 1203 -1027 -2872 -3089 -1407 1256 3244 3286 1313 -1443 -3130 -2890
3319b890J954K225J347j98j313j633j462m34O38J581J849J250m30j874k458j483
$$ -2890 -936 1289 2636 2438 1125 -508 -1970 -2404 -1766 -185 1664 2914 2484 610 -1848 -3331
3335c331M94K401K635J264r33k272k293r60Q62J756J765R30j90j154j600j376
$$ -3331 -2837 -436 2199 3463 2530 258 -2035 -2995 -2133 -377 1388 2318 2128 974 -626 -2002
3351b002o45Q78K007K154Q21j114k475k365o02J392K607K036K62j338k145j612
$$ -2002 -2647 -1769 238 2392 3213 2099 -376 -2741 -3343 -1951 656 2692 2954 1616 -529 -2141
3367b141l59Q44J573J515Q16o7j216j908j595l16J553K429J899J39j839k695j784
$$ -2141 -2500 -1656 -83 1432 2248 2181 965 -943 -2538 -2854 -1301 1128 3027 3166 1327 -1368 -3152
3384c152L11J875K325J271k35j424j754j149k91O66J471J621J052l17j787k180
$$ -3152 -2841 -966 1359 2630 2395 971 -783 -1932 -2223 -1557 -86 1535 2587 2270 483 -1697
3400a697j338M10K115K542J221q10k293k250q41Q58J797J877P42l73j263j506
$$ -1697 -3035 -2625 -510 2032 3253 2443 150 -2100 -2941 -2083 -286 1591 2333 1960 697 -809
3416h09j245l44P99J916J714Q38q26k338k247p49J391K383K079M89j444k136j639
$$ -809 -2054 -2398 -1599 317 2031 2869 2043 -295 -2542 -3291 -1900 483 2562 3051 1607 -529 -2168
3433b168l09R86J473J440P84l01j176j647j428j58J276K227J788J48j645k524
$$ -2168 -2477 -1491 -18 1422 2206 1905 729 -918 -2346 -2504 -1228 999 2787 2935 1290 -1234
3449a234j806K36J910K267J245l36j380j799j118j09Q98J369J436P50l35j547
$$ -1234 -3040 -2804 -894 1373 2618 2282 902 -897 -2015 -2124 -1226 143 1579 2329 1994 447
3465D47k039j273L54J945K428J265p19k264k161q82Q38J893J720P25m48j236j438
$$ 447 -1592 -2865 -2511 -566 1862 3127 2408 144 -2017 -2899 -2061 -168 1552 2277 1829 593 -845
3482h45j076k13Q43J597J651O23p58j994k173o65J271K329J962L60j341k134j564
$$ -845 -1921 -2134 -1291 306 1957 2580 1822 -172 -2345 -3010 -1739 590 2552 2912 1571 -563 -2127
3499b127k82J076J637J263N85l97j184j564j153j78J166K096J638K00j632k297
$$ -2127 -2409 -1333 304 1567 2152 1755 571 -993 -2146 -2324 -1158 938 2576 2776 1144 -1153
3515a153j579jJ740K320J329l63j434j737j189J4R59J396J163N88l50j357j837
$$ -1153 -2732 -2733 -993 1327 2656 2293 859 -878 -2067 -2053 -1094 302 1465 2053 1703 346 -1491
3532a491j106M11J701K196J200o06k132k088r55Q40J833J790O85n49j334j405
$$ -1491 -2597 -2186 -485 1711 2911 2305 173 -1915 -2870 -2030 -197 1593 2278 1729 395 -1010
3548a010q35o5Q22J470J463O15p45j870j982p62J087K261J993L43j276k107j521
$$ -1010 -1845 -1910 -1088 382 1845 2460 1715 -155 -2137 -2899 -1812 449 2442 2785 1509 -598 -2119
3565b119k88J101J627J295L54l46j270j375j002o0J134J758J586K00j460k207
$$ -2119 -2407 -1306 321 1616 1970 1624 354 -1021 -2023 -2083 -949 809 2395 2595 1135 -1072
3581a072j558K2J647K263J319l17j601j797r44J23R16J414J108M39m50j224j731
$$ -1072 -2630 -2608 -961 1302 2621 2304 703 -1094 -2038 -1915 -999 415 1523 1962 1512 288 -1443
3598a443r10K18J606K132J187n27j918k126q73P68J832J680P69o14j442j364p06
$$ -1443 -2353 -2135 -529 1603 2790 2263 345 -1781 -2654 -1886 -54 1626 2395 1781 339 -1025 -1731
3615a731J18P69J324J316M61p12j735j765n91Q98K116J897L85j208k079j638j97
$$ -1731 -1613 -844 480 1796 2257 1545 -190 -1955 -2546 -1648 468 2365 2750 1542 -537 -2175 -2372
3632b372J115J639J258K92n87j173j277q27Q1J007J582J394K08j295k091j517
$$ -2372 -1257 382 1640 1932 1345 172 -1105 -1932 -1851 -844 738 2132 2340 1045 -1046 -2563
3648b563J3J550K081J384l25j456j784j015K43J002J433R29L35o65j103j342q34
$$ -2563 -2550 -1000 1081 2465 2140 684 -1100 -2115 -1872 -870 563 1492 1827 1162 59 -1283 -2117
3665b117K27J467J868J105m68j751k037j002P15J881J797P02p19j504j363o75
$$ -2117 -1890 -423 1445 2550 2082 331 -1706 -2708 -1993 -112 1685 2387 1668 164 -1199 -1874
3681a874L27Q44J266J048L32o66j465j634o12Q13J875J803N62j108k017j619k46
$$ -1874 -1547 -703 563 1611 1943 1277 -188 -1822 -2434 -1621 254 2057 2619 1511 -506 -2125 -2371
3698b371J097J716J196K91p85j124j149o10R5J012J374J250J30j111j858j487
$$ -2371 -1274 442 1638 1929 1144 20 -1129 -1739 -1644 -632 742 1992 2122 1011 -847 -2334
3714b334p5J487K126J263k84j454j787j072K71J167J353R06J40n05j208j202p66
$$ -2334 -2409 -922 1204 2467 2183 729 -1058 -2130 -1859 -692 661 1567 1707 1202 -6 -1208 -1974
3731a974K49J358J730J058l89j637j976q68N31J757J785P81q11j524j354n07L17
$$ -1974 -1725 -367 1363 2421 2032 395 -1581 -2449 -1918 -161 1624 2405 1594 70 -1284 -1791 -1474
3748a474R73J180Q58J72o31j285j464n65P38J761J730N21j010k013j531k43J123
$$ -1474 -501 679 1537 1709 1078 -207 -1671 -2236 -1498 263 1993 2514 1504 -509 -2040 -2283 -1160
3765a160J664J217K24p75j322j025n52K51R91J260R75J93r75j683j421j74J351
$$ -1160 504 1721 1945 1170 -152 -1177 -1729 -1478 -487 773 1748 1941 966 -717 -2138 -2312 -961
3782i61J948J292j27j484j785r88K64J244J371Q37j3o50j069j038o05K88J192
$$ -961 987 2279 2152 668 -1117 -2105 -1841 -597 774 1611 1598 948 -121 -1159 -1764 -1476 -284
3799b84J484R82k28j587j837r67N53J720J785P21p52j553j374m97L94J058J068
$$ -284 1200 2182 1954 367 -1470 -2437 -1884 -164 1621 2342 1590 37 -1337 -1834 -1440 -382 686
3816F86P36J83o69j216j243m79N99J632J618N08r01j865j578k23J044J682J206
$$ 686 1422 1605 936 -280 -1523 -2002 -1403 229 1847 2355 1454 -411 -1989 -2212 -1168 514 1720
3833A720J39q35j282r91l37L83R28J020R43Rr24j523j220j52J232J814J315j14
$$ 1720 1859 1024 -258 -1249 -1586 -1203 -275 745 1688 1697 773 -750 -1970 -2122 -890 924 2239 2125
3851B125j444j721j040K41J269J342Q56q7p49j072q77m19L29J046J337R17l43
$$ 2125 681 -1040 -2080 -1839 -570 772 1628 1541 792 -280 -1157 -1576 -1247 -201 1136 2053 1710
3868A710j264j826q94M56J643J706O42o59j530j323m49M19J077J112O10k6o42
$$ 1710 446 -1380 -2274 -1818 -175 1531 2173 1514 -16 -1339 -1788 -1369 -292 820 1430 1404 762
3885G62j107j063m68O22J493J421N62q83j664j558l11R27J784J261P3q14j345
$$ 762 -345 -1408 -1876 -1254 239 1660 2222 1339 -325 -1883 -2194 -1267 517 1778 1851 1037 -308
3902c08j044k00M43Q47J071P38L5q60j359j109j96J104J668J302n9j354j799r40
$$ -308 -1352 -1552 -1109 -262 809 1547 1582 722 -637 -1746 -1942 -838 830 2132 2073 719 -1080 -2020
3920b020K79J228J414P65j23q82r96q45l06L51J032J155P01k25j168j692p89L80
$$ -2020 -1741 -513 901 1666 1543 661 -335 -1180 -1486 -1135 -103 1052 1753 1528 360 -1332 -2121 -1741
3938a741J586J628P01o21j530j322n19N77J098J068N31j62o84j039r18k98N06
$$ -1741 -155 1473 2174 1553 23 -1299 -1818 -1241 -143 925 1456 1294 610 -429 -1347 -1645 -1139
3955a139J389J259N04o75j639j488l69J019J633J313K1q57j349r53k11N36R50
$$ -1139 250 1509 2013 1338 -301 -1789 -2158 -1139 494 1807 1828 971 -378 -1331 -1542 -1006 -56
3972e6R72M84j07o93j280r56j97R83J603J248m8j282j677r73K51J221J390P75
$$ -56 916 1400 1293 600 -680 -1636 -1833 -850 753 2001 1953 671 -1006 -1979 -1728 -507 883 1658
3990A658k03r21j031o73j96M62P97J109O06k29j185j376q10L65J378J554P67o02
$$ 1658 1455 534 -497 -1170 -1366 -904 -107 1002 1608 1379 194 -1182 -1992 -1627 -249 1305 2072 1470
4008A470j440j367m71N82J160J023N24k88p47r66p74k09N72J137J168M94o05j578
$$ 1470 30 -1337 -1808 -1226 -66 957 1481 1193 446 -520 -1294 -1503 -931 206 1374 1868 1263 -315
4026c15j374l19Q92J558J250J89j016j288r16j50N72R84Q10M28j14p85j051q98
$$ -315 -1689 -2008 -1116 442 1692 1881 865 -423 -1339 -1489 -917 67 877 1305 1191 406 -645 -1543
4044a543j05Q19J511J169j2j194j567r98K26J227J425P84l04r78j012p42k4N07
$$ -1543 -1648 -829 682 1851 1839 645 -922 -1920 -1694 -467 958 1742 1438 460 -552 -1294 -1318 -811
4062h11Q82R65M99l08r96j261q14L21J288J545P30n68j456j374m21N17J243J023
$$ -811 71 1036 1535 1227 231 -1030 -1844 -1523 -235 1310 2040 1472 16 -1358 -1779 -1262 -19 1004
4080A004M44l19p89r08o65k2M34J040J081M28n60j414j318l59Q18J530J245J90
$$ 1004 1448 1129 340 -568 -1233 -1255 -821 219 1300 1728 1168 -246 -1564 -1923 -1105 425 1670 1860
4098A860r64j330r45r2O65J010Q23K62k72p35r21p22j21Q57J296J053K8j073j508
$$ 1860 896 -434 -1379 -1471 -806 204 1027 1289 1017 282 -639 -1361 -1482 -625 671 1724 1752 679 -829
4117h29j028J92J165J445P25k62r62j116o03LO06Q68P60L79k24r76j145o99L02
$$ -829 -1857 -1665 -500 945 1670 1408 446 -670 -1273 -1270 -664 204 964 1343 1119 143 -1002 -1701 -1399
4136a399J204J348O76m15j383j357m92N73J260J073L98m98q18q45m96m1N46Q85
$$ -1399 -195 1153 1829 1414 31 -1326 -1818 -1245 15 1088 1486 988 170 -675 -1171 -1212 -666 219
4154B19R35M21n66j171j311m51Q94J407J210J56q48j413q84r9P11J076O73K27
$$ 219 1154 1575 1009 -162 -1473 -1924 -1030 377 1587 1743 895 -518 -1402 -1501 -790 286 959 1186
4172A186k03p06q70o75N6O28J171J004Rr00j430j012J49J117J419P46l20r76j070
$$ 1186 983 277 -593 -1268 -1212 -584 587 1591 1600 700 -730 -1742 -1593 -476 943 1689 1369 393 -677
4191f77n81N8O95Q49O16K29k71p98r93o63K04J113J282P23m30j319j338m50O12
$$ -677 -1258 -1200 -505 344 960 1189 918 120 -873 -1536 -1332 -219 1063 1786 1356 37 -1301 -1751 -1139
4210a139J137J069L42l62q81r04m07O4O06P58Q21K61m46j055j137l95O01J404
$$ -1139 -2 1067 1409 1047 166 -738 -1145 -1081 -475 283 1104 1365 919 -136 -1273 -1668 -1067 337
4228C37J252J70q53j333r45q9P03J215O28J34m79o47p25n76pP98J007P93J22q65
$$ 337 1589 1759 906 -427 -1372 -1461 -758 457 1085 1219 740 93 -632 -1208 -1215 -417 590 1383 1505 640
4248F40j349r89R7J070J341P78k19r75j257m92K00O59Q51N86J43l78o84q58n67
$$ 640 -709 -1698 -1601 -531 810 1588 1369 394 -863 -1355 -1155 -496 355 941 1084 706 22 -836 -1403
4267a403J81J002J150P54m02j173j279n76N93J184J128L12m10j035q69l78L02
$$ -1403 -1222 -220 930 1684 1282 109 -1170 -1746 -1153 31 1159 1471 1061 26 -843 -1221 -919
4284i19N33P59P26J61m96r76r98l42N43J295J070L45q23j317r17q3P30J063P94
$$ -919 -386 373 1099 1260 764 -212 -1210 -1552 -1009 286 1356 1701 878 -439 -1356 -1439 -709 354 1148
4303A148nm19p44p08m24J89O30Q64P53L2p51j192r64J06R72J320P88k66r69j176
$$ 1148 1143 724 -20 -728 -1152 -963 -333 531 1284 1316 565 -627 -1591 -1485 -513 807 1595 1329 360 -816
4323h16m98J84P55Q71M91Q2m23p13q16l22J53Q59J095O46l03j145j164n66N33
$$ -816 -1314 -1130 -375 496 987 1069 646 -67 -883 -1205 -1052 -193 902 1548 1245 100 -1064 -1630 -1097
4342a097J250J023K79n75r07p52l03J91O31P03N44J52n16q41q44l57N92J049J155
$$ -1097 153 1176 1455 880 -27 -779 -1082 -891 -260 443 987 1139 623 -218 -1062 -1419 -827 222 1377
4361A377J74o75j315r41q6Q14J087O76N5n22q72n76k24J37N85Q51N98O7o75j098
$$ 1377 1551 876 -439 -1380 -1466 -652 435 1111 1166 644 -228 -804 -1028 -891 -306 545 1143 1210 535 -563
4381e63q30N0P88J293Q02k99r43j066n89K18Q07R04M15p5m27p20n84k99K04P93
$$ -563 -1393 -1343 -555 738 1540 1241 298 -768 -1357 -1139 -332 572 987 912 485 -235 -819 -1118 -914 -121
4401a21R71N32l35r63j105n22M30J155J084L24n46r82p99k12K97O93N78M89N8
$$ -121 850 1382 1047 84 -1021 -1543 -1113 42 1126 1450 904 -78 -877 -1089 -792 -99 479 968 1026
4420A026m86p52q20k26M27J070R28K87n70j233r59lO70J111O93k5n61p96n27k22
$$ 1026 540 -212 -1032 -1258 -831 239 1167 1454 884 -349 -1308 -1311 -641 470 1163 1138 577 -219 -746 -968
4440i68K42N65O93N46L2o45j013p51K5P61J280O22k02q36j135n71K89Q25Q60L62
$$ -968 -726 -161 532 1078 1110 465 -548 -1299 -1274 -513 767 1389 1187 351 -784 -1355 -1066 -241 619 981
4460I81j14m28o74o08j84K82O13Q86N21k45q37j094n54L83J094J035K93m77r67
$$ 981 867 439 -235 -843 -1027 -745 -132 754 1275 1030 193 -901 -1455 -1072 22 1057 1350 873 -94
4479i4p98k54M26O20O17L91p7l86o83o45k06M33Q56R42K67o69j064r01j38O83
$$ -94 -892 -1146 -720 -100 517 908 831 445 -238 -883 -1089 -656 200 1142 1409 740 -324 -1225 -1363 -680
4499f80J111P07J05p23q44n31q4K96N21O29M47L4o13q85o72n4P71J126O91j39
$$ -680 431 1138 1243 520 -324 -855 -939 -643 -122 507 954 988 375 -510 -1182 -1236 -465 661 1352 1213
4519A213q90j098n50L08Q81P69M13j71n73n89m74j65K66O79P29L73j67q32j009
$$ 1213 323 -775 -1325 -1017 -136 633 1046 875 302 -287 -761 -926 -660 19 748 1121 954 122 -887
4538h87n03M03R69J061K88m68r81q37j70L46P84N60L66j67m28o01o04j66L83Q45
$$ -887 -1390 -987 -18 1043 1331 863 -118 -955 -1125 -779 5 565 931 764 336 -265 -869 -1035 -652 193
4558A93Q66K31n85j041q11j49P02R41Q30l0o51q63n14r4M36N25N96K57o5m29p74
$$ 193 1059 1290 705 -336 -1147 -1296 -594 347 1177 1147 496 -367 -881 -975 -539 -14 582 839 774 345 -429
4579d29o96N9O63R56P98j80q43j099m95K63Q11Q81L92k40n60o53m52K4K41N95
$$ -429 -1125 -1066 -403 553 1351 1171 328 -771 -1266 -1003 -192 689 1081 841 281 -372 -824 -800 -559 36
4599C6O62L40j89p03r05n64M23Q76R99L54n21q91q41k38M30Q44N18K45j74n68
$$ 36 698 1038 849 146 -759 -1323 -900 -24 975 1329 808 -83 -924 -1162 -732 112 630 875 701 133
4619A33n41l74j67M66O92O81L21m88j025q14k06O86J029P15J1o56q31n63M8L91
$$ 133 -408 -782 -949 -483 209 890 1211 723 -302 -1116 -1322 -636 393 1108 1119 463 -368 -931 -883 -492
4639d92O12M98J70j61l89o78n29j7N50R67O47j07p01j072n69K55Q47Q53L99k49
$$ -492 120 618 788 627 238 -440 -969 -986 -436 531 1178 1071 370 -702 -1271 -1016 -169 684 1083 834
4659H34o40o56l00K9L16N49N33K41k12o62q09l57K66Q75R16L82m73q94q60j41
$$ 834 194 -462 -762 -733 -417 132 665 906 694 32 -777 -1134 -868 7 923 1305 832 -62 -922 -1063
4679a063L66Q11N93J66k11n75m91l14j05L72O59O24K22m26q82p52k66O82R63P71
$$ -1063 -697 114 707 873 662 87 -404 -718 -823 -451 208 832 1054 628 -254 -1006 -1272 -590 373 1144
4699A144j01o77p39n16J8M92N60M97P8j64m59o24m23M2N35Q26O49q2p47r68n13
$$ 1144 1043 366 -373 -889 -871 -379 181 678 756 592 133 -491 -914 -872 -337 489 1138 1056 309 -659 -1172
4720a172J76P88R12L03k42o20o07l36J35L78M70M57J92k05n68p25l84K28P83Q87
$$ -1172 -996 -208 704 1007 765 145 -462 -798 -663 -285 185 642 834 629 61 -664 -1048 -820 -37 850
4740H50L21l57r37q05j75M83P89N58J61l14n12n13l11L5L60N92N65K22m41p69
$$ 850 1171 814 -123 -928 -1103 -620 169 727 888 574 62 -451 -762 -727 -367 225 790 1012 571 -198
4760a98q45j14N54R74P03K5o48r01m89R0M57N93M23J01k24m38m74m17O7N15P63
$$ -198 -1043 -1157 -603 371 1074 1099 451 -450 -939 -849 -392 201 624 725 501 63 -411 -828 -761 -246 517
4781E17M76n3o15q63n95J47Q28Q03M48l35o10o43l26J75L40N86L59J21j94o08
$$ 517 993 940 325 -538 -1133 -986 -158 645 1093 758 148 -495 -821 -646 -306 280 639 760 566 -42
4801d2o11k84J69O43J010K42l47q76p73k05M06P85O21J52l49n80m96k20R5M00
$$ -42 -653 -937 -768 -125 885 1127 780 -96 -869 -1074 -668 117 738 890 541 -39 -535 -755 -660 -260
4821b60N23M23J26l42o85o21j98M58R50O50P1o29q31o37J54M96O54L86M7k62m75
$$ -260 263 686 812 470 -215 -836 -1034 -576 374 1024 1095 466 -365 -1002 -848 -352 302 688 735 473 -2
4842bm51l18Q7M29O44N76o4n78q41n26J88O61Q52L68k46o41p42j81P7M73N32L38
$$ -2 -453 -771 -684 -255 389 965 901 323 -518 -1044 -856 -195 657 1025 779 138 -604 -785 -708 -235 297 635
4864F35O0k24n44m73l54J81O84P01L79l68p05q12j88L86P86O39R2l78n42m64j37
$$ 635 695 471 -73 -546 -900 -719 -35 666 1045 677 -28 -840 -1028 -642 144 783 875 497 -45 -509 -646
4885f46Q4L51M98L57J54m30n90n83k01M62Q41O46N5n67q12m58j7N02O57M08k0
$$ -646 -562 -211 287 644 798 368 -222 -805 -1006 -544 297 943 998 431 -381 -839 -856 -354 303 711 691
4906F91l02m38m29j69M0M63N59M43Lm86q48n25J22O56R09L37k24p08o86k93K39
$$ 691 389 -49 -478 -647 -607 -144 415 858 861 375 -473 -998 -876 -220 689 1026 802 94 -592 -885 -646
4927f46M87N18L13j10j95m40n38j36J34N86P02L54l03p62p15k60L12Q30P24J7
$$ -646 -159 359 672 562 367 -73 -611 -747 -613 -27 675 1029 726 -36 -751 -1011 -699 131 855 872
4947H72m13n94m15j67K01L80M54L11J2k76n89m90j55L77Q00O01L7n40p62n55J05
$$ 872 459 -135 -550 -717 -516 -136 318 629 641 365 -224 -714 -869 -492 308 909 946 406 -356 -911 -806
4968h06N14P18L20l3m29m49l78r0N7M89M99K85O0m69p05n00J33N65Q10L37j82
$$ -806 -292 426 746 713 284 -165 -543 -633 -576 -87 412 697 757 288 -417 -917 -784 -219 591 928 746
4989G46o92o52j92J69N03M98K45l3l63l66m49m4J04N03O34K82k84o61o93j97L84
$$ 746 54 -598 -790 -621 -118 380 625 592 229 -137 -586 -630 -526 -23 611 893 609 -52 -745 -942 -558
5010e58O46P17P9m14o53m19r5J98M48M47J61N0k43n76m65j45L65P29N06Q9m05
$$ -558 88 805 884 470 -183 -602 -697 -499 -51 396 557 607 364 -212 -677 -822 -457 272 778 867 462
5031D62p68n81N1N48O64L64j4m22n05l27mK28K98M98J81j22l38o94l51M9N86P84
$$ 462 -306 -887 -836 -288 376 740 726 304 -201 -528 -532 -304 -6 492 673 551 213 -481 -832 -783 -197 587
5053E87K93j05o99o06l38L05M74N14K03j09l17m22l01r9J86M75M35L54k01o83
$$ 587 880 775 76 -530 -868 -563 -89 425 628 519 202 -220 -521 -620 -434 41 476 830 629 -54
5073e4n91k09K86O14P15O8l89o42l71j23L38M34L65J14n7k92l48m48n9K74N81
$$ -54 -645 -854 -568 46 761 829 440 -202 -573 -696 -358 76 441 555 498 206 -142 -590 -649 -375 206
5094B06N46J47n02p11n38M9N53O57L60j41m29m92k10k6K35L30L18K52o0l51n51
$$ 206 752 899 397 -314 -852 -803 -250 407 767 626 197 -295 -505 -531 -296 34 352 604 544 193 -358
5115c58m21L9N48O74L33j52o15n89l19K74N20N33J68j13l95l63l46K1K75L62M56
$$ -358 -779 -740 -192 482 815 663 48 -541 -860 -586 -66 467 635 522 127 -236 -582 -561 -286 76 532
5136E32J91k21n46o19j43K65O26O34J10m28n07n15o9L47M52L12J46j36k91m04
$$ 532 723 502 -44 -663 -806 -541 85 719 829 401 -106 -621 -690 -343 109 421 567 431 140 -264
5156b64l51O0K23N77M47Jl80n87n31N2N09O52L82j74m40m60k66j0L38L53K42J37
$$ -264 -615 -555 -332 245 692 693 313 -274 -805 -753 -244 408 790 616 176 -284 -550 -560 -222 131 373 510
5178E10j08l63l95l70K5N60O37L60k23n36o22k73K29N60M88J11j41m22l25j65
$$ 510 402 39 -356 -726 -701 -141 496 856 633 97 -525 -798 -569 -9 479 590 449 27 -298 -463
5198d63l5K52M02L10J52k00n23m92k31K99O46N88J28l97o56m45O9L34M14L21Q7
$$ -463 -498 -246 156 466 618 418 -105 -597 -828 -529 117 705 833 436 -220 -665 -596 -262 152 473 560
5219E60k04k84l87j87pK70M68M63ml99n62m51J4M89N99L35j02n25m39l28J23L62
$$ 560 356 72 -315 -502 -509 -239 229 692 688 289 -273 -724 -710 -221 378 713 611 86 -353 -681 -558 -196
5241a96L97K19L2j04l31l33l22N4M19O48K58j73m50o70k30K69N03N91P8k21m63
$$ -196 201 420 452 348 17 -316 -638 -584 -165 483 741 568 118 -552 -782 -513 -10 581 659 438 -25
5262b5l54j48J25K33L32L21Jp5n20l85k46L11N95N56L9l81n62m60KL40N09K63
$$ -25 -379 -527 -402 -169 163 484 485 410 -110 -495 -741 -430 165 721 760 379 -183 -643 -641 -301 208 471
5284D71L0j78k89l22j82P4J86M14L58O6m08n25l90K4M05N96L98j28m43n94j44
$$ 471 501 323 34 -288 -470 -396 -210 204 562 628 220 -305 -695 -671 -266 330 728 600 157 -437 -581
5305e81J04L30M05J92k1j44l16l19k06J14L99M52K59n9n18o32k36K27N92M92J36
$$ -581 -477 -147 258 450 429 285 -31 -350 -556 -442 -43 409 668 609 91 -541 -777 -550 42 534 670
5326F70k45m32l86q1J50K64K93K03P1k08l56m25j01K17N53M32J17l81n76m08K0
$$ 670 425 -7 -393 -474 -324 -60 233 436 507 299 -57 -482 -583 -366 187 619 736 355 -221 -629 -609
5347f09L71M84K95n3k06l63k70j20N1L47L31K63N3l39m73l73l1M50N45L76j42
$$ -609 -238 246 541 488 282 -81 -351 -471 -420 -73 258 521 574 235 -238 -611 -642 -192 353 729 587
5368E87m70m84k35J02L36M19K61j00j82k68l36o2M2K67N02K08p0n39m86j55J49
$$ 587 117 -367 -602 -500 -164 255 516 416 234 -34 -370 -432 -390 -123 379 587 517 -22 -508 -663 -514
5389e14O14M35J16k49m67l89p2K17K72L01J80o7j06m00k59j60K17M97M25M8l44
$$ -514 100 535 651 402 -65 -454 -526 -309 -37 264 444 377 271 -129 -388 -548 -331 166 591 639 295
5410B95m66m49k0L71N05L37n8l44k94k58l9Q7L55K15K68r1k15m16m47P0M12N15
$$ 295 -171 -620 -640 -269 236 573 515 171 -123 -381 -420 -333 22 237 505 414 199 -217 -664 -594 -182 333
5432C33K87r9m50m70k29J60L45L96J97p8k60k45l10QN9L56L62J86q1n07m82j38
$$ 333 620 521 71 -399 -628 -468 -123 273 470 392 132 -113 -423 -415 -356 0 362 548 467 -40 -522 -660
5454f60K12N30M54Q9k73n23k84m5K35K58K77O8M3k75k74k44p4J62M16M46N9k99
$$ -660 -448 82 536 625 352 -171 -455 -500 -265 -7 270 338 381 106 -168 -412 -486 -324 92 538 597 298
5476B98n36l18l1M11M34K48n7k16m05k64K3J59K60K43J62K0k89m30k25rL41M95
$$ 298 -238 -556 -587 -176 258 506 449 233 -172 -436 -413 -254 6 249 411 431 142 -288 -513 -522 -181 314
5498C14K83j9n36m63j56J58L94M12Q8j70j88l09j43n7J52L12K80J63j54l15n00
$$ 314 597 578 42 -421 -577 -419 -25 387 475 305 117 -192 -335 -392 -240 72 352 515 361 46 -454
5519d54j79K29M57M48N8j98m31l64k3K48K99K47M3l8k53k17l07l4K75L61K23J36
$$ -454 -633 -404 53 501 559 361 -70 -434 -457 -209 90 337 380 342 89 -128 -435 -469 -194 167 390 526
5541E26k34n65k40n6L87M48K45j02j77m99j51l0K99K45J91R6o8k67m08j55L0L25
$$ 526 292 -273 -513 -569 -182 266 511 409 232 -267 -418 -448 -149 96 287 383 315 48 -360 -515 -485 -160
5563a60N05K09k0m42n45j57K06M24L34J34j22l68k48j04QJ51K28L75K6p6l76l13
$$ -160 345 554 534 92 -453 -610 -404 20 354 488 366 -2 -250 -354 -346 -195 33 408 434 358 -18 -331
5585c31j91J76M17L45J97k70m60l24n2K23L64K29J04k09j96k29k37K8J68M04L23
$$ -331 -522 -346 71 416 613 343 -117 -441 -493 -270 94 323 427 218 22 -207 -444 -416 -248 156 479
5606D79J5k96m17l19m6M27M83K50j18l74l43j14KJ56L48J81J14j31l50j94k15
$$ 479 494 198 -219 -538 -584 -157 326 576 458 84 -259 -373 -371 -215 133 314 428 297 -53 -247 -462
5627d62N1K71L87L36j02l83m82j75J40M06L31K06k24k21k92j39L6J33K72K47P1
$$ -462 -411 -140 247 583 481 98 -384 -559 -419 -13 318 524 300 79 -213 -352 -316 -183 89 336 407
5648D07q6l30l85r0J04M88L30J31k78n07k65JK14M06K15L5j68k20k00j83P9J05
$$ 407 321 -9 -394 -484 -380 108 438 569 291 -216 -481 -480 -266 140 355 390 222 2 -198 -381 -302 -197
5670a97L65J95J73l15m67l08l2M01M34L35j57k87m04k13R5K53L00J08M5r2k27
$$ -197 168 363 536 221 -246 -554 -586 -185 249 584 427 140 -264 -477 -382 -129 171 279 324 232 5
5691Ek40j58P8K66M01J86j03m32m20j08J62L76L86J22j43l86l14k2Q5K27J46J95
$$ 5 -235 -393 -315 -49 352 538 435 3 -417 -525 -363 13 399 521 378 -8 -322 -344 -259 -32 114 309
5713C09N9j80k01l87n7J94L62L30J08k48m89k72j5K71L71K16L7k00k13k13j22
$$ 309 368 188 -13 -400 -457 -263 99 429 537 289 -200 -472 -487 -216 155 371 408 208 -5 -218 -340
5734c40R5J94K36J70K2k14l92k96LM15L88K95j32l48l30k77J06K92L51J23o9j85
$$ -340 -245 -51 185 355 377 163 -229 -525 -522 -107 281 576 444 96 -234 -511 -405 -113 238 361 292 107
5756A07j66k26o5N7K91L44P5O6m52m03j94J44M40L52J95l02k72k86j55J89K52
$$ 107 -59 -285 -350 -293 -2 342 417 483 31 -372 -566 -422 18 370 565 263 -9 -295 -450 -261 -9
5777iK12J89j37j00k87j73j38J62L67M07R4l82m12k29o8K48M47K81k7k99j87k81
$$ -9 203 392 255 155 -132 -305 -443 -281 86 493 587 205 -207 -436 -504 -256 191 472 445 146 -41 -322
5799c22l8J50J96J62K61p8j98l46k73kL27M60K05n9m11k79k59K65K12K55J38p6
$$ -322 -360 -210 -14 148 409 331 133 -213 -486 -488 -161 299 504 445 34 -245 -504 -239 -27 228 366 290
5821B90j47k55j87NP1K48K31K17j71k87l86j13J53L39L74J33j47m54k50l3J27
$$ 290 143 -112 -299 -294 -223 25 256 473 302 15 -371 -484 -331 8 382 515 368 -86 -336 -369 -242
5842b42K28K82P5p2j77j47k46j10J57L30L53O1k19m53l09LK65L80K76J2k60l93
$$ -242 -14 268 343 271 94 -53 -299 -409 -252 78 431 492 273 -180 -489 -486 -221 159 435 447 187 -206
5864b06j19JJ12K40J59J43k1k19l58j60J0K45M42K47o7l80m31j38J71L02K89J27
$$ -206 -325 -324 -212 28 187 330 309 90 -268 -428 -418 -173 269 516 449 69 -362 -500 -329 -27 262 389
5886C89o3k40k60j34j1J56K64K04J22p8l42l53j58J28L52M26O3k31l70k38k1R6
$$ 389 326 86 -174 -308 -319 -163 101 305 427 349 7 -346 -504 -376 -24 402 465 234 -136 -374 -395 -299
5908b99L45J61J91j91j85j83j47q5J80L61K49J3j69l44l57L0K30L85K32j4l53
$$ -299 46 207 398 207 22 -161 -308 -393 -213 148 397 410 241 -103 -460 -430 -200 185 417 403 50
5929E0k48j21K8Q4J95K50J37o6k57k55k05M4K70K99K74j15k95m07j18R4L11L83
$$ 50 -198 -319 -291 -207 -12 238 375 309 52 -203 -408 -364 -94 205 479 364 69 -338 -456 -362 -51 332
5951C32Q1j74k29j77j10k0J45K56J67J50j69k50l22k16K33L76L56R8k61l93k91
$$ 332 413 239 10 -167 -277 -297 -152 104 271 421 252 2 -320 -536 -303 73 429 527 266 -127 -418
5972d18N1J59K68K80k9r0j43k61j67L3J28L38J81R7j73m36k96K0L17L28K14p2
$$ -418 -367 -208 60 340 311 221 78 -183 -350 -317 -189 149 330 427 254 -182 -478 -458 -141 187 401 329
5994C29k38k72k43P9K29K44J02P7j67q6k62j60M4K64L31J59j0l63l75r3O5L87
$$ 329 91 -181 -424 -345 -116 128 230 307 140 54 -208 -368 -324 -60 271 430 420 57 -318 -411 -346 41
6016D1K76R0r6k79k08q0n7K02J86J88L8j22j68l16q9J35L87K42J56k89l47l44
$$ 41 317 407 311 32 -176 -256 -313 -111 75 263 301 179 11 -305 -394 -259 128 370 526 237 -110 -454
6038d54L1K02L72J80l2l4k52j72k06R2K19J69K55L6k00l68k92JK51M67J73l2k70
$$ -454 -423 -221 151 331 299 265 13 -159 -365 -273 -54 115 370 406 206 -162 -454 -453 -202 265 438 406 136
6061A36l61j27kL11J44J63Q0k18j22j54j96J7L37K81J73p1m22k13k56J83L45K88
$$ 136 -225 -352 -354 -43 101 264 344 126 4 -150 -346 -329 8 289 462 391 -31 -244 -500 -317 28 316
6083C16J85k27l31j89o7P3J62K23J95M5j60l04k25q8P5L73L29M0k24k50k98r5
$$ 316 501 274 -57 -246 -313 -240 -78 145 340 385 225 -79 -304 -392 -317 56 385 425 201 -49 -347 -442
6105d42K15L64J60N6k41j64j80Ok5J67K56K08J7k52l19k07l1K52L43K50N1l42
$$ -442 -227 137 297 353 112 -52 -232 -226 -251 -84 172 380 397 145 -174 -381 -412 -160 183 433 484 142
6127A42l85j51P2K78K26Q8K6j75j25k07j28R2K61K48J51j30k74l52q3J04L37L49
$$ 142 -243 -394 -322 -44 182 270 296 121 -4 -211 -339 -247 14 262 413 283 9 -343 -426 -322 15 364
6149C64J26j70l64j66j96J64K21K00J58rk10k24k12p7J44L62K21R2j53m51k40
$$ 364 490 320 -44 -210 -406 -242 -21 179 337 328 118 -106 -318 -395 -251 111 332 424 271 -180 -420
6170d20M6J91K92K88m6k05k60j60m8J77Q2K11J87Mj72l71j77K0J60M12K38o5k76
$$ -420 -374 -183 109 397 351 146 -114 -274 -322 -145 -63 148 335 339 167 -204 -381 -361 -201 211 449 384 108
6193A08l48k24J69K19K48J21j8j62k16j12l0JK45K33K00p1l39l21j67J38L29L35
$$ 108 -240 -464 -295 -76 172 293 275 113 -103 -215 -245 -244 1 234 434 363 24 -297 -464 -326 3 338
6215C38P6j99k14l65m2R3L61J68L8Rj61j73k33p6J49L17K96J22k84l48k90k4K18
$$ 338 414 215 1 -364 -406 -313 48 216 254 263 102 -71 -304 -380 -231 86 382 504 220 -128 -418 -442 -224
6238b24M19K15o2j62k76k07O3N0K63J35J29j06j37k73j99R6J98L12K22p8l94k65
$$ -224 195 410 348 186 -90 -297 -234 -184 79 214 343 237 100 -173 -372 -276 -78 234 456 378 -16 -281
6260b81j77J64K34K73J27p4j11k47j65nlK97K28O8o9k23l96j10K01L31K63J03
$$ -281 -458 -294 -60 213 340 266 155 -92 -257 -262 -265 32 260 328 259 36 -360 -470 -269 62 325 428
6282D28j53l41k78j4J22K73J66L8Lj63j72j56r0K04K44K57N4k19l75k33K6J75
$$ 428 275 -66 -344 -358 -236 37 203 241 244 81 -91 -247 -337 -133 111 368 422 203 -172 -405 -379 -204
6304b04M10K17o0k52j73k30k9J73J93K01J16j30j42k75j53m9K84L85J76q9k82
$$ -204 206 423 363 111 -62 -292 -321 -148 45 246 362 232 90 -185 -338 -387 -103 282 458 369 87
6325H7l45j95J57K31K92J04p5j47k66r0p9K04J41K79M8q1k70k97j04J21L37K99
$$ 87 -258 -453 -296 -65 227 331 256 109 -157 -247 -326 -122 19 298 346 265 -5 -302 -406 -285 52 351
6347C51J39j86m02k36k1J33K43K38Q9q8k48j55j23m9J65K34K41Q3j72l44l15J3
$$ 351 490 304 -98 -334 -355 -222 21 259 348 260 12 -143 -266 -315 -150 84 325 408 236 -108 -423 -410
6369d10K45L79J60L1k16l23j99L7J17K73M9P4n2j38k13j99P1K40L31J78p1l09
$$ -410 -165 214 374 405 189 -134 -333 -296 -179 94 143 217 165 27 -186 -385 -314 -74 257 435 364 55
6391E5l11j85Q6L53L24M6r9k51j92j24kJ80J56K11J09r3k47k77j60J33L93K64
$$ 55 -256 -441 -355 -2 322 368 269 18 -174 -298 -300 -120 36 247 356 263 16 -261 -421 -288 105 369
6413C69J09k47k93k64n4J67L15J72L2j42j61j93r6O7J45J50K89K1k24k84k74n3
$$ 369 478 231 -62 -326 -380 -213 102 274 306 164 3 -190 -286 -219 -74 76 365 386 162 -122 -396 -449
6435d49L33L37J64n6k25k59k09J21J17K30J57O4j58j66k76j3K6J29L62J92Kl76
$$ -449 -116 221 385 329 104 -155 -364 -243 -126 104 261 325 167 1 -275 -288 -262 -133 229 421 423 47
6457D7l55k13K31L22K60R3j61k31k26j5k8J51K95N6Q6j07k84k60m5J10L11L24
$$ 47 -308 -521 -290 32 292 385 224 -7 -233 -248 -276 -125 170 226 312 205 -79 -339 -384 -274 37 361
6479C61M4j51l32k94J2J91K71J87L6j66j58k27m3K8J74K35J78o7j08k78k37l9
$$ 361 405 254 -78 -372 -360 -169 102 289 325 159 1 -226 -269 -241 -67 168 346 279 171 -107 -344 -383
6501c83K10L98K15l9k58l47j06K2J78K63J18J3r6k60j34j59Q7K60L03J59j17l20
$$ -383 -173 225 440 401 143 -204 -310 -288 -110 153 271 284 188 -72 -206 -365 -278 -18 285 444 327 7
6523Gk56j20J5L84K61J26j33k67l11p2R6K25J63J75j5j48j93k71l3R3L60K15J45
$$ 7 -249 -369 -354 30 291 417 284 17 -294 -366 -270 -45 118 293 278 130 -63 -334 -367 -274 86 301 446
6546D46j97l98k73j9J82L62K58j0j77k56j81q0P4K57K23L3O3j44l35k35k3L23
$$ 446 249 -149 -422 -441 -259 103 361 351 174 -82 -263 -343 -269 -12 211 244 307 163 -172 -407 -430 -107
6568a07L74K57p4l60l56j25O5K00K75K37n3k04j72j82n8P8J28L66J21j23k99k24
$$ -107 267 524 450 90 -266 -391 -326 -126 149 386 333 129 -43 -225 -283 -205 -77 289 410 287 -12 -236
6590b36j78K7L86M04K2j72k44k54j20J74J74K06R8p0j42k00j81m9J54K59K63P2
$$ -236 -414 -387 -1 403 425 253 9 -245 -365 -191 -17 189 287 217 75 -125 -306 -355 -201 58 321 393
6612C93j66k93l37kJ52L76K19N4k36k05j73n2O3J08L16K6k6r8k06k91M8J87L50
$$ 393 227 -66 -403 -405 -253 123 342 396 160 -45 -218 -270 -207 -99 217 243 217 119 -87 -378 -330 -143 207
6635B07K43j13j93m02j30J12K10K61J36n2k07j87r7r1R0J70K90J31n0k77l56j37
$$ 207 450 337 144 -258 -388 -276 -66 195 331 279 72 -115 -212 -303 -213 -43 247 378 328 51 -305 -442
6657d42J05L58K99J37k27k69l09J8J51K07R0J56o3q8k62j53k5J24K63K32O6j85
$$ -442 -337 21 320 457 230 -39 -348 -330 -179 28 118 274 211 123 -139 -292 -317 -193 70 302 368 183
6679A83l08k36m2K11L03K19M1k31k78j49M0J39J16K35L2j6j43k91j56KJ98M13
$$ 183 -125 -361 -403 -192 111 330 371 140 -138 -287 -247 -108 8 243 275 259 116 -175 -331 -329 -131 282
6701B82J45rk67m38o8j0L34K81L0j20j05k08r5OO7K44J06J35q6j86l24j68J93
$$ 282 427 418 151 -287 -355 -365 -31 250 280 160 55 -153 -248 -242 -175 69 175 310 224 38 -286 -454 -261
6724b61K43L25J75j89l31k48r2J84K59J52Q8q4j13k08j81k4J85K87K00L5j82k77
$$ -261 -18 307 482 293 -38 -286 -378 -194 65 217 305 221 108 -100 -281 -305 -120 167 367 402 220 -57
6746e7l42nK49L17K36n2j48l28j70O2N4J75K71Lm3j50k36j79J0K23K64J86P4l24
$$ -57 -399 -404 -155 162 398 346 198 -130 -300 -238 -184 -9 262 265 222 72 -164 -343 -333 -110 154 340 414 90
6770I0l03j91P3K72L02J72j34k49k39k1j2R9J98J57J53r8l24k46j20J36L14L41
$$ 90 -213 -404 -331 -59 243 415 281 32 -207 -228 -240 -141 57 214 367 269 -55 -301 -421 -285 29 370
6792C70R8j64l50k20j23J75K16K59R5j54j36k01p7o5J33K53K20M6j94k31k93p7
$$ 370 468 304 -46 -266 -389 -214 2 261 356 202 66 -135 -212 -277 -144 109 329 375 181 -50 -343 -420
6814d20K21L94K66l0k92k39k69K9K08J79K47l7p0j50j91j54k6K42K63K08J7l87
$$ -420 -199 195 461 431 139 -100 -369 -340 -132 47 294 257 187 37 -154 -308 -334 -92 171 379 396 9
6836Il09p5k5L61L33M1n6j84k87p7O0R9K42J44K1o1k49l33m1P5L89K45J06j49
$$ 9 -300 -375 -400 -39 294 335 279 95 -192 -269 -209 -110 132 276 297 236 -13 -346 -387 -312 77 322 428 279
6860B79l49k55o6J37L29J95Q0j40k37j32p2m8J25L07J81j5j24k92k28o6K53L45
$$ 279 -70 -325 -391 -254 75 270 350 210 -27 -159 -231 -279 -154 153 334 319 195 -97 -325 -391 -138 207
6882B07J38O7l02l06j72J08J73J10K06M2j03j39j78j36N2J86K87J20j4k54l57
$$ 207 345 412 110 -196 -368 -260 -87 23 229 271 168 29 -149 -285 -233 -47 240 360 346 92 -265
6903b65j73J57K38K84J94j61l40j86l6N3K56J27J20L6j38j53k67j32J36K19L73
$$ -265 -438 -281 -43 241 435 274 -66 -252 -288 -235 21 148 268 304 166 13 -254 -386 -250 -31 342
6924C42M4j28k68l11%J23L01K33q1o6j85k43n5Q6J13K35J80L9k09k84j67r5K83
$$ 342 386 258 -10 -321 -321 -198 103 336 255 189 4 -239 -294 -208 -95 140 320 359 150 -134 -301 -396 -113
6947a13K32K53L5k77l44j45K0K57K50J17k9p2k03k03o7J7K16K59J74n1k77k70
$$ -113 119 372 407 130 -214 -359 -339 -82 168 285 256 184 -19 -222 -289 -272 -56 203 377 326 49 -221
6969b21k00Q2L05L20P5j66k11k52o4P4K33J19K01k6r9k36k24m5J23L15J83J59
$$ -221 -421 -339 -34 286 361 195 -16 -268 -332 -258 -25 94 295 269 170 -66 -290 -335 -212 103 286 445
6991D45j76k96l00rJ61K57K66mj32l03j43m8J02J92J26J43J9j64k45k35m2J99
$$ 445 269 -27 -327 -336 -175 82 348 344 212 -91 -234 -282 -180 12 138 281 300 136 -109 -344 -386 -187
7013a87L69K04k1k86l27j12J7K75K37P9N2j40j82j72k7K6J93J71J38k2k38k82
$$ -187 182 386 365 79 -248 -360 -343 -68 169 248 300 160 -22 -194 -221 -195 -2 169 307 285 47 -235
7035b35j39O8L28L01M9j18k78k03j89K37J92K19pj6q1k43j02o9J17K21K44J18
$$ -235 -374 -306 22 323 372 254 -24 -227 -416 -179 13 232 225 209 128 -115 -217 -286 -169 52 296 414
7057D14j85l04l05RJ91J94L24J9j82k70j41k2R2J31K52J16j21j29j84k15RJ16
$$ 414 229 -75 -380 -371 -180 14 338 357 175 -95 -236 -258 -166 -35 217 333 212 83 -101 -316 -307 -191
7079a91K96K30K9k56l21j50O9K03K71J81q6j59k36j41J0J23J85R0J61r0j35l52
$$ -191 105 335 364 108 -213 -363 -294 -91 180 361 275 116 -120 -261 -251 -128 57 147 308 218 83 -269
7101b69j24J49K74K27J35j16k71k96k2Q1K05K09J05p4j13j11k09j5l0K89K48J54
$$ -269 -393 -244 30 257 392 276 5 -291 -313 -232 -27 182 287 213 100 -11 -220 -235 -265 24 272 426
7123D26k31k35k52n0J31L30J99Qj69k56j66q2K03J39J84P9J7k17k20p9q2J67K74
$$ 426 195 -40 -292 -342 -211 119 318 326 157 -99 -265 -347 -144 -5 179 258 275 58 -162 -241 -323 -156 118
7146A18K55j2k25l82j16L5K56K45J33q0j88j00j50l9J22K03J30P3n8j89k62k26
$$ 118 373 361 136 -246 -362 -327 -71 174 307 227 39 -61 -211 -250 -128 75 205 278 220 31 -231 -457
7168d57K30K07K35K31j23l10k85r4J39K24K43np5m5k43q4l1J23K06K03N3j19k83
$$ -457 -227 -20 215 446 323 13 -272 -366 -227 -3 240 235 160 115 -128 -212 -243 -120 86 289 342 223 -60
7191f0k74K3J07L60J83L1k07k74j06o8J24K03J29R1k9k22k00j09J5J02L91J60
$$ -60 -334 -311 -204 156 339 370 163 -111 -217 -285 -161 42 171 262 233 11 -189 -298 -283 -181 210 370
7213C70n6j66l64j71O6K11K72K08j28j45k69q9pJ53J49J79P1o1j93k64j40J40
$$ 370 314 148 -216 -387 -321 -110 162 370 242 97 -172 -261 -268 -115 34 213 284 223 30 -234 -374 -234
7235b34K32K51J51j26k33l72M0P4L19R8O3o8j30j93n0o5J30J77J87J06j62k56
$$ -234 -2 249 400 274 41 -331 -291 -217 102 200 263 195 65 -128 -178 -243 -113 64 251 357 195 -61
7257f1k43r5J99L21K16M7k58k27j78K4J07K72J04Mn9r4k11o7l3Q7L28J69n8k06
$$ -61 -304 -399 -200 121 337 384 126 -101 -279 -255 -148 124 228 232 173 79 -132 -199 -232 -145 183 352 294 88
7281H8k41k18J8K88K42J90r8k45k01j07L5K40R3K00j1p9k35j84j11Q0K20L54J01
$$ 88 -153 -371 -353 -65 177 367 269 24 -177 -284 -249 -9 84 284 273 194 -41 -225 -336 -256 -36 318 419
7304D19j81k63k40j13J26L27J92P7j60j65j89q2j9J61K23K06kj31l25j71n7J30
$$ 419 238 -25 -265 -378 -252 75 267 344 184 19 -170 -252 -271 -110 113 319 317 186 -139 -310 -367 -237
7326b37M00J60O4k12l21j79K3K24J87Q3M5m2k32j01o5j9J47J95J85J6k00l65j47
$$ -237 163 323 387 175 -146 -325 -302 -78 109 192 237 195 -37 -138 -203 -222 -75 120 305 321 121 -244 -391
7349c91J02K32K37J77j15j74k52j46J17J91J17J66op6j85j99j01Q7K51K49J04
$$ -391 -289 -57 180 357 242 68 -184 -330 -213 -22 95 261 255 179 -6 -205 -306 -219 32 281 385
7370C85j18k58k72p1P6L02K38K9o2k47j39j20K2J53J28K12Q4j84k65j58j22K04
$$ 385 267 9 -263 -334 -258 44 282 311 249 2 -137 -257 -235 -82 46 258 342 158 -107 -265 -387 -183
7392a83K82K62%k57l04j00k9K42J37J97K9k04q9j46j38R4J50K02J84n6j79l22
$$ -183 99 361 361 104 -200 -300 -329 -87 50 247 276 72 -17 -163 -301 -207 -57 145 329 273 94 -228
7414b28j18K8K45L35P0o4k01l14l3M8J65K11J35o3p1j39k11j10J31K11K26J50
$$ -228 -346 -318 -73 262 332 268 67 -247 -280 -232 -67 144 279 216 145 6 -205 -315 -184 27 253 403
7436D03j48l00k48p2J22K76K74K5j48k40j76m5N5J93O8K14p3o5k77j63mJ21K54
$$ 403 255 -45 -293 -365 -243 33 307 332 184 -56 -232 -277 -222 -29 39 253 180 115 -162 -325 -329 -208 46
7459D6K94J9j48l74j85p6L27K42J42j4j66j23j54j09J30J37J40K27l6k35k41j93
$$ 46 340 359 211 -163 -348 -424 -97 145 287 273 107 -16 -170 -279 -149 -12 128 355 319 84 -157 -350
7481c50J19K34K58J12q2k36k91q0P5K50J29J50l7j64j35r8j44J28J60K27J57j32
$$ -350 -231 3 261 373 291 55 -236 -316 -241 9 138 288 251 87 -48 -146 -290 -162 -2 225 382 250
7503B50k81k64j24J92K98K27L6j60k05k38JJ32J56J50R8p4r1j39k04o5J78K43
$$ 250 -31 -295 -419 -227 71 298 334 174 -31 -269 -268 -136 20 170 268 194 103 -36 -240 -305 -127 116
7525A16J90R5k27k93k25K2K29K73J08J3k44o5j64m5O1J74J48J73p7k01j81k45
$$ 116 306 401 174 -119 -344 -322 -93 180 288 301 57 -8 -172 -217 -156 18 166 339 262 61 -120 -365
7547c65Q3K18K97K13j51k84k49m7N0J92J90J59q1q0k24j39n2J18K28J18J24p2
$$ -365 -282 -64 233 446 295 11 -238 -285 -235 -43 147 306 225 145 -79 -218 -270 -152 76 194 318 246
7569B46k75k43m0J08K64J91K4j30k19k03J5R5J95J26J02n7j70j46j91O6Q2K93
$$ 246 -29 -272 -312 -204 60 251 275 145 -74 -277 -262 -167 28 154 256 199 29 -117 -308 -242 -160 133
7591A33J76Lj49k48l08R9J83K51J66rk30j12j58j2J24J08J46J23n1j40l08j19
$$ 133 309 312 163 -85 -393 -294 -111 140 306 297 67 -45 -203 -215 -91 17 163 286 235 95 -213 -332
7613c32P8J86K83J35q2k46k09j53J48J45K25P9l2j47k02l0n0J31R8K40M3j09k97
$$ -332 -254 -68 215 350 268 22 -187 -340 -192 -47 178 257 225 78 -124 -154 -204 -73 25 265 308 199 -98
7636i8j89o5J41K34L03Rj67l16n6l6N7J97J44O9k8j59j56j77M9J09K68J58M3k02
$$ -98 -287 -352 -211 23 326 335 168 -148 -204 -240 -183 14 158 227 199 40 -116 -293 -244 -135 133 291 334 132
7660A32k94j38KJ61K40K07Qk11k81pl1R4J50J68M8k7j39l03r0K7K39K77J88j46
$$ 132 -162 -300 -298 -137 103 310 318 107 -174 -181 -212 -118 32 200 248 221 82 -221 -311 -284 -45 232 420 274
7684B74k78k05j19J25J53L01P8j40j48j19j54LO1J95K21M0j00k11k60p1J16L24
$$ 274 -4 -209 -328 -203 -50 251 329 189 41 -78 -232 -229 -168 27 248 288 188 -23 -283 -354 -238 86
7706H6J58P1j33k48k03j0J06K66J07L3j27o9j72j56RK20J66J49P7k25k71j42n
$$ 86 244 315 182 -66 -269 -279 -173 93 200 233 106 37 -135 -291 -282 -62 104 253 330 105 -166 -308 -313
7729c13K13K70R3L2k09k02j51J1J53J35R9J04r3j09j67j68J12R5L34J11m2k60
$$ -313 -100 170 263 295 86 -116 -267 -256 -103 32 131 235 142 33 -134 -302 -190 -95 239 350 308 48
7751D8k94j19J52K60J77O1j42j34j91r2L0J73J46J66P6j50j93l00n9J81K46K81
$$ 48 -246 -365 -213 47 224 285 143 9 -182 -274 -244 -71 75 241 317 167 -26 -326 -385 -204 42 323
7773C23p5n8k76j85l5J31K80J06K4j03j44p8j28L3J49J27K41r9j39k44j80p1L08
$$ 323 248 190 -86 -271 -306 -175 105 211 235 132 -12 -90 -218 -185 -36 91 332 233 94 -150 -330 -401 -93
7796i3K44J52rk53k49q5P0J87Q2J79L3q5j84j41p1l2J54L15R4k9k81k80k2N4K51
$$ -93 151 303 294 41 -208 -293 -223 -36 46 225 258 173 -11 -152 -223 -255 -101 214 308 279 -2 -282 -304 -250 1
7821AK24O1j28j45k40n5R1J26J19K36l3j35r8k58o3M7L67J58O7j44k56k64K9J27
$$ 1 225 286 158 13 -227 -282 -191 -65 54 290 257 122 24 -234 -297 -250 117 275 342 198 -58 -322 -293 -166
7845a66K15J82J5j28p4j85j41O4J54K00J11P7k08k48j52lK66K10J54q2j94k30
$$ -166 49 231 246 118 44 -141 -282 -218 -64 136 247 324 116 -132 -284 -287 -21 189 343 261 67 -163
7867a63j44Q9J41K23L9M6j12j71j63j9K4J84K82J14p4k54l13l2M5K65K54K0n0
$$ -163 -307 -218 -77 146 185 231 119 -52 -215 -234 -210 -26 256 370 296 42 -271 -303 -258 7 261 281 231
7890B31k90j08j06K7J76J64J11Q2j23k46j42q3J59J53L01N6j66k65k30k8J80K83
$$ 231 -59 -167 -273 -246 -70 94 205 287 164 -82 -224 -307 -148 5 306 362 196 -69 -299 -327 -147 136
7912A36J57n6j21j03j50n3N6J16J57J16P9k15k56j61N5K17K33J64p4k28k60p5
$$ 136 293 237 116 13 -137 -190 -134 -18 139 255 334 119 -137 -298 -243 -26 207 371 297 69 -191 -266
7934b66J0J83J74J35j0o1k18j60n7N3K05K09J52r9k18l06q3R1K69K32Q2j54j67
$$ -266 -256 -73 101 236 226 165 -53 -213 -270 -217 -12 197 349 250 32 -274 -357 -266 3 235 317 163 -4
7957dk40m7J30J13J86O0L0j76j21j32l6J07J94K21N1q6l59j40m0J23L20Q9M0j66
$$ -4 -244 -291 -161 -48 138 198 228 52 -69 -201 -237 -130 64 285 336 250 -109 -249 -289 -166 154 243 283 117
7981A17j54r8o6Q9J01R7K17l9j88j81k04L9J73K66J87p9k25k98m2M3J97J97L1
$$ 117 -37 -135 -201 -112 -11 86 303 264 76 -105 -309 -270 -97 169 356 277 52 -246 -288 -245 -48 149 180
8004A80No1j55r7j32J21J81J45J03n8k32k19p6K8K43K70N4j19k85p3j68J44J49
$$ 180 185 124 -31 -128 -260 -139 42 187 290 232 0 -219 -295 -267 -24 246 300 181 -104 -177 -345 -201 -52
8027e2K50L6k3j26j67j46ML1K17K93j7j35k84j11j05K00K60J45n3n8k51o3j10
$$ -52 198 234 211 85 -82 -228 -224 -193 24 317 300 165 -119 -230 -335 -135 125 270 217 159 -92 -155 -265
8050b65R3J31J07J07N9k03j25j02j14K25K24J63j6k41k66r9O7K16J97L1M0j82
$$ -265 -172 -41 66 173 232 29 -96 -198 -312 -87 137 300 284 43 -223 -322 -255 -39 158 189 229 47
8072D7j64r9j3P5J76J57J05q5k57j91j22J00L27K14Q0j50k38j59q2R1K16J49M2
$$ 47 -117 -216 -229 -154 22 179 284 199 -58 -249 -371 -271 56 270 350 200 -38 -197 -279 -188 28 177 219
8095B19K0k22n9j94k2J52K18J44P0j27l20j76J3J82J79K85j03j35j97j88M0N9
$$ 219 239 17 -42 -236 -258 -106 112 256 326 199 -121 -297 -284 -102 77 362 259 124 -73 -261 -221 -162
8117a62J59J49O5o7k2k49j65k0K48K68J44J8k61l00j35M7K21K55R4q5j95k0k07
$$ -162 -3 146 211 144 122 -127 -292 -312 -64 204 348 366 105 -195 -330 -283 -62 193 287 202 7 -13 -220
8140b20J7O7J71J51M3L7k39k36j30J46K03K74M7j34k14j87o9J17J69J62k6j3r9
$$ -220 -203 -136 35 186 229 266 27 -209 -339 -193 10 284 331 197 -17 -204 -273 -156 13 175 149 136 37
8163C7j68p5lP6K10J85O9j47k45k35K3J17K73J89l0j82k41p5j0Q5K24Q3R0q6p6
$$ 37 -131 -206 -209 -133 77 262 331 184 -61 -296 -273 -156 117 306 276 94 -147 -222 -232 -147 77 160 250 164 88
8188H8k36j02P
$$ 88 -148 -250 -243
8191b43
$$ Imaginary data points
##PAGE= N=2
##DATA TABLE= (X++(I..I)), XYDATA
0@%%%%%%%%%%%%%%%%JoJ1j4J6j6J6j6K1k7L0l2L3l9M6n0N6o2O9p7Q5r6J06j16
$$ 0 0 0 0 0 0 0 0 0 0 0 0 0 0 0 0 0 1 -5 6 -8 8 -8 8 -8 13 -14 16 -16 17 -22 24 -26 30 -32 37 -40 45 -51 55 -61
40f1J29j44J60j76J96k18K42k71L03l42L88m42N10n98P16q80J127j540K350m519
$$ -61 68 -76 84 -92 104 -114 128 -143 160 -182 206 -236 274 -324 392 -488 639 -901 1449 -3070
60c070K0823P3350j4034o2693m0398m094m67N558K7823L6498J3048j0644k0178
$$ -3070 17753 91103 77069 14376 -26022 -30116 -30583 -25025 2798 39296 52344 41700 21522
73B1522k8701l4790r637L6310N4540K4894j3985k9696l1132l1754j3558K8246
$$ 21522 -7179 -41969 -51606 -15296 39244 64138 50153 20457 -10675 -42429 -55987 -27741
85b7741N6739L7342j1072m1798l8391j8152M287K2116K6853J7677Q316P39j9118
$$ -27741 28998 66340 55268 13470 -24921 -43073 -38786 -16670 10183 27860 36176 36915 17797
98A7797m4548l8532R730N3949M9794J2100k0050l5433l8996k1073J6631M1214
$$ 17797 -26751 -65283 -55553 -1604 48190 60290 40240 4807 -34189 -55262 -38631 2583
110B583L0870P708l627j3693l2672l5527l114L3972L7219J6169J686p628k8626
$$ 2583 33453 41161 37534 23841 -8831 -44358 -47472 -13500 23719 39888 41574 33946 5320
123E320m3601k0573K6773M9743L1025J61j9274l1684l6136j5639K3022M2228K4860
$$ 5320 -38281 -58854 -32081 17662 48687 48848 29574 -2110 -38246 -53885 -30863 11365 36225
136C6225r25j0506j5367k7353k8131j597L0680L9093K3404r10k5794m1725l1433
$$ 36225 35300 24794 9427 -17926 -46057 -47654 -16974 22119 45523 44613 18819 -22906 -54339
149e4339M238L4808L6766J9039l60j8618l3045l0139m741K3365L2944K4220P150
$$ -54339 -50101 -15293 21473 40512 40152 21534 -11511 -41650 -46391 -23026 9918 34138 41288
162D1288j3145k9621k9697j0716J1933K4430K7552K2568J038l2249m7720k3606
$$ 41288 28143 -1478 -31175 -41891 -29958 -5528 22024 44592 45630 13381 -34339 -57945
174e7945J9490M0668K9571P996q241k1661k9538j9992L645K1747K5560K2236J0310
$$ -57945 -38455 2213 31784 39780 31539 9878 -19660 -39652 -36007 -14260 11300 33536 43846
187D3846j4957l8208l2964k180K3689K8797K3361J3830q214l5149m0368j2453
$$ 43846 28889 -9319 -42283 -44463 -20774 8023 31384 45214 37000 1851 -38517 -50970
199e0970K2932L7080K6633N516j4778k6415k3507q923N993J5379K2070K3510Q640
$$ -50970 -28038 9042 35675 41191 26413 -2 -23509 -32432 -26439 -11060 11010 34520 43160
212D3160k0463m0293l0016K323K9561L5039K1696j698k4751l3608k1304K303K0036
$$ 43160 22697 -17596 -47612 -45289 -15728 19311 41007 39309 14558 -19050 -40354 -38051 -18015
225a8015K5612K1565P007j4736k8452k2825o012P954J8355K7390K3857j391l1776
$$ -18015 7597 29162 36169 21433 -7019 -29844 -35856 -27902 -9547 17843 41700 40309 8533
238H533l9094j8096J2012L1246L2473J6046j0880k9380k6634q657P009J4520J8842
$$ 8533 -30561 -48657 -36645 -5399 27074 43120 32240 2860 -23774 -32431 -25422 -10902 7940
251G940J9379P941j3120k7949k5285q152J3029K8809L0420J1661j8159l5850k7989
$$ 7940 27319 35260 22140 -5809 -31094 -39246 -26217 2592 33012 44673 26514 -9336 -37325
264c7325l847J7886K7729K3798P256j4014k5233k0124p066M392J4496K3338K1183
$$ -37325 -41172 -23286 4443 28241 35497 21483 -3750 -23874 -30940 -26548 -12052 11286 32469
277C2469K949k0091l0623k2907k249K1303L4370K5631j650k6396l0776j6025L260
$$ 32469 35418 15327 -15296 -38203 -40452 -19149 15221 40852 39202 12806 -17970 -33995 -30735
290c0735J7356K2811J7785L552j1834k0002j8985j0577M136K1118K8332J6801
$$ -30735 -13379 9432 27217 30769 18935 -1067 -20052 -30629 -26493 -5375 22957 39758
302C9758p702k6994k8952j4583P616K6408L0060J4023j0705k6062k3590r920M875
$$ 39758 32056 5062 -23890 -38473 -30857 -4449 25611 39634 28929 2867 -20723 -30643 -25768
315b5768J6553K1181J5648J893j2863k1450k1006r820J0474K8281K8259Q670j6410
$$ -25768 -9215 11966 27614 29507 16644 -4806 -25812 -35632 -25158 3123 31382 40052 23642
328B3642k9678k4533o277J4938K6859K2470N127j2742k0802j8029q674M166J6511
$$ 23642 -6036 -30569 -36846 -21908 4951 27421 32548 19806 -996 -19025 -27699 -23533 -7022
341g022K1493J4896m59j6306k4477j9803k758J8936L0116K1458j384k2062k7732
$$ -7022 14471 29367 28908 12602 -11875 -31678 -34436 -15500 14616 36074 34690 12628 -15104
354a5104j7390J638J8349K3951J5650M83j2324j8346j7213q771N811J9600K3309
$$ -15104 -32494 -30856 -12507 11444 27094 27577 15253 -3093 -20306 -29077 -23266 -3666 19643
367A9643J3302n202k1669k6547j5830O130K4891K7423J2514q745k2347k2428j0873
$$ 19643 32945 27743 6074 -20473 -36303 -30173 -5282 22141 34655 25910 3563 -18865 -29738
380b9738N315J7474J9496J1682l37j1285j8032j7627p232J0015K3377K2998P955
$$ -29738 -24423 -6949 12547 24229 23892 12607 -5425 -23052 -30284 -20269 3108 26106 34061
393C4061j2621k5875k3949o866J4762K6392K0916L747j2781k0361j7250o793O246
$$ 34061 21440 -4435 -28384 -35250 -20488 5904 26820 30567 17786 -2575 -19825 -26618 -20372
406b0372J5950J8068J1906k08j3712k1972j8343k524J6631K6175J9523O27j8670
$$ -20372 -4422 13646 25552 25344 11632 -10340 -28683 -31207 -14576 11599 31122 31749 13079
419A3079k6364j7639J546J8289K2029J3301l94j1773j6670j4679n961O271J6372
$$ 13079 -13285 -30924 -29378 -11089 10940 24241 23847 12074 -4596 -19275 -25236 -18965 -2593
432b593J9006J1434l724j8853k4122j4267N944K2793K5188J1998p840k1706k1968
$$ -2593 16413 27847 24123 5270 -18852 -33119 -27175 -4382 20806 32804 24964 3258 -18710
445a8710r683O711J7208J7664J0382m08j0877j7144j5777n623R124K0191K0619
$$ -18710 -28393 -21682 -4474 13190 23572 23164 12287 -4857 -20634 -26257 -17133 3058 23677
458B3677Q312j0415k3771k2548o811J2870K3688J9581M390j1797j9828j6453n205
$$ 23677 31989 21574 -2197 -24745 -31556 -18686 5002 24583 28973 17176 -2652 -19105 -24310
471b4310P237J4639J5448R530p68j2331j9099j5770k175J4734K3857J8363O85
$$ -24310 -17073 -2434 13014 22544 21776 9445 -9654 -25424 -27599 -12865 10992 29355 30040
484C0040j7877k4747j5886J842J6906K0823J3677K81j2094j7440j3778m088P078
$$ 30040 12163 -12584 -28470 -26628 -9722 11101 24778 25059 12965 -4475 -18253 -22341 -15263
497a5263J4916J6626J0006l146j6562k1616j3584M024J9907K3541J2132o843k0563
$$ -15263 -347 16279 26285 23139 6577 -15039 -28623 -24599 -4692 18849 30981 24138 3575
510C575k0720r109O241J6153J6554Q986j740j0953j5399j3255m015Q673J7835
$$ 3575 -17145 -26254 -20013 -3860 12694 21680 19940 8987 -6412 -19667 -23682 -15009 2826
523B826J7814O967r323k1126k0308o722J1267K2432J9542M933j1654j9955j5732
$$ 2826 20640 27607 18284 -2842 -23150 -29872 -18605 3827 23369 28302 16648 -3307 -19039
536a9039m121P607J4332J4307Q494j155j1527j7132j4068k087J2848K1185J6359
$$ -19039 -23160 -15553 -1221 13086 21580 20425 8898 -8234 -22302 -24389 -11541 9644 26003
549B6003J076j4858k1780j5775l78J4906K0526J3615n48j2853j6616j1722k111
$$ 26003 27079 12221 -9559 -25334 -25712 -10806 9720 23335 22787 9934 -6682 -18404 -20515
562b0515P004J2900J4028Q737k683j5056j9568j1859L858J8270K1493J1586n475
$$ -20515 -13511 -611 13417 22154 19471 4415 -15153 -27012 -23154 -4884 16609 28195 22720
575B2720j8661j9852r495N410J5782J6980R490k055j1653j5021j1464k341Q220
$$ 22720 4059 -15793 -25288 -19878 -4096 12884 22374 20319 8666 -6355 -17819 -20160 -11940
588a1940J4840J4786O944o241j7997k0154q513R565K1241J8653M486j1067j8689
$$ -11940 2900 17686 24630 18389 392 -19762 -28275 -18710 2531 21184 25670 14603 -4086
601d086j5012l921P308J3600J3026P443k223j1387j5583j1574q91J1244J8205
$$ -4086 -19098 -23019 -15711 -2111 10915 18358 16135 4748 -10835 -22409 -23300 -12056 6149
614F149J4854K221j2591k0205j6162j703J4547K1407J4217r29j3256j5934j0607
$$ 6149 21003 23224 10633 -9572 -25734 -27437 -12890 8517 22734 21805 8549 -7385 -17992
627a7992j630P085J2364J2686P630k380j2865j7213j1408K270J5555J9794J1962
$$ -17992 -19622 -12537 -173 12513 20143 17763 4898 -12315 -23723 -21453 -5898 13896 25858
640B5858m068j7685j9561r374N215J5084J6110Q582l398j2283j3787q692j149
$$ 25858 21790 4105 -15456 -24830 -19615 -4531 11579 20161 16763 4480 -9307 -17999 -19148
653a9148O674J2857J3991O984o158j7419j8309p189R316J9647J7527N253r262
$$ -19148 -12474 383 14374 21358 15200 -2219 -20528 -27717 -18401 1246 18773 24026 14764
666A4764j7616j5461m436Q387J4781J2791N518k912r811j2911r963j408R229J6182
$$ 14764 -2852 -18313 -22749 -14362 419 13210 18728 15816 6005 -6906 -16869 -18277 -9048 7134
680G134J4748L256j1614j9919j5182n70J3969J9044J1960j501j2027j4381j0033
$$ 7134 21882 25138 13524 -6395 -21577 -22147 -8178 10866 22826 21325 9298 -5083 -15116
693a5116k286O731J2783J2368N211m564j2092j4376r626J877J3734J8082J1312
$$ -15116 -17402 -10671 2112 14480 19691 15127 3035 -11341 -20967 -19090 -5356 12726 24038
706B4038k974j5991j9223j0155M971J6046J6081P557m229j1337j1850p638j441
$$ 24038 21064 5073 -14150 -24305 -19334 -3288 12793 20350 16121 4784 -7066 -14704 -16145
719a6145N442J2190J4025O493o830j6332j5398n494P329J6469J6068N794q184
$$ -16145 -10703 1487 15512 22005 15175 -1157 -16555 -22049 -14720 1749 17817 23611 15427
732A5427j6770j4942m664P708J4544J2560M304m441j0294j1797q344m38Q484J4078
$$ 15427 -1343 -16285 -20949 -13241 1303 13863 18167 13726 3432 -8365 -16709 -17147 -8663 5415
746E415J2894L541j0034j8908j5185r07J3264J8084J1814j65j1037j4664j0404
$$ 5415 18309 21850 11816 -7092 -22277 -23184 -9920 8164 19978 19813 8776 -5888 -16292
759a6292j643P272J2323J1259M641m070j0760j2740q786J330J2407J6535J0299
$$ -16292 -17935 -10663 1660 12919 17560 13490 2730 -10010 -18796 -17466 -5059 11476 21775
772B1775k697j3755j7132j0305L589J5037J5922P296m258j1157j2134p791l20
$$ 21775 19078 5323 -11809 -22114 -18525 -3488 12434 19730 15472 4315 -7819 -15610 -15930
785a5930P350J1797J0945M368n591j3569j4345o400N963J5802J6412O404p973
$$ -15930 -8580 3217 14162 18530 12939 -630 -14975 -21375 -15412 390 16802 23206 15233
798A5233j6664j4253m119P069J3458J2427M816m255j0132j1155p466j00Q459J3015
$$ 15233 -1431 -15684 -19803 -12734 724 13151 17967 13712 3580 -7575 -15041 -15141 -6682 6333
812F333J0801K208q688j5446j3345k251J0689J6531J2334R88j0833j5728j1047
$$ 6333 17134 19342 10654 -4792 -18137 -20388 -9699 6832 19166 20154 9321 -6407 -17454
825a7454k7R124J1688Q832K963l833r746j1781p921J327J1208J5327J0026k089
$$ -17454 -17481 -8357 3331 12163 15126 11293 1547 -10234 -18155 -16828 -5620 9707 19733 17644
839A7644j3168j6254r665K849J3521J5613P980l249j1062j2483p723P13Q317J1005
$$ 17644 4476 -11778 -21443 -18594 -5073 10540 18520 15271 4209 -8274 -15997 -15284 -6967 4038
853D038Q522K723m425j0714j2645o651M563J4145J5327O692o880j6108j4700l922
$$ 4038 12560 15283 10858 144 -12501 -19152 -14589 -444 14883 21575 14695 -1413 -16113 -20035
867b0035P902J3566J1224L773m712j0166j0276o298M46P744J1777J0176K134p968
$$ -20035 -12133 1433 12657 16430 11718 1552 -8724 -15022 -14576 -6832 4945 15121 17255 9287
881I287j4314j2601k942R584J6268J2692J331j0331j5260j0624j73Q893J1630
$$ 9287 -5027 -17628 -20570 -10986 5282 17974 19305 8974 -6286 -16910 -17083 -8190 3440
894C440Q390K423l891q948j0423o548J354R398J3437R898q93j2154j5987r310
$$ 3440 11830 14253 10362 1414 -9009 -15557 -14203 -4805 8632 18530 17637 5483 -10504 -19814
908a9814L117J3043J4736P621l426j1372j2159o758J181P844J0428Q282K536m924
$$ -19814 -16697 -3654 11082 18703 15277 3905 -8254 -15012 -13831 -5987 4441 12723 15259 10335
922A0335j0666j1756o066M511J3255J4264O334n974j4612j4171m806O922J3295
$$ 10335 -331 -12087 -18153 -13642 -387 13877 20211 14237 -375 -14546 -19352 -12430 865
935H65J1518L939m880j0168r917n114J337P097J0197R024K180p284j3244j1514
$$ 865 12383 16322 11442 1274 -8643 -13757 -12420 -5323 4874 13898 16078 8794 -4450 -15964
949a5964k379Q823J4916J1787J271r934j4484j0093m41Q609J1873Q648J824n080
$$ -15964 -18343 -9520 5396 17183 18454 8520 -5964 -16057 -16498 -7889 3984 12632 14456 9376
963I376r215r566n382J799R002J2167Q532o10j0694j4623r453J935J2024J4473
$$ 9376 161 -9405 -14787 -12988 -3986 8181 16713 16103 5409 -9214 -18667 -16732 -4708 9765
977I765Q050k872j1226j2191o440J899P728R653P363J770m846r704j0051m935
$$ 9765 17815 14943 3717 -8474 -14914 -13015 -5287 4366 11729 13499 8653 -1051 -11102 -16037
991a6037L830J1601J2932O086n164j3480j3455n032O340J3301J1855L566n469
$$ -16037 -12207 -606 12326 18412 13248 -232 -13687 -18719 -12379 922 12777 16343 10874
1004A0874j0398r591m578K011P371R641P739J523o428j1828j0792k929P480J4063
$$ 10874 476 -9115 -13693 -11682 -4311 5330 13069 14592 8164 -3664 -14456 -17385 -9905 4158
1018D158J1802K112r103j4183j0270o66Q359J1522Q393J384n349q784q445m547
$$ 4158 15960 18072 8969 -5214 -15484 -16150 -7791 3731 12124 13508 8159 -625 -9070 -13617
1032a3617J975Q055J0727P611m40r362j3394r262J318J1503J4221P928k860j0966
$$ -13617 -11642 -3587 7140 14751 14311 4949 -8445 -17707 -16389 -4886 9335 17263 14403 3437
1046C437j2040o510J979Q323R832O925R19n070r108r007m443L390J0483J2120
$$ 3437 -8603 -15113 -13134 -4811 5021 11946 12865 7795 -1313 -10320 -14763 -11373 -890 11230
1060A1230O354m236j2569j3089n398N557J2749J1579L836n206j0410r386l941
$$ 11230 17584 13348 779 -12310 -17708 -12151 598 12177 16013 10807 397 -8989 -12930
1073a2930K446P247Q670O539R92n949j0624r771k581O899J2946J1034J989q408
$$ -12930 -10484 -3237 5433 11972 12964 7015 -3609 -13380 -15961 -9062 3884 14918 16907 8499
1087H499j3421j0180q63Q334J1818Q507J167n925r096p920l434K513P574R596
$$ 8499 -4922 -15102 -15965 -7631 4187 12694 13861 7936 -1160 -9080 -12514 -10001 -2427 7169
1101G169P141k22q496j2560q891J031J0355J3371P835k024j0450j1887o515K118
$$ 7169 14310 14088 5592 -6968 -15859 -14828 -4473 8898 16733 14709 4259 -7628 -14143 -12025
1115a2025Q382R459N963K30n259q470p871l610L511R476J0630N473l827j1461
$$ -12025 -3643 5816 11779 12009 6750 -1720 -9591 -13201 -9690 -214 10416 15889 12062 601
1129F01j2363n341N123J2259J1555M037n346j0731r328l489L042P462Q307N852
$$ 601 -11762 -17103 -11980 279 11834 15871 10525 -206 -9534 -13023 -9981 -2519 5788 11640
1143A1640N45n791r636q686k404N941J1651J0600K681p371j2935j0147j137P842
$$ 11640 12185 6394 -3242 -11928 -14332 -8391 3260 13860 16541 9170 -3765 -13912 -15049 -7207
1157g207J1628Q161P50o155q871p168k747K703P127Q575N943o05p877j1213p936
$$ -7207 4421 12582 13332 7177 -1694 -8862 -11609 -8906 -1779 6796 12739 12134 4257 -6956 -14892
1172a4892N84R314J2640Q150j772j0290j1886o611K162Q553R911N805k46n648
$$ -14892 -14308 -4994 7646 15796 14024 3734 -8152 -14763 -12601 -4048 5863 11668 11422 5774
1186E774q086p034k855L178Q530R932N412l043j0437j1758n484M382J1560J1272
$$ 5774 -2312 -9346 -12201 -9023 -493 9439 14851 11808 1371 -10387 -15871 -11489 71 11343
1200A1343M103n194j0217r180l530L307P580Q047M788o02n841q513p355k198N226
$$ 11343 15446 10252 35 -9145 -12675 -9368 -1788 6259 11047 10445 4604 -3909 -11264 -13462 -8236
1215h236J0723R978K584p058j2315j0090j289P838J1589Q279N71o314q858p126
$$ -8236 2487 12465 15049 7991 -4324 -14414 -15703 -7865 3724 12003 12574 6260 -2598 -9724
1229i724k293L225P246P967N132q48o916r985p415R3Q504J1920P903j327r534
$$ -9724 -12017 -8792 -1546 6421 11553 10705 3789 -6196 -13611 -13518 -5014 6906 14809 13482 3948
1244C948j1495o457K055Q680R678N190j234n942p374o150k173L267Q004Q861M431
$$ 3948 -7547 -14004 -11949 -3269 6409 11599 10365 4423 -2951 -9101 -11274 -8007 -3 8858 13289
1259A3289l180r580j0759n246L984J1025J0835M177m735j0281r458l542L913Q177
$$ 13289 10109 529 -10230 -15476 -11492 -467 10368 14545 9810 -471 -9929 -13471 -9558 -1381
1273a381P721L965r49n360p645o607k047M906R813R230K667o098j1382r470j599
$$ -1381 6340 10305 9356 3996 -3649 -10256 -12303 -7397 2416 11646 14313 8215 -3167 -12637 -14236
1288a4236P250J1195Q028N35o283q827o760j782L935P207O862L764j069o282r123
$$ -14236 -6986 4209 12237 12772 6489 -2338 -9098 -10880 -6945 262 7124 10888 9819 3537 -5586
1303e586o878K09P842J1044P492p52q997j1666o853K151Q856R480N088j183n887
$$ -5586 -12464 -12255 -4413 6631 14123 13371 4374 -7292 -14145 -11994 -3138 6342 11430 10247 4360
1318D360p562n800j528L562P365P721M088k459q445r989n424L327J0310J0516
$$ 4360 -3202 -9002 -10530 -6968 397 8118 12206 9747 1302 -8687 -14111 -10784 -474 10042
1332A0042M243m363r908r345l314M257Q204P097L253j350n271p364o031j196M815
$$ 10042 14285 9922 14 -9331 -12645 -8388 -184 6913 10166 8816 3545 -3819 -9850 -11046 -6231
1347f231Q755Q177K725n504j1028r321j736O909J0739Q161J038o338r216o841
$$ -6231 2524 10701 13426 7922 -3106 -12427 -14163 -7254 3485 11646 12684 6346 -2870 -9711
1361i711j188M241O891O444L444j194n886q250o184N0P122J0194P163n99q352
$$ -9711 -10899 -6658 233 6677 10121 8927 3041 -5209 -11393 -11343 -4221 5973 13136 12537 4185
1376D185j0858o484K030Q379R065N051j134o193p858n375m51M052O656O722L531
$$ 4185 -6673 -13157 -11127 -2748 6317 11368 10234 4041 -3817 -9192 -9643 -5591 1065 7787 11318
1391A1318k457q129r237m702L038R274J0216M636m118r941r208l128L886Q004
$$ 11318 8861 732 -8505 -13207 -10169 -895 9321 13957 9839 -102 -9310 -12438 -8552 -548
1405e48P455L280j700n617o943n106o33M505P848P259K370m787r668q641j861
$$ -548 6907 10187 8487 2870 -4073 -9179 -9812 -5307 2541 9800 12170 7383 -2285 -10926 -12787
1420a2787N954J0104Q103J331o267r547o673m97M587O778O050K811k052o042p248
$$ -12787 -6833 3271 11374 12705 6438 -3109 -9782 -10279 -5692 1086 7136 9947 7895 1853 -5395
1435e395n040J04O232R453O942m51p836j0322o539J166Q038R687N347j545o664
$$ -5395 -10435 -10331 -4099 5354 12296 11845 4009 -6313 -12852 -11686 -3648 6039 11386 9841 3177
1450C177p678m694n8M149O236N902K961k327p124q154m490K448Q445R793M656
$$ 3177 -4501 -9195 -9253 -5104 1132 7034 9995 7668 544 -7610 -12100 -9652 -1207 8586 13242
1465A3242l789r583r007l009L924Q130P497L040k791o151o178m043k94M199P317
$$ 13242 9453 -130 -9137 -12146 -8222 -92 7405 10445 7654 1503 -4675 -8718 -9012 -4813 2504
1480B504O754K038m512q975q413k345N774J0186Q054J074o161r060o651p57M726
$$ 2504 9258 11296 6784 -2191 -10604 -12949 -7175 3011 11065 12139 5978 -3082 -9733 -10490 -5764
1495e764O965N713K259k205n597o502m446J74N675Q637O414k22p233r672o224
$$ -5764 1201 6914 9173 6968 1371 -5131 -9577 -9403 -3728 4909 11323 11101 3868 -5804 -12028
1510a2028J035P692R584N199j906o841p316m367J01M421O428N459J995k534o470
$$ -12028 -10993 -3301 6283 11482 9576 2735 -4581 -8948 -8847 -4426 2002 7461 9456 6922 452
1525D52p521m353K353Q150R026M395l223q837q928l499L666Q121P511K807k648
$$ 452 -7069 -11422 -9069 -919 8107 12502 9279 442 -8486 -11985 -8319 -198 7313 10120 7472
1540G472o109o133l677K44M179O568N956J558m032p851p620k372M973R549P830
$$ 7472 1363 -4770 -8447 -8203 -4024 2544 8500 10058 6026 -1825 -9445 -11817 -6844 2705 10535
1555A0535J142n804q698o746q51N052P378N428J429k611n342o106l999O59N421
$$ 10535 11677 5873 -2825 -9571 -10422 -5370 2008 7436 8865 6254 912 -5194 -9193 -8534 -3113
1570c113P688N757J41o247r315o465O29P420R119N411j403o742p502m398O25M524
$$ -3113 4575 10332 10473 4226 -5089 -11554 -10925 -3505 5614 11025 9622 2880 -4622 -9020 -8395 -3871
1586c871O109M745J496k550n711o606l853J941P259Q389M197k718q218q790l641
$$ -3871 2238 6983 8479 5929 218 -6388 -10241 -8300 -1041 7348 11545 8827 609 -8181 -11822
1601a1822L739Q238P304K534k833o162o209l284R91M229O033N124J566l676p466
$$ -11822 -8083 155 7459 9993 7160 998 -5211 -8495 -7504 -3275 2758 7882 9448 5772 -1694
1616a694p169k309M436Q869P722J637n342q874o643q32M937P247N386J138k911
$$ -1694 -8863 -11172 -6736 2133 9855 11492 6150 -2724 -9367 -10199 -5262 1985 7371 8509 5598
1631E598n279n508l225Q06M971O777N165J84n792q592o182P53O934Q778N191j258
$$ 5598 319 -5189 -8414 -7608 -2637 4140 9305 9489 3697 -4895 -11077 -10324 -3390 5388 10579 9321
1647I321o635p716m421J052N032O003M387J038k846n640n918l196J869O528P854
$$ 9321 2686 -5030 -9451 -8399 -3367 2636 7023 8061 5215 -425 -6343 -9539 -7670 -1142 6712
1662F712M299k345p909q322l735L282P889P346K740k966o353n962k696J257M374
$$ 6712 11011 8666 757 -7565 -11300 -8018 -129 7217 9957 6991 638 -5324 -8020 -6763 -2389
1677b389N290M410J149l477o736o379j994M033Q049P225J799n048q677o588p25
$$ -2389 2901 7311 8460 4983 -1753 -8132 -10126 -6093 1956 9181 10980 5932 -2745 -9333 -10058
1692a0058N004P239N349R79l343n487n087k498J001M654O273M836M0n222p776
$$ -10058 -5054 2185 7534 8513 5170 -317 -5404 -7902 -6901 -2247 4026 8862 8902 3680 -4096
1707d096n775L0O290Q521N344r68o373p621m200J106M987N881L919N57k953n186
$$ -4096 -9871 -9841 -3551 4970 10314 9346 2973 -4648 -8848 -7742 -2755 3126 7045 7602 4649 -537
1723e37n155k592J679N824P101L908k072p253p945l633K945P546P362K820l144
$$ -537 -5692 -8284 -6605 -781 6320 10228 8156 903 -7042 -10675 -7730 -184 7178 9998 6854
1738F854o512n914k572J570M502N324L866O50l365o022n875j947L417P538O942
$$ 6854 342 -5572 -8144 -6574 -2072 3252 7118 7768 4403 -1619 -7494 -9441 -6024 1514 8456
1753H456J995m521q187o475j041M841P191N248P70l505n424m684k036J443M398
$$ 8456 10451 5930 -2257 -8732 -9773 -4932 2259 7507 8277 4772 -652 -5336 -7372 -5929 -1531
1768a531N568M030j23m702p158n369l7N898Q110N307r36o298p541m283J056N264
$$ -1531 4037 8067 7944 3242 -3916 -9285 -9322 -3424 4686 9993 9057 2759 -4782 -9065 -8009 -2745
1784b745O125L793J4l307m939m660k222J764N360O506L657j707o575p558l694
$$ -2745 3380 7173 7187 3880 -1059 -5719 -7941 -6177 -817 5689 9346 7639 1064 -6494 -10188
1799a0188K616P115P278K802k878o467n929k326J923M725M906L136R9l224n452
$$ -10188 -7572 -457 6821 9623 6745 278 -5651 -7977 -6054 -1329 3577 6713 6812 3588 -1864
1814a864n075j610L186O844O471J834m083p782o462j083M679P168N325O43l581
$$ -1864 -6939 -8549 -5363 1481 7952 9786 5703 -2079 -8541 -9624 -4945 2223 7548 8191 4610
1829D610n713m622j530J782M376M951L419K3m251o542n101k03N236P720N075m14
$$ 4610 -1103 -5725 -7255 -5473 -1097 3854 7273 7296 3045 -3497 -8598 -8801 -3565 4155 9230 8816
1845H816n947p403m276J139N257N990L409k53l442m787m091j505J830M907N651
$$ 8816 2869 -4534 -8810 -7671 -2414 3576 6985 6732 3290 -1497 -5588 -7093 -5263 -356 5295
1860E295L230j549n938p113l629K306O783P076L049k842o514n988k240K196M675
$$ 5295 8525 6976 1038 -6075 -9704 -7398 -615 6461 9510 6668 154 -5834 -8074 -5878 -1203
1875a203M807K891j76l270n001m469j476K816O062O139K033l586p317o286j276
$$ -1203 3604 6495 6319 3049 -1952 -6421 -7897 -5081 981 7120 9153 5567 -1750 -8036 -9312
1890i312M322P081N287O24l759n648m285j238K246M087M569K863l08l976n863
$$ -9312 -4990 2091 7378 8002 4243 -1405 -5690 -6928 -4682 -595 3974 6837 6529 2553 -3310
1905c310m571k92M833P190N089l10n701p311m266J032N118O078L581m98l731m718
$$ -3310 -7881 -8173 -3340 3850 8939 8629 2928 -4383 -8649 -7617 -2499 3579 7160 6662 2931 -1787
1921a787l748j129J910M481N115K992j343n413o483l670J943O345O890L059k631
$$ -1787 -5535 -6664 -4754 -273 4842 7834 6491 1078 -5405 -9075 -7132 -787 6103 9162 6531
1936F531o364n790k135K244M788M686K501o82l294m577l827j139K683N672N560
$$ 6531 167 -5623 -7758 -5514 -726 3960 6461 5779 2485 -2092 -5919 -7058 -4375 1297 6857
1951F857J804l358o802o014j410L954O913N469P37l913n714m291j015K295M245
$$ 6857 8661 5303 -1499 -7513 -8923 -4969 1944 7413 8150 4237 -1477 -5768 -6783 -4488 -243
1966b43M220K417n46l623n222m204k99M273O599M777j80n063o824m314P53N073
$$ -243 3977 6394 5848 2225 -2997 -7201 -7500 -3227 3372 8149 7969 2906 -3918 -8232 -7479 -2406
1982b406O084L432p40l811m723l228p17J970M311M545K474j377m859n981l380
$$ -2406 3678 7110 6370 2559 -2164 -5392 -6109 -4139 172 4717 7191 5814 955 -5026 -8406
1997h406J522N997O663L092k423o062n816k451K167N060M816K247r88l302m276
$$ -8406 -6884 -887 5776 8868 6445 383 -5433 -7884 -5717 -657 4159 6406 5418 2116 -2160
2012b160l451q36K515N004M873J887k748o163n816j670L666O636N310P95l762
$$ -2160 -5611 -6447 -3932 1072 5945 7832 5084 -1079 -6895 -8565 -4899 1737 7047 7842 4080
2027D080n639m252p85K548M280L938J860r01l417m696l614l50L997O025M652J04
$$ 4080 -1559 -5811 -6596 -4048 232 4170 6030 5129 1712 -2984 -6598 -6948 -2951 3074 7726 7830
2043G830m688o767m432M47N037O217L400p51l764m819l148l86K245L934M000K115
$$ 7830 3142 -3625 -8057 -7610 -2573 3644 7044 6293 2529 -2290 -5438 -5824 -3579 355 4355 6470
2059F470j120m386n450l184J246N376O306L066k052n918n839k191K249N106M721
$$ 6470 5350 964 -4486 -7670 -6424 -1048 5258 8324 6272 354 -5485 -7676 -5427 -321 4400
2074D400J921j341l444m086k938m31K580M545M381J695k504n791n527j727L566
$$ 4400 6321 4980 1536 -2550 -5488 -5919 -3339 1206 5587 7282 4778 -1013 -6540 -8267 -4701
2089d701O275N111J090l555n719m394p59K819M271L686J616j062l324m253l160
$$ -4701 1574 6685 7775 4220 -1499 -5893 -6652 -3833 438 4124 5740 4678 1354 -2899 -6059
2104f059j43L417N546M226K62m322o231m278L08M937N908L376p15m066m756l010
$$ -6059 -6202 -2785 2761 6987 7249 2927 -3304 -7582 -7274 -2337 3571 6947 6232 2166 -2590 -5600
2120e600k4K572L875L508J706j254m151m924k893J249M794N874L266j748n598
$$ -5600 -5624 -3052 823 4331 6037 4783 632 -4292 -7185 -5936 -1142 4732 7998 6250 652
2135F52n817k510K210M933M809K067j451l661l991k368k10K393M177L869J470
$$ 652 -5165 -7675 -5465 -532 4277 6344 4893 1232 -2759 -5127 -5337 -2944 1233 5102 6572
2150F572k312m910n225j787K956N919N234J074l437n721m323n49K913M451L516
$$ 6572 4260 -650 -5875 -7662 -4706 1213 6447 7521 4084 -1637 -5960 -6509 -3596 855 4371
2165D371J205j344l329l908k643O3L024M971M145M12l991n983m245J62M422N992
$$ 4371 5576 4232 903 -3005 -5648 -5585 -2561 2410 6555 6967 2976 -3007 -7252 -7090 -2668 3324
2181C324L627p65m062m773k870J26K570L837L246J193j339l599m402k643R99M451
$$ 3324 6951 6186 2124 -2649 -5519 -5393 -2823 1014 4260 5453 4114 515 -3887 -6530 -5531 -1080
2197a080N501L076j534n296n640k411K109M920M760J949j618l798l889k205K46
$$ -1080 4421 7497 5963 667 -4973 -7384 -5275 -355 4405 6354 4736 938 -2951 -5156 -4910
2212d910K414L878L592J208k222m695m676j825K595N647N198J231l325n444m376
$$ -4910 -2496 1382 4974 6182 3960 -735 -5411 -7236 -4641 1006 6204 7435 4110 -1334 -5710
2227e710q51K834M596L533J013j595l240l629k202K61K900M454L557M52l513n608
$$ -5710 -6561 -3727 869 4402 5415 3820 580 -3049 -5251 -4990 -2090 2364 5921 6373 2860 -2748
2243b748m023N4M132N764L596n77m167m923k720K99K846L866L012P90j518l495
$$ -2748 -6771 -6717 -2585 3179 6775 6198 2031 -2892 -5612 -5313 -2467 1399 4411 5201 3683 188
2259A88l770k418P50M217N123K967j266m816n487k648J752M968M771J925j653
$$ 188 -3582 -6000 -5250 -1033 4090 7057 5791 975 -4512 -7160 -5408 -440 4331 6256 4603
2274D603l869l810j981O06K444L529L041Q65j878m258m321j648K317N240M838
$$ 4603 734 -3076 -5057 -4451 -2007 1522 4563 5428 3550 -708 -5029 -6677 -4360 880 5718
2289E718J379l028n459m342p89L015M677L542P21j952l246l395j853L69K811M083
$$ 5718 7097 4069 -1390 -5732 -6521 -3506 1171 4713 5434 3482 236 -3159 -5012 -4643 -1832 2251
2305B251L325L17l109n146m089j93L995N567L586l85l942m967k840M56K963L830
$$ 2251 5576 5893 2784 -2362 -6451 -6644 -2649 2918 6504 6119 2177 -2790 -5630 -5174 -2211 1619
2321A619K609O19j666l255l437j950P99L692M739K765j090m568n238k556J695
$$ 1619 4228 4847 3181 -74 -3511 -5461 -4662 -970 3769 6534 5444 876 -4362 -6918 -5223
2336e223M842M829J793j757l918l899j775P40K714L432K676O38j891l953m049
$$ -5223 -381 4448 6241 4484 566 -3333 -5108 -4368 -1654 1778 4454 5092 3201 -752 -4801
2351d801j451K074M868M616J531k782n196m391q54K887M629L506P15k133l386
$$ -4801 -6252 -4178 690 5306 6837 4055 -1141 -5532 -6386 -3499 1130 4636 5351 3218 -168
2366a68l152j441O65K693L646K836K07k820m714l691k59L608N331L639l89l899
$$ -168 -3320 -4761 -4096 -1403 2243 5079 5286 2466 -2248 -5939 -6198 -2590 2741 6380 5991 2092
2382B092m942k942O31L145L946K518K22j793l265l193j481Q63L340M205K741q68
$$ 2092 -2850 -5792 -5161 -2016 1930 4448 4670 2877 -388 -3581 -5062 -4199 -859 3346 6087 5219
2398E219m226n017k598J422M582M722K060j734m007l876j674J009K804L300K216
$$ 5219 993 -4024 -6622 -5200 -618 4104 6164 4430 423 -3453 -5127 -4118 -1314 1986 4202
2413D202L30j920l539l413j347J828M429M376J509k448n034m338r86K864M661
$$ 4202 4532 2612 -927 -4340 -5687 -3859 570 4946 6455 4007 -1027 -5365 -6351 -3487 1174
2428A174L597N80k188l549l013j300R19K715L323K523J97k620m362l506l64L213
$$ 1174 4771 5351 3163 -386 -3399 -4699 -3780 -1065 2258 4781 4978 2358 -2004 -5510 -5874 -2661
2444b661N076L613j14l700m892k922M69L285L880K351P2k067l056k715j291R82
$$ -2661 2415 6028 5914 2214 -2678 -5600 -5131 -1846 2034 4385 4457 2390 -666 -3381 -4672 -3690
2460c690L043L872K345p48l783m724k667J248M431M811K091j718m175l896j522
$$ -3690 -647 3225 5570 4822 1039 -3685 -6352 -5104 -673 4138 6229 4511 336 -3560 -5082
2475e082J120L046L083J975K18k002l229l131j238J628M089M042J572k052m787
$$ -5082 -3962 -916 2167 4142 4360 2358 -871 -4002 -5240 -3612 477 4519 6091 4039 -748
2490g48m277j096K658M545L628N91k279l611k921r52J159K644K913K135o2k296
$$ -748 -5025 -6121 -3463 1082 4710 5301 3022 -589 -3510 -4462 -3303 -659 2254 4389 4327 2031
2506B031l921l231m22K987M839L525j20l479m804l020N28L239M051K384j25k249
$$ 2031 -1890 -5121 -5543 -2556 2283 5808 5688 2209 -2595 -5615 -5087 -1848 2203 4587 4462 2213
2522B213l105k478j048J055K898L481K194p05l453m424k533J058M042M676K120
$$ 2213 -892 -3370 -4418 -3363 -465 3016 5210 4505 1052 -3372 -5905 -4847 -805 3871 5991
2537E991j611m033l907j475J240L043L179J651j89k067k948k705r36J578L688
$$ 5991 4380 347 -3560 -5035 -3795 -752 2427 4078 3889 1822 -1126 -3831 -4767 -3189 499
2552D99L788J481k014m443m182j221K622M546L610O18k260l732k968q21J410K672
$$ 499 4287 5768 3754 -689 -4871 -6092 -3470 1076 4686 5304 3044 -688 -3656 -4477 -3067 -395
2568c95K791J815j71k225l549k930l63K585M427L384Q2l213m673k966L83L283
$$ -395 2396 4211 4040 1815 -1734 -4664 -5027 -2442 1985 5369 5451 2238 -2435 -5401 -5018 -1735
2584a735L938K301k53k336l101k329n89J219K665L033J897n89l216m073k375Q80
$$ -1735 2203 4504 4251 1915 -1186 -3515 -4104 -2885 -220 2813 4710 4121 905 -3168 -5543 -4663
2600d663L741M554K185j440m014l921j646J385L157L122J621m44k050k800k339
$$ -4663 -922 3632 5817 4377 363 -3558 -5204 -3819 -662 2460 4081 3637 1587 -1213 -3552
2615c552q07J442L340L502J352j648m185l959j154K269M339L563P07k387l722
$$ -3552 -4359 -2917 423 3925 5277 3629 -556 -4515 -5669 -3400 939 4502 5209 2822 -900
2630i00k817o31J550K654K717J357l99k166l161k576l69K560M015L233J92l083
$$ -900 -3717 -4348 -2798 -144 2573 3930 3531 1365 -1796 -4372 -4741 -2181 1834 5067 5259 2176
2646B176m491l008L61L166M034K341l14k460l123k231l02J382K480K777J556o84
$$ 2176 -2315 -5323 -4962 -1796 2238 4579 4265 1805 -1318 -3549 -3851 -2469 11 2788 4344 3660
2662C660k889l604k253P22L493M298K138j330l780l871j595J330L257L177J374
$$ 3660 771 -2833 -5086 -4364 -871 3427 5565 4235 455 -3416 -5011 -3681 -424 2753 4127
2677D127o49k307k656j981m83J508L017L068J231j556l813l779j168K090M191
$$ 4127 3478 1171 -1485 -3466 -3949 -2441 576 3644 4875 3319 -494 -4273 -5441 -3351 840
2692H40L655O67k314l781k854n24J582K824K560J188o71k046k934k151k59K184
$$ 840 4495 5162 2848 -933 -3787 -4311 -2729 95 2655 3843 3172 1126 -1808 -3959 -4218 -2034
2708b034L693K970K73k736m202k939R3L198L937K347m68k637l113k035m5J581
$$ -2034 1659 4629 4902 2166 -2036 -4975 -4882 -1684 2253 4600 4132 1495 -1618 -3653 -3698 -2117
2724b117K495K369J232p86k575l321k099O14L238M088K187j115l685l906j630
$$ -2117 378 2747 3979 3193 618 -2703 -4802 -4188 -950 3138 5325 4210 525 -3381 -5011
2739e011J276L289L245J360r04k346k538j778k47J557K750K661J145j413l403
$$ -5011 -3735 -446 2799 4159 3255 909 -1629 -3407 -3654 -2097 653 3314 4459 3046 -357
2754c57l485j309J904M030L495O74k159l720k894n31J906K847K395Q49p14k074
$$ -357 -3842 -5151 -3247 783 4278 4952 2793 -927 -3821 -4352 -2446 401 2796 3645 2931 857
2770H57k744j809j76K039L470K717L57k648l971k899J0K938L978K459m94k555
$$ 857 -1887 -3696 -3872 -1833 1637 4354 4711 2063 -1908 -4807 -4797 -1859 2119 4578 4084 1529
2786A529l118k052NJ717K397K107J027p40k417l055j829O28K911L658K125r18
$$ 1529 -1589 -3641 -3636 -1919 478 2585 3612 2872 455 -2600 -4429 -3801 -890 2768 4893 3975
2802C975l463l795j624J332L297L131J314j009k508k477j517J24J443K603K417
$$ 3975 512 -3283 -4907 -3575 -278 2853 4167 3158 650 -1827 -3344 -3220 -1777 826 3243
2817C243Q62j312l152l241j265J798L769L324R00k094l621k948n54J951L027K157
$$ 3243 4105 2793 -359 -3600 -4865 -3067 702 4026 4926 2832 -789 -3737 -4291 -2340 687 2844
2833B844O51q91k161k326j546M4J884K933K483L86k315l770k675j01K790L770
$$ 2844 3495 2604 443 -1883 -3429 -3385 -1501 1432 3915 4301 1986 -1784 -4459 -4560 -1770 2000
2849B000K470m32k687l198j859K00J943K402J944O53q79k248k653j704N19K740
$$ 2000 4470 4038 1351 -1847 -3706 -3506 -1563 839 2783 3436 2557 309 -2344 -4048 -3529 -789
2865g89L485K017p14l229l750j754J267L218L139J280j082k551k519j296L90J521
$$ -789 2696 4713 3999 770 -2980 -4734 -3467 -249 2890 4170 3088 537 -1982 -3278 -2888 -1367
2881a367K186K219O89j221k852k932j237J501L600L237Q51k042l617k760o03J996
$$ -1367 819 3038 3727 2506 -346 -3278 -4515 -3014 586 3823 4674 2632 -985 -3745 -4348 -2352
2897b352L077K242N32j180k123k187j429K70J805K732K300L18k133l515k621j20
$$ -2352 725 2967 3499 2319 196 -1991 -3420 -3150 -1345 1387 3687 4005 1872 -1643 -4264 -4384
2913d384K620L612K484l14k657l230j808K97J919K361J868M51j127k073k236j398
$$ -4384 -1764 1848 4332 4018 1361 -1869 -3677 -3380 -1461 900 2768 3219 2092 19 -2217 -3615
2929c615M41K489L151J892p64k947l558j722J184L145L241J191j190k583k555
$$ -3615 -3174 -685 2466 4358 3594 647 -2911 -4633 -3449 -304 2937 4128 2938 355 -2200
2944b200j127N11J707K199J794N28j247k638k649r98J263L255L213R23j878l439
$$ -2200 -3327 -2816 -1109 1090 2884 3412 2165 -473 -3122 -4120 -2857 398 3611 4534 2656 -783
2960g83k841n20J817L106K279M09j308k243j939j039L52J739K403J869K12j779
$$ -783 -3624 -4144 -2327 779 3058 3467 2159 -84 -2023 -3062 -2710 -971 1432 3301 3513 1734
2976A734l163k545j36K408L572K261j79k573l254j897M93J997K505J652L03j238
$$ 1734 -1429 -3974 -4110 -1702 1870 4131 3952 1379 -1875 -3772 -3279 -1282 1223 2875 3178 1940
2992A940k150j961j214N16K293K852J787n55k779l363j713R23L075L128J280j140
$$ 1940 -210 -2171 -3385 -2869 -576 2276 4063 3508 729 -2634 -4347 -3424 -349 2779 4059 2919
3008B919k640k516j082O62J757K081J467L47j158k390k396r65J255K916L076Q88
$$ 2919 279 -2237 -3319 -2657 -900 1181 2648 2995 1837 -553 -2949 -3914 -2659 257 3333 4221
3024D221j665l311k865n38J852L076K316L83j432k343j906p82M75J689K202J690
$$ 4221 2556 -755 -3620 -4158 -2306 770 3086 3469 2037 -306 -2212 -2994 -2519 -830 1372 3062
3040C062K11j698k836k324l33K199L376K350j42k425l205j924L92K114K543J502
$$ 3062 3273 1575 -1261 -3585 -3918 -1719 1657 4007 3865 1440 -1765 -3689 -3297 -1183 1360 2862
3056B862Q7j366j972j855q41O07J951K602J580m52k612l108j697Q56K909L182
$$ 2862 2949 1583 -389 -2244 -3085 -2478 -527 2075 3655 3203 591 -2517 -4214 -3358 -449 2733
3072B733J277j140k651k566j047Q04J919K118J273J7j205k006k154q34J081K761
$$ 2733 4010 2870 219 -2347 -3394 -2590 -671 1447 2720 2737 1532 -474 -2628 -3462 -2381 380
3088C80K707R53j354l168k834o58J826L013K231L60j491k260j947n49P15J643
$$ 380 3087 4040 2686 -482 -3316 -3974 -2148 865 3096 3456 1965 -295 -2242 -2791 -2076 -433
3104d33J944J376%j466k630k125k66K017L129K295j62k343l087j909L94K080K632
$$ -433 1511 2887 2887 1421 -1209 -3334 -3600 -1583 1546 3841 3679 1336 -1751 -3660 -3266 -1186 1446
3121A446J446n5j410j970j683o47O36J893K315J494m07k320k946j772P50K750
$$ 1446 2892 2837 1427 -543 -2226 -2873 -2237 -344 1971 3465 3058 738 -2208 -3980 -3230 -480
3137d80K996J357j014k648k540q82P91J971J988J079o0j277j890j816p41J032
$$ -480 2516 3873 2859 211 -2329 -3211 -2420 -449 1539 2618 2558 1281 -609 -2425 -3166 -2134
3153b134K419K509J013j350k918k766p68J733L036K240L82j561k403j762n53Q19
$$ -2134 285 2794 3807 2457 -461 -3227 -3995 -2262 774 3014 3396 1835 -568 -2330 -2883 -2064
3169b064J717J838J249p9j457k317k020k46J786K930K249M9k180l058j856K48
$$ -2064 -347 1491 2740 2661 1204 -1113 -3133 -3379 -1593 1337 3586 3635 1455 -1603 -3459 -3211
3185c211K115K562J476k29j531j949j429m70P51J747K059J256m66k105k726j573
$$ -3211 -1096 1466 2942 2713 1182 -767 -2196 -2666 -1915 -168 1891 3147 2681 576 -2150 -3723
3201c723O54K537L026J330r77k607k663q32R04K009K054R24k73j281j903j483
$$ -3723 -3069 -532 2494 3824 2847 240 -2423 -3255 -2351 -342 1712 2636 2363 1082 -821 -2304
3217b304o37R88K215K341Q79j170k671k591q09J634K852K216M10j529k360j920
$$ -2304 -2941 -1953 262 2603 3482 2312 -359 -2950 -3759 -2125 727 2943 3353 1824 -536 -2456
3233b456l44R71J721J680R75k28j339k188j657k89J668K771K092J5j967k928k005
$$ -2456 -2800 -1829 -108 1572 2547 2319 980 -1208 -2865 -3154 -1486 1285 3377 3392 1425 -1503 -3508
3250c508K91K108K586J499k27j656k029j266l39P93J693J789J074l34j865k483
$$ -3508 -3217 -1109 1477 2976 2749 1093 -936 -2202 -2541 -1748 -55 1734 2808 2474 609 -1874
3266a874j415L53K369K805J353p70k539k528j001R09K158J893R04l78j413j732
$$ -1874 -3289 -2936 -567 2238 3591 2821 282 -2246 -3247 -2338 -180 1713 2617 2239 826 -906
3282i06j301l55R38J958J990Q60j043k455k471q31J433K755K290N46j562k401
$$ -906 -2207 -2562 -1624 334 2324 3184 2141 -314 -2785 -3616 -2183 572 2862 3408 1846 -555
3298e55j885l22J065J753J599P41l50j217j885j530k07J399K474J960J70j842
$$ -555 -2440 -2762 -1697 56 1655 2396 2046 829 -1056 -2586 -2793 -1394 1080 3040 3210 1368
3314A368k744j911J89K016K520J546l01j694k002j269p5R96J515J586Q69m42j726
$$ 1368 -1376 -3287 -3098 -1082 1438 2984 2683 989 -1013 -2282 -2357 -1361 154 1740 2609 2167 441
3331D41k168j404L88K092K656J512q15k393k486j083R39K077K089P35n84j359
$$ 441 -1727 -3131 -2743 -651 2005 3517 2702 309 -2177 -3260 -2321 -244 1845 2580 1996 637
3347F37j581j227j69R62J743J797O97q52k221k370p93J233K677K201M85j508k384
$$ 637 -944 -2171 -2340 -1378 365 2162 2859 2007 -214 -2584 -3377 -2144 533 2734 3219 1711 -673
3364f73j837k30J214J727J525N97m57j336j696j161j43J257K240J854J26j659
$$ -673 -2510 -2740 -1526 201 1726 2323 1866 530 -1166 -2327 -2470 -1213 1027 2881 3007 1348
3380A348k570j938O6K022K561J462l07j696k025j186J8J034J534J334O66m44j491
$$ 1348 -1222 -3160 -3094 -1072 1489 2951 2644 948 -1077 -2263 -2245 -1211 323 1657 2323 1879 388
3397C88j986j214L26J911K394J405o69k299k360j095Q82K160J986P90p32j549
$$ 388 -1598 -2812 -2486 -575 1819 3224 2555 256 -2104 -3199 -2317 -157 1829 2619 1887 338
3413C38j463j000m9R87J616J597N77p28k069k121q37J114K461K256M57j303k390
$$ 338 -1125 -2125 -2174 -1187 429 2026 2603 1875 -194 -2315 -3152 -2038 423 2679 3136 1833 -557
3430e57j840k75J254J735J495M89o68j286j520r87n4J173J964J653K42j506k356
$$ -557 -2397 -2672 -1418 317 1812 2301 1633 347 -1173 -2160 -2214 -1041 923 2576 2818 1312 -1044
3447a044j928L1J864K458J568l97j744j940j201J39J195J506J253L82n16j439
$$ -1044 -2972 -2941 -1077 1381 2949 2552 808 -1132 -2333 -2194 -999 507 1760 2142 1626 187
3463A87j701j120L00J807K267J379n45k162k452j098R41K062J908Q03o78j597
$$ 187 -1514 -2634 -2334 -527 1740 3119 2574 412 -2040 -3138 -2197 -135 1773 2576 1898 301
3479C01j485q46J24J025J450J306N02p12j873j903p91R67K293K129O04j370k274
$$ 301 -1184 -2030 -1906 -881 569 1875 2377 1665 -208 -2111 -2902 -1935 358 2487 3091 1721 -553
3496e53j907k34J213J983J367L30p27j319j326r74J76J153J677J492K83j464k265
$$ -553 -2460 -2694 -1481 502 1869 2199 1472 153 -1173 -2147 -1971 -818 859 2351 2634 1170 -1095
3513a095j750J4J644K354J612k01j757k066j117K53J160J504J171L37o68j390
$$ -1095 -2845 -2831 -1187 1167 2779 2578 821 -1245 -2362 -2109 -949 555 1726 2063 1395 5
3529Ej398r27K42J591J989J273m22j965k299j103P97K084J978P46o79j681j573
$$ 5 -1393 -2320 -2078 -487 1502 2775 2353 388 -1911 -3014 -2217 -133 1845 2591 1912 231 -1342
3546a342p30L69J035J358J109L99p62j628j665p61Q21K132J943N90j093k231j898
$$ -1342 -2072 -1703 -668 690 1799 2198 1436 -192 -1857 -2618 -1797 335 2278 2868 1775 -456 -2354
3563b354k74J153K006J370K75q30j349j242o80J98J031J552J279J86j179k082
$$ -2354 -2628 -1475 531 1901 2176 1346 -3 -1245 -1925 -1727 -696 856 2135 2321 1142 -940
3579i40j699M3J511K357J422j74j670k101j146L17J322J446J042J77o83j236j364
$$ -940 -2639 -2596 -1085 1272 2694 2520 850 -1251 -2397 -2080 -758 688 1730 1907 1224 -12 -1376
3596a376p22J86J443J962J155m41j806k105j128O93J972J960Q23p03j716j494
$$ -1376 -2098 -1912 -469 1493 2648 2207 401 -1704 -2832 -2139 -167 1793 2616 1913 197 -1297
3612a297q01M47J130J207R48L04o98j547j549n54P18J942J853N62j044k247j687
$$ -1297 -2098 -1651 -521 686 1634 1938 1240 -307 -1856 -2410 -1692 250 2103 2665 1621 -626 -2313
3629b313l53J249J903J444K38j010j397j165m51J56J080J449J141P1j106j781
$$ -2313 -2666 -1417 486 1930 2168 1158 -239 -1404 -1855 -1699 -619 830 1971 2042 936 -845
3645h45j522j98J413K298J308k8j598j995j144J95J432J554R08L5q02j241j091
$$ -845 -2367 -2565 -1152 1146 2454 2426 828 -1167 -2311 -2116 -684 870 1778 1813 1011 -230 -1321
3662a321n69L45J252J629J058l23j688k036j047O00J854K111O64p33j752j488
$$ -1321 -1890 -1545 -293 1336 2394 2071 383 -1653 -2700 -2100 -246 1865 2529 1796 44 -1444
3678a444n68L60J239J284P77J03p04j303j396o35P71J698J738P29r83k003j836
$$ -1444 -2012 -1652 -413 871 1648 1751 1047 -256 -1652 -2287 -1516 182 1920 2649 1666 -337 -2173
3695b173l29J192J903J382J77r41j478j168l11M10R94J259R73K0r48j626j432
$$ -2173 -2502 -1310 593 1975 2152 1211 -267 -1435 -1746 -1336 -342 917 1890 1910 962 -664 -2096
3712b096k67J339K049J497j24j590j909j270L62J405J512Q87o2q51j183j041m94
$$ -2096 -2363 -1024 1025 2522 2398 808 -1101 -2371 -2009 -604 908 1795 1733 882 -301 -1342 -1836
3729a836L75J242J455R89k85j502j860j104M88J757J924Q44p55j654j590n64N26
$$ -1836 -1461 -219 1236 2225 1940 438 -1422 -2526 -2038 -281 1643 2487 1732 78 -1512 -2076 -1550
3746a550J305J153P18j07p30j139j190m00N84J573J584N44q15j913j727m01J133
$$ -1550 -245 908 1626 1519 789 -350 -1540 -1940 -1356 217 1801 2345 1530 -383 -2110 -2511 -1378
3763a378J913J448J29r58j550j068l34N39J028J177P73k9r33j532j224j69J185
$$ -1378 535 1983 2112 1154 -396 -1464 -1798 -1259 -231 946 1719 1690 757 -775 -1999 -2168 -983
3780i83J884J389k5j413j963j127K69J293J600Q79j60r16j219q70k55L84J101
$$ -983 901 2290 2265 852 -1111 -2238 -1969 -676 924 1803 1643 727 -492 -1362 -1617 -1233 -132
3797a32J346P43j96j362j740r83L78J743J723R38p20j714j526n60O35J222J232
$$ -132 1214 1957 1761 399 -1341 -2324 -1946 -203 1520 2458 1738 24 -1502 -2062 -1427 -205 1027
3814A027N62j55q02j113r56m10O13J369J498N81p49j828j523n31J065J849J409
$$ 1027 1589 1434 632 -481 -1437 -1847 -1234 135 1633 2214 1465 -363 -1886 -2417 -1352 497 1906
3831A906J13r59j425j119k07N65J073J039N89j44p78j379j020k45J061J710J328
$$ 1906 2019 1060 -365 -1484 -1691 -1126 -53 986 1575 1431 653 -726 -1746 -1991 -930 780 2108
3848B108K0j310j847j188J90J390J629Q86k72r98j177q51j20N10R54J174P01k29
$$ 2108 2128 818 -1029 -2217 -2027 -637 992 1878 1606 608 -569 -1420 -1540 -1030 -76 1098 1799 1570
3866A570j175j670q84L28J540J714Q89n42j727j507n62O41J356J197M21k51q95
$$ 1570 395 -1275 -2159 -1831 -291 1423 2312 1770 43 -1464 -2026 -1385 -29 1168 1589 1338 443
3883D43j066p22k56N53J260J322N02o60j670j516m52R17J851J350K18j001j544
$$ 443 -623 -1345 -1601 -1048 212 1534 2036 1376 -294 -1810 -2262 -1345 506 1856 2074 1073 -471
3900d71j076j61O77J120R28M38j52q37j123r82j46R39J603J200Q4j238j706j228
$$ -471 -1547 -1708 -1031 89 1017 1455 1303 466 -657 -1639 -1785 -846 757 1957 2041 803 -903 -2131
3918b131J67J344J601R51l19j102j179p32k8N70J006R63N61l40j013j408r31L21
$$ -2131 -1964 -620 981 1932 1613 511 -668 -1400 -1428 -858 148 1111 1672 1332 319 -1089 -2020 -1699
3936a699J416J665Q11n18j563j514o06O02J332J270M72m59q38r84o85j60N19J102
$$ -1699 -283 1382 2193 1675 112 -1402 -2008 -1406 -74 1196 1668 1209 371 -613 -1298 -1458 -939 163
3954A63J216M17n72j415j424n19Q98J618J410K93j111j476j124r1P84J140R16
$$ 163 1379 1796 1224 -191 -1615 -2134 -1236 382 1792 2085 974 -502 -1626 -1717 -933 207 1123
3971A123L25m01p11j070q52r3R47J398J178J06j100j699j201J02J346J619P86
$$ 1123 1448 1047 336 -734 -1586 -1679 -732 666 1844 1950 850 -849 -2050 -1948 -602 1017 1803
3988A803k51r70j289p64J02O67R82P76M10k86r72j194p91K28J304J530Q53n27
$$ 1803 1552 582 -707 -1471 -1369 -702 280 1056 1466 1180 208 -986 -1777 -1549 -245 1285 2138 1611
4006A611j504j565m78N64J341J255M96n63r82r45n01n5N88J012J023M06n75j346
$$ 1611 107 -1458 -1936 -1372 -31 1224 1720 1157 175 -770 -1271 -1326 -738 274 1297 1703 1128 -218
4024b18j301m90P78J579J355L06r81j486j182n0P93J139R17K36l76p92r29o63
$$ -218 -1519 -2009 -1231 348 1703 2009 1028 -458 -1640 -1690 -897 242 1159 1395 1019 227 -702 -1365
4042a365l5P04J260J166k2j015j485j128J57J140J633Q22k95j100j234o73J23
$$ -1365 -1400 -696 564 1730 1708 693 -792 -1920 -1763 -623 1010 1832 1537 437 -797 -1470 -1347
4059a347P58Q82Q00K74l74q67j144n97K23J073J480Q69m51j475j456n74O13J264
$$ -1347 -589 293 1093 1367 993 126 -1018 -1615 -1392 -319 1161 2030 1579 104 -1352 -1926 -1313 -49
4077d9J276M13n41r88r41m59J4P32Q81Q54K51m63j122j346l52O97J460J326K84
$$ -49 1227 1640 1099 111 -830 -1289 -1275 -543 338 1192 1443 980 -142 -1488 -1840 -1143 317 1643 1927
4096A927r02j546j030j10Q43J115R13J32m60q81q71m31Q3O97J100R27J53r17j524
$$ 1927 1025 -521 -1551 -1661 -818 297 1210 1342 882 1 -870 -1301 -1218 -521 579 1506 1659 742 -782
4115g82j022P4J102J543Q49j58j189j234p50K65P85R35O95J02l43q75r70n99K38
$$ -782 -1804 -1730 -628 915 1764 1606 417 -817 -1567 -1302 -517 418 1113 1215 872 -3 -973 -1572 -1334
4134a334J095J316O98l32j281j411o36N23J477J143L76n57j027r41l37J71O49
$$ -1334 -239 1077 1775 1443 162 -1249 -1885 -1362 115 1258 1634 1077 50 -891 -1228 -1057 -408
4151d08Q57P66J43m95j125j073l40N13J432J286K76q46j445j014j68Q29J228Q78
$$ -408 449 1215 1358 863 -262 -1335 -1675 -1162 270 1556 1832 986 -459 -1473 -1641 -812 416 1294
4169A294M8n67q07p19m27J03P19R36Q40J02q29j335r72o8J113J456Q68j65j198
$$ 1294 1342 775 -32 -751 -1178 -1075 -356 580 1420 1522 693 -642 -1614 -1682 -569 887 1755 1590 392
4188C92j293o23K32P82J002O25M6m36q21q28m72J81J054J170O88l37j203j367
$$ 392 -901 -1524 -1292 -510 492 1117 1163 727 -94 -922 -1394 -1213 -159 1011 1699 1362 159 -1208
4206a208n88M58J357J145M46n58j007r61l61K77O76P79N99R3l58j088q91l80N50
$$ -1208 -1796 -1338 19 1164 1610 1052 45 -916 -1277 -1000 -324 455 1054 1147 789 -299 -1190 -1570 -1020
4225a020J277J153L73q37j390j030k23Q74J207Q49J00o38r00p01l54K82P35Q60
$$ -1020 257 1410 1783 946 -444 -1474 -1697 -823 384 1233 1333 695 -205 -906 -1260 -978 -243 617
4243F17O20N9p42j210r67J6R90J308R82k30r75j329o46K55Q60R48N61L1n99p19
$$ 617 1237 1296 554 -656 -1623 -1607 -617 691 1673 1443 468 -861 -1507 -1252 -392 556 1117 1148 549 -170
4263a70p28l16K16Q01J055O89l18j095j261o81N20J235J326L42n36j098r81l04
$$ -170 -898 -1214 -998 -197 858 1547 1229 134 -1127 -1808 -1288 -53 1273 1615 1079 -19 -1000 -1304
4281a304L13Q68P58M34l0m10q18q48l46M46J160J121M01p32j381j162o9Q44J168
$$ -1304 -991 -123 635 1069 1039 629 -189 -1037 -1383 -937 223 1344 1745 1013 -368 -1530 -1599 -755 413
4300D13Q93j5n79r36o44k26K63O04Q54N64n6o26j017r10k7R00J303Q79j92j050
$$ 413 1306 1291 712 -224 -868 -1094 -831 -227 627 1191 1135 509 -508 -1418 -1445 -545 758 1637 1445 395
4320C95j204o76K53R72R03N06j32n35p29o03k34K85O53R86M98j14j039j241n71
$$ 395 -809 -1485 -1232 -260 643 1149 1017 482 -247 -850 -1084 -799 -146 840 1338 1224 185 -1056 -1627
4339a627M09J176J224M37o33j118r09k70M46O84P92M07m3n14q02o76k59M34J048
$$ -1627 -1218 -42 1182 1619 986 -132 -1041 -1311 -865 -181 611 1018 975 461 -341 -1017 -1276 -842 206
4358B06R53L69o64j298r06k25Q51J138Q47M6o83r50p08j08L76O85P00M11J4o35
$$ 206 1159 1528 864 -434 -1340 -1565 -714 424 1271 1317 634 -316 -1024 -1132 -756 -71 629 1040 1054 419
4378D19r28p46p6P71J185Q83j19j005j201n45Q2R20J003N62k48n54p26m98k15
$$ 419 -509 -1255 -1331 -560 625 1508 1389 384 -817 -1362 -1280 -360 643 1205 957 403 -323 -821 -1036
4397a036L39O97P72N44k57q68j149o03L86J102J149M18m73j201q86k45M18Q55
$$ -1036 -697 0 772 1316 1059 191 -958 -1561 -1175 -73 1076 1494 1021 -180 -1066 -1311 -893 -38
4415c8P30L63j88n86o11n29l22M16Q84J022L00n70j124j019k05P86J156P63L7
$$ -38 692 1055 867 281 -330 -859 -1181 -765 119 1141 1441 871 -253 -1272 -1477 -691 465 1228 1265
4434A265p11r05p04NM14O61O64L20o0o18q81n94p8P73J034Q36j19q93j165o68
$$ 1265 554 -351 -1055 -1050 -636 25 689 1009 949 331 -550 -1144 -1222 -449 585 1421 1302 409 -756 -1424
4454a424J85R45J027M50k52o44o89m34j02L14O68P00L44j62p86r98m89K18J096
$$ -1424 -1239 -294 733 1183 931 287 -402 -836 -938 -624 44 744 1088 926 140 -858 -1347 -1129 -33
4473c3J003M50m26j080r09k92N07Q06P77K02k10n40o80m47j47M19P39Q57L03n41
$$ -33 970 1420 994 -86 -995 -1287 -780 26 803 1005 795 255 -425 -872 -1019 -600 139 996 1299 758
4493G58j086r26j51O64J186P88L0p57q70o74O1M20P02N43K30j57m81p31o66M0
$$ 758 -328 -1254 -1405 -741 445 1233 1263 506 -364 -1038 -977 -557 145 688 918 761 280 -451 -1117 -1077
4513a077O18R44Q09r3q18j188n76K47Q45J023M91k96o20q23m01O0L91N92N81L25
$$ -1077 -459 485 1294 1201 383 -805 -1381 -1134 -289 734 1225 929 309 -514 -915 -855 -464 128 709 1034
4533A034k04p98p84n48K55R55J005M56l92r78j011k57M24R88O55K30l07n41n88
$$ 1034 830 32 -752 -1300 -1045 -90 915 1371 979 1 -1010 -1267 -843 145 800 1030 723 182 -406
4552d06l99j06M21O70Q22J14l96r19r68j90O53J045Q79Ro85r08p32J34M72P34
$$ -406 -805 -911 -490 180 1002 1116 720 -199 -1167 -1357 -704 341 1220 1229 544 -364 -1096 -962 -490 244
$$ [...]
8191A57
##END NTUPLES=NMR FID
##END=
