##TITLE=1H_Pr 5-4-Cl
 D2O, 8 sc, 
 24.7.2019
##JCAMPDX= 6.0         $$ Bruker NMR JCAMP-DX V2.0
##DATA TYPE= NMR FID
##DATA CLASS= NTUPLES
##ORIGIN= UXNMR, Bruker Analytische Messtechnik GmbH
##OWNER= root
$$ XWIN-NMR		Version 3.5
$$ Wed Jul 24 16:21:29 2019 Russian Standard Time (UT+4h)  she@DPX200
##.OBSERVE FREQUENCY= 200.13155
##.OBSERVE NUCLEUS= ^1H
##.DELAY= (6, 6)
##.ACQUISITION MODE= SIMULTANEOUS
##.ACQUISITION SCHEME= undefined
##.AVERAGES= 8
##.DIGITISER RES= 18
##SPECTROMETER/DATA SYSTEM= spect
##.PULSE SEQUENCE= zg30
##.SOLVENT NAME= D2O
##.SHIFT REFERENCE= (INTERNAL, D2O, 0, 15.7039)
##AUDIT TRAIL= $$ (NUMBER, WHEN, WHO, WHERE, WHAT)
$$ ##TITLE= Audit trail, XWIN-NMR		Version 3.5
$$ ##JCAMPDX= 5.01
$$ ##ORIGIN= Bruker BioSpin GmbH
$$ ##OWNER= she
$$ F:/spectra/data/she/nmr/H-F/1/audita.txt
$$ ##AUDIT TRAIL=  $$ (NUMBER, WHEN, WHO, WHERE, WHAT)
(   1,<2019-07-24 16:20:05.40 +0400>,<she>,<DPX200>,
      <created by zg, POWCHK disabled, PULCHK disabled
       configuration hash MD5:
       00 E9 B6 7A A2 85 ED C7 34 08 36 98 17 FE 4E 26
       data hash MD5: 16K
       AD 9F C1 DA A6 92 29 54 E8 D2 5A 22 2F 68 0A 5D>)
$$ ##END=
$$ 
$$ hash MD5
$$ C6 4B FE 19 E8 A8 78 86 EB ED 0B 1D 86 F6 FD DE
##$RELAX= 
##$RELAX= 
##$RELAX= 
##$RELAX= 
##$RELAX= 
##$RELAX= 
$$ Bruker specific parameters
$$ --------------------------
##$DU= <F:/spectra>
##$EXPNO= 1
##$NAME= <H-F>
##$PROCNO= 1
##$TYPE= <nmr>
##$USER= <she>
##$AMP= (0..31)
100 100 100 100 100 100 100 100 100 100 100 100 100 100 100 100 100 100 
100 100 100 100 100 100 100 100 100 100 100 100 100 100 
##$AQSEQ= 0
##$AQ_mod= 1
##$AUNM= <au_zg>
##$AUTOPOS= <>
##$BF1= 200.13
##$BF2= 200.13
##$BF3= 200.13
##$BF4= 200.13
##$BF5= 200.13
##$BF6= 200.13
##$BF7= 200.13
##$BF8= 200.13
##$BYTORDA= 1
##$CFDGTYP= 0
##$CFRGTYP= 5
##$CHEMSTR= <none>
##$CNST= (0..31)
1 1 145 1 1 1 1 1 1 1 1 1 1 1 1 1 1 1 1 1 1 1 1 1 1 1 1 1 1 1 1 1 
##$CPDPRG= <>
##$CPDPRG1= <>
##$CPDPRG2= <>
##$CPDPRG3= <>
##$CPDPRG4= <mlev>
##$CPDPRG5= <mlev>
##$CPDPRG6= <mlev>
##$CPDPRG7= <mlev>
##$CPDPRG8= <mlev>
##$CPDPRGB= <>
##$CPDPRGT= <>
##$D= (0..31)
0 1.2 0 0 0 0 0 0 0 0 0 0.03 0 0 0 0 0 0 0 0 0 0 0 0 0 0 0 0 0 0 0 0 
##$DATE= 1563970804
##$DBL= (0..7)
120 120 120 120 120 120 120 120 
##$DBP= (0..7)
150 150 150 150 150 150 150 150 
##$DBP07= 0
##$DBPNAM0= <>
##$DBPNAM1= <>
##$DBPNAM2= <>
##$DBPNAM3= <>
##$DBPNAM4= <>
##$DBPNAM5= <>
##$DBPNAM6= <>
##$DBPNAM7= <>
##$DBPOAL= (0..7)
0.5 0.5 0.5 0.5 0.5 0.5 0.5 0.5 
##$DBPOFFS= (0..7)
0 0 0 0 0 0 0 0 
##$DE= 6
##$DECBNUC= <off>
##$DECIM= 24
##$DECNUC= <off>
##$DECSTAT= 4
##$DIGMOD= 1
##$DIGTYP= 9
##$DL= (0..7)
0 120 120 120 120 120 120 120 
##$DP= (0..7)
150 150 150 150 150 150 150 150 
##$DP07= 0
##$DPNAME0= <>
##$DPNAME1= <>
##$DPNAME2= <>
##$DPNAME3= <>
##$DPNAME4= <>
##$DPNAME5= <>
##$DPNAME6= <>
##$DPNAME7= <>
##$DPOAL= (0..7)
0.5 0.5 0.5 0.5 0.5 0.5 0.5 0.5 
##$DPOFFS= (0..7)
0 0 0 0 0 0 0 0 
##$DQDMODE= 0
##$DR= 18
##$DS= 0
##$DSLIST= <SSSSSSSSSSSSSSS>
##$DSPFIRM= 0
$$ [...]
##$SUBNAM2= <"">
##$SUBNAM3= <"">
##$SUBNAM4= <"">
##$SUBNAM5= <"">
##$SUBNAM6= <"">
##$SUBNAM7= <"">
##$SUBNAM8= <"">
##$SUBNAM9= <"">
##$SW= 24.9336996594482
##$SWIBOX= (0..15)
0 0 2 0 0 0 0 0 0 0 0 0 0 0 0 0 
##$SW_h= 4990.01996007984
##$TD= 16384
##$TD0= 1
##$TE= 0
##$TE2= 300
##$TE3= 300
##$TEG= 300
##$TL= (0..7)
0 120 120 120 120 120 120 120 
##$TP= (0..7)
150 150 150 150 150 150 150 150 
##$TP07= 0
##$TPNAME0= <>
##$TPNAME1= <>
##$TPNAME2= <>
##$TPNAME3= <>
##$TPNAME4= <>
##$TPNAME5= <>
##$TPNAME6= <>
##$TPNAME7= <>
##$TPOAL= (0..7)
0.5 0.5 0.5 0.5 0.5 0.5 0.5 0.5 
##$TPOFFS= (0..7)
0 0 0 0 0 0 0 0 
##$TUNHIN= 0
##$TUNHOUT= 0
##$TUNXOUT= 0
##$USERA1= <user>
##$USERA2= <user>
##$USERA3= <user>
##$USERA4= <user>
##$USERA5= <user>
##$V9= 5
##$VALIST= <valist>
##$VCLIST= <CCCCCCCCCCCCCCC>
##$VD= 0
##$VDLIST= <DDDDDDDDDDDDDDD>
##$VPLIST= <PPPPPPPPPPPPPPP>
##$VTLIST= <TTTTTTTTTTTTTTT>
##$WBST= 1024
##$WBSW= 4
##$XGAIN= (0..3)
0 0 0 0 
##$XL= 0
##$YL= 0
##$YMAX_a= 302866
##$YMIN_a= -435284
##$ZGOPTNS= <>
##$ZL1= 120
##$ZL2= 120
##$ZL3= 120
##$ZL4= 120
##$ABSF1= 10
##$ABSF2= 0
##$ABSG= 5
##$ABSL= 3
##$ALPHA= 0
##$AQORDER= 0
##$ASSFAC= 0
##$ASSFACI= 0
##$ASSFACX= 0
##$ASSWID= 0
##$AUNMP= <proc_1d>
##$AZFE= 0.1
##$AZFW= 0.1
##$BCFW= 1
##$BC_mod= 2
##$BYTORDP= 1
##$COROFFS= 0
##$CY= 11.3945322036743
##$DATMOD= 1
##$DC= 2
##$DFILT= <>
##$DTYPP= 0
##$F1P= 18.9103706918063
##$F2P= -1.10871071338519
##$FCOR= 0.5
##$FTSIZE= 0
##$FT_mod= 4
##$GAMMA= 1
##$GB= 0.15
##$INTBC= 1
##$INTSCL= 1
##$ISEN= 128
##$LB= 0.24
##$LEV0= 0
##$LPBIN= 0
##$MAXI= 10000
##$MC2= 0
##$MEAN= 0
##$ME_mod= 0
##$MI= 1.114404
##$NCOEF= 0
##$NC_proc= 0
##$NLEV= 6
##$NOISF1= 3.799351
##$NOISF2= 2.8
##$NSP= 1
##$NTH_PI= 0
##$NZP= 0
##$OFFSET= 15.70392
##$PC= 1
##$PHC0= -8859.779
##$PHC1= 5.200965
##$PH_mod= 1
##$PKNL= yes
##$PPARMOD= 0
##$PSCAL= 0
##$PSIGN= 0
##$REVERSE= no
##$SF= 200.130013532006
##$SI= 16384
##$SIGF1= 3
##$SIGF2= 2
##$SINO= 400
##$SIOLD= 16384
##$SREGLST= <1H.CDCl3>
##$SSB= 0
##$STSI= 0
##$STSR= 0
##$SW_p= 3612.71676300578
##$SYMM= 0
##$S_DEV= 0
##$TDeff= 0
##$TDoff= 0
##$TI= <>
##$TILT= no
##$TM1= 0
##$TM2= 0
##$TOPLEV= 0
##$USERP1= <user>
##$USERP2= <user>
##$USERP3= <user>
##$USERP4= <user>
##$USERP5= <user>
##$WDW= 1
##$XDIM= 8192
##$YMAX_p= 0
##$YMIN_p= 0
$$ End of Bruker specific parameters
$$ ---------------------------------
##NTUPLES= NMR FID
##VAR_NAME=  TIME,          FID/REAL,        FID/IMAG
##SYMBOL=    X,             R,               I
##VAR_TYPE=  INDEPENDENT,   DEPENDENT,       DEPENDENT
##VAR_FORM=  AFFN,          ASDF,            ASDF
##VAR_DIM=   8192,          8192,            8192
##UNITS=     SECONDS,       ARBITRARY UNITS, ARBITRARY UNITS
##FACTOR=    0.0002004,     1,               1
##FIRST=     0,             0,               0
##LAST=      1.6414764,     0,               0
##MIN=       0,             -435284,         0
##MAX=       1.6414764,     302866,          0
$$ Real data points
##PAGE= N=1
##DATA TABLE= (X++(R..R)), XYDATA
0@%%%%QqQj6J6k4L2l6M5n7P2q8J05j27J51j76K08k42K80l27L76m30M90n57O36
$$ 0 0 0 0 0 8 0 8 -8 8 -16 16 -20 25 -32 40 -48 57 -70 81 -95 113 -129 151 -176 200 -230 260 -297 339
29C39p18Q09r13J023j146J280j428J593j769J965k181K414k673K958l275L630
$$ 339 -379 430 -483 540 -606 674 -754 839 -930 1035 -1146 1268 -1405 1553 -1722 1908
45A908m023M466m967N536o200O977p895R009j0389J2160j4527J7868k2981L1884
$$ 1908 -2115 2351 -2616 2920 -3280 3697 -4198 4811 -5578 6582 -7945 9923 -13058 18826
59A8826n1842J76365n4313l46152J8887R1857J23420J17788J61553L146j44345
$$ 18826 -33016 143349 89036 -257116 -238229 -146372 -22952 94836 256389 259535 115190
70A15190j90042j08183n0115P2320J98347K18405M3775j40008k20570j57559l2114
$$ 115190 -74852 -183035 -233150 -160830 37517 255922 299697 159689 -60881 -218440 -250554
81b50554J04589J57205J44641Q8283j7646j82997k46336j08321J08091J98101
$$ -250554 -145965 11240 155881 244164 226518 43521 -202815 -311136 -203045 -4944
91d944J67107Q5169m3048j78416j79604n7241L2685O4823J49721K06427O0187
$$ -4944 162163 247332 204284 25868 -153736 -210977 -178292 -113469 36252 242679 302866
102C02866j87924k48610j08638K2444R4550J82693J93576K1840j72736j81415
$$ 302866 114942 -133668 -242306 -219862 -125312 57381 250957 272797 100061 -81354
112h1354p8803k5980K3944J43868K10149R5777r8913j95167j60510n6412O3668
$$ -81354 -160157 -186137 -162193 -18325 191824 287601 188688 -6479 -166989 -223401 -159733
123a59733J44788J55955J03947r844j57744k20338j09832O9507J53409J44913
$$ -159733 -14945 141010 244957 235113 77369 -142969 -252801 -183294 -29885 115028
133A15028J13029J7763j49567k20094r8274N5944R6783J07295J41392P5313j09434
$$ 115028 228057 245820 96253 -123841 -222115 -166171 -69388 37907 179299 254612 145178
144A45178k10595j31815j0345O4843J42418J83812P6767j10855j88721j32189
$$ 145178 -65417 -197232 -207577 -142734 -316 183496 260263 149408 -39313 -171502
154a71502m9186M0992J52818J87711P3501q3511j50834j33071p7210J7501J24201
$$ -171502 -220688 -179696 -26878 160833 234334 150823 -11 -133082 -210292 -192791 -68590
165f8590J61591J06253k900j20306j84003j23905K0543J24234J44298J20735M0979
$$ -68590 93001 199254 196354 76048 -107955 -231860 -211317 -87083 57215 177950 218929
176B18929j07016k00268j26226K0159R0080J09220J37283Q8570p8719j97597j38498
$$ 218929 111913 -88355 -214581 -194422 -104342 4878 142161 230731 152012 -45585 -184083
187a84083r485N8686J04012J50117J03317m9374j62027j46858o8148K1836J23627
$$ -184083 -193568 -134882 -30870 119247 222564 173190 11163 -135695 -203843 -182007 -58380
198e8380J76165J02302m2891j37178j44000r0174J0273J14973J46295R2810Q591
$$ -58380 117785 220087 177196 40018 -103982 -194156 -183883 -68910 77385 170195 178786
209A78786p7342j47844j37271k3793R9143J42586J19538N1241o7709j70622j46212
$$ 178786 101444 -46400 -183671 -207464 -108321 34265 153803 205044 137335 -33287 -179499
220a79499j9004P9056J12214J26665Q6538m6855j66842j44224l3643M4955R2570
$$ -179499 -198503 -119447 -7233 119432 205970 159115 -7727 -151951 -185594 -140639 -48069
231d8069J36340J07192k4779j40015j38944o9155O242Q7571J49735J17184k618
$$ -48069 88271 195463 170684 30669 -108275 -177430 -171188 -83617 66118 183302 180684
242A80684j09579j42310j06347j3975R5852J47400J05754J6434p1622j33295j25956
$$ 180684 71105 -71205 -177552 -191527 -95675 51725 157479 173913 102291 -31004 -156960
253a56960l1619P8182J22387J06214O0315l1124j36656j52726n2640O2213J14078
$$ -156960 -188579 -110397 11990 118204 178519 147395 10739 -141987 -194627 -132414 -18336
264a8336J19706Q3491k2097j35754j43497n5033L1350Q4179J22939J07404O32
$$ -18336 101370 184861 162764 27010 -116487 -171520 -140170 -55991 66948 174352 174984
275A74984j14208j38998q0738l236P4952J32973J13864J4202q4771j24871j04800
$$ 174984 60776 -78222 -158960 -162196 -87244 45729 159593 173795 89024 -35847 -140647
286a40647l6551O3191J33691J18817L7539n6803j24405j27869m7458O2274J16906
$$ -140647 -177198 -114007 19684 138501 176040 119237 -5168 -133037 -180495 -118221 -1315
297a315J03239N6763j7051j06497j38427p1127L4497R8358J14806R0119K262j08725
$$ -1315 101924 158687 141636 35139 -103288 -174415 -139918 -41560 73246 163365 165627 56902
309E6902j43576p5151J7300P7478J11615J03918K1276q7595j31590r1752j7030
$$ 56902 -86674 -161825 -144525 -67047 44568 148486 169762 82167 -49423 -141175 -158205
320a58205O1014J19429J13961L2020o7041j15561j03055m4527M3469J14067J16198
$$ -158205 -97191 22238 136199 168219 101178 -14383 -117438 -161965 -118496 -4429 111769
331A11769N1828l5442j05883j24257o6335L7094J08661J10583O3121j0330r0580
$$ 111769 163597 128155 22272 -101985 -168320 -131226 -22565 88018 151139 140809 50229
342E0229j26701p8577J6069Q5144J07082Q7379J7808q0703j31058r0396l145O7268
$$ 50229 -76472 -155049 -138980 -53836 53246 140625 158433 77730 -53328 -143724 -146869 -79601
354g9601J06448J01657L3671o5868j21121r7494k9055M6776J05904J11034M6400
$$ -79601 26847 128504 162175 96307 -24814 -122308 -151363 -104587 1317 112351 158751
365A58751m7045j05745j04649n3285K8577R8804J11992O1352j9820q9290j14749
$$ 158751 111706 5961 -98688 -151973 -123396 -24592 87400 148752 128932 39642 -75107
376g5107p5821J2225R0717J11116P4070L006p4629j17788q7430l631P1485J02958
$$ -75107 -150928 -138703 -47986 63130 137200 140206 65577 -52211 -139641 -143272 -71787 31171
388C1171Q7821K8500n7156j15001r7437k5003N0464R8625J00473M7275m1267j05933
$$ 31171 118992 147492 90336 -24665 -122102 -147105 -96641 1984 102457 149732 108465 2532
400B532j02664m5907K9599R1561J08352O1272k3666r1150j05581o4508J0255Q1433
$$ 2532 -100132 -146039 -116440 -24879 83473 144745 121079 29929 -75652 -140160 -129905 -48472
412d8472J08178P2830j215p2160j06454q2596j0178O9041J06047Q4944K0285n7211
$$ -48472 59706 132536 131321 59161 -47293 -129889 -140067 -71026 35021 119965 140250 83039
424H3039j05756r3174k5104N2655R7902R2517L9872l8176r8795j00133m3709L2920
$$ 83039 -22717 -115891 -140995 -88340 9562 102079 141951 103775 4980 -95153 -138862 -105942
436a05942Q9652R9715N6617k0988q8529j02445o0132J2084P8192J02643P1555
$$ -105942 -16290 83425 140042 119054 30525 -71920 -132052 -119968 -41776 60867 132422
447A32422k664p4376j03793p4794n034O4661J00440Q0231J6290n5954r9215q6491
$$ 132422 129758 55382 -48411 -123205 -128239 -63578 36862 117093 133383 77429 -21786 -108277
459a08277k6426M9038R6132R0913L4735m1349r3594r3166m1386L1355Q7437R5438
$$ -108277 -134703 -85665 10467 101380 136115 94766 1172 -91994 -133380 -102025 -14588 80850
471H0850N0977k1923q3462r7883n8284J4042P8184R7899O3016m145o9588r7088
$$ 80850 131827 109904 26442 -71441 -129725 -115683 -37499 60400 123416 119271 49683 -47405
483d7405p1898n332O3850R6400P7184J6358n5782r8412q2534j9701N0322Q9921
$$ -47405 -119303 -124635 -60785 35615 112799 129157 73375 -25037 -107571 -127272 -76950 12971
495A2971Q3943L2906l8580q9446q8296l8952K9980Q3505R3795M9531k4753q2139
$$ 12971 96914 129820 91240 1794 -86502 -125454 -95474 -11969 81826 131357 106604 24465
507B4465r0230n2067J1161P2773R5449O1973o074o7322r2193o9605o000O4076
$$ 24465 -65765 -117832 -106671 -33898 61551 123524 117450 50128 -42065 -111670 -117670 -53594
519e3594R5755O9818R427n1717q8944p8999k2210M7666Q7375P9250L2008l5858
$$ -53594 42161 111979 121406 69689 -19255 -98254 -120464 -72798 14577 93827 125835 89977
531H9977q8577q8900l4376L4690P7970Q3812M7551j9646q0192r0508m8049J4411
$$ 89977 1400 -87500 -121876 -87186 -9216 74596 122147 102501 22309 -68199 -116248 -101837
543a01837O7761Q9457O1653p034o9256q6664o0117o727N6035R2481P1892P884
$$ -101837 -34076 55381 117034 110000 40744 -45920 -106037 -112764 -56729 35752 107644 115528
555A15528n4287q4026p4776k2813M9001R0550P3731K0735l5154p6392q3764l9178
$$ 115528 61241 -22785 -97561 -120374 -71373 19177 92908 113643 78489 2097 -81667 -120845
567a20845L4346Q2318Q0073L9174k0334p5282q8285m4958K0804O5763P9195N8680
$$ -120845 -86499 -4181 75892 115066 94732 19450 -68835 -113793 -92989 -27226 51969 110649
579A10649j206o9582r2316n5924M195N6015Q4936O9042M683o0560q1755n9053
$$ 110649 109443 39861 -52455 -108379 -104184 -48169 36767 105809 110492 49932 -31823 -90876
591i0876j6765L6939Q2209P9269K3308m2477p9766p7527l4246L5993Q5230P4607
$$ -90876 -107641 -70702 11507 90776 114084 71607 -8159 -85686 -119932 -83939 1291 75898
603G5898K6032k2954o3209q2160n2006J9660P5217P9319M5962n927o4364r0508
$$ 75898 101930 78976 15767 -66393 -118399 -98739 -23522 55797 101759 95832 31468 -59040
615e9040n4560J4516O0988P0922N7159J2815n1061q6441o4875r741M4497Q1654
$$ -59040 -113600 -99084 -38096 32826 89985 102800 51739 -34702 -99577 -109318 -64821 16833
627A6833P7484J7295n4786p9134n7580k1011K3617P1517Q1795L4067l2173o9710
$$ 16833 94317 111612 56826 -22308 -79888 -100899 -77282 -5765 76030 110097 77924 8214
639H214p3517m4796J7871P7885Q1934L4865j8086n5997p6169n5635O488O3688
$$ 8214 -65303 -110099 -92228 -14343 67591 102456 84370 28373 -47796 -103431 -96943 -33255
651c3255P4779N0832Q753m8865q9579o6411M155N5575O5767N6000K4000l6451
$$ -33255 41524 92356 101109 52244 -37335 -103746 -99591 -44016 21751 77751 101751 65300
663F5300q2511o9710j6798L3593O7322P6088L4628l6868p7038o5654k9421J5192
$$ 65300 -17211 -86921 -103719 -70126 -2804 73284 107912 71044 -5994 -71648 -101069 -85877
675h5877O4505Q1302M0068k3899n9902o6447n1060j388O5098Q5555M3626j0254
$$ -85877 -21372 59930 99998 76099 16197 -50250 -101310 -102698 -37600 47955 91581 81327
687H1327m5423o8064o3226j0603N4673P6932N3863J4576l5066p8568p1137j0361
$$ 81327 35904 -32160 -95386 -105989 -51316 25616 79479 94055 58989 -19579 -90716 -101077
699a01077M3872O1555N9176L7000k2202p8804p5587k1382K7532N6322P1557M7103
$$ -101077 -57205 4350 63526 100526 78324 -480 -76067 -97449 -69917 -13595 57962 105065
711A05065j9793p1879o6995l1753M850M8685P7867N4570q356n5288o7325n4982
$$ 105065 85272 13393 -53602 -85355 -80505 -31820 46047 100617 92261 36973 -30352 -85334
723h5334j0107N4380Q2283M7821k614l3476n8442o8653k7939M3759P8600N6891
$$ -85334 -95441 -41061 41222 89043 86429 52953 -5489 -74142 -102081 -58322 20278 77169
735G7169J7832k4178o8231p6279k5130L8109O0998N4644L6323q560o4756p6564
$$ 77169 95001 70823 2592 -73687 -98817 -60708 290 54934 91257 82697 17941 -58623
747e8623l4213J5574M9451P0391N5809q702o8082o8086l2692j199L3010O9851
$$ -58623 -92836 -77262 -27811 42580 98389 89687 21605 -46481 -79173 -80372 -47362 22489
759B2489O3658O006m8401o4451n5720k2180L7275Q1145O1067O111l3067n4759
$$ 22489 86147 92153 43752 -20699 -76419 -98599 -61324 19821 80888 86999 53932 -827
771h27o4165l2913L1357P0432N6875K4852r262n5532q0084l9892L0546O1768N2428
$$ -827 -64992 -97905 -66548 3884 60759 85611 76349 20817 -59267 -99159 -68613 -6845 45583
784D5583L6680L461n0329p5645m3476P988M1586O2588O0465J0219n4883p3017
$$ 45583 82263 85724 35395 -40250 -83726 -75738 -34152 28436 88901 99120 44237 -28780
796b8780m3469o761K8960O6561O5616J3387m2922n7593n0311l1152J8382P0860
$$ -28780 -72249 -79010 -50050 16511 82127 95514 52592 -5001 -55312 -86464 -68082 2778
808B778P0246J8118k7408m9753o0793m2385J5148O4547O1022K8456l492m1183
$$ 2778 73024 91142 63734 13981 -46812 -89197 -74049 -9502 51520 79976 76484 35301
820C5301p2485n2455J0531N3827N4928M2785J5457l8899p7272n3647J725L6429
$$ 35301 -37184 -89639 -79108 -25281 29647 72432 87889 48990 -28282 -81929 -80204 -43775
832d3775N3659N8708K5114l7980p1542n1363j4007K0164N5731O8624K7869l2611
$$ -43775 9884 68592 93706 55726 -15816 -67179 -81186 -61022 -5291 63333 91202 58591
844E8591n6429m9699l2934N077N6613P0775L0094j5991l9218n6233n3139m570
$$ 58591 2162 -47537 -80471 -75394 -18781 51994 82088 66097 26879 -29354 -82493 -87063
856h7063N7480O8625L6511J114l2797o5243n9139l245M7522N6364M2698K1121
$$ -87063 -29583 39042 75553 76667 43870 -21373 -80512 -83757 -36235 20129 62827 83948
868H3948k4883o9460o0520r006L0721M8700N5511L4121k3505o5815n4896j9517
$$ 83948 59065 -10395 -70915 -79921 -49200 -500 55011 89132 65627 -188 -55084 -74601
880g4601J0755M4139O6335M1626j8129n4759n3168l6180l649M6294P0513L9988
$$ -74601 -63846 -19707 46628 88254 70125 15366 -37802 -73982 -77631 -31337 39176 79164
892G9164r635l7306n1187n2610j5483M5002O8228M2192O152k5019n7479o2317
$$ 79164 69529 32223 -18964 -71574 -87057 -42055 26173 68365 74517 49498 -7981 -70298
904g0298j6194L9829N6555M3009K2503j3619n7979o3150k0543K3691M4070N2449
$$ -70298 -86492 -46663 9892 52901 75404 61785 3806 -59344 -79887 -56196 -12126 40323
916D0323L9833q275n7652o0282k6805N599L6476O2856M8995o144n0112n3762l7740
$$ 40323 80156 71881 14229 -46053 -72858 -67259 -30783 32073 81068 74924 24812 -28950 -66690
929f6690j0919L5012O7168M8984j202l4454m7288m9336k3746L0877O3530M6816
$$ -66690 -77609 -42597 24571 73555 72353 37899 -9389 -58725 -82471 -51594 11936 58752
941E8752J2415j6466m6413o1413l0488K6348N4100M6859K7911l743m8229o5969
$$ 58752 71167 54701 8288 -53125 -83613 -57265 -3165 43694 71605 67862 19633 -46336
953d6336l1675J7033M1468M9199M2475L029m7756o1376l3786O59L0017N5317N2245
$$ -46336 -78011 -60978 -19510 29689 72164 75193 27437 -33939 -67725 -67066 -37049 18268 70513
966G0513O958m1559n4134l9335j5833K3353N9365N4295J0292k8905m4204m8280
$$ 70513 77471 35912 -18222 -57557 -73390 -50037 9328 63623 73915 45010 806 -47474
978d7474k9558J7860N7882N2098J8427j1368l9628n8001l8028J3534N1332M8893
$$ -47474 -77032 -59172 -1290 50808 69235 57867 18239 -39762 -77790 -64256 -12924 35969
990C5969L0515K252l8736o2564m0347Q142L8201M7444M2347J1401l7593n9586
$$ 35969 66484 68736 30000 -32564 -72911 -64769 -26568 20876 63223 74624 37031 -22555
1002b2555l8912m441K4217M8307N2369J7403l1883n1651m2072k0054J3885N1474
$$ -22555 -61467 -65908 -41691 6616 58985 76388 44505 -7146 -49218 -69272 -55387 -3913
1014c913N7016K0630k2201m2470m7121l3482P910N0946N4593K5008p822l3467
$$ -3913 53103 73733 51532 9062 -38059 -71541 -63631 -12685 41908 66916 59094 25627
1026B5627n3502m2685L427M3998N0195L2716P375k8768n7395m5679k397L2837
$$ 25627 -27875 -70560 -67133 -23135 27060 59776 67151 38383 -19012 -64691 -67088 -34251
1038c4251M5205M2778J8728k5536n6462m5137j1453J9231M3125N1583K5869k1690
$$ -34251 10954 53732 72460 46924 -9538 -54675 -66128 -46897 -3772 47811 73680 51990
1050E1990m8831m5033k3527O775M2691N6294K9280j3579l9346m6251l5504j575
$$ 51990 3159 -41874 -65401 -58626 -15935 40359 69639 56060 16714 -29537 -65041 -66616
1062f6616M1580N5104L1381j839k9160m8449m4623o683L6072M9183L5931J2096
$$ -66616 -25036 30068 61449 59610 30450 -17999 -62622 -69305 -33233 15950 51881 63977
1074F3977k1531n0609m9095j1921K6795M3767M2620K3451j6147n0355m8864j7820
$$ 63977 42446 -8163 -57258 -69179 -42384 1383 44003 67454 51307 952 -47912 -65732
1086f5732J4500L8190M9084L1445j1219m4430m6563k7057J977L5613N2943L4810
$$ -65732 -51232 -13042 36042 67487 56268 11838 -34725 -61782 -59805 -24192 28751 63561
1098F3561m709l4710m4324l7315q182L2390N2367L7075N086k4082m4767m6033
$$ 63561 58852 24142 -20182 -57497 -65679 -33289 19078 56153 61239 37157 -7610 -53643
1110e3643j4442K8141M8032L8848J4909j4307m3970m9344k0358J8252M1686M2636
$$ -53643 -68085 -39944 8088 46936 61845 47538 3568 -45776 -66134 -47882 -6196 36440
1122C6440K6862p714m3029m9918k4943Q891L3694M5687L4475j106l6957m7187
$$ 36440 63302 55588 12559 -37359 -62302 -53411 -19717 25970 60445 59339 22382 -24805
1134b4805l2214l817K8550M9317L9294M027k9058m3917l8223j3700K3585M7895
$$ -24805 -57019 -60836 -32286 17031 56325 60352 31294 -12623 -50846 -64546 -40961 6934
1146F934M0476J1946j8185m1092m5168k1563J8833M5020M1094J9843r082l7150
$$ 6934 47410 59356 41171 79 -45089 -66652 -47819 -2799 38295 58138 49056 11906
1158A1906m8327k6780J0457L7478M2937K9361q2l5098m8612l1165J870L0182M3595
$$ 11906 -36421 -63201 -52744 -15266 27671 57032 56950 21852 -26760 -57925 -56055 -25873 17722
1171A7722L5917O576k8971m5606l5716r231K2686M4944M1540J1531k2593m0695
$$ 17722 53639 60215 31244 -14362 -50078 -59309 -36623 8321 49861 61392 38799 -1896
1183a896l9567j8556J5635M2538M3278J8363j2371l6803m4576k6787J0610L9487
$$ -1896 -41463 -60019 -44384 -1846 41432 59795 47424 10621 -33955 -60742 -50132 -10645
1195a0645M2819K3874l512l1210m6294l1589K369L2695M2985L1272M792k7954
$$ -10645 32174 56048 52536 21326 -24968 -56557 -54188 -21493 21492 52764 57556 29602
1207B9602m5801l5484m788K5264M1396L7031J1360k1154m2477l8675j4751J7621
$$ 29602 -16199 -51683 -56471 -31207 10189 47220 58580 37426 -5051 -43726 -58477 -40856
1219d0856M0468M1705J7092j4942l8521m0121k1862R375L7468M2188K4005p053
$$ -40856 -388 41317 58409 43467 4946 -35175 -57037 -47662 -10194 31994 55999 48946
1231D8946l1968m2842k9486K385L3632M2646K8353J025k5965m2256l5188n067
$$ 48946 16978 -25864 -55350 -52965 -19333 23313 51666 52691 26726 -15530 -50718 -55785
1243e5785K7308M2050L3562R318k1217m1874l7687j1360K0509L8649L6843J5815
$$ -55785 -28477 13573 47135 56453 35236 -6638 -44325 -55685 -35176 3473 40316 56131
1255E6131j3858l7410m0747j9941J2217L6932M0243K2165q387l3495m0766k5577
$$ 56131 42273 4863 -35884 -55825 -43608 -6676 33567 55732 47345 13850 -26916 -52493
1267e2493L884L1216M1752K7825o60k8623m1288l1207l026K7094M0598L1264O169
$$ -52493 -48609 -17393 24359 52184 51524 22901 -18387 -49594 -52620 -25526 15072 46336 52505
1280E2505k1620l8564l5396j2163J9829M0033L6719J3221j6367l7481l8379j6853
$$ 52505 30885 -7679 -43075 -55238 -35409 4624 41343 54564 38197 716 -37663 -54516
1292e4516J4096L6130L6200J9452p213l2133m0620k5185O593L3097L9052K4906
$$ -54516 -40420 -4290 31910 51362 44149 12016 -28604 -53789 -47196 -14099 24953 49859
1304D9859j557k7884m0047k8806j165K5678L8538L0708P024k3019m0504l3043
$$ 49859 48302 20418 -19629 -48435 -49600 -23922 14616 45324 52348 29329 -11175 -44218
1316d4218q246K1040L8442L3760J0684j7101l4431l4287j7708J1663L5721L8791
$$ -44218 -52464 -31424 7018 40778 51462 34361 -70 -34357 -52065 -40402 -4681 34110
1328C4110J7641j0216l2639l7802k3219P538L3139L7566K1285k741k6209l8347
$$ 34110 51751 41535 8896 -28906 -52125 -44587 -11448 26118 47403 44662 18453 -19894
1340a9894k9161K3K8293L7031K7525M428k1846l8820l2190n570K1338L4305L2022
$$ -19894 -49055 -49032 -20739 16292 43817 48245 26399 -12421 -44611 -50181 -28843 5462 37484
1353C7484J3037j6200l8020l5011j3028J4904L4431L5623J6661j2531l2540l3911
$$ 37484 50521 34321 -3699 -38710 -51738 -36834 -2403 33220 49881 37350 4810 -29101
1365b9101j9657N854L0621L7970K1521n249k6404l5354k7657j136K9139L8473
$$ -29101 -48758 -42904 -12283 25687 47208 41959 15555 -19799 -47456 -48592 -19453 19020
1377A9020K4494J138k0520l5489l2056o602K3901L6201K7696R322j5407l4843
$$ 19020 43514 44652 24132 -11357 -43413 -50015 -26114 10087 37783 47105 31698 -3145
1389c145l4613j0728J6154L1454L2435J7204r663l4364l5844j6619R086K8927
$$ -3145 -37758 -48486 -32332 -878 31557 48761 39098 4734 -31110 -47729 -38643 -9716
1401i716L5706K2346o742l0323l3403k1547o91K5557L7936K5459j568k2780l2436
$$ -9716 25990 48336 41594 11271 -22132 -43679 -44370 -18813 19123 44582 43014 20234 -12202
1414a2202k8459p625K2267L7295K7483N400j5147l2144l4891j2977J9887L5411
$$ -12202 -40661 -48286 -26019 11276 38759 44159 29012 -3132 -38023 -51000 -31113 4298
1426D298K8336J1243r166l0965l5654j5673J2762K8540L0087K0239k894k9780
$$ 4298 32634 43877 34711 3746 -31908 -47581 -34819 -6279 23808 44047 41153 11373
1438A1373l6248j9886M434K4063L4599K6054j071k6887l2865k2746m339J9095
$$ 11373 -24875 -44761 -40327 -16264 18335 44389 43318 16431 -16434 -39180 -43519 -24424
1450b4424L6516K8653L024k0428k9756k7186j2818J5950L5496K9729Q006j1240
$$ -24424 12092 40745 43769 23341 -6415 -33601 -46419 -30469 5027 34756 42762 31522
1462C1522k7156l3811j8817J2846L3506K9885J3910m090k6019l6799k0599Q907
$$ 31522 4366 -29445 -48262 -35416 -1910 27975 41885 37795 11776 -25023 -45622 -36715
1474c6715K6847K8051K1545K586k3623l6367k2651M98J9410L0759K8586O320k2600
$$ -36715 -9868 18183 39728 42314 18691 -17676 -40327 -39829 -20419 10340 38926 45246 22646
1487B2646l2625k4480p766J3459L2782L2039P850j7264k7129k6726j6509Q530
$$ 22646 -9979 -34459 -42225 -28766 4016 36055 43905 26641 -488 -27214 -43723 -35193
1499c5193L3026L1993J1109q357k2473l1269k3334N316L0448L0503J6510p8k0099
$$ -35193 -2167 29826 40935 32578 10105 -21164 -44498 -39182 -8734 21769 38279 38201 18102
1512A8102l5041k5947L241K4485K8303K1723P152j8277l4772k5589k522J5596
$$ 18102 -16939 -42886 -39645 -15160 13143 34866 42018 23741 -11031 -36620 -39142 -23546
1524b3546K6320K9201J2336j6134l1580k6041j0622Q115K7877L3760J4378j3526
$$ -23546 2774 31975 44311 28177 -3403 -29444 -40066 -31951 -4074 29686 44064 30538
1536C0538k6418k6050j8537L010K8572L3164J5101o471j9640k8306k4799r36K7102
$$ 30538 4120 -21930 -40467 -37457 -8885 24279 39380 32909 13269 -15037 -39836 -40772 -13670
1549a3670L0537J7508K137j4578l1207k8962k618K1493K7268K1860J0465j2314
$$ -13670 16867 34375 36512 21934 -9273 -38235 -40853 -19360 7908 29768 40233 27919
1561B7919l2934k8500n207J3137K3901K7725J6279j1005k9949k7034j1756M468
$$ 27919 -5015 -33515 -38722 -25585 -1684 26041 42320 31315 1366 -25668 -37424 -32956
1573c2956K3222L2891J8870r437k4819k5243j8393k037K2895L3776J8522m098
$$ -32956 -9734 23157 42027 32590 7771 -17472 -35865 -37902 -15007 18769 37291 33193
1585C3193j6848k4911k5548o808K1423L1013J9575M623j0654k7391l0178r136
$$ 33193 16345 -8566 -34114 -40922 -19499 11514 31089 35712 25058 -2333 -32511 -41647
1597d1647J7960K6614K2334J3056p058k9164l0953r688J0753K1921K6103J8868
$$ -41647 -23687 2927 25261 38317 31259 2095 -28858 -38546 -27793 -5872 20231 39099
1609C9099n072k7762k7908j3047J984J7943L0180K2394k868k2459k4322j8748
$$ 39099 34027 6265 -21643 -34690 -32706 -14763 15417 37811 34943 12484 -11838 -30586
1621c0586p125J5923L2177K3626R26j5329k2504k5693j2354J5046L1135K2798
$$ -30586 -37711 -21788 10389 34015 34941 19612 -2892 -28585 -40939 -25893 5242 28040
1633B8040O660p973k2572l0135j4293J2778K5664K2526J3859j738k3471l0986
$$ 28040 34700 26727 4155 -25980 -40273 -27495 -1831 20695 34554 32816 9345 -21641
1645b1641j5073P520J8702K3587K1402J901k2664k8775j6239j082J3058K7114
$$ -21641 -36714 -29194 -10492 13095 34497 36398 13734 -15041 -31280 -32362 -19304 7810
1657G810K5861L437j9110k4774j9682r790J0594K9377K6939N141j3449k0776k4289
$$ 7810 33671 37108 17998 -6776 -26458 -36248 -25654 3723 30662 35803 22354 1578 -22711
1670b2711j5715R923K8409K4847Q523n746j8359k8872j7982P964K3893K2333J4605
$$ -22711 -38426 -28503 -94 24753 33276 27530 9171 -19701 -37683 -29719 -5826 16507 31112
1683C1112J938j7941l0517j8909L260J7364K2273K1685O666j7914k9539j8869
$$ 31112 33050 15109 -15408 -34317 -31057 -13693 8580 30265 36931 19017 -10522 -29391
1695b9391k704J0880K4134K6618P985j5926k5423j9736r804O279K5716K7728Q721
$$ -29391 -32095 -21215 2919 29537 37522 21596 -3827 -23563 -33367 -27088 -1372 26356 35077
1708C5077j1366j8963k2035j7095L680K4616K5772J1751k532j5594k6492k1256
$$ 35077 23711 4748 -17287 -34382 -30702 -6086 19686 31437 28905 13311 -13181 -34437
1720c4437J887K1502K3816J5462M853j4151k8390k2360l75J5734K1273K1412R714
$$ -34437 -32550 -11048 12768 28230 33083 18932 -9458 -31818 -32193 -16459 4814 26226 35940
1733C5940j3056k8190k1207n226Q817K0531K5807J2598j1811k3312k0372j1496
$$ 35940 22884 -5306 -26513 -31739 -22922 -2391 23416 36014 24203 891 -19481 -30977
1745c0977K408K0478K8148J3624p224j7651k1735j8142j510K0788K6758J4799
$$ -30977 -28569 -8091 20057 33681 26457 8806 -12929 -31071 -32581 -11793 14965 29764
1757B9764n39j3270k3423k2940l478J8646K3681J6886O378j0086k5391k3751n109
$$ 29764 29225 15955 -7468 -30408 -33886 -15240 8441 25327 31705 21619 -3772 -27523 -32632
1770c2632J3021K0569J9935J2481p545k4961k2712q226N731J7377K3843J6662
$$ -32632 -19611 958 20893 33374 25829 868 -21844 -30070 -24339 -6962 16881 33543
1782C3543n623k1468k1699j3071j076J6343K6983J7726l004j6638k0593j8637
$$ 33543 27920 6452 -15247 -28318 -29394 -13051 13932 31658 28654 12016 -8577 -27214
1794b7214n605J5737K6648J7823J853j0469k1325k2939q089J3715K3150J7927
$$ -27214 -32819 -17082 9566 27389 29242 18773 -2552 -25491 -33580 -19865 3285 21212
1806B1212Q713n501k1436k5278j0037R346J8575K0266J4540k353k0964k4469j1691
$$ 21212 29925 24424 2988 -22290 -32327 -22981 -4406 15860 30400 28047 7083 -17386 -29077
1819b9077K997J4319K2673J9196k39j8386k2432j5120l161J1740K4787K0550J668
$$ -29077 -26080 -11761 10912 30108 29869 11483 -10949 -26069 -29230 -17490 7297 27847 29515
1832B9515j3857j9435j8721r198R971K4612K0342N563p612j8445k2340j2253Q463
$$ 29515 15658 -3777 -22498 -31696 -21725 2887 23229 28792 21180 2735 -19605 -31858 -23395
1845b3395K1273J9440J0939k657j7093k4525j4481N136J7036K0024J5605J906
$$ -23395 -2122 17318 28257 25600 8507 -16018 -30499 -25363 -8327 11697 27302 29208
1857B9208j7044k4010j5012j24J2398K0582J9879M349j4419k1917j6435n987Q450
$$ 29208 12164 -11846 -26858 -26982 -14584 5998 25877 30226 15807 -6110 -22545 -28532 -20082
1870b0082K1408K2060O429j0648j8683j8609j1493N403K1184K1846R450n317j5997
$$ -20082 1326 23386 29815 19167 484 -18125 -29618 -24215 -3031 18815 28265 22948 6951
1883F951k1485j5160L472J8868K0613J2471P10j3922k3093j7250O30J4608J9925
$$ 6951 -14534 -29694 -26222 -7354 13259 25730 26440 12518 -10575 -27825 -27195 -12587 7338
1896G338J6549N014j2528k2918j7428l018R807J8359J9837Q826j0311k0806j8154
$$ 7338 23887 28901 16373 -6545 -23973 -26991 -17184 1175 21012 29838 19527 -1279 -19433
1909a9433p995N363J8663K2116R827o804j7240j8827j2947J467J7780K2683J1975
$$ -19433 -27428 -22065 -3402 18714 28541 21737 4497 -14330 -27277 -25810 -8030 14653 26628
1922B6628k603j3610k0021j6681j044J5845K0510J4360L039j0484k1170j8665
$$ 26628 24025 10415 -9606 -26287 -27331 -11486 9024 23384 26423 15939 -5231 -23896
1934b3896l472J1765J8506J7540P749q688k0842j8825o664P302J6656K0129J1199
$$ -23896 -27368 -15603 2903 20443 28192 19504 -1338 -20163 -26827 -19525 -2869 17260 28459
1947B8459o214j8820j9386r911K744J5698K1230J3214l236j5715j8534j3938j719
$$ 28459 22245 3425 -15961 -25872 -23128 -7430 13800 27014 23778 8063 -10471 -24409 -26128
1960b6128J4401K1569J4660Q44j2385j9071j6887m053J2141J9828J5904N027q253
$$ -26128 -11727 9842 24502 25346 12961 -6110 -22997 -27050 -14909 4919 20823 25850 17597
1973A7597j8951j9226p016R279J7708J7827R197n240j8650j9741q498M711J5510
$$ 17597 -1354 -20580 -27596 -18317 -609 17218 26415 21175 2525 -17216 -25714 -21003 -5493
1986e493J8709J2979k660j6551j9325j2300J267J2771K0282J4808M21j3501j8691
$$ -5493 13216 26195 23535 6984 -12341 -24641 -23374 -10603 9679 24487 24908 11407 -7284
1999g284j4379m170J0824K0375J6466L685r488j7942j7752o436Q371J8712J7114
$$ -7284 -21663 -25833 -15009 5366 21832 25517 16029 -1913 -19665 -26101 -17730 982 18096
2012A8096P413n862j6818j9128r879N490J6481J7956J1284k595j5498j9751j1570
$$ 18096 25509 19647 2829 -16299 -26178 -20688 -4207 13749 25033 22438 6940 -12811 -24381
2025b4381K039J3728J8404J3923L59j3273j9152j3699j851J0423J9026J5927L700
$$ -24381 -22342 -8614 9790 23713 24072 10799 -8353 -22052 -23903 -13480 5546 21473 25173
2038B5173j0708j8019j5538n928P367J8362J8103O547p443j6335j7784r079N289
$$ 25173 14465 -3554 -19092 -25020 -17653 709 18812 25359 17916 1581 -16203 -25282 -19993
2051a9993J6759J7995R379l286j4426j8974j1901J939J4595J8153J2645M59j3129
$$ -19993 -3234 14761 24140 20854 6428 -12546 -24447 -22508 -7913 10240 22885 23344 10215
2064A0215j9027j3738j104J2117J7984J4407L420j0618j8291j5275m036Q778J6990
$$ 10215 -8812 -22550 -23654 -11537 6447 20854 24274 13656 -4635 -19910 -23946 -15168 1822
2077A822J6445O389p511j6883j6805p503N365J5934J7487R570m674j4705j7829
$$ 1822 18267 24656 17145 262 -16543 -24046 -18681 -2747 14740 24310 19636 4931 -12898
2090a2898j0561K232J4323J8199J1528r15j3157j7656j2640j417J2099J7859J3772
$$ -12898 -23459 -21227 -6904 11295 22823 21908 8751 -8905 -21545 -22962 -10863 6996 20768
2103B0768K559j0649j6978j5138m273R326J6996J5653N792p705j6765j6578o901
$$ 20768 23327 12678 -4300 -19438 -23711 -14385 2611 18264 24056 16351 -414 -16992 -23893
2116b3893O846J5385J6395Q432m362j4849j7298r268K932J3591J7132J1426j246
$$ -23893 -17047 -1662 14733 23165 18803 3954 -13344 -22612 -19680 -6089 11043 22469 21223
2129B1223j3687j7051j1714p73J1831J7813J2806K114j1314j6599j3842l080Q664
$$ 21223 7536 -9515 -21229 -22002 -10171 7642 20448 22562 11248 -5351 -19193 -22273 -13609
2142a3609J6864J4739M341p729j5261j5441p198O470J6004J5744P560m633j4629
$$ -13609 3255 17994 22335 14606 -655 -16096 -23294 -16824 -820 14924 22484 17851 3222
2155C222j6672r505M053J4377J6016J0018j293j3005j7044j1386J218J1644J5542
$$ 3222 -13450 -22955 -18902 -4525 11491 21509 20216 7211 -9833 -21219 -20001 -8357 7185
2168G185J2674J929j0906j6886j3155j949Q795J5650J5067M161q829j6004j3964
$$ 7185 19859 21788 10882 -6004 -19159 -21108 -12313 3337 18404 22565 13736 -2268 -16232
2181a6232n521O077J5240J6254O135o156j3824j4831q835L129J4787J6070Q820
$$ -16232 -21753 -15676 -436 15818 21953 15797 1973 -12858 -21693 -18564 -3777 12293 21113
2194B1113k440j2102j6548j1595J465J3096J5653J0723Q92j0355j7046j2908k95
$$ 21113 18673 6571 -9977 -21572 -20107 -7011 8642 19365 20257 9902 -7144 -20052 -20347
2207b0347J0205J4357J3063M174q152j6819j3709l501O634J4104J5460O993o881
$$ -20347 -10142 4215 17278 21452 13300 -3519 -17228 -20729 -14095 9 15469 22462 15581
2220A5581j5152j4270o750L436J3843J6626Q026m377j2352j4556r815N71J2714
$$ 15581 429 -13841 -20591 -17155 -3312 13314 21340 16963 4611 -9945 -19760 -19189 -6475
2233f475J6382R442n60j0086j4756j3359j426J1608J5345J0993K813p484j5879
$$ -6475 9907 19349 18789 8703 -6053 -19412 -20838 -9230 6115 17108 19921 12437 -3442
2246c442j4162k968Q498J3995J2776O078o039j4954j4375n308N119J2009J5266
$$ -3442 -17604 -20572 -12074 1921 14697 20775 14736 -218 -14593 -19901 -14782 -2773 12493
2259A2493Q437m225j3591j4242p991J709J1251J6378J0101k447j1534j3988j0269
$$ 12493 20930 16705 3114 -11128 -19119 -17410 -6159 10219 20320 17873 6339 -7649 -17918
2272a7918j655J0581J6026J0881N36q452j3329j3260m162R322J4898J1777L912
$$ -17918 -19573 -8992 7034 17915 18451 9999 -3330 -16590 -20752 -11430 3468 15245 19157
2285A9157n112j4412j4892n090P116J2848J2506P495l045j4178j4863o661L921
$$ 19157 14045 -367 -15259 -20349 -13233 -385 12121 19616 16571 2393 -12470 -19131 -15210
2298a5210J0268J4272J0211j494j2535j4181q347q48Q871J5578J1955m4j0339
$$ -15210 -4942 9330 19541 18047 5512 -8669 -17016 -17864 -8993 6585 18540 18496 8157
2311H157j2990j0621m030P838J5743J2392J856o855j2392j2849o518O784J4306
$$ 8157 -4833 -15454 -19484 -11646 4097 16489 18345 11490 -902 -13751 -20269 -13485 821
2324H21J2517M829l159j1792j5612p542N159J1979J2219Q643n59j1646j5567q601
$$ 821 13338 18167 15008 3216 -12396 -19938 -14779 -2800 9419 18062 17503 5857 -9710 -18311
2338a8311K079R338J2807J1482J370j0949j4606q954j532O625J4009J3168K382
$$ -18311 -16232 -6894 5913 17395 18765 7816 -6790 -15744 -17276 -10651 3358 16526 18908
2351A8908q958j2490j1002n061N357J4119J3377L702n602j0761j2825q230M239
$$ 18908 9950 -2540 -13542 -18603 -13246 873 14250 17952 12350 1589 -11236 -19466 -15227
2364a5227J3322J3058O168k277r659j4914r229K993J1245J1963Q826J448r733
$$ -15227 -1905 11153 17321 15044 5385 -9529 -18758 -15765 -4520 7443 16269 17717 7984
2377G984j5340j0022J027Q307J1936J1603L368q961j4243r850k371N159J1957
$$ 7984 -7356 -17378 -16351 -8044 3892 15495 18863 9902 -4341 -14191 -16562 -11403 554
2390E54J3441N111p690j2120j0472o581K993J2707J4458N560m777r717j2014r440
$$ 554 13995 19106 11416 -704 -11176 -17757 -14764 -2057 12401 17961 13184 3467 -8547 -17987
2404a7987J469J2225J3605O348j25q399j3628j0821N43J0432J1661Q700L032o987
$$ -17987 -16518 -4293 9312 15660 15535 7136 -6492 -17313 -16770 -6338 5323 14023 17055 10068
2418A0068j4195j1427j248O942J0945J1705N210n868j3681j1445l479L819J0122
$$ 10068 -4127 -15554 -16802 -9860 1085 12790 18000 12132 -1549 -12994 -16473 -12654 -2532
2431b532J3970O933n241j1673j1006p012J125J0614J4672P347l190r106j0985
$$ -2532 11438 18371 13130 1457 -9549 -16561 -15436 -4822 9850 17197 14007 4901 -6084
2444f084r671r06J0177J3311Q074p7o224j2045j1524k291Q642J1631R438M209
$$ -6084 -15755 -16661 -6484 6827 14901 14824 8600 -3445 -14969 -17260 -8618 3013 12451 16660
2458A6660m879j3046j2270l073O137R670J1177P058l813j2723j2025m650K815
$$ 16660 11781 -1265 -13535 -16608 -10471 -801 10376 17434 13621 898 -11127 -15777 -12962
2471a2962Q967J2797Q447l162j0939j0868o822p17Q652J3566Q937j525p984j0581
$$ -12962 -3995 8802 17249 14087 3148 -7720 -14542 -15259 -6607 6959 15896 14371 6387 -4194
2485d194r641k614P836J3292Q711J515m869j0662j2474m113O857J1616R634M610
$$ -4194 -13835 -16449 -8613 4679 13390 14905 10036 -626 -13100 -17213 -10356 1260 10894 15504
2499A5504k909j1058j2899m753M549R503J0405P912k112j0834j2225n802J491
$$ 15504 12595 1537 -11362 -16115 -11566 -2063 8342 16254 14142 3308 -8917 -14719 -13228
2512a3228P611J1339J0091p10r535j0958p435k067N952J2484J0591R14p074r471
$$ -13228 -5617 5722 15813 15103 5568 -5390 -12825 -14892 -8940 3544 14135 15049 7975 -1496
2526a496j0020m783N319J2600J0025L204l851r655j1645o068M588J0897R823N475
$$ -1496 -11516 -16299 -10980 1620 11645 14849 10998 1343 -10302 -16370 -11782 -885 8938 14413
2540A4413j259r243j2437o736K709Q318R723Q558P06q527j2373p224l80O066J0727
$$ 14413 13154 3911 -8526 -15262 -12553 -4235 5488 14046 14752 6225 -6148 -13372 -13752 -7686 3041
2555C041J0364J901p719j0536q412l091M110J1166J1157L273n369r567r578n773
$$ 3041 13405 15306 7587 -2949 -11361 -14452 -10342 824 11981 15254 9885 318 -9260 -15033
2569a5033K730J1135J1003M332k823p882j1035p276J806R648R883O446P25p656
$$ -15033 -12303 -1168 9835 14167 11344 3462 -7573 -14849 -13043 -3395 6488 12934 13659 6003
2583F003j1746q039Q1P472R808Q724K442o367j1806r052j108M889R612J0310L843
$$ 6003 -5743 -13782 -13701 -6229 3579 12303 14745 8378 -3428 -12480 -13588 -8699 913 11223 15066
2598A5066n670j0357q932m222L120R738J1225M678l883q979r325o469J063R349
$$ 15066 9396 -961 -9893 -14115 -10995 -1257 9968 14646 10763 1784 -7541 -14010 -12947 -3598
2612c598J1431N640j750o465j0064q860m01Q441J0566O666J754n648j1159r041
$$ -3598 7833 13473 11723 5258 -4806 -13666 -14067 -5626 4940 11606 13360 7712 -3447 -12488
2626a2488j290O052R861Q257L925m665j1201q636l052L765Q525J0131N121l693
$$ -12488 -13778 -7726 2135 10392 14317 9652 -1549 -10185 -13237 -9472 -947 9184 14305 10612
2640A0612r527q980m972J071Q092J1346O373k373p805r076p404m66P421J1256
$$ 10612 1085 -7895 -12867 -11796 -3704 7642 14015 11642 3837 -5239 -12643 -13109 -5688 5568
2654E568O673j61n815r037r266j798O528R992Q016K349m025r601j0278k864N136
$$ 5568 12241 12080 6265 -2772 -12038 -13836 -7308 2684 10700 13049 9024 -577 -10855 -13719 -8583
2669h583Q547Q612M843k726r838r745m031K607P405R726O495j587q774r310n507
$$ -8583 -36 8576 13419 10693 855 -8890 -12921 -10314 -2909 6817 13312 11725 2951 -6359 -11866
2684a1866J35O419J0157P980o88o823r099p254j933N694J0655P664J202m773q565
$$ -11866 -11731 -5312 4845 12825 12137 5314 -3785 -11039 -12972 -7278 3377 11041 12243 7470 -1095
2699a095r272l166N036R810P910L160k566q727r558m581L167Q134Q713N377r32
$$ -1095 -10367 -13533 -8497 1313 9223 12383 9817 1090 -8468 -13049 -9882 -1748 6965 12342 11410
2714A1410q382r916n082J047O800Q951P424j86p307r394o285r65N190R622Q543
$$ 11410 3028 -6888 -11970 -10923 -4123 4828 12252 12066 4759 -4635 -10920 -11885 -6695 2927 11470
2729A1470J050n659q480p546l440M234R621Q349K787l658q027q813m658K776Q932
$$ 11470 12520 6861 -1619 -9165 -12605 -8371 1250 9599 12386 8728 701 -8112 -12770 -9994 -1062
2744a062Q591M429j813p270r164n886J425P317Q442O254J43o474r644o531J69
$$ -1062 7529 11958 10145 2875 -6289 -12175 -10750 -3433 5009 11263 11406 4932 -4712 -11243 -11074
2759a1074N582Q432P989J261n724r328o940j853M066Q408Q578K742m289q222p702
$$ -11074 -5492 2940 10929 12190 6466 -2862 -9802 -11655 -7589 819 9397 12139 7850 -372 -8074
2774h074l693K387Q197Q971M287k616o998q666n717J665P091Q953N311m13o219
$$ -8074 -11767 -9380 -1183 7788 12075 9459 2461 -6205 -11922 -10257 -3166 5787 11098 10685 4466
2789D466q724o657J19N959Q243O388K251n486q884p446j482M466P634Q240K818
$$ 4466 -4258 -10915 -10796 -4837 3406 9794 12045 6559 -2325 -9771 -11253 -6787 847 9087 11905
2804A1905m137q462p509k910K754P341Q645M133k758p467p930m433Q15P021R003
$$ 11905 7768 -694 -8203 -11113 -8359 -1018 7627 11760 9002 1535 -6395 -10828 -10013 -2992 6011
2819F011N154j186n866q459o281m14O038Q914O100R22n039q308p445j446M741
$$ 6011 11165 9979 4113 -4346 -10627 -11041 -5003 3911 10011 10933 5894 -2414 -9859 -11305 -6564
2834f564P965P220K782m094p906p504l069L069P414Q008L988k314p796p794m270
$$ -6564 1401 8621 11403 7309 -597 -8101 -11170 -8101 -687 7321 11309 8995 1199 -6595 -10865
2849a0865J541O752Q291N047r32o572q472m656o32N943Q390O332K91n358p881
$$ -10865 -9324 -2572 5719 10766 9834 3262 -5210 -9866 -10498 -4555 3835 10167 10458 5100 -2781
2864b781o209j891M792Q190O839J919l879p662p596k861L711P660P233L435k964
$$ -2781 -8990 -10881 -6089 2101 8940 10859 6980 -682 -8278 -11139 -7428 232 7465 10900 7936
2879G936o858p815l787J694O764P903M639o77o924p694n642O84N989P860N925
$$ 7936 1078 -6737 -10524 -8830 -2066 5837 10476 9799 2875 -4819 -10461 -9777 -3788 4072 9997
2894I997L7n294q033n729j293M914P876O256J833m468p446o869k224L448P123
$$ 9997 10034 4740 -3293 -9022 -10315 -5401 2475 8731 10564 6096 -1350 -8219 -10443 -6995 128
2909A28P757K548l070o900p578l294K137O796P608M235j815o477p622m648J052
$$ 128 7885 10433 7363 463 -7115 -10409 -8272 -1476 6132 10367 8552 2075 -5547 -10195 -9143
2924i143O065P737M914k41n387p742n595j56M811P427O069J200m135p911o366
$$ -9143 -3078 4659 9573 9332 3945 -3797 -9392 -9548 -4737 2690 8759 9959 5824 -2087 -8453
2939h453j560L963P131O191K674k892p453o480k892K040O705P386L806k138o398
$$ -8453 -10013 -6050 1081 7272 9946 7054 -399 -6879 -9771 -7731 -1026 6360 10166 8028 1630
2954A630p329l968R42N950P741M916p43o041p129m972m73M913P920N341N31m085
$$ 1630 -5699 -9667 -8725 -2775 4966 9882 9139 3098 -4031 -9003 -9476 -4563 3357 8698 9229 5144
2970E144o870o500j631M164P026O276K245l075p214o753k931L194O986O218L676
$$ 5144 -1726 -8226 -9857 -5693 1333 7609 9854 6779 -435 -7188 -10119 -6925 61 6279 9955
2985I955k339o078p472l509J495N656O794M721o65n576p121m511k83M947P072
$$ 9955 7616 1538 -5934 -9443 -7948 -2292 4502 9223 8558 2982 -4139 -8650 -8933 -3986 3086
3000C086N495Q17m677o967n407j700L893P422N573J761l218o487o632k471K836
$$ 3086 8581 9398 4721 -2246 -7653 -9353 -5460 1962 7535 9296 6078 -409 -7041 -9512 -6676
3015f676O720O051L032j729o086p230l602J746O022O491M208l80o075o982m009
$$ -6676 44 6095 9127 7398 1312 -5918 -9520 -7774 -1752 4739 8947 8567 2492 -4490 -8499
3030h499K18N089O231N497L29m912o478n305r82L772O663O045J314l376o425n784
$$ -8499 -8281 -3192 3039 8536 8865 3953 -2525 -7830 -8812 -5040 1623 7668 8982 5606 -819 -6603
3046f603k582K871O606O316K326k206n793o680l048J525N852O373L644j159m915
$$ -6603 -9185 -6314 292 6608 8934 6728 935 -5745 -8793 -7268 -1416 4957 8601 7442 2527
3061B527o997m432R69N469O043M789L24m727o978n028K9L825N923N688J555m068
$$ 2527 -4470 -8902 -7933 -2464 3579 8368 8692 3965 -3013 -8041 -8012 -4187 1736 7424 8979 4911
3077D911o466n495j273K372O117O477K495k974n762o121k734J538N991O682K926
$$ 4911 -1555 -7050 -8323 -5951 166 6643 9138 6164 402 -5719 -8453 -6915 -924 5758 8684
3092H684j874m969n794m264J89N868O153L559k3m041o535n068M1M358O176M451
$$ 8684 6810 1841 -3953 -8217 -8028 -2160 3993 7552 7529 3488 -3047 -8115 -8074 -3716 2460 6911
3108F911J470l417o389o059r50L340N784N767K055k437o409n528k349J995N325
$$ 6911 8381 4964 -1425 -7484 -8434 -5094 690 6457 8512 6075 -334 -5862 -8211 -6216 -891
3123h91O562L053j908n399o033l198M24N166O475L671p95l920o271m463k91M266
$$ -891 5671 8724 6816 1417 -4616 -7814 -7390 -2224 4251 7922 7127 3207 -3064 -7527 -7818 -3552
3139c552O540M308L83l322n850n967j060L728N947N018J827k279o281n894j989
$$ -3552 2988 7296 7679 4357 -1493 -7460 -8520 -4792 1155 6173 8000 5721 -560 -6454 -8443
3154h443K706N174N321L361j512o225n548k677J067M511O812L539q17n018n637
$$ -8443 -5737 -563 4758 8119 6607 382 -5166 -7843 -6776 -2265 4547 8086 7269 2251 -3386
3169c386l809l91M159O701M384j65l958n430n269j172L958O140M760J017k538
$$ -3386 -7195 -7586 -3427 3274 7658 7493 3535 -1895 -7164 -8336 -4378 1762 6522 7539 5001
3184E001n543n471k580L321N217N104K520j416n399o076k580J726M542N492L827
$$ 5001 -542 -6013 -8593 -5272 -55 5049 7569 6153 754 -5322 -7902 -6176 -1634 3858 7685
3199G685j88n576n790l383L40L708N664M981R3m366n691l939q68K890N914N049
$$ 7685 7497 1921 -3869 -7252 -6912 -3204 2460 7441 7534 3168 -2523 -6462 -7330 -4440 1474 6523
3215F523R77l164n192m719k382K661N729N012J882j593m960n724k989K077N073
$$ 6523 7500 4336 -856 -5575 -7957 -5296 433 5445 7327 5734 774 -4950 -7939 -5862 -789
3230g89M882K908m78m346o267l390J015M192N146M207l4m167o127l558r3L007
$$ -789 4093 7001 6523 2177 -4090 -7480 -6465 -2273 2873 7080 7046 2879 -3248 -6806 -6899 -3892
3246c892N728M885R06l943n117m050j706K160N821N358J148k436m637m954k603
$$ -3892 1836 6721 7627 3684 -1433 -5483 -7189 -5029 792 6150 7298 4862 225 -4729 -7332
3261g332J472N199N866J912j280m010n819l296R44M491N342L113J9l727n870m093
$$ -7332 -5860 -661 5205 7117 5837 1827 -3992 -7288 -6344 -1853 3489 6602 6621 2894 -2976 -7069
3277g069L95L923M538M328J284l558n327m516p51K315N118M763K030k771n611
$$ -7069 -6674 -2751 1787 6115 7399 3841 -1486 -6002 -6753 -4438 680 5443 7473 4702 -909
3292i09m301j612J652M765N320K261j644m573m947k680K37M676N878K569n44l709
$$ -909 -5210 -6822 -5170 -405 4915 7176 5532 959 -3988 -6668 -6431 -1755 4123 6692 6148 2439
3308B439n314l759N0M309N000L201O72k814n578m561n48L307M861L947J783k424
$$ 2439 -2875 -6634 -6584 -2275 2725 5926 6598 3784 -1794 -6355 -6903 -3596 1265 5212 6995 4571
3324D571n191m738j311K103M257M980K442j674n308m411k191O88M438N056L099
$$ 4571 -620 -5358 -6669 -4566 -309 4671 7113 5439 131 -4280 -6471 -5783 -1345 3711 6810
3339F810j043m261m444l464J99L673N523L022P6k770m994m338q35L573M772M044
$$ 6810 5767 1506 -2938 -6402 -6203 -2530 2993 6015 6091 3321 -1673 -6011 -6846 -3273 1499 5543
3355E543Q62k165m940m779j434K762M418M122K445j657m950m645j963J476L866
$$ 5543 6405 4240 -700 -5479 -6913 -4151 267 4389 6834 5177 227 -4418 -6381 -4905 -1039
3370a039N263K573j376m219m774k148r3L818N025L202n09l263m459l664p23L387
$$ -1039 4224 6797 5421 1202 -3572 -5720 -5813 -1995 3030 6232 5723 2460 -1999 -5663 -6386 -2999
3386b999N076L674N4k376m676l583j894L131M532L959J504j843m429m856j725
$$ -2999 2077 5751 5805 3429 -1247 -4830 -6724 -3593 939 4898 6402 4559 130 -4726 -6451
3401f451K200M160M070K323j026m302m761k371J056L282M938L442r66l839m442
$$ -6451 -4251 -91 3979 6302 5276 974 -3787 -6158 -5102 -1820 3118 6560 5594 1755 -2687
3416b687k987J04K977M475M066l9l117m670l263j227K794M854L788O50k085m145
$$ -2687 -5674 -5570 -2593 1882 5948 5909 2792 -1878 -5141 -6368 -3574 1280 5068 5718 3633 -512
3432e12l904k118K136M584L941J837j094l903n004k008J315L879M125K344j59
$$ -512 -4416 -6534 -4398 186 4127 5964 4870 967 -4037 -6045 -4730 -851 3274 5618 5459
3447E459l677n020k531N65K835M444L755k30k807m825l064j09J924M337M130J022
$$ 5459 1782 -3238 -5769 -5204 -2369 2075 5830 5600 2793 -2032 -5096 -5205 -3281 1056 5186 6208
3463F208k773m240l618j524J784M479M288J233j683l742m410k079J097M377M023
$$ 6208 3435 -805 -4423 -5947 -4163 316 4604 5837 4154 412 -3998 -6077 -4980 -603 3420
3478C420K050m79l357m974k453P52L110M461K758K74l116m211l559k21K980L657
$$ 3420 5470 4991 1634 -3340 -5793 -5041 -1931 2530 5288 5562 2446 -1765 -5324 -5545 -2565 1092
3494A092L999J097l073m500l188o59J630L734M233J420j814l596m190j850J051
$$ 1092 5091 6188 3115 -1385 -4573 -5232 -3602 132 4365 5785 3971 375 -3815 -5665 -4614
3509d614M162M062J968j069l459l960k718O21L518M305K397j68l086m117l279
$$ -4614 -452 3610 5578 4509 1050 -2910 -5628 -5007 -1489 2816 5213 5045 1959 -2158 -5437
3524e437L87K641M144L226O83k707m368l202o65K205L444L867J477k353l698l550
$$ -5437 -5050 -2409 1735 4961 5644 2937 -1431 -4633 -5298 -3093 351 4218 5695 3342 -356 -3906
3540c906j351J445L185M574J695j308l635l712k262N50L468M127K332m10k792
$$ -3906 -5257 -3812 -627 3947 5642 4334 699 -3013 -5275 -4725 -1257 2870 5202 4792 2000
3555B000m165k871o0K888M416K402N65k473l775l520r73K735L818K906J472j783
$$ 2000 -2165 -5036 -5096 -2208 2208 4610 5175 2702 -1073 -4593 -5566 -2831 987 3893 5365 3582
3571C582l865m096j166K009L214L919J633j185l443l954j896R70K908M214K450
$$ 3582 -283 -4379 -5545 -3536 -322 3597 5230 4045 602 -3352 -5248 -4278 -1370 2844 5294
3586E294r27k836m033k305J16K790L857K476J49k766l265l108o97K591L908K743
$$ 5294 4367 1531 -2502 -4807 -4691 -1901 1956 4432 4581 1815 -1450 -4558 -5255 -2664 1244 3987
3602C987R02j774l692l163j317J805L351L640J213j099l600l640j448Q53L198
$$ 3987 4889 3115 -577 -3740 -5057 -3252 99 3739 4952 3853 253 -3387 -4835 -3982 -784
3617g84L755K046m73l161l965k305M52K810L878K610mk695l812k955j31J865M332
$$ -784 2971 5017 4544 1383 -2582 -4887 -4435 -1625 2253 4863 4859 2164 -1648 -4603 -4734 -2869 1463
3634A463K501R08j948l356l419r95J742L509L302J122j478l176l158k068J235
$$ 1463 3964 4872 2924 -432 -3851 -4846 -3104 405 3707 4829 3351 175 -2983 -5051 -3816
3649c816L154L671J964p83k990l860k081P60K561L518K685j06k792l512k314l93
$$ -3816 -662 3009 4973 4190 1200 -2660 -4741 -3981 -1420 2098 4783 4677 1885 -1627 -3941 -4334
3665d334J805L898K680O65k162l544l067p14J793L788K786J262j780l130l174
$$ -4334 -2529 1369 4049 4714 2552 -992 -4059 -4773 -2980 808 3594 4856 3076 -54 -3228
3680c228j579J157L374K991K138j247k836l066k514Q65K903L359K169l97k119
$$ -3228 -4807 -3650 -276 2715 4853 3606 770 -2296 -4810 -3945 -1042 2317 4486 4089 1970
3695A970l807k476j25K608L464K443M86k110l389k809m40J668L527K480J337j714
$$ 1970 -1837 -4313 -4438 -1830 1634 4077 4563 2453 -936 -3745 -4185 -2517 1010 3490 4827 3113
3711C113l322l119j335J435K729L865J089r59l036l408j393M85L164L204J812
$$ 3113 -209 -3328 -4663 -3228 -499 3366 4455 3496 460 -2948 -4341 -3856 -692 2512 4324
3726D324m18k356l642k159p2K443L746K500n71j621l358k572k78J589L333K774
$$ 4324 3906 1550 -2092 -4251 -4323 -1880 1866 4366 3795 2174 -1184 -3756 -4034 -2445 888 3662
3742C662P20j559l454k478j122J226L102L070R56j088k471l215j668O62K917K986
$$ 3662 4382 2823 -631 -3109 -4231 -3005 97 3167 4123 3035 564 -2651 -4319 -3657 -740 2246
3758B246K139r28k760k738k141K77K418L282K414l01k285l014k501k97J723L418
$$ 2246 4385 3457 697 -2041 -4182 -3905 -1487 1795 4209 3908 1623 -1391 -3892 -4189 -2466 952
3774I52K557R20j961l018k580j359J679K636L263J087j356k639k898j591P23L053
$$ 952 3509 4429 2468 -550 -3130 -4489 -2810 -174 3089 4176 2820 181 -2717 -4308 -3585 -532
3790e32L256J363o20k688k996j638K44K538L052K039l02k057l457k221J80K002
$$ -532 2724 4087 3467 779 -2217 -3855 -3611 -1073 1979 4018 3716 1659 -1798 -4019 -3839 -1837
3806a837K809K461K85j273l351k535n86J280L014L048O06j003k903k621j516J038
$$ -1837 972 3433 3718 2445 -906 -3441 -4027 -2747 267 3315 3921 2918 15 -2606 -4122 -3084
3822c084K759K702J722r29k723k793k058J231K270K852J866m6k274l029k539M96
$$ -3084 -325 2377 4099 3170 447 -2346 -4404 -3173 -903 1949 3815 3769 1495 -1534 -4073 -3577
3838c577K076K387K788L40j932l086k271m55J458K730K793O60j207l103k642j163
$$ -3577 -1501 886 3674 4014 2082 -1004 -3275 -3730 -2272 458 3251 3911 2704 -399 -3041 -4204
3854d204J708K389K784J183r40k473k860j256L76K651K836J559l85k311l218j383
$$ -4204 -2496 -107 2677 3860 2920 447 -2413 -3669 -3293 -642 2194 3753 3368 1057 -2161 -3544
3870c544Q1K067K890K157j46k129k444k498K00J605K590K020P10j270k953k380
$$ -3544 -3463 -1396 1494 3651 3505 1376 -1068 -3566 -3366 -1761 829 2849 3559 2289 -664 -3044
3886c044q48J989K174K259J241o89k803k958j120Q34K601K407J713o95k352k494
$$ -3044 -3892 -1903 271 2530 3771 3082 279 -2679 -3799 -2965 -364 2043 3756 3061 709 -1785
3902a785j795K29K220L045J554k95j785k475k195n52K303K722J894M28r47l427
$$ -1785 -3580 -3351 -1131 1914 3468 3173 1388 -1087 -3282 -3834 -1531 1191 3085 3513 2566 -861
3918h61k266n36J577K514K444Q10q93l054k438q57Q16K407K635J516p75k664k276
$$ -861 -3127 -3663 -2086 428 2872 3682 2789 -265 -2703 -3560 -2744 -337 2298 3814 3039 375 -1901
3935a901j475J79K048K868J676n5j943k798j872J15J631K483K282J23j299l135
$$ -1901 -3376 -3197 -1149 1719 3395 3340 1397 -1401 -3273 -3158 -1527 956 3238 3361 2062 -1073
3951a073j705r40J824K460K328M67j107k583k399r64J190K423K377J103m66k262
$$ -1073 -2778 -3718 -1894 566 2894 3361 2254 -329 -2728 -3692 -2502 -79 2298 3401 2935 673
3967F73k834j191N80K312K317J450J30k459k679j486K2J598K769J837M12j882
$$ 673 -2161 -3352 -2772 -460 1857 3307 3437 978 -1701 -3187 -3165 -1567 1202 3039 3451 1569
3983A569k710j657q37J589K795K200K91j249k356k193q59J247K268K270R02p20
$$ 1569 -1141 -2798 -3635 -2046 749 2949 3240 1991 -365 -2558 -3417 -2170 98 2368 3270 2550
3999B550k366k525j096R48J905K565J344o4k215k955j571N74J873K326J897J33
$$ 2550 184 -2341 -3437 -2489 -584 1981 3325 3261 1046 -1909 -3480 -2906 -1033 1293 3190 3323
4015C323j736k946j783M3J215K536K645j10j436k235j931q54R57K404K514O98
$$ 3323 1587 -1359 -3142 -3099 -1884 652 3297 3187 1751 -484 -2415 -3269 -2312 92 2606 3304
4031C304j148k037k187j310O24K301K328J340n61j827k606j388L21J732K500J317
$$ 3304 2156 119 -2068 -3378 -2754 -453 1875 3215 2654 827 -1779 -3167 -2846 -1114 1386 2703
4047B703Q8j533k417j404l84J360K471J733N87j554k044j757q28J027J768K820
$$ 2703 2791 1258 -1159 -2563 -2947 -1587 884 2617 3204 1650 -394 -2151 -2979 -1952 -184 2636
4063B636Q44j383k028k115j189P41K249K252J181o92k245j705j718K71J618K973
$$ 2636 3480 2097 69 -2046 -3235 -2494 -245 2007 3188 2496 251 -1454 -3172 -2901 -1283 1690
4079A690J045J23j742k509j764J47J776K139J761J66j040k600j747n81J427J842
$$ 1690 2735 2858 1116 -1393 -3157 -3010 -1234 905 2666 2832 1792 -808 -2555 -3136 -1709 133
4095A33K099J279j321k323k011r47R20J818K721M20j02k381k075q21J5J839K023
$$ 133 2232 3511 2190 -133 -2144 -3091 -2171 -353 2368 2788 2686 305 -1770 -2591 -2576 -737 1286
4112A286J492j56j739j926j997j25K164K093J651Pj118k507j450n88J302K488
$$ 1286 2778 2622 883 -1043 -3040 -3165 -1001 1092 2743 2750 1632 -875 -2325 -2913 -1611 877
4128H77J498M91p30k565j860n79Q64K233J945J052q39k170k107j093P56J846J814
$$ 877 2375 2866 2136 -429 -2289 -2868 -2004 229 2174 3226 2387 217 -1890 -2983 -2227 -381 1433
4145A433J639p11j417k297j241O5J454K102J952n27j275k113j542p82J616K438
$$ 1433 3072 2361 944 -1353 -2594 -2529 -1075 1027 2979 2452 1177 -936 -2478 -3260 -1644 794
4161G94J581N16j571j616k216p04J224K080J897O87m88k172j988r57N48K493J732
$$ 794 2375 2891 1320 -296 -2512 -3216 -1992 88 1985 2672 2184 12 -1976 -2933 -2385 108 1840
4178A840J132p50j376k650j117M69J452K320J295K50j987k052j219m27J466K315
$$ 1840 2972 2222 846 -1804 -2921 -2452 -1000 1320 2615 2865 878 -1174 -2393 -2820 -1354 961
4194I61J588J53j330k226j456m39J041J908J878J016j150j965j744j164O12K267
$$ 961 2549 2702 1372 -854 -2310 -2749 -1708 200 2078 3094 1944 -21 -1765 -2929 -2317 -50
4210e0J821O73j55j614k482j025M80J716K125J366O9j879k371j563L04J300K263
$$ -50 1771 2444 2289 675 -1807 -2832 -2352 -636 1489 2855 2924 1045 -1326 -2889 -2585 -1285 978
4227I78J509L96j589k256j163l31N69K330K248J00j130j865j772n39L03J987K177
$$ 978 2487 2883 1294 -962 -2125 -2456 -1887 443 2691 2791 1661 -204 -1976 -2515 -2212 -225 1952
4244A952O68n85j598j928r64J9J906J685J312j32j352k012j788L14J587J734J380
$$ 1952 2620 2035 437 -1491 -2455 -2436 -530 1155 2467 2335 983 -1029 -2817 -2503 -916 818 2198
4261B198P16j546j994j859O3J016K290J265J90n75k099j665o92R13J963J847P37
$$ 2198 2914 1368 -626 -2485 -2422 -1406 884 2149 2339 1764 -335 -2000 -2692 -1779 184 2031 2768
4278B768n91k295j490j265O68J816J646J575o47j668j858j299O2J311K222J292
$$ 2768 2177 -118 -1608 -2873 -2205 -389 1257 2832 2185 517 -1341 -2640 -2578 -1267 955 2247
4294B247L66j391k044j457j62J304J574J833K84q85j901j775o23J088J775J696
$$ 2247 2613 1222 -822 -2279 -2441 -1137 437 2270 2554 1669 -232 -2007 -2630 -1542 233 1929
4310A929P76q36j818j962o70O64J729K106N72m05j494k212j016K60J614K097J302
$$ 1929 2705 1869 51 -1911 -2581 -1917 -188 1918 2490 2085 591 -1621 -2637 -2377 -763 1334 2636
4327B636o06p06k261j482q1J263J704J836K02j399j565j637l10Q73J928J525N35
$$ 2636 2030 1324 -937 -2419 -2500 -1237 467 2303 2505 1106 -459 -2096 -2406 -1533 395 1920 2455
4344B455p51j845j772p56P03J743J687J284o32j983j416r50K69J173J790J450
$$ 2455 1704 -141 -1913 -2669 -1966 -223 1464 2748 2116 133 -1283 -2233 -1964 -791 999 2449
4360B449Kj582j842j395k28J690J537J494N48j214j871j971j89J071J649J670
$$ 2449 2451 869 -973 -2368 -2596 -906 631 2125 2673 1459 -412 -2383 -2572 -1501 148 1818
4376A818Q01j321j482j791q65P52K094J811N44m87j554j750j097O91J352J676
$$ 1818 2619 1298 -184 -1975 -2840 -2088 6 1817 2361 1874 320 -1430 -2527 -1836 -484 1192
4392A192J287m91j521j436j131r8J396J565J601j25j062j732j534J28O27J965
$$ 1192 2479 1988 467 -969 -2100 -2198 -802 763 2364 2239 1177 -555 -2089 -1961 -1334 631
4408F31J404K49p40j598j865m41M97J742J566R94n52j591j691p93N04J204J885
$$ 631 2035 2284 1544 -54 -1919 -2360 -1863 -121 1445 2439 1887 296 -1395 -2188 -1684 -480 1405
4425A405M87K33j360j859j248M42J180J609J608l56j112j676j173o96J181J909
$$ 1405 1892 2125 765 -1094 -2342 -1900 -720 889 2497 2141 1029 -647 -1820 -2516 -1335 574
4441E74J256M49j043j329j908m29P76J706J771L62j94j774j934j000J021J814
$$ 574 1830 2279 1236 -93 -2001 -2430 -1654 52 1823 2185 1991 217 -1717 -2717 -1696 118
4457A18J318J015k65j541j837j201L03J510J480J315k41q74k013j239O6Q70J847
$$ 118 1436 2451 2186 645 -1192 -2393 -2090 -580 900 2215 1974 1100 -913 -2152 -2086 -1216 631
4474F31J615J42j189j372j860k86J020J430J689K28n92j589j304r37N04J864J540
$$ 631 2246 2388 1199 -173 -2033 -2319 -1299 131 1820 2048 1456 -133 -1437 -2374 -1870 -6 1534
4491A534P72o00j278j649j071L26J057J448J613j21j226j666j340K56R90J589
$$ 1534 2306 1706 428 -1221 -2292 -1966 -909 539 2152 2031 805 -861 -2201 -1945 -955 634
4507F34J297J35j101j107j762N0Q47Q25J940M64o36j609j473m08L18J570J563
$$ 634 1931 2066 965 -142 -1904 -1854 -1007 -182 1758 2222 1586 -23 -1496 -1904 -1586 -16 1547
4524A547N12l35j222j800p45L26J013J759R64j47j237j602r22P0P43J810J010
$$ 1547 2059 1724 502 -1298 -2043 -1717 -704 1055 2019 1872 635 -967 -1889 -1819 -1076 734 1744
4541A744O29j047k126q29k74O56J872J278J73p76j145j562o28P89J226J536O60
$$ 1744 2373 1326 -800 -1629 -1903 -1247 625 1903 2076 1300 155 -1407 -2035 -1246 -20 1516 2176
4558B176p22j390j527p43M97J425J559O15J52j434j418j400L42J075J742J151
$$ 2176 1454 64 -1463 -2206 -1709 -284 1275 1890 2042 608 -810 -2210 -1868 -793 949 2100
4574B100L9j321j607j153j36P47J568J488O05j109j518r61m67K99J572J731K59
$$ 2100 2139 818 -789 -1942 -2078 -1331 237 1725 2330 1221 -297 -1258 -1725 -1426 146 1877 2136
4591B136o23j583j045q57L15J414J608R05p34j066j677r23j26J678J579P89K97
$$ 2136 1513 -70 -1115 -1972 -1657 -243 1365 2270 1536 470 -1207 -2130 -2256 -578 1001 1790 2087
4608B087j105j896r46J48R93J082J163N69r48j500j121n66R25J365J239P60r45
$$ 2087 982 -914 -1860 -1712 -719 363 1526 2095 1147 -353 -1474 -2040 -1115 250 1489 2249 1304
4625A304j008j712o05L56J236J953L40m72j328j084r11L9J205J704N53N4q19j192
$$ 1304 296 -1416 -2021 -1665 -429 1524 1864 1392 64 -1020 -1931 -1892 -687 1017 1570 1624 805 -387
4643c87j375j18R60J407J190M16r95j601j092m64R64J664J043m4l69j234j349
$$ -387 -1762 -1880 -920 487 1677 2093 1098 -503 -1595 -2059 -1095 569 1612 1568 1199 -35 -1384
4660a384n12M48J472J340O89o90j301j219o33K61J106J351J017n32q79j589o48
$$ -1384 -1896 -1448 24 1364 2053 1363 62 -1157 -1790 -1529 -423 928 1945 1413 534 -1055 -1703
4677a703R9Q18J476J168j03j080j264q23o89J074J580O55M88n60j345j324j51
$$ -1703 -1604 -786 690 1858 1755 675 -589 -1412 -2101 -1027 553 1208 1696 1136 -209 -1533 -1684
4694a684K84J508J086M72k07j408j404m98M34J095J416O44j89r85j620r37L72
$$ -1684 -1400 108 1194 1666 1459 51 -1353 -1851 -1417 -322 1094 1738 1549 564 -1056 -1993 -1621
4711a621Q79J475J410k29j020j230j205J20N09J411P99M62p56j138j327m89Q29
$$ -1621 -742 733 2143 1914 894 -336 -1541 -1421 -912 499 1298 1760 1004 -134 -1461 -1950 -1121
4728a121R56J412K95k77j128j296p90O06J312J080O24k14j295j067j182O71R49
$$ -1121 -165 1247 1542 1265 137 -1159 -1949 -1343 -31 1049 1673 1459 164 -903 -2085 -1414 -465
4745d65J220J146k09j217j217q60n6R88J198J035K99j377n87j431l50O56J419
$$ -465 755 1901 1692 475 -742 -1602 -1658 -670 528 1563 1862 485 -102 -1533 -1883 -1227 192
4762A92J356O0n49r71j229m47K07J453J054N88o81o43j294r44N16J069J142Q32
$$ 192 1548 1608 1059 88 -1141 -1588 -1381 72 1126 1714 1033 390 -904 -1848 -1332 -263 879 1711
4780A711o6r35j649q24K84Q28J260R22J8o56j612r57n4Q80J227R28K22n12j250
$$ 1711 1645 710 -939 -1763 -1479 -651 609 1531 1549 893 -719 -1676 -1730 -850 377 1305 1527 1015 -235
4799b35q85k53J28J344R00P71n34j230j095n47N65Q32J252O67m03n42j467o52
$$ -235 -1120 -1373 -1245 99 999 1770 1236 6 -1089 -1636 -1071 -239 1013 1680 1277 735 -732 -1384
4817a384j12R10J725L03J80p10j230j069m25Q83J425O24N26o08j490j022j13O97
$$ -1384 -1496 -586 1139 1442 1622 912 -318 -1387 -1812 -929 496 1120 1646 1038 -452 -1474 -1587 -890
4835h90J196L20J050p86q86r74p52M70J071J201M17k0r00j450n75L46Q30R16R71
$$ -890 306 626 1676 890 4 -970 -1722 -1252 -181 1020 1437 1417 517 -933 -1508 -1162 -332 584 1555
4854A555k10r45r56r54j85J169J049J065r5q43j237r05m4L14J507J054L90m11
$$ 1555 1345 400 -556 -1510 -1695 -526 523 1588 1493 650 -587 -1492 -1536 -1222 285 1339 1729 1318
4872A318j320r98q10R64P07J234K68q1j258p69j058M50J023J239O14k07o36j187
$$ 1318 -2 -1000 -1810 -846 -139 1095 1363 1282 24 -745 -1803 -1353 -330 909 1523 1316 680 -507
4890e07q66m4R49Q00P46q8l16r59j305M6R26R46P49L50n36j158q18n80R86N95
$$ -507 -1373 -1417 -468 332 1078 990 674 -285 -1590 -1544 -618 328 1077 1427 891 -267 -1085 -1665 -679 -84
4910h4J292K91m88q04j042p49O29O89J115M81K8j009j164m66K44O07J146Q38q9
$$ -84 1208 1499 1011 207 -835 -1584 -955 -266 849 1330 1358 349 -815 -1281 -1037 -430 716 1554 1465
4929A465p15j375p70J28O70J066O87K2k09r27j108k98M66R21R08O09m20q72j589
$$ 1465 750 -625 -1395 -1267 -597 469 1156 1178 969 42 -1066 -1364 -898 23 931 1540 1120 248 -1341
4948a341l73Q12O01J160M68Qr19j127l17j31R14O37Q97J45o89j315o41q8O40J037
$$ -1341 -1714 -902 -301 859 1327 1335 416 -711 -1028 -1159 -245 392 1289 1434 745 -570 -1211 -1299 -659 378
4968C78R57j45n81j078q11m39P68J124R45O3n40o08j132j88P5J002R64N57k67
$$ 378 1335 1190 609 -469 -1280 -1719 -951 173 1118 1181 641 33 -1099 -1287 -1212 -210 754 1311 1044
4987A044q60j101m11K13Q04J153M48p9o26j218o96L25M59R83P81J85m30j687l88
$$ 1044 184 -917 -1328 -1115 -311 842 1290 1211 585 -633 -1329 -1004 -545 438 1219 1404 974 -713 -1101
5006a101k71N18J054J038L71q35o51p46p61J50J150J086O7Q9r25r65n24J04R36
$$ -1101 -1372 -854 200 1238 1609 774 123 -623 -1384 -1234 -84 1002 1069 1158 233 -732 -1256 -1152 -216
5025b16Q36P51j10p99j058o37J6J012Q93N86K16j088r02m78k88M39J380N65J56
$$ -216 620 1371 1261 462 -596 -1233 -1217 -205 688 1274 1490 402 -500 -978 -1266 -827 553 1118 1274
5044A274m66j024q91j09L78R81O78L57k95p45j108N9k56R03J089L77n6j030o41
$$ 1274 808 -216 -1107 -1216 -838 143 821 1178 883 138 -970 -911 -1167 -264 825 1202 1146 116 -525
5063e25m59k80N26J443N21j06o88j042l68l42R13N79P09M34p78m82q52m40J72
$$ -525 -984 -1264 -738 705 1226 1120 432 -610 -978 -1320 -407 172 881 1315 537 55 -797 -1237 -1065
5082a065Q51J283O6j44j135p15k57K56P80P06O89k05p87r69p63L90L28J340Q00
$$ -1065 -214 1069 1135 991 -144 -859 -1116 -860 -80 626 1315 1110 323 -646 -1409 -1019 -691 649 1449
5101A449l93m97j014m73k21N48J110N94j53l98p53p22l06N38Q99O82O73r14q56
$$ 1449 1056 559 -455 -928 -1149 -601 509 1103 950 552 -201 -923 -1229 -691 208 890 1563 649 -207
5120b07j075k08N54Q39O12Q63j3j227p91n58J99P27J012L96j71l70j139m35k36
$$ -207 -1282 -1490 -936 -97 515 1378 1365 138 -653 -1211 -1012 -285 727 1123 952 582 -557 -992 -1228
5139a228P36R71M81L59r40r25o31%N88Q03O94K22l75j122n81k14K92Q41O44M48
$$ -1228 -492 479 960 1319 379 -546 -1177 -1177 -589 214 908 1130 755 -367 -948 -1162 -870 -29 615 1063
5159A063J53j107j045j58J12K82J609O9L91j190q50k51n6K94J050L70L34l09j032
$$ 1063 1216 109 -936 -1094 -982 -700 909 978 1369 179 -671 -922 -978 -684 366 736 1070 761 -271
5178b71q06m9M02R74N70K69k03p72j171j83M25J098L42M99l51r08n43n03M82O09
$$ -271 -1077 -1126 -724 250 820 1089 886 114 -1057 -1240 -815 283 625 1124 773 -135 -678 -1181 -699 -90
5198i0J093m5j14n78q08n8k87N92R47O48m02n04p76o70M40p4J150N23J71m46r28
$$ -90 1003 958 844 266 -542 -600 -887 -295 652 1300 898 394 -382 -1052 -612 -686 464 987 1158 712 -216
5219b16m90l63J80P76P49N59o15p61j53n99J92Q02Q37J10j4m87j116l84M7O15
$$ -216 -706 -1069 -889 -113 636 1195 580 -181 -334 -933 -741 61 898 1008 994 507 -609 -993 -946 -331
5239c31J077O12o54l71p88q12J27O55P30P14l0l35q78m06m03L68Q55P05J26k92
$$ -331 746 1358 704 333 -455 -1267 -1140 -485 245 959 929 594 -284 -690 -1093 -725 130 835 961 669
5259F69o29p85m27L23J072L45O86m36n11r63l89Q0N99J157K61K51q01j067o9k30
$$ 669 40 -745 -1172 -849 223 568 1254 818 307 -656 -1045 -965 -366 791 1052 1303 502 -565 -634 -864
5279h64M88P62N31R9m78p15o21l37P49M80P01N9r9j073m76j11Q0Q34P09O20m88
$$ -864 -376 386 917 1016 538 -177 -798 -1135 -386 94 795 854 755 -318 -794 -905 -825 9 718 1338 850
5300H50n76j024p9K6N58O97K58l8l14q14p08M3O11P49R24j31m77j151k01j96K02
$$ 850 274 -750 -829 -803 -245 452 710 672 358 -456 -1164 -1121 -510 239 1163 1032 555 -596 -797 -993 -791
5321g91R54P35K84n15r76j37n53J53L98J426m6J36r04j043j49J13P33Q70N26l24
$$ -791 163 898 1182 667 -309 -446 -999 -846 -448 978 932 1068 164 -879 -1028 -915 -182 688 1214 890
5341H90o91p85m64K99K63J220J09p2k95p42m15m57L58J104L86j16l11m32p02k44
$$ 890 199 -586 -1050 -751 -488 732 841 769 474 -268 -683 -1140 -782 322 708 592 281 -151 -853 -1097
5361a097M33Q44K97N63l64l77q89m05K00M30P41N42j99o05m10q06L50N73J039
$$ -1097 -664 180 477 1040 676 299 -590 -995 -795 -365 376 918 719 114 -296 -1102 -752 -179 860
5380H60p7L38p62o62o93L55K79Q05J70K87l21p75o34n0M75N75N05k0K45r79p06
$$ 860 783 1121 359 -303 -996 -641 -362 443 613 900 579 -196 -830 -880 -405 170 675 655 900 -79 -785
5401g85l75P19N90K04L51j41m58j08p75k09R34O48o4J94q18k91n32J75K90Q91
$$ -785 -1160 -441 149 353 704 563 105 -3 -778 -987 -53 595 531 725 -93 -384 -916 -741 -451 440
5421D40J57R9k03r62j75l52L92N64N69J04k6r12m98K75J4P49O49K24o22n22n44
$$ 440 597 696 493 -469 -644 -996 -604 -40 529 633 607 -305 -803 -528 -514 235 884 1108 486 -36 -580
5442e80l07L07J71J206J02lp85l81o57M08K23L32P71k4k27p69m98pM68K05R17
$$ -580 -887 -580 -409 797 899 896 111 -270 -927 -519 -296 36 807 783 556 -213 -711 -718 -250 -45 872
5463H72k39j06p97l69j89M81L34P22L34m60n58m96m79K84M77K92N79j9l97p42
$$ 872 633 527 -270 -639 -828 -347 -13 709 1043 583 25 -471 -950 -666 -189 103 682 663 266 -476
5483d76m63j62R07O20J12K10l38m71o47k08P89N18M66o2k20o24l52o14K83R33
$$ -476 -939 -1101 -194 426 538 748 410 -61 -708 -916 -127 391 857 795 575 -49 -401 -1015 -732 201
5503B01K52M40l19j90j131p3K25Q56K27M66k04o55m15n92K97L72N91K4K89q5p95
$$ 201 453 893 574 384 -747 -820 -595 261 488 954 750 95 -320 -912 -615 -243 348 372 661 576 -219
5524b19o88O9N52N77N73j25m18p15k93q5o4J032N16K12m46o56l40k40NN67L26
$$ -219 -907 -838 -286 291 864 739 321 -394 -687 -772 -836 196 712 924 478 -178 -518 -758 -753 -186 140
5545A40P51o7q34m34k40J8P30K49N12N3o17o67l32K0L56O36L89J25m86m71k70
$$ 140 891 824 -10 -444 -684 -666 64 313 825 878 261 -406 -738 -718 -362 274 663 788 302 -169 -439
5566d39n4N7N82O18J2l77n35l59m19j20R95O20K32j34m66p74l02N61K55O65J24
$$ -439 -493 -436 146 764 776 399 -136 -495 -914 -1034 -39 581 813 679 213 -561 -863 -302 -47 618 742
5587G42k50l20p55l15R7K78O06Q58L1n45l14o21m01M20N73M72J29j0p34m23M4
$$ 742 492 172 -583 -898 -801 -523 83 941 972 427 113 -508 -909 -489 84 556 685 675 -59 -482 -438
5608d38N5L59O60J27K16r71n94k89L35M94L80N07l21j04j026k64M35J19N43N97
$$ -438 -383 -24 636 763 979 8 -586 -875 -540 -46 334 841 520 416 -610 -874 -439 -320 223 820
5628H20m1j59r22l93Q1K39N83L08Kj87n95k34k27L69M96M91J51q7j103j79J9j25
$$ 820 779 620 -302 -695 -614 -375 208 516 518 331 -264 -498 -725 -356 140 631 782 695 -408 -587 -568 -693
5650f93M96O44J79No69l78m74K41J82P78M01j23l21m35o60K09M54M36K59lk97
$$ -693 -197 447 626 631 -38 -416 -890 -649 -467 311 712 589 268 -167 -827 -618 -164 272 531 528 231
5671B31l11p18J18N45M84J29M45m63l41o56j33K32J14R62L24m13n95j26m30J51
$$ 231 -80 -798 -680 -135 349 478 923 460 119 -537 -670 -438 -324 638 962 549 -46 -172 -602 -451
5691d51L91N00J08k75R6o05r5m9K5K53O71q9j32m10m75n7M9O23N36K43n22l13
$$ -451 -60 440 548 273 369 -236 -331 -380 -355 -102 569 480 348 -62 -537 -594 -545 78 614 857 335 22
5713B2n19l48n8J135K07L42l01k21o89l82K23L28Q04K09l8n14n21j54j87O22K09
$$ 22 -497 -845 -903 232 439 781 480 259 -430 -812 -589 -261 543 752 714 200 -321 -475 -662 -40 169
5734A69O43k45l61l83n65Q4L15L76N11M5k18o66k41k34K84J43Q85J57l94j28o32
$$ 169 812 567 206 -177 -742 -658 -343 33 544 589 371 -295 -536 -770 -486 -343 542 699 305 177 -455
5755d55j68L7N48N32k32O43l30q70m42k2Q89R5J56Q3l77k97k96Q7L19K09L79J09
$$ -455 -623 -586 -38 494 262 905 575 -295 -737 -759 130 225 381 464 87 -210 -506 -419 -100 109 488 597
5777E97k59k27n39j65N4P01L63K0J10o96k79m38M58J85L77L46k91j51m87m24J78
$$ 597 338 111 -428 -593 -539 162 525 545 655 -41 -320 -758 -300 -115 262 608 317 166 -321 -745 -567
5798e67K45M67L45M8l54l87m16p9M63N36K39K32l21n99l87j4K89K71P23M8k84
$$ -567 -322 145 490 538 184 -203 -619 -698 -235 301 540 772 451 -148 -535 -549 -260 11 734 782 498
5819D98l76r85N91k07N38M8N00J14q65m70J46k9L93N27rM93q80j24n81J97N1R57
$$ 498 122 -863 -272 -479 59 107 607 721 -144 -614 -468 -497 -104 423 414 907 27 -97 -678 -481 -430 527
5841E27N0j6k01m09o21J21O1Q8R16J7n5o77j97k52J28N52N04j05L36o57l03k21
$$ 527 577 561 360 -49 -670 -549 -488 -400 516 533 478 -199 -396 -648 -520 32 536 431 767 110 -193 -414
5863d14j82M54N61M0N2m59l44l25o3N50J81M72j78K9p47m5j22Q5P44J39J98k95
$$ -414 -596 -142 419 459 511 52 -292 -617 -680 -130 51 523 345 374 -373 -418 -540 -455 289 428 626 331
5885C31m41m79l6J09R12j18n2j22m35l2o5J28P3P68j17J13k25p14l62K83J24P09
$$ 331 -110 -589 -625 -516 396 278 226 104 -331 -363 -428 -300 -227 541 424 537 312 -402 -764 -481 -357 352
5907C52Ok3l48j31n64j98Q19K91J01O3R6m37j50n60K53L34N55J24j85m30n75J24
$$ 352 358 335 -13 -144 -708 -906 -87 204 305 368 464 27 -123 -683 -430 -96 459 583 398 -32 -607 -483
5929d83J93j0P01K31j2l99o05N5l71L28L51O00j69l46k31m39J12L76K69K25ml99
$$ -483 -290 -300 401 632 620 221 -384 -329 -700 -372 -21 579 410 64 -167 -606 -494 -118 151 376 372 -27
5951b7k19j55l36K90N70M01ON1o78l35l62N32K47J11M77l31k28j55k35K9L05J15
$$ -27 -246 -401 -737 -447 123 524 530 581 -97 -432 -794 -262 -15 96 573 242 14 -141 -376 -347 -42 73
5973G3N27j69j78m89k61n1L91M93j36O03q10k06Pj85J49N83k9K02j53m70o50M88
$$ 73 600 431 253 -236 -497 -548 -157 336 200 803 -7 -213 -206 -391 -242 341 312 514 361 -109 -759 -271
5995b71K32O1L65k97R0k22k04k06L4K79L25M14j15m15m93J30k82M96L20R9J07
$$ -271 -39 22 387 90 180 -42 -246 -452 -418 -139 186 600 485 70 -423 -293 -575 -79 241 340 447
6016D47k00m47j7J35j23J89M75m2J99r58L7j52J34O28k19M08j76j37m71p9j53
$$ 447 247 -200 -217 -82 -205 -16 459 417 616 -342 -305 -457 -323 305 86 494 318 181 -290 -369 -522
6037e22K89N57K11O6q22l6k66j8O01R6L42j39p9l42j90P1K11K02L18l38m4j44
$$ -522 -233 324 535 601 -221 -257 -523 -541 60 156 498 359 280 -62 -252 -181 30 232 550 212 168 24
6059B4l96j48J34M74j72N77k11n00l7k19J94L42J01L58K8m99n30k33K60J13L88
$$ 24 -372 -520 -386 88 -84 493 282 -218 -255 -474 -280 62 163 521 549 50 -480 -713 -453 -340 48
6080D8L27J77k05o03k67J11M38j17N14j98k3n13j60j41M34J09L22J87l78J20m96
$$ 48 375 552 347 -256 -523 -412 26 -91 423 225 202 -311 -471 -612 -178 -69 253 440 62 182 -314
6101c14j42K6J15O14N19n90J0n53k5Q9J73L06M41l8k79o98L47n89K69M97J46L15
$$ -314 -456 -430 -315 299 818 228 238 -315 -340 -251 -78 228 669 631 352 -346 1 -588 -319 178 324 639
6123F39o04O9l55p3k01O04N59l00M82p83n70K00p4N45q2M43l99j61p7jk07J87
$$ 639 35 104 -251 -324 -525 79 638 338 820 37 -533 -333 -407 138 56 499 100 -61 -138 -139 -346 -159
6145a59K57N48k01n43j48jl9J11K15O67k17k06m65l42N7L70J30K59P2k4o41J52
$$ -159 98 646 445 -98 -246 -247 -286 -175 40 707 490 284 -181 -523 -466 -96 34 293 365 341 -300 -148
6167a48J34j31L0N19Q9j92m69Q4o11K00L63L85J22J94l44m8n18J15L08J94J6K95
$$ -148 -14 -145 -115 404 493 301 -168 -84 -695 -495 -132 253 375 569 225 177 -341 -226 82 276 292 587
6189E87n85j56J13m53K20L67K10K9%l34l61j61M72j42P74j61l41k75K21m39k47
$$ 587 2 -154 -41 -494 -274 93 303 332 332 -2 -363 -524 -52 -194 580 419 78 -197 24 -415 -662
6210f62N12L59L98k49m51j26l18K79O4M31J41J06l76l07n99L94ON13R9M86m64
$$ -662 -150 209 607 358 -93 -219 -537 -258 -194 237 378 484 108 -199 -798 -404 -398 115 214 700 236
6231B36k00k51k60M78K2L28r1k31J4j58k42J72K45K28M9K0j7n16k67L33K6L63
$$ 236 36 -215 -475 3 25 353 262 31 45 -113 -355 -183 62 290 339 359 342 -174 -441 -108 -82 281
6253B81p8l1L8m66L40n07M70J45K2K35J32n79j95j55K84k9L78Q1o4n27j74JK01
$$ 281 203 172 210 -256 84 -423 47 192 214 449 581 2 -193 -348 -64 -93 285 366 302 -225 -399 -398 -197
6276a97N7M68k00L45m36j42l31o9N52j29J42J98l8l77k16M8K08J77Q8L59k07l67
$$ -197 -140 328 128 473 37 -105 -436 -505 47 -82 60 258 220 -157 -373 -325 -117 60 148 507 300 -67
6298f7l60R7L73l01O32J63l46k82l62j38J60K83O63k94J51q8n95QK45o8K70K58
$$ -67 -427 -330 43 -258 374 537 191 -91 -453 -591 -431 -148 515 221 372 284 -311 -303 -58 -126 144 402
6320D02N5m41k89k07Q2L71k7M72J45m44m43j38k27J97N18J57m9qq3k20j00K66
$$ 402 457 16 -273 -480 -398 -27 -54 418 563 119 -324 -462 -689 -492 26 183 134 126 43 -177 -277 -11
6342a1r4K40J64k3M3l88k09J03K05K35j02M44o59k12R1j50L09J83J26K12m99j70
$$ -11 -105 135 299 276 319 -69 -278 -175 30 265 163 607 -52 -264 -173 -323 -14 169 295 507 8 -162
6364a62j19m59P68Q8K62J74j14n65j28k0L0J71N26M1p30J07J7k23L7L36m9K60
$$ -162 -281 -740 28 116 378 552 438 -127 -255 -275 -245 -74 452 493 -237 -130 -113 -336 -299 37 -12 248
6386B48k07j51P6m9j83OJ29N07J7N0n21qn28M67r0M57M5R9m64j59k93L58M40J67
$$ 248 41 -110 -34 -83 -266 -260 -131 376 393 443 -78 -86 -614 -147 -237 220 265 364 -100 -259 -552 -194 246 413
6410D13l82K43l2n55j1l07R00o2n4J38l48k16Pp6K61L86j37O7n2k14J02m84M99
$$ 413 31 274 242 -313 -324 -631 269 207 153 291 -57 -273 -266 -342 -81 305 168 235 183 -31 71 -413 86
6433H6K10L3k15J2l02J61j44p0J53K06J25k9m03N6l24K02L26J65K24m95k06kq
$$ 86 296 329 114 126 -176 -15 -159 -229 -76 130 255 226 -177 -121 -445 -243 83 248 472 -23 -229 -231 -239
6456b39j65L95J32O2L80m72K9l06j27L09K70O6n37N28l14l93J12j29P15j43K02
$$ -239 -404 -9 123 185 565 93 122 -184 -311 -2 268 334 -203 325 11 -382 -270 -399 316 173 375
6477C75o4j39k37k61L2J17M20O0k29j64j12j3L4O2L42k29J15l12KJ0k23L97j2
$$ 375 311 172 -65 -326 -294 -177 243 303 74 -90 -202 -215 -181 -119 223 -6 109 -203 -201 -191 -414 -17 -29
6500b9K82l10K69j20k15J02Q6J13q5p4M4j90j27L3P6J85M5K14j05l70q1j15J35
$$ -29 253 -57 212 92 -123 -21 65 178 93 19 63 -127 -254 -221 -145 40 85 299 194 -176 -257 -372 -237
6523b37K72J50j56J28r7k1r7k88K36K86NLm1j67k79r3J28N72l2l2k1l13r8j3K21
$$ -237 35 185 29 157 60 39 -58 -346 -110 176 181 184 143 -24 -303 -396 -268 304 272 240 219 -94 -192 -205 16
6548A6k72L79P8k2P3m44j57K19o0M12qO3ol56j19J16L1l8L68Jm29j70J46j50M51
$$ 16 -256 123 201 179 252 -192 -349 -130 -190 222 214 277 271 -85 -204 -88 -57 -95 273 274 -155 -325 -179 -329 122
6573A22j14L21Nk69j37o2k30K31l10O05m0J57m0n43L91l21J48K51k0J31n77K01
$$ 122 8 329 334 65 -72 -134 -364 -133 -443 162 122 279 239 -304 87 -234 -86 165 145 276 -301 -100
6595a00R0Q3k17m8L67p5r1l62J94k1J74J33k5P4J86n11j84N02m5l38M17j14j30
$$ -100 -10 73 -144 -192 175 100 9 -353 -159 -180 -6 127 102 176 362 -149 -333 169 124 -214 203 89 -41
6618d1L7O3m33K25K37RK64k85k18j60J39N4J70J73J38Ll87j43K65k49j33M79Q8
$$ -41 -4 59 -374 -149 88 97 361 76 -142 -302 -163 -109 61 234 372 375 -12 -155 110 -139 -272 207 295
6641B95m22K85M3k31r3J57j06L49j51Q3j17j74mk0j15L78K26l07j13l5O5M2l43
$$ 295 -127 158 201 -30 -123 34 -72 277 126 209 92 -82 -86 -106 -221 157 383 76 -37 -72 -7 35 -308
6664c08L52L1k29j5K83m41L25j19K70M5j54J65m24j29J74J16J2k9M00j58k92j58
$$ -308 44 75 -154 -169 114 -327 -2 -121 149 194 40 205 -219 -348 -174 -58 -46 -75 325 167 -125 -283
6686b83m2O08m28J48K96j68Mk6j55r1o7M74j43J57Q9n93L1L36n1k4QO8J64n81
$$ -283 -325 283 -145 3 299 131 135 109 -46 -137 -204 270 127 284 373 -220 -189 147 96 72 80 148 312 -269
6710b69Q5K3k15K44L05j1lq8l73K83k99M57n0L05k92l50M13n13K5L89J19j40J33
$$ -269 -184 -161 -376 -132 173 162 159 71 -302 -19 -318 139 89 394 102 -248 165 -348 -323 66 185 45 178
6733A78j38l93J30J82k55L78m2j08K41k26j19j11K80J99j61j38K95k63J16m49
$$ 178 40 -353 -223 -41 -296 82 40 -68 173 -53 -172 -283 -3 196 35 -103 192 -71 45 -404
6753d04Q3K19J11Jj18M2N3k67M65m57J50N86l35k47n1R5l0k21N17L2j68J51j09
$$ -404 -321 -102 9 10 -108 -66 -13 -280 185 -272 -122 464 129 -118 -169 -74 -104 -325 192 224 56 207 98
6776I8k28J04p7N0L59j60j66j69L93k18j49j91L36J68j8N7l77m7mM44j68J22j27
$$ 98 -130 -26 -103 -53 306 146 -20 -189 204 -14 -163 -354 -18 150 132 189 -188 -235 -239 205 37 159 32
6799C2k26k9P9j07K78K87o2J35m82L0k56K69k02O42q2k81K71l30j65k9j78N95
$$ 32 -194 -223 -144 -251 27 314 252 387 -95 -65 -321 -52 -254 388 306 25 296 -34 -199 -228 -406 189
6821A89p4O4j85o8nj40J30j36K26K92o1m39K18j27p3j41L36k1k74K09l7J1j32
$$ 189 115 179 -6 -74 -79 -219 -89 -225 1 293 232 -207 11 -116 -189 -330 6 -15 -289 -80 -117 -106 -238
6844b38j64M09K77N5l39QNk73K84P1P4n2n2p6J27n88O55l17J86J0k6M4n0Jk26
$$ -238 -402 7 284 339 0 8 13 -260 24 95 169 117 65 -11 116 -472 183 -134 52 62 36 80 30 31 -195
6869a95K69j94L94R7k65j66j35L04k7k97L75m0L26k71k31m07L69J67L89m58J59
$$ -195 74 -120 274 371 106 -60 -195 109 82 -215 160 120 446 175 -56 -463 -94 73 462 4 163
6890A63J26o01K82J1j7k04L19R6n4j18M3r7J65n9l3K86j83k54k40P30n17n4N67
$$ 163 289 -312 -30 -19 -36 -240 79 175 121 3 46 -51 114 55 22 308 125 -129 -369 361 -156 -210 357
6913C57l17j77K27k04J98j63l4L33m9j53J17j05j83j25J99L48j57J69P1m40O7
$$ 357 40 -137 90 -114 84 -79 -113 220 171 18 135 30 -153 -278 -79 269 112 281 352 -88 -21
6934b1J60k26K69j09JJ02k09j88N0R3p7M00j15M02n90R5K78m41O6k4K18K92n19
$$ -21 139 -87 182 73 74 176 -33 -221 -171 -78 -155 245 130 532 -58 37 315 -126 -60 -84 134 426 -93
6957i3j54l0L88j74J10j09p8j44k6K22N7J63N2K7n7l77R8J18k66J82N9p1K24m0
$$ -93 -247 -277 111 -63 47 -62 -140 -284 -310 -88 -31 132 184 211 154 -223 -125 -7 -273 -91 -32 -103 121 81
6981H1k29Q3k28M9K49J48m53L99J69n18K57nR0l26K04L40o62K73j23J5M7J3K6
$$ 81 -148 -65 -293 -244 5 153 -300 99 268 -250 7 2 92 -234 -30 310 -352 -79 -202 -187 -140 -127 -101
7004a01J28K09q1k43j40J57N80o90K04q3J63l65OJ49J35o6o2J96k58N5Q6n9J99
$$ -101 27 236 155 -88 -228 -71 509 -181 23 -60 103 -262 -256 -107 28 -38 -100 96 -162 -107 -21 -80 119
7027A19Q2k36M31l62j8L1l68L82J64k20k57M86o2k35L53l68j78L67O8k34R9k27
$$ 119 201 -35 396 34 16 47 -321 61 225 5 -252 234 172 -63 290 -78 -256 111 179 -55 44 -183
7049a83jPK11k30M11j00j68k83L08J4j29M7L40p1q4J39k95K16k79J52J99j58k46
$$ -183 -184 -177 34 -196 215 115 -53 -336 -28 -14 -143 -96 244 173 89 228 -67 149 -130 22 221 63 -183
7072a83J30j70Q9k6J87k9K16j08l23p5Q4j8M0K74j49o0R1qJ51J01l7j69qN3n34
$$ -183 -53 -223 -134 -160 27 -2 214 106 -217 -292 -208 -226 -186 88 -61 -121 -30 -38 113 214 177 8 0 53 -481
7097d81M06J21Q9k77P46n86K03j3k47oM4p5K48J26k06j50O9K5k45J36J77k59J69
$$ -481 -75 46 135 -142 604 18 221 208 -39 -45 -1 -76 172 298 92 -58 11 36 -209 -73 104 -155 14
7120A4M14l30j69j4l0K78n8o8L73l81j39J42l18J03J85J33K93l65J00n43L19k28
$$ 14 428 98 -71 -85 -115 163 105 37 410 29 -110 32 -286 -183 2 135 428 63 163 -380 -61 -289
7142b89L95K22j4n21lM93m59j40J52K54o3m04M19J73l04j1K83j89J73ql04p1K35
$$ -289 106 328 314 -207 -210 283 -176 -316 -164 90 27 -377 42 215 -89 -100 183 -6 167 159 -145 -216 19
7165A9j74J69j5J79l84l3K56j70R3k5R2r7L82k50j25p0K27J0l19L47K19l83M59
$$ 19 -155 14 -1 178 -206 -239 17 -153 -60 -85 7 -90 292 42 -83 -153 74 84 -235 112 331 -52 407
7188D07n66J13K29r0q3k75L79k69J30M7j32K96pl19J26K00p3q9j10L0K07l3j58
$$ 407 -159 -46 183 93 10 -265 114 -155 -25 22 -110 186 179 -140 -14 186 113 24 -86 -56 151 118 -40
7211d0J2K70n71K20k59M39K81nk57j7o3J22k34J04j87Q9P9K27o90J45RJ53K73
$$ -40 -28 242 -329 -109 -368 71 352 347 90 73 10 132 -102 2 -185 -96 -17 210 -480 -335 -326 -173 100
7234A00j84L14l57P9k7J94J93m33R6J71l82M25k3o40M70jj50K73l7j82M28l23
$$ 100 -84 230 -127 -48 -75 119 312 -121 -25 146 -236 189 166 -474 -4 -5 -155 118 81 -101 327 4
7256DL86m86K82r8j46J16k32K0j3K30m6J52m3M8j53J7k02J87J83l93N98M5k29
$$ 4 390 -96 186 88 -58 58 -174 -154 -167 63 17 169 126 174 21 38 -164 23 206 -187 411 456 227
7279B27k73J39l6nl3L7l20J70J63m55K84K4n2J92j53M9M0m9l04K29J00K7Q0Ko0
$$ 227 -46 93 57 52 19 56 -264 -94 69 -386 -102 -78 -130 62 -91 -42 -2 -51 -355 -126 -26 1 81 83 23
7304B3R1m25J30J90M9p2k7J2M5M3K05n76J45n5L75m4n3l48j07L21K84m00K60j34
$$ 23 114 -311 -181 9 58 -14 -41 -29 16 59 264 -312 -167 -222 153 109 56 -292 -399 -78 206 -194 66 -68
7328f8J99j84j77K97m7k1JK38j39m57L70j13R6J53Lr3o3j83L80k18j68j32L99
$$ -68 131 -53 -230 67 20 -1 0 238 99 -358 12 -101 -5 148 151 58 -5 -188 192 -26 -194 -326 73
7351G3K28k74k26M03j10p1j84J95j96L69l8k82K71k93J43k17j66M87k43LP3qj65
$$ 73 301 27 -199 204 94 23 -161 34 -162 207 169 -113 158 -135 8 -209 -375 112 -131 -128 -55 -63 -228
7374b28R8J51R1l76J90k10K68m27O07J31l08K19k03K43j69k9j23K58j49K44l19
$$ -228 -130 21 112 -264 -74 -284 -16 -443 164 295 -13 206 3 246 77 48 -75 183 34 278 -41
7395d1J9k8K6j11K81J34m95J66J05j8j86K72L1k8n8o5n1J32L6k71M03k05o3M29
$$ -41 -22 -50 -24 -135 146 280 -215 -49 56 38 -148 124 155 127 69 4 -47 85 121 -150 253 48 -15 414
7419D14n31N6J11R1J0j18l8n2j6j92L3M79n10N4K97K3j21O0o8N0Pk02k8K83j4
$$ 414 -117 -61 50 141 151 33 -5 -57 -73 -265 -232 247 -263 -209 88 111 -10 50 -18 32 39 -163 -191 92 78
7444G8j97R3k88O96l78P4Q1M5n01L52j14R2j04q5L29j22J93k76o9P4J15k31L01
$$ 78 -119 -26 -314 382 4 78 159 204 -297 55 -59 33 -71 -156 173 51 244 -32 -101 -27 88 -143 158
7467A58m5j35Q3j99l1M15l75K65l2l64M7J80J13k66L20j00K83k77j67l11M36j15
$$ 158 113 -22 61 -138 -169 246 -129 136 104 -260 -213 -33 80 -186 134 34 317 40 -127 -438 -2 -117
7489a17K77O4k33J53l28L11j07l25J34J14N5K85m71j65L57J9p5M1J13r2l56N67
$$ -117 160 224 -9 144 -184 127 20 -305 -171 -57 -2 283 -188 -353 4 23 -52 -11 102 10 -346 221
7511B21k22K63m77L5K14j35R2k13Q4j74J01J75k98P19j67k52K70l1j85k4J0N9
$$ 221 -1 262 -215 -180 34 -101 -9 -222 -138 -312 -211 -36 -334 385 218 -34 236 205 20 -4 6 65
7533F5P4r7k57L40k52J92j85K15j33K6K38j62n8l3j14K25j37J2K49m01j46K91
$$ 65 139 42 -215 125 -127 65 -120 95 -38 -12 226 64 6 -27 -141 84 -53 -41 208 -193 -339 -48
7555d8r4p6M16m26L16q4k21p8K69n6J15J33k51L86m20ML7J04L7K43l87P4k10J09
$$ -48 -142 -218 198 -228 88 4 -217 -295 -26 -82 33 166 -85 301 -119 -115 -78 26 63 306 -81 -7 -217 -108
7579a08Q3r2J63J3Nk21K66k06J20o6j02J46k18J05o1J12K5J65k89P9J61J4M3R2
$$ -108 -25 -117 46 59 64 -157 109 -97 23 -43 -145 1 -217 -112 -173 -61 -36 129 -160 -81 80 94 137 229
7603B29l82o9K37k99P89m01J92j74q2j74K71M1k17M39l07j54l4J81r7j52M48j21
$$ 229 -153 -222 15 -284 505 104 296 122 40 -134 137 178 -39 400 93 -61 -95 86 -11 -163 285 164
7625A64j87l6j31q2J54J83J92K0j60j32k96K01m93O00K0K2p7M2j68j2O8j19N1
$$ 164 -23 -59 -190 -272 -118 65 257 277 117 -15 -311 -110 -603 -3 17 39 -38 4 -164 -176 -108 -227 -176
7648a76J37k9K73k50o5J79k59L49j80j90L01q3P7M5k85J28K14J18r2L4l14J35
$$ -176 -39 -68 205 -45 -110 69 -190 159 -21 -211 90 7 84 129 -156 -28 186 304 212 246 -68 67
7670F7J71n71K65K39J01m51N88m83J25M9l46J40L87k35j71N4N6K03J8k74L9M59
$$ 67 238 -333 -68 171 272 -179 409 -74 51 100 -246 -106 281 46 -125 -71 -15 188 206 -68 -29 430
7692D30n57M1j32m2L24q0J02Qj30K6j63k43K89K69k26K94j86j0n1J9R5m20M02
$$ 430 -127 -86 -218 -260 64 -16 86 94 -36 -10 -173 -416 -127 142 -84 210 24 14 -37 -18 77 -343 59
7715E9J49j13k7n9O9l58K92J73j41L7R7j08m9p8Q9Q4J42k12l8j72q9J14J14n0
$$ 59 208 95 68 9 78 -280 12 185 44 81 178 70 21 -57 32 116 258 46 8 -164 -253 -139 -25 -75
7739g5L66k94j1J46k81M37m98J90J09j74O7J37q4j45K99l57J53J52k36P3j27K22
$$ -75 291 -3 -14 132 -149 288 -210 -20 89 -85 -18 119 35 -110 189 -168 -15 137 -99 -26 -153 69
7761F9k53K50J03n7J40m57K67j92k86L87J73O1l36L58l1k10k29K66J22j15J62
$$ 69 -184 66 169 112 252 -205 62 -130 -416 -29 144 205 -131 227 196 -14 -243 23 145 30 192
7782A92p3n72L37P6j58K54k81Q8K51Qj33Qm70O94K02n54L26j2k84j46J74K94j24
$$ 192 119 -453 -116 -40 -198 56 -225 -137 114 122 -11 -3 -473 221 423 -131 195 183 -101 -247 -73 221 97
7805I7n4J44J47k88k8l05J36J20n3J91r0k55J62m6j21L45P3r7j19J14k9j40m1
$$ 97 43 187 334 46 18 -287 -151 -31 -84 107 17 -238 -76 -122 -243 102 175 78 -41 73 44 -96 -137
7828a37K29m99N43j0j45l07M7M25j92k52J47L56j62n9L09k14r4K02k7J59k59q2
$$ -137 92 -407 136 126 -19 -326 -279 146 -46 -298 -151 205 43 -16 293 79 -15 187 160 319 60 -22
7850b2K5K49j95L5j15J63k27O8l7N6n2k3L29j89J82k67q5L6N47p17J80L39l30
$$ -22 3 252 57 92 -23 140 -87 -19 -56 0 -52 -75 254 65 247 -20 -105 -69 478 -239 -59 280 -50
7873e0L7O3Lj38l0J06J25%Q4k97K8L20k30j4K49l59j18M15k43J52k20j4q8L03
$$ -50 -13 50 53 -85 -115 -9 116 116 200 -97 -69 251 21 7 256 -103 -221 194 -49 103 -117 -131 -219 84
7897H4PK4n1k56J47k76K43p1K39J99j67q3m19M17K95j87k71J34k22N6l04M59j54
$$ 84 91 115 64 -192 -45 -321 -78 -149 90 289 122 39 -380 37 332 145 -126 8 -214 -158 -462 -3 -157
7920a57M98j87K7k90J88J06j52J07l37L71j71m0j07O4j21p3N81j83j58L33l42
$$ -157 341 154 181 -109 79 185 33 140 -197 174 3 -37 -144 -80 -201 -274 307 124 -34 299 -43
7941d3J20l73J91L26l6j97k7J23l20n9J14J17L83l10m8j66N1q2q6K27J24N1j34
$$ -43 77 -296 -105 221 185 -12 -39 84 -236 -295 -181 -64 319 9 -39 -205 -154 -236 -322 -95 29 80 -54
7964e4k6K39m24J05k17O20J32j61mq2M0j83l53L72K83p8j71J15k98J83k06M68
$$ -54 -80 159 -265 -160 -377 243 375 214 210 128 168 -15 -368 4 287 209 38 153 -145 38 -168 300
7986C00l93L21N1k94m1J14k52J40k03K59K81l01p7J68M3l7J02j97Q3N6j31k63
$$ 300 -93 228 279 -15 -56 58 -194 -54 -257 2 283 -18 -95 73 116 79 181 -16 67 123 -8 -271
8008b71M58m02q2L11K54Q7k50l14k11N39JJ40k15J26k64K30m50q7M98J34j29k01
$$ -271 187 -215 -297 14 268 355 105 -209 -420 119 120 260 45 171 -93 137 -313 -400 98 232 103 -98
8030i8K43n3K74l82L02k12o9O4K21l07k19P2m0J72P6k47K24q0j02l3P3K95P6l9
$$ -98 145 92 366 -16 286 74 5 69 290 -17 -236 -164 -204 -32 44 -203 21 -59 -161 -194 -121 174 250 211
8054B11j4n00K58j90N3lJ10O4o6O9R3l1l22M76o9L3n6K12k78l0K7J09r4L5J43
$$ 211 197 -303 -45 -235 -182 -185 -75 -11 -77 -8 85 54 -268 208 139 172 116 328 50 20 47 156 62 97 240
8079B40m60J66M9RJ8K41m06K26L14n45J12l84L57M3M1M13l01k33n0M3j7R2K0j20
$$ 240 -220 -54 -5 4 22 263 -143 83 397 -148 -36 -420 -63 -20 21 434 133 -100 -150 -107 -124 -32 -12 -132
8103a32K37N9m48K46J89k61J66j53K57k86k27M07j37k8N19j77p4k86n4J84p1o0
$$ -132 105 164 -284 -38 151 -110 56 -97 160 -126 -353 54 -83 -111 408 231 157 -129 -183 1 -70 -130
8125a30J7M19l19p6K6l2R6j51M14l0r8J05j29l9j56lK23M3L01m93K0j20P2n3k14
$$ -130 -113 306 -13 -89 -63 -95 1 -150 264 234 136 241 112 73 -83 -86 137 180 481 -12 8 -112 -40 -93 -307
8150c07M05j40p3K42o5k40J51K35M3k51M47n09K04j55r0K94j29ON0J73m77J42
$$ -307 98 -42 -115 127 62 -178 -27 208 251 0 447 -62 142 -13 -103 191 62 68 118 291 -186 -44
8172d4l37L39M51m78L54k94L0l83L23l5L9J66L2j15l4L1k79J64j78
$$ -44 -381 -42 409 -69 285 -9 21 -362 -39 -74 -35 131 163 48 14 45 -234 -70 -248
8191b48
$$ Imaginary data points
##PAGE= N=2
##DATA TABLE= (X++(I..I)), XYDATA
0@%%%%%%qJ6j6J6j6K4l3M1n6O4p2Q8j04J22j43J66j94K23k57K97l38L86m36M91
$$ 0 0 0 0 0 0 0 -8 8 -8 8 -8 16 -17 24 -32 32 -40 48 -56 66 -77 89 -105 118 -139 158 -180 206 -230 261
30B61n57O25p00P84q74R73j082J204j336J479j640J817k008K224k464K734l039
$$ 261 -296 329 -371 413 -461 512 -570 634 -702 777 -863 954 -1054 1170 -1294 1440 -1599
47a599L380l776M236m776N426o217P211q509J0270j2825J6886k4357M2648j69903
$$ -1599 1781 -1995 2241 -2535 2891 -3326 3885 -4624 5646 -7179 9707 -14650 27998 -141905
61a41905k93379K00465K36371J37386L3418K3469j12573k02809j46110K0551J01740
$$ -141905 -435284 -234819 1552 138938 172356 195825 83252 -119557 -265667 -245116 -143376
72a43376J54598J70515Q8099j14910k37031j86877k0816J24120J92693J47810
$$ -143376 11222 181737 269836 154926 -82105 -268982 -289798 -165678 27015 174825
82A74825M2443n8792j35182j93398j39113N7842K35049K13947O0212p4077j55937
$$ 174825 217268 158476 23294 -170104 -309217 -251375 -16326 197621 257833 183756 27819
93B7819j88259r7358P1245J51813J17644R7807P1098q4667k56639j98828L6529
$$ 27819 -160440 -257798 -186553 -34740 82904 180711 251809 167142 -89497 -288325 -251796
104b51796J77346J63309J26991N4287j17937k40673j46524L7601J07883J04286
$$ -251796 -74450 88859 215850 270137 152200 -88473 -234997 -197396 -89513 14773
114A4773J33225J10600m8887k06902j97753n3988Q9664J62839J53457P2061l6490
$$ 14773 147998 258598 209711 2809 -194944 -248932 -159268 3571 157028 229089 192599
125A92599j32374j85602j37143L3593J91496J87805P0462k8364j08408j86723
$$ 192599 60225 -125377 -262520 -228927 -37431 150374 220836 192472 84064 -102659
135a02659j54661K8522J75775J49861O3334K6215m8896j77640j85805k1988J29345
$$ -102659 -257320 -228798 -53023 96838 160172 186387 137491 -40149 -225954 -247942 -118597
146a18597J50403J23533P3851n8750j99229j80800k8136R2933J36565J51134R4872
$$ -118597 31806 155339 229190 170440 -28789 -209589 -237725 -144792 -8227 142907 237779
157B37779n7688j82186j61318m8308N0210J19155J50643J01372j4732j21000j63912
$$ 237779 180091 -2095 -163413 -211721 -161511 -42356 108287 209659 194927 73927 -89985
168h9985j24371M52J40273J76510R9839k59q5801j64500j59823j4943J41263J57594
$$ -89985 -214356 -213904 -73631 102879 202718 202459 116658 -47842 -207665 -222608 -81345 76249
180G6249Q5685L4056l6065j55591j86201m4640J15357J44111J01616O4765j6660
$$ 76249 161934 195990 159925 4334 -181867 -226507 -111150 32961 134577 199342 182682
191A82682j43749j79642p2352N8952J25840J44202J04613k0375j50005j68347
$$ 182682 38933 -140709 -213061 -154109 -28269 115933 220546 200171 50166 -118181
201a18181p9950K8988J13672J48716R9202j1921j00544j31191j13691l5956R0172
$$ -118181 -198131 -169143 -55471 93245 192447 180526 79982 -51209 -164900 -200856 -110684
212a10684J64948J21155J9050p1075j39512j51611n2257R8093J56494J07520L9848
$$ -110684 54264 175419 194469 123394 -16118 -167729 -219986 -121893 34601 142121 181969
223A81969l1298j29071j69531o8036Q1236J34339J06232O8736k428j17583j67565
$$ 181969 150671 21600 -147931 -215967 -134731 -392 105840 174576 172148 54565 -113000
234a13000q3051M1481J06660J22698J01581J3702j08126j58053j02411m3R3715
$$ -113000 -196051 -154570 -47910 74788 176369 190071 81945 -76108 -178519 -178562 -84847
245h4847J45427J15156J0400r1898j31917j10276l6171P2945J43300J14326K6814
$$ -84847 60580 175736 186136 94238 -37679 -147955 -184126 -111181 32119 146445 173259
256A73259m8989j08672j37800p8955N6851J46686J23992M8724k7251j08573j50558
$$ 173259 124270 15598 -122202 -201157 -144306 2380 126372 175096 147845 39272 -111286
267a11286q3180M8083J21460J10781P1106P926r2383j52506r8852J7094R6425
$$ -111286 -194466 -146383 -24923 85858 156964 164890 72507 -79999 -178851 -161757 -65332
278f5332J18731R9051K2899q4817j39864j03314j6912O6276J23691J20618L8770
$$ -65332 53399 152450 175349 90532 -49332 -152646 -169558 -103282 20409 141027 179797
289A79797o7257j27067j17956m9411N5254J32247J19538L7147m2473r4966j19086
$$ 179797 112540 -14527 -132483 -181894 -126640 5607 125145 162292 119819 24853 -94233
300i4233q1345K5942J19162J23824O4234r032q7149j39217r8845J8726J09242
$$ -94233 -175578 -149636 -30474 93350 157584 148552 61403 -77814 -176659 -157933 -48691
311d8691J15375P5220J5052p0944j34318j06267p133P9921J14124J00043L5305
$$ -48691 66684 141904 156956 86012 -48306 -154573 -161706 -81785 32339 132382 167687
322A67687o3778j27366j06707l0047N1780J08594J13925N1903m4463j10018j14700
$$ 167687 103909 -23457 -130164 -160211 -108431 163 114088 165991 121528 11510 -103190
333a03190o2498L0120J13207J24119N6946l0139r0906j13520q0789R727R9180
$$ -103190 -165688 -135568 -22361 101758 158704 128565 37659 -75861 -156650 -146923 -47743
344d7743J18401P0444J243o9825j21007j01999p954Q6988J14596Q4638K3478n6914
$$ -47743 70658 141102 142345 72520 -48487 -150486 -158440 -71452 43144 127782 151260 94346
356I4346j19079j08164k5068O2877J06639R9601M4851m4117j12284j09670m3669
$$ 94346 -24733 -132897 -157965 -95088 11551 111152 156003 111886 -398 -110068 -153737
367a53737L7565R7577J10339N9914k6940r5681j09470o8325J0727R1329J18836
$$ -153737 -116172 -18595 91744 151658 124718 29037 -80433 -148758 -138031 -46702 72134
378G2134P2812j0250p9379j09182q6100p630P9770J13884Q0202J3670n7217j06193
$$ 72134 144946 134696 55317 -53865 -139965 -147595 -67825 46059 126261 139931 82714 -23479
390b3479j00856k8662O2303J06829R2271L6556l9626j02759j08005m4774M0843
$$ -23479 -124335 -152997 -90694 16135 108406 144962 105336 2577 -105428 -150202 -109359
401a09359R6428J01955N5902k2821r4467j09598o0191J8354Q4165J06391P1061
$$ -109359 -12931 89024 144926 122105 27638 -81960 -142151 -123797 -39632 66759 137820
412A37820o393p8828j05362p7009o542O9974J08893Q4130J2554o2430j03723r0691
$$ 137820 131427 52599 -52763 -129772 -136314 -66340 42553 126683 139237 76807 -26916 -117607
424a17607k5088N7238J04011R0644K9586m2638r5812r9356m4228L8555R5482R7264
$$ -117607 -142695 -85457 18554 109198 138784 96146 334 -99022 -143250 -104695 -9213 88051
436H8051M8888k4568q8437j03670n9046J9208Q2772J00611O5725n656p6222j05390
$$ 88051 136939 112371 23934 -79736 -138782 -119574 -36802 63809 129534 123878 47656 -57734
448e7734p2952r77P0449J01556P6784J1226o0676r9482q3711k1699N2677R8128
$$ -57734 -130686 -131663 -61214 40342 117126 128352 67676 -31806 -115517 -137216 -84539 13589
460A3589Q8167L0611m4494r5253r2551l7836L6693R0799R3584M6757k6271q5512
$$ 13589 101756 132367 87873 -7380 -99931 -137767 -101074 -10275 83309 130066 103795 18283
472A8283r6723n5233J8459Q1122R8599O0509r837p3741r6532o7463j431O6991
$$ 18283 -78440 -133673 -115214 -34092 64507 125016 115179 41438 -55094 -122557 -123988 -56997
484e6997R7914P3884J0038n8165r6475q1920j8965N5478R5436Q0887K5801m2198
$$ -56997 40917 114801 124839 66674 -29801 -111721 -130686 -75208 20228 101115 126916 84718
496H4718q9329q8181l6193L6207Q6198Q8961M5906k5207q5455r3968m9111K0394
$$ 84718 -4611 -92792 -128985 -92778 -6580 82381 128287 103080 17625 -76343 -125454 -105060
508a05060P5113R1153N9909q331p2383r4198o3465p97O3129R5878P2272N230o1390
$$ -105060 -29947 61206 121115 112784 40401 -53797 -117262 -118059 -54930 40948 113220 118450 57060
521E7060q9082p2599j8654M8720R1058P9474K3389m0793q4009q6449l7124L8094
$$ 57060 -32022 -104621 -123275 -74555 16503 95977 119366 78573 -5436 -91885 -129009 -90915
533i0915Q7635Q3064L7349k3430p5932r1205n0116K1373P5570Q6110N4713n934
$$ -90915 -3280 79784 117133 93703 17771 -73434 -123550 -102177 -26607 59503 114216 108282
545A08282o9458r3156n8457M952N9813Q5984O9888J0005n9661q9716o8041j4938
$$ 108282 38824 -54332 -112789 -107837 -48024 37960 107848 117853 58192 -31524 -99565 -114503
557a14503M5966Q8974P9740J9633m8003q0096p3400l3237K8856Q3965Q6442L4574
$$ -114503 -68537 20437 100177 119810 71807 -8289 -81689 -114926 -86070 -2105 84337 118911
569A18911l0094p3912q3222m7979K1976P6681Q0701M5452p047o1207r0369o3657
$$ 118911 88817 14905 -68317 -116296 -94320 -17639 63062 108514 101467 40260 -50109 -113766
581a13766Q187O7437Q2317N9731P155n7459r0838o3647k569M7926P3457P1130
$$ -113766 -105579 -38142 44175 103906 111061 53602 -37236 -100883 -103452 -55526 17931 89061
593H9061K7233m2564q6132p4581k5578L3906Q1811Q3579K9258l8437p2159o8876
$$ 89061 116294 73730 -12402 -86983 -112561 -78655 3156 86735 115993 77556 5397 -63479
605f3479m1551J2169P2722Q9178M4326j8461o3576q0292n8337P502P2129Q3142
$$ -63479 -105030 -92861 -20139 69039 113365 94904 31328 -48964 -107301 -99799 -27670 55472
617E5472M5626j500m5925p8971o9091r479N4259P9846O6609K0987m6198r0890
$$ 55472 101098 99598 53673 -25298 -94389 -103868 -49609 30237 96846 117833 71635 -19255
629a9255p0052p578M1222O3707O8446L7774k7776p9782p5783l2181J9868O7798
$$ -19255 -89307 -96885 -55663 8044 76490 114264 86488 6706 -69077 -101258 -81390 -13592
641a3592Q4846M5021k7095p1140o9709m3682L133N9695Q4214M9878p486n0295
$$ -13592 71254 116275 89180 18040 -51669 -95351 -92218 -32523 51691 101569 94083 43788
653D3788p4645o7399j0608O3077Q5272M9403L647l4929o9777p3207k2863M4442
$$ 43788 -30857 -98256 -108864 -45787 39485 88888 92535 57606 -12171 -85378 -108241 -63799
665f3799P4851O3508K9033k6545p8464p7803k4523L1968O1881O9654M5163j8438
$$ -63799 11052 74560 103593 77048 -1416 -79219 -103742 -71774 -9893 59761 104924 86486
677H6486p2882p2523l4054P647N1565Q1775N8615j2259o5159o7767m5136r527
$$ 86486 13604 -58919 -92973 -85326 -33761 48014 106629 94370 29211 -38556 -83692 -93219
689i3219M4546Q2822O1610K841m5265o7241o5528k3078M6313Q0065N6302J4616
$$ -93219 -48673 34149 95759 98600 53335 -13906 -79434 -102512 -56199 23866 80168 94784
701I4784k2391o2032p9389l5732L6949P2136O0600L2979j1235o5774q1853l5835
$$ 94784 72393 10361 -69028 -104760 -67811 4325 64925 97904 86669 20895 -60958 -96793
713i6793K4135N4159O2074N0478N06o0033p8225m5334j75M4309P7059O2145j451
$$ -96793 -72658 -18499 43575 94053 94559 34526 -43699 -89033 -89208 -44899 32160 94305 92854
726I2854n6699o2954m6033k1691K6757P8089P2197J2584m1049o2268o3121l4329
$$ 92854 36155 -26799 -72832 -94523 -67766 10323 82520 95104 54055 -8213 -71334 -105663
738a05663L1342P7099O3568J7442j9020n0785p2044m4863J9861O4412O3299M0738
$$ -105663 -74321 2778 66346 83788 64768 13983 -58061 -102924 -83063 -18651 44648 85386
750H5386N00n6767q3617m4054J9140M8844N4857N1415J6763m5893p7102n2524
$$ 85386 85886 29119 -54498 -98552 -79412 -30568 24289 75704 92467 46574 -30528 -83052
762h3052o785L3463O8519P0261J7031m8865o7526m9087k1803J9760O7992P1854
$$ -83052 -89837 -56374 12145 82406 99437 50572 -16954 -66041 -87844 -68084 -92 71762
774G1762K1114l0264n1992o0324m5957J3745P3460P1563K2522j6566m0877o4237
$$ 71762 92876 62612 10620 -49704 -95661 -81916 -8456 63107 85629 69063 28186 -36051
786c6051n3461N072N7106O3657M2287R768m0641p8961n8004L511M5916N6682N3141
$$ -36051 -89512 -84440 -27334 36323 78610 88378 47737 -31224 -89228 -85717 -39801 16881 70022
799G0022K2485l7936p4168n3874r914K2646N3391O9758L4106l4467o7712n3272
$$ 70022 92507 54571 -19597 -73471 -83385 -60739 -7348 62410 96516 62049 -5663 -58935
811e8935k5971Q861N5923P3186L4142k1881m8717n4766m7345l833N6399P3662
$$ -58935 -84906 -76045 -20122 53064 87206 65325 16608 -38158 -85503 -89336 -32937 40725
823D0725L6453m606l3968o0924o1871q968N1663O4833M3071J4926k4924o7638
$$ 40725 77178 72572 38604 -22320 -84191 -93159 -41496 23337 66408 81334 56410 -11228
835a1228o5802j2712L8489N4980N3294L1851k2358o8308o0349j7394J7787M3831
$$ -11228 -77030 -89742 -51253 3727 57021 88872 66514 -1794 -62143 -79537 -61750 -17919
$$ [...]
8191c5
##END NTUPLES=NMR FID
##END=
