##TITLE=1H_Pr 5-4-22
 CDCl3, 8 sc, 
 3.7.2019
##JCAMPDX= 6.0         $$ Bruker NMR JCAMP-DX V2.0
##DATA TYPE= NMR FID
##DATA CLASS= NTUPLES
##ORIGIN= UXNMR, Bruker Analytische Messtechnik GmbH
##OWNER= root
$$ XWIN-NMR		Version 3.5
$$ Wed Jul  3 15:37:52 2019 Russian Standard Time (UT+4h)  she@DPX200
##.OBSERVE FREQUENCY= 200.13155
##.OBSERVE NUCLEUS= ^1H
##.DELAY= (6, 6)
##.ACQUISITION MODE= SIMULTANEOUS
##.ACQUISITION SCHEME= undefined
##.AVERAGES= 8
##.DIGITISER RES= 18
##SPECTROMETER/DATA SYSTEM= spect
##.PULSE SEQUENCE= zg30
##.SOLVENT NAME= THF
##.SHIFT REFERENCE= (INTERNAL, THF, 0, 15.7039)
##AUDIT TRAIL= $$ (NUMBER, WHEN, WHO, WHERE, WHAT)
$$ ##TITLE= Audit trail, XWIN-NMR		Version 3.5
$$ ##JCAMPDX= 5.01
$$ ##ORIGIN= Bruker BioSpin GmbH
$$ ##OWNER= she
$$ F:/spectra/data/she/nmr/H-F/1/audita.txt
$$ ##AUDIT TRAIL=  $$ (NUMBER, WHEN, WHO, WHERE, WHAT)
(   1,<2019-07-03 15:36:24.03 +0400>,<she>,<DPX200>,
      <created by zg, POWCHK disabled, PULCHK disabled
       configuration hash MD5:
       00 E9 B6 7A A2 85 ED C7 34 08 36 98 17 FE 4E 26
       data hash MD5: 16K
       AA CF 38 1D 25 8A 2F 4C 9D 0C 83 FB 64 9F 6C 91>)
$$ ##END=
$$ 
$$ hash MD5
$$ 1B 6A 12 B8 82 F2 7A 18 5F 95 A9 69 85 6B C8 FD
##$RELAX= 
##$RELAX= 
##$RELAX= 
##$RELAX= 
##$RELAX= 
##$RELAX= 
$$ Bruker specific parameters
$$ --------------------------
##$DU= <F:/spectra>
##$EXPNO= 1
##$NAME= <H-F>
##$PROCNO= 1
##$TYPE= <nmr>
##$USER= <she>
##$AMP= (0..31)
100 100 100 100 100 100 100 100 100 100 100 100 100 100 100 100 100 100 
100 100 100 100 100 100 100 100 100 100 100 100 100 100 
##$AQSEQ= 0
##$AQ_mod= 1
##$AUNM= <au_zg>
##$AUTOPOS= <>
##$BF1= 200.13
##$BF2= 200.13
##$BF3= 200.13
##$BF4= 200.13
##$BF5= 200.13
##$BF6= 200.13
##$BF7= 200.13
##$BF8= 200.13
##$BYTORDA= 1
##$CFDGTYP= 0
##$CFRGTYP= 5
##$CHEMSTR= <none>
##$CNST= (0..31)
1 1 145 1 1 1 1 1 1 1 1 1 1 1 1 1 1 1 1 1 1 1 1 1 1 1 1 1 1 1 1 1 
##$CPDPRG= <>
##$CPDPRG1= <>
##$CPDPRG2= <>
##$CPDPRG3= <>
##$CPDPRG4= <mlev>
##$CPDPRG5= <mlev>
##$CPDPRG6= <mlev>
##$CPDPRG7= <mlev>
##$CPDPRG8= <mlev>
##$CPDPRGB= <>
##$CPDPRGT= <>
##$D= (0..31)
0 1.2 0 0 0 0 0 0 0 0 0 0.03 0 0 0 0 0 0 0 0 0 0 0 0 0 0 0 0 0 0 0 0 
##$DATE= 1562153783
##$DBL= (0..7)
120 120 120 120 120 120 120 120 
##$DBP= (0..7)
150 150 150 150 150 150 150 150 
##$DBP07= 0
##$DBPNAM0= <>
##$DBPNAM1= <>
##$DBPNAM2= <>
##$DBPNAM3= <>
##$DBPNAM4= <>
##$DBPNAM5= <>
##$DBPNAM6= <>
##$DBPNAM7= <>
##$DBPOAL= (0..7)
0.5 0.5 0.5 0.5 0.5 0.5 0.5 0.5 
##$DBPOFFS= (0..7)
0 0 0 0 0 0 0 0 
##$DE= 6
##$DECBNUC= <off>
##$DECIM= 24
##$DECNUC= <off>
##$DECSTAT= 4
##$DIGMOD= 1
##$DIGTYP= 9
##$DL= (0..7)
0 120 120 120 120 120 120 120 
##$DP= (0..7)
150 150 150 150 150 150 150 150 
##$DP07= 0
##$DPNAME0= <>
##$DPNAME1= <>
##$DPNAME2= <>
##$DPNAME3= <>
##$DPNAME4= <>
##$DPNAME5= <>
##$DPNAME6= <>
##$DPNAME7= <>
##$DPOAL= (0..7)
0.5 0.5 0.5 0.5 0.5 0.5 0.5 0.5 
##$DPOFFS= (0..7)
0 0 0 0 0 0 0 0 
##$DQDMODE= 0
##$DR= 18
##$DS= 0
##$DSLIST= <SSSSSSSSSSSSSSS>
##$DSPFIRM= 0
$$ [...]
##$SUBNAM2= <"">
##$SUBNAM3= <"">
##$SUBNAM4= <"">
##$SUBNAM5= <"">
##$SUBNAM6= <"">
##$SUBNAM7= <"">
##$SUBNAM8= <"">
##$SUBNAM9= <"">
##$SW= 24.9336996594482
##$SWIBOX= (0..15)
0 0 2 0 0 0 0 0 0 0 0 0 0 0 0 0 
##$SW_h= 4990.01996007984
##$TD= 16384
##$TD0= 1
##$TE= 0
##$TE2= 300
##$TE3= 300
##$TEG= 300
##$TL= (0..7)
0 120 120 120 120 120 120 120 
##$TP= (0..7)
150 150 150 150 150 150 150 150 
##$TP07= 0
##$TPNAME0= <>
##$TPNAME1= <>
##$TPNAME2= <>
##$TPNAME3= <>
##$TPNAME4= <>
##$TPNAME5= <>
##$TPNAME6= <>
##$TPNAME7= <>
##$TPOAL= (0..7)
0.5 0.5 0.5 0.5 0.5 0.5 0.5 0.5 
##$TPOFFS= (0..7)
0 0 0 0 0 0 0 0 
##$TUNHIN= 0
##$TUNHOUT= 0
##$TUNXOUT= 0
##$USERA1= <user>
##$USERA2= <user>
##$USERA3= <user>
##$USERA4= <user>
##$USERA5= <user>
##$V9= 5
##$VALIST= <valist>
##$VCLIST= <CCCCCCCCCCCCCCC>
##$VD= 0
##$VDLIST= <DDDDDDDDDDDDDDD>
##$VPLIST= <PPPPPPPPPPPPPPP>
##$VTLIST= <TTTTTTTTTTTTTTT>
##$WBST= 1024
##$WBSW= 4
##$XGAIN= (0..3)
0 0 0 0 
##$XL= 0
##$YL= 0
##$YMAX_a= 172932
##$YMIN_a= -311091
##$ZGOPTNS= <>
##$ZL1= 120
##$ZL2= 120
##$ZL3= 120
##$ZL4= 120
##$ABSF1= 10
##$ABSF2= 0
##$ABSG= 5
##$ABSL= 3
##$ALPHA= 0
##$AQORDER= 0
##$ASSFAC= 0
##$ASSFACI= 0
##$ASSFACX= 0
##$ASSWID= 0
##$AUNMP= <proc_1d>
##$AZFE= 0.1
##$AZFW= 0.1
##$BCFW= 1
##$BC_mod= 2
##$BYTORDP= 1
##$COROFFS= 0
##$CY= 11.3945322036743
##$DATMOD= 1
##$DC= 2
##$DFILT= <>
##$DTYPP= 0
##$F1P= 18.9103706918063
##$F2P= -1.10871071338519
##$FCOR= 0.5
##$FTSIZE= 0
##$FT_mod= 4
##$GAMMA= 1
##$GB= 0.15
##$INTBC= 1
##$INTSCL= 1
##$ISEN= 128
##$LB= 0.24
##$LEV0= 0
##$LPBIN= 0
##$MAXI= 10000
##$MC2= 0
##$MEAN= 0
##$ME_mod= 0
##$MI= 1.114404
##$NCOEF= 0
##$NC_proc= 0
##$NLEV= 6
##$NOISF1= 3.799351
##$NOISF2= 2.8
##$NSP= 1
##$NTH_PI= 0
##$NZP= 0
##$OFFSET= 15.70392
##$PC= 1
##$PHC0= -8503.279
##$PHC1= 16.60097
##$PH_mod= 1
##$PKNL= yes
##$PPARMOD= 0
##$PSCAL= 0
##$PSIGN= 0
##$REVERSE= no
##$SF= 200.130013532006
##$SI= 16384
##$SIGF1= 3
##$SIGF2= 2
##$SINO= 400
##$SIOLD= 16384
##$SREGLST= <1H.CDCl3>
##$SSB= 0
##$STSI= 0
##$STSR= 0
##$SW_p= 3612.71676300578
##$SYMM= 0
##$S_DEV= 0
##$TDeff= 0
##$TDoff= 0
##$TI= <>
##$TILT= no
##$TM1= 0
##$TM2= 0
##$TOPLEV= 0
##$USERP1= <user>
##$USERP2= <user>
##$USERP3= <user>
##$USERP4= <user>
##$USERP5= <user>
##$WDW= 1
##$XDIM= 8192
##$YMAX_p= 0
##$YMIN_p= 0
$$ End of Bruker specific parameters
$$ ---------------------------------
##NTUPLES= NMR FID
##VAR_NAME=  TIME,          FID/REAL,        FID/IMAG
##SYMBOL=    X,             R,               I
##VAR_TYPE=  INDEPENDENT,   DEPENDENT,       DEPENDENT
##VAR_FORM=  AFFN,          ASDF,            ASDF
##VAR_DIM=   8192,          8192,            8192
##UNITS=     SECONDS,       ARBITRARY UNITS, ARBITRARY UNITS
##FACTOR=    0.0002004,     1,               1
##FIRST=     0,             0,               0
##LAST=      1.6414764,     0,               0
##MIN=       0,             -311091,         0
##MAX=       1.6414764,     172932,          0
$$ Real data points
##PAGE= N=1
##DATA TABLE= (X++(R..R)), XYDATA
0@%%%%%%JrJ6j6K4l2M0m9N7p2Q8j05J29j53J78k10K42k81L26l74M25m82N50o23
$$ 0 0 0 0 0 0 0 1 -8 8 -8 16 -16 24 -25 32 -40 48 -57 72 -81 97 -113 129 -152 174 -200 225 -257 293 -330
30c30P03p94Q92r97J114j242J382j536J705j893K097k321K569k845L153l494L878
$$ -330 373 -421 471 -526 588 -654 728 -808 897 -996 1101 -1220 1349 -1496 1657 -1837 2041
47B041m313M810n384O054o853P818r014J0547j2592J5473j9868K7489m4390J48073
$$ 2041 -2272 2538 -2846 3208 -3645 4173 -4841 5706 -6886 8587 -11281 16208 -28182 119891
61A19891p2371k48816J96629J77599m9817j62733K5439P9441p52m8402M9582J7510
$$ 119891 47520 -201296 -4667 172932 123115 -39618 -14179 65262 64510 16108 65690 83200
73H3200j05619q6800J10772J21288o0167j20415L7194R6967j6697r6390j1966
$$ 83200 -22419 -109219 1553 122841 62674 -57741 -20547 76420 59723 -36667 -48633
84d8633O4229K2487m5546p866L9283K261l2377J6907K2262n0581m7000N6456P4657
$$ -48633 15596 38083 -7463 -15329 23954 26215 -6162 10745 33007 -17574 -64574 -8118 66539
97F6539k4751p1982J397N8062R760m6508k622M6773j4184o9726K0248J07123J7449
$$ 66539 41788 -30194 -28797 29265 39025 -7483 -10105 36668 22484 -47242 -26994 80129 97578
110I7578j10009o6074O8523Q9971j3865p8951k4787M1028K1137j0964J1966J0009
$$ 97578 -12431 -78505 -9982 79989 66124 -12827 -37614 3414 24551 13587 25553 35562
122C5562m4345l7999M2278N9773j6835o8122k5206M6652M7735j7348m2791N846
$$ 35562 -8783 -46782 -4504 55269 38434 -29688 -54894 -8242 39493 22145 -20646 -14800
134a4800K9958r624l2166l172K4556K1210o206k9321q490L4779K8623k3261m6412
$$ -14800 15158 5534 -26632 -29804 -5248 15962 9756 -19565 -28055 6724 35347 12086 -34326
147c4326j9041K7316M9720J6162l4689k7600J6061K2358m056j6570j2304K527
$$ -34326 -53367 -26051 23669 39831 5142 -22458 -6397 15961 11905 -4665 -16969 -14442
159a4442K0401J8278L039l701r707j0801L009L478j6771n094L5293L0657j9671
$$ -14442 5959 24237 27276 23575 13868 3067 6076 9554 -7217 -12311 22982 53639 33968
172C3968m0329o106L6454K7299l4102n8503M087O4091L7459k4039m3040j9444
$$ 33968 -6361 -12467 23987 51286 17184 -41319 -37232 26859 64318 40279 -2761 -22205
184b2205J3717K4629M60k0538j1417J755J0454K3662J3670k5546l8557p408K3650
$$ -22205 -8488 16141 16601 -3937 -15354 -13599 -3145 20517 34187 8641 -29916 -37324 -13674
197a3674K3625j454k1352n270K0105Q029j3214l518K446j4613q491K1068K2690
$$ -13674 9951 8497 -12855 -18125 1980 10009 -3205 -6723 -4277 -18890 -27381 -6313 16377
210A6377l789j8063o471J3793J1240j4086j6310J0346J6039r38l203K21n357O163
$$ 16377 12588 -5475 -11946 1847 13087 -999 -17309 -6963 9076 8138 4935 5156 -201 5962
224E962J9051m424l1694j2433K7979L3057n087l8610j5658L3581L0227j5362k8204
$$ 5962 25013 20589 -11105 -23538 4441 37498 32411 -6199 -21857 11724 41951 26589 -1615
237a615r116J524J2222K4412M178k6829j9635J5549K8722J029l3444k3904K0291
$$ -1615 -10731 -9207 3015 27427 31605 4776 -14859 690 29412 30441 -3003 -26907 -6616
250f616K8902m422j3914N238M823o890m151j005k962J846M645K125K497J326P14
$$ -6616 22286 17864 3950 9188 14011 7121 2970 1965 -997 849 5494 7619 10116 11442 12156
265A2156M060m015j9055o181J7830J1417o262j801N282Q95j734l750p243k348
$$ 12156 16216 12201 -6854 -13035 4795 16212 9950 8149 13431 14326 12592 8842 1599 -749
279g49K315J753O567Q204j851l144K695q273j4604L022J3027J388m486L78L371
$$ -749 1566 3319 9886 18090 16239 13095 15790 7517 -7087 -4065 8962 10350 5864 6242 9613
294I613O346J653j2914j3692j98O333P762P483m027q112M821O511q760r543J055
$$ 9613 15959 17612 4698 -8994 -9192 -2859 4903 12386 8359 247 5068 11579 2819 -6724 -5669
309e669O12N02O639M745O23n79n057o331R5L89k601M948M411n183J990J1555j305
$$ -5669 -5057 -4555 2084 6829 7452 6873 1816 -4515 -4420 -4031 -6632 -1684 2727 -2456 -466 11089 9784
326I784j3844m554K778J797K842J429m06L621K825k565r45k660q727l07J0466
$$ 9784 -4060 -8614 -5836 -4039 -1197 232 -174 3447 6272 3707 2762 102 -8625 -8932 1534
341A534j67o097P108R145m543q109k683q09Q76P70j428K583N602m95Q32L109q547
$$ 1534 1367 -4730 2378 11523 6980 -1129 -3812 -4621 -3745 -2975 -4403 -1820 3782 3287 4119 7228 -1319
358a319j1626N245Q667m557k653P611M803j501k964m412k143L2l805Q75Q688K321
$$ -1319 -12945 -7700 967 -3590 -6243 1368 6171 4670 1706 -2706 -4849 -4817 -8622 -7747 941 3262
374C262l465N101K940j0710o525N358J136l927J829N592M662J979n057n201O48
$$ 3262 -203 4898 7838 -2872 -9397 -4039 -2903 -6830 -5001 591 5253 7232 2175 -3026 -2378
389b378k493n977M277Q004j935K8P290j130q831k395L27k430K61K300L358O211
$$ -2378 -4871 -10848 -6571 1433 -502 -474 6816 5686 -3145 -5540 -5213 -7643 -7382 -5082 -1724 4487
405D487O63o244j061J640p050m660N922K262r42N119M407l796m122j218l153q65
$$ 4487 5150 -1094 -2155 -515 -7565 -12225 -6303 -4041 -4983 136 4543 747 -3375 -4593 -7746 -8611
421h611k41r40N526P708k761l449L241k162q242R0L574j565J770O775K166j203
$$ -8611 -8852 -9792 -4266 3442 681 -2768 473 -1689 -9931 -9841 -6267 -7832 -6062 713 2879 1676
437A676k183m127j770Q52l916o86Q376L668l910L126L827p218p030J641R38o61
$$ 1676 -507 -4634 -6404 -5552 -9468 -10154 -1778 1890 -2020 1106 4933 -2285 -9315 -7674 -6736 -7397
453g397K884K406K974K363k906m180J115l615p004M617Q828k190k146O043J818
$$ -7397 -4513 -2107 867 3230 324 -3856 -2741 -6356 -13360 -8743 85 -2105 -4251 1792 3610
468C610n454l964k163j364J742J069K273N350O06m603J720K075r202o379P271
$$ 3610 -1844 -5808 -7971 -9335 -7593 -6524 -4251 1099 1705 -2898 -1178 897 -8305 -14684 -7413
483g413N654j664J546L621j15m13j417m655k235p67J228Q091O538o267m554P744
$$ -7413 -1759 -3423 -1877 1744 1629 1216 -201 -4856 -7091 -7858 -6630 1461 7999 1732 -2822 4922
499D922K645r227n267J375J907N099N957o19l045j090OJ834j509r419l240J2425
$$ 4922 7567 -1660 -6927 -5552 -3645 1454 7411 6792 3747 2657 2663 4497 2988 -6431 -9671 2754
515B754R285l988l697r4j786P76J457o624o373M596R628O169k175j0190m472P629
$$ 2754 12039 8051 4354 4260 2474 3250 4707 -1917 -8290 -3694 5934 12103 9928 -262 -4734 2895
531B895K131j0083m403M561L239M202N592l915r365k941L044K455p07o357j939
$$ 2895 5026 -5057 -9460 -4899 -1660 2542 8134 4219 -5146 -8087 -5043 -2588 -3295 -9652 -11591
546a1591J0847Q555m873p457k542k625J156M685k340m577M778O959J218j766n299
$$ -11591 -744 7811 2938 -4519 -7061 -9686 -8530 -3845 -6185 -10762 -5984 975 2193 427 -4872
561d872o760q5M111J948J936M6m044L426J0911k618j6080n824Q005P406J287m145
$$ -4872 -11632 -11717 -7606 -5658 -3722 -3676 -7720 -4294 6617 3999 -12081 -17905 -9900 -2494 -1207 -5352
577e352l332N265O743k692p226m892l641L032R628J999o948q14N520J51k874l860
$$ -5352 -8684 -3419 3324 632 -6594 -11486 -15127 -12095 -2467 -468 -7416 -8230 -2710 -2559 -5433 -9293
593i293o939j206Q630O948j452n074k357O505N956j0597j5163O825J6779j007
$$ -9293 -16232 -17438 -8808 -1860 -3312 -8386 -10743 -4238 1718 -8879 -24042 -17217 -438 -1445
607a445j1015K056J0574K347p820r578R79O638J04k173O058L605m286R49M878
$$ -1445 -12460 -10404 170 2517 -5303 -14881 -13902 -7264 -7160 -9333 -3275 330 -3956 -3007 1871
622A871n774r613Q60Q046N565O00m166j261P289M407p342j0584l860O998J4570
$$ 1871 -3903 -13516 -12656 -4610 955 1555 -2611 -3872 3417 7824 482 -10102 -13962 -6964 7606
637G606L364j5397p483J5474J0887j2063j5666j158R224P069n07k799J746l57
$$ 7606 10970 -4427 -11910 3564 14451 2388 -13278 -14436 -5212 1857 1350 -1449 297 -60
651f0o209J506O533o794j2403K769J2671O971j943q383p474M078P410l334q570
$$ -60 -6269 -4763 1770 -5024 -17427 -14658 -1987 4984 3041 -5342 -12816 -8738 -1328 -4662 -13232
666a3232k497N420Q803M511n526o052O49j588k982O792N309j0737o465J5967J7971
$$ -13232 -15729 -10309 -1506 3005 -2521 -8573 -7924 -9512 -12494 -5702 -393 -11130 -17595 -1628 16343
681A6343o959k4756q927K0980K0685j3213k5137M639K5878J0096j0564j4337p444
$$ 16343 9384 -15372 -24299 -3319 17366 4153 -20984 -16345 9533 19629 9065 -5272 -12716
694a2716N263J2568N033p917j0977r49J5482J6639p754k5018q037J4444J3718
$$ -12716 -7453 5115 10148 2231 -8746 -9695 5787 22426 14672 -10346 -18383 -3939 9779
707I779J56j0250r854N182J7927M971j6459j6685J753J5441Q416j0573j0939J0656
$$ 9779 9935 -315 -10169 -4987 12940 17911 1452 -15233 -13480 1961 10377 -196 -11135 -479
721d79J5366p650j5759R71Q372j656o133K175R895M658q331n552Q082M066j3195
$$ -479 14887 7237 -8522 -7551 821 -835 -6968 -4793 5102 9760 1429 -4123 3959 8025 -5170
736e170p785J1295J0618l091n126J995M594j361p609k035O672q54r901L659J7805
$$ -5170 -12955 -1660 8958 5867 741 2736 7330 5969 -1640 -3675 2997 2143 -7758 -4099 13706
751A3706L623j5046j1510L449J0669K722j0644q950O782J2119L301m065q928q510
$$ 13706 17329 2283 -9227 -5778 4891 7613 -3031 -11981 -5199 6920 10221 6156 -2772 -11282
765a1282L694R229l673r537M206J0171k16p849k845M729K239j0248q817R870J2643
$$ -11282 -7588 1641 -2032 -11569 -7363 2808 2592 -5257 -8102 -3373 -1134 -11382 -20199 -10329 2314
780B314m040p219M226R08q314l47R118o58j3169n202J6755J8622r294k4857OK2237
$$ 2314 -1726 -8945 -4719 -3811 -12125 -12472 -3354 -4012 -17181 -22383 -5628 12994 3700 -21157 -21151 1086
796A086M015j8225q582J0485J2483L296o016q055p8O249M100l960r710m443J4154
$$ 1086 5101 -13124 -21706 -11221 1262 4558 -1458 -9513 -9591 -3342 758 -3202 -12912 -17355 -3201
811c201J7518n281j8986l304J0965O611k917p739o971L817J3336R362m610j4855
$$ -3201 14317 9036 -9950 -13254 -2289 4322 1405 -6334 -13305 -9488 3848 13210 8600 -6255
825f255j0046R214J5506l729j6068k96J3456N723l568l311k719k579k383q68N968
$$ -6255 -16301 -7087 8419 4690 -11378 -11674 1782 7505 3937 626 -2093 -4672 -7055 -7923 -1955
840a955O552l203o057L121N993m83m459o540m412O229J0955M50o231j088L159
$$ -1955 4597 1394 -4663 -1542 4451 3968 -491 -7031 -11443 -5214 5741 6191 -40 -1128 2031
855B031K714j651p388m994N921Q461J848k621l955j980O443O004j0005j4534K361
$$ 2031 4745 3094 -4294 -9288 -3367 5094 6942 4321 366 -1614 4829 10833 828 -13706 -11345
870a1345J6024J0022n378j3745m451J1917R437p595j3781l643P853J2784N517
$$ -11345 4679 14701 9323 -4422 -8873 3044 12481 4886 -8895 -12538 -4685 8099 13616
883A3616j0054j0460M368P968k201o669l021J973N491L608j522r91K87k695k724
$$ 13616 3562 -6898 -2530 5438 3237 -3432 -6453 -4480 1011 4619 3097 2106 2393 -302 -3026
898c026l37j968N95P643K966o826k535O264K789n166p572k601O319P774l84m109
$$ -3026 -3363 -5331 -4736 2907 5873 -953 -3488 2776 5565 399 -7173 -9774 -3455 4319 3935 -174
914a74N26J267m33k58l561n258L221Q048n13n353J437N852Q22n907q179n44Q385
$$ -174 352 1619 1186 928 -2633 -7891 -4670 3378 2865 -2488 -1051 4801 5623 -284 -8463 -9007 -622
931f22M586l311k028J078Q82L328K143q176r159M065R687K993l121l137J280M196
$$ -622 3964 653 -1375 -297 585 3913 6056 -2120 -11279 -7214 2473 5466 2345 -792 488 4684
947D684j451o635j152L023r6M50M003J324r81J682k520p211j923N521M121o86
$$ 4684 3233 -3402 -4554 -1531 -1627 -1177 2826 4150 3169 4851 2331 -4880 -6803 -1282 2839 2153
963B153l215n76O316M721o802q343K45K544J906L745K73l685J359M618j175o318
$$ 2153 -1062 -1638 4678 9399 2597 -5746 -5501 -2957 -1051 2694 2967 -718 641 5259 4084 -2234
979b234l661J400M367K189l814k16P074J992o744m299R0r7K708L265j908k137
$$ -2234 -5895 -4495 -128 2061 -1753 -1969 5105 7097 353 -3946 -3856 -3953 -1245 2020 112 -2025
995b025L624M562l37n610o808L98P443K435m368Q12N274r5k857r38k377k167J918
$$ -2025 1599 6161 5824 214 -6594 -6196 1247 3682 -686 126 5400 5305 2448 1510 -867 -3034 -1116
1012a116J909K17J667J508J273N60m845o254K473O159k261l945L007M388J264
$$ -1116 793 1010 2677 4185 5458 6018 1173 -5081 -2608 3551 1290 -2655 352 4740 6004
1027F004j192l672m527K28J832J83J271O76k55K443K121m600m737J376J136k128
$$ 6004 4812 1140 -3387 -3159 -1327 -1144 127 803 548 2991 5112 512 -4225 -2849 -1713 -3841
1043c841O63K957J623K121l31m707k396J102J54m22O78j16K066N614q42n935j543
$$ -3841 -3178 -221 1402 3523 3192 -1515 -3911 -2809 -2655 -3077 -2399 -2515 -449 5165 4323 -1612 -3155
1060c155J166j404jK137J58J235L529O27k988k181k017K64K071j174j343N087
$$ -3155 -1989 -3393 -3394 -1257 -1099 136 3665 4292 1304 -877 -2894 -2630 -559 -1733 -3076 2011
1076B011M885l352l532M38j256k808J289J307l7J626K213J413J25m245m791K078
$$ 2011 6896 3544 12 450 -806 -3614 -2325 -1018 -1055 571 2784 4197 4322 77 -4714 -2636
1092b636K648k941l41N862J774k976L3Q29k292l133j056J315L795J494j301J889
$$ -2636 12 -2929 -3270 2592 4366 1390 1423 2252 -40 -3173 -4229 -2914 881 2375 1074 2963
1108B963J666l986k908K607j043l626K541N684Q55j332n44m00Q8j693l630M50
$$ 2963 4629 643 -2265 342 -701 -4327 -1786 3898 4753 3421 2877 2477 2565 872 -2758 -2308
1124b308M409O38K28L331m33m521P51J560l642l153K186M034K905K22l302n53
$$ -2308 2101 2739 2967 6298 5865 1344 2095 3655 13 -3140 -954 3080 5985 6207 2905 2352
1140B352J830k291l868J274Q22n94M099L874k853l356P90K81k114j855n90K155
$$ 2352 4182 1891 -1977 -703 119 -475 3624 7498 4645 1289 2079 2360 246 -1609 -2199 -44
1156d4M824O58k205J33o41l259k8J585k908j113N612L387j275j455j986j358P09
$$ -44 4780 5438 3233 3366 2725 -534 -562 1023 -1885 -2998 2614 6001 4726 3271 1285 -73 636
1173F36p40j847J806J990M99K879J684m641m380J996Q72j784N49J955M85K529
$$ 636 -104 -1951 -145 1845 2344 5223 6907 2266 -2114 -118 754 -1030 -481 1474 1959 4488
1189D488J362k176k882k477j467L008K854k791j282N531K897l642l302j493j648
$$ 4488 5850 3674 792 -1685 -3152 -144 2710 -81 -1363 4168 7065 3423 121 -1372 -3020
1204c020J174K979J14n58J002J700J587r93o525l704M925L133k179K59K487l94
$$ -3020 -1846 1133 1247 689 1691 3391 4978 3985 -2540 -6244 -1319 1814 -365 -106 2381 1987
1220A987L21J490l280n265n23L306M153P65l684o60N723R59o969l505K302Q60
$$ 1987 2308 3798 518 -4747 -5270 -1964 2189 2954 -730 -1390 4333 5292 -1677 -5182 -2880 -2020
1236b020N70K820L52j034O73N17j357k415l605l93N136L332k811q22K785m64j625
$$ -2020 -1450 1370 1722 688 1361 1878 521 -1894 -5499 -5892 -756 2576 -235 -1057 1728 1264 -361
1253c61o97l115k941L820N406Q0k456j174J284K999k283o795p03N730K149n97
$$ -361 -1058 -4173 -7114 -3294 2112 2192 -264 -1438 -154 2845 562 -6233 -6936 -1206 943 346
1269C46J912k46k803M42J527k212k853j016K669O002K766m550l769K291J614j387
$$ 346 2258 2012 -791 -349 1178 -1034 -3887 -4903 -2234 3768 6534 1984 -1785 506 2120 733
1285G33j685l022q1O576N806l228n338l35J663J055j373l411l35M197K830J088
$$ 733 -952 -3974 -4055 2521 8327 5099 -239 -574 1089 2144 771 -2640 -2975 1222 4052 5140
1301E140J354m318p041K034P287q62o915j839O130P663Q03q012o616K632M484
$$ 5140 6494 2176 -4865 -2831 4456 3594 -3321 -5160 970 8633 9436 1424 -5192 -2560 1924
1316A924K85j376k492r73O071O313l233q025k634J706L863L120k395l974J850
$$ 1924 2209 833 -1659 -2632 3439 9752 6519 -1506 -4140 -2434 1429 4549 2154 -1820 30
1331C0N789L041k869q302n493O302R468k521q302O89P473L624l325o935l877L514
$$ 30 5819 8860 5991 -2311 -7804 -1502 7966 5445 -2857 -2168 5305 8929 5604 -1331 -5208 -1694
1347a694M204j30n66N83j103J085K876k013n589j956J173L630M438q15n279K20
$$ -1694 2510 2380 1814 2397 1294 2379 5255 3242 -2347 -4303 -3130 500 4938 4123 -1156 -936
1363i36N243k63n536l865Q95M103L157j881r35L010n01m759k72K670j902k569
$$ -936 4307 4044 -1492 -5357 -4462 -359 2798 917 -18 2992 2491 -2268 -2540 130 -1772 -4341
1379d341K352L755K570j83m111k319J957N84k306m75Q72J719M104J347n276k457
$$ -4341 -1989 1766 4336 4153 42 -2277 -320 264 -2042 -2517 -1645 74 4178 5525 249 -2208
1395b208L365l15m177J13L577K402J8j210P80J583l173n147K342M670k772k741
$$ -2208 1157 842 -3335 -3222 355 2757 2775 1565 2345 3928 755 -4392 -2050 2620 -152 -2893
1411b893N722M664m150n477J70L529K42n379k781O775O593k798n156l57O96M29
$$ -2893 2829 7493 3343 -2134 -1964 1565 1807 -3572 -6353 422 7015 4217 -939 -1296 -600 -171
1427a71Q11l002l911L168P266K140m184m812j290M168K062m468l000K559L233
$$ -171 640 -2362 -6273 -3105 4161 6301 2117 -2695 -3985 183 2245 -2223 -5223 -2664 569
1442E69K710K836l539q210j6P256J925n438m987L502R570L168p793p367K982M234
$$ 569 3279 6115 2576 -5634 -5650 1606 3531 -1907 -6894 -3392 6178 9346 1553 -5814 -2832 1402
1458A402n63j931p75m6L830L709j615l658k001j215L37K599O78j071N61J085Q16
$$ 1402 839 -1092 -1867 -1913 1917 5626 4011 353 -1648 -2863 -2526 73 751 -320 241 1326 2142
1475B142J533k704n837l40M605J279j235J791P66j588J3P73j209k317l097O59
$$ 2142 3675 971 -4866 -5206 -601 678 -557 1234 2000 412 425 1198 -11 -2328 -5425 -4766
1491d766O865L841m700m423K959K864j219l270l789j27O654N018k732m393o14
$$ -4766 2099 5940 1240 -3183 -224 2640 1421 -1849 -5638 -5765 889 5907 3175 -1218 -1832
1506a832K649K620k572o821k27P261L859j713j447j448j324J866J265l225l133
$$ -1832 817 3437 865 -5956 -6183 1078 4937 3224 1777 329 -995 871 2136 -1089 -4222
1521d222J500M568L662o75n497j297M125k27n046m73L290K215P59k45j706L53
$$ -4222 -2722 1846 5508 4833 -664 -1961 2164 1937 -3109 -3582 -292 1923 2682 2437 731 1084
1537A084R95k755l410N42K981K507J296k233k164K730J663m155l368P83J666K677
$$ 1084 2079 -676 -4086 -3544 -563 1944 3240 1007 -1157 1573 3236 -919 -4287 -3504 -1838 839
1553H39K447j683k738J550J966j530l655k111J360N645K591m199j810L341O54
$$ 839 3286 1603 -1135 415 2381 851 -2804 -4915 -3555 2090 4681 482 -1328 2013 2667
1568B667k465j926k003j59M664L685j831k662J26J810O61k922m581J263N839M49
$$ 2667 202 -1724 -3727 -3886 778 4463 2632 -30 96 1906 2567 -355 -4936 -3673 2166 2615
1584B615k464K107J388k677k108K86n94m38J431J160J242l8j010J225Q02n217
$$ 2615 151 2258 3646 969 -1139 -853 -1447 -1885 -454 706 1948 1910 900 2125 2927 -2290
1600b290m245M577N566k426l134J890L138N97k803m116p69K044J348J400J412
$$ -2290 -6535 -1958 3608 1182 -1952 -62 3076 3673 870 -3246 -4015 -1971 -623 777 2189
1615B189j783j462L950J456o220m550L589M307K70k334n62K763K739k498m558
$$ 2189 406 -1056 2894 4350 -1870 -6420 -2831 1476 1746 -588 -1150 1613 4352 1854 -2704
1630b704m43O99N62L312J473l405n12M228M86m426l458L65L243K126j072j055
$$ -2704 -3147 -2448 -1886 1426 2899 -506 -1018 3210 3696 -730 -4188 -3823 -580 1546 474 -581
1646e81K687J667l137k191rq46O16K158k14j115K682J778j691k756k347n19L372
$$ -581 2106 3773 636 -1555 -1564 -2410 -1794 364 150 -965 1717 3495 1804 -952 -3299 -3818 -446
1663d46J801k203p98L058J448l55k191l596j180L660J862k113m4K606J340o01
$$ -446 1355 -848 -1646 1412 2860 2505 314 -3282 -4462 -802 1060 -1053 -1097 1509 2849 2248
1679B248j996k903k16K156M00q90J368J051R91J493k315m985o5L594Q14j798M44
$$ 2248 252 -2651 -2867 -711 -311 -1201 167 1218 2209 3702 1387 -3598 -3663 -69 745 -1053 -609
1696f09J490K027O93k800l017L88N66l61J648Q10r67J367K538k259m040O0J552
$$ -609 881 2908 3601 801 -2216 -1828 -1262 -1623 25 835 -132 1235 3773 1514 -2526 -2466 -914
1713i14L9l78l86J923L105k4m012j346J043j276K31J505j17n10L049J748k460
$$ -914 -875 -1253 -1639 284 3389 3365 -647 -1993 -950 -2226 -1995 -490 -607 -1117 1932 3680 1220
1730A220k563j084K40J460n7j090K287K741j159j872L28j231j854R56J080r33
$$ 1220 -1343 -2427 -2187 -727 -784 -1874 413 3154 1995 123 451 -780 -2634 -1678 -598 -1531
1746a531J484K949K66j909j979j092J043R16k585j8L898J801j688l04j05k785
$$ -1531 -47 2902 3168 1259 -720 -1812 -769 147 -2438 -2456 1442 3243 1555 1251 1146 -1639
1762a639l97J195n05m77J471K069J341j004k922q72K175r40l167J291L738K24
$$ -1639 -2036 -841 -1346 -1823 -352 1717 3058 2054 -868 -1740 435 -505 -3672 -2381 1357 1581
1778A581oO35j597k047K63M98n20o56M81K395K932j272l918M42J878k134j933
$$ 1581 1575 2210 613 -1434 -1171 -673 -1193 -1849 -1368 1027 3959 2687 -1231 -789 1089 -1045 -2978
1795b978J888J596N60J365J83j475r98r66m79O84l02j035L051L374j975k741O53
$$ -2978 -1090 506 1066 2431 2614 1139 141 -825 -1304 -620 -922 -1957 1094 4468 2493 -248 405
1812D05J62j719l56N33j16J614J883P8p37j246k201L15J109j489r04L144J844
$$ 405 567 -1152 -1508 -975 -1091 523 2406 2484 1747 501 -1700 -1385 -276 -1765 -2669 475 2319
1829B319j195K14q8k044j422N84j50O62J252K25R50J527j734k386R2k13j096J677
$$ 2319 1124 1338 1250 -794 -2216 -1632 -1782 -1120 132 357 1307 2834 1100 -1286 -1194 -1407 -2503 -826
1847h26J971p14K34J635j43k103j515j025K67K042M68j57J690K89j431J70l00
$$ -826 1145 431 665 2300 2157 54 -1461 -2486 -2219 -177 291 134 1824 2113 682 852 552
1864E52l248j071L529J708p37J10L44J97L05j824k468J5J270O19K016J284k295
$$ 552 -2696 -3767 -238 1470 733 843 1187 1384 1689 -135 -2603 -2588 -1318 -699 1317 2601 306
1881C06q45K291l22l773j202J339J636J859P8p21K67L1j412l93l39j968K89M412
$$ 306 -539 1752 1430 -2343 -3545 -2206 -570 1289 1367 646 913 944 -468 -861 -1200 -3168 -2879 1533
1899A533J463k388o63J036m32j074j021j064P96K198J177P87j81k444p61J801
$$ 1533 2996 608 -55 981 549 -525 -1546 -2610 -1814 384 1561 2348 2167 -277 -1038 763
1915G63o91l180N93L143J097M06J72j399j414J20m17j65L88j044J167L820N44
$$ 763 72 -3108 -2515 628 1725 2131 2303 904 -510 -390 -807 -972 -584 -1628 -461 3359 3903
1932C903l512j622P35m30j30K49o43Q9K766J785j117k570j762j38K268p5k221
$$ 3903 391 -1231 -496 -926 -1056 -807 -1450 -1361 1405 3190 2073 -497 -2259 -2397 -129 -204 -2425
1949b425J122K833M45m00J29k481k428Q57K468R6j026j54J721K945p69m497j579
$$ -2425 -1303 1530 1975 1575 1704 -777 -3205 -2348 120 216 -810 -964 757 3702 2933 -1564 -3143
1966c143K222M48l43J158N84o53J764N96k165k283o77M68K060J059r46L27J687
$$ -3143 -921 -473 -816 342 926 273 2037 2633 468 -1815 -2492 -2024 36 1095 149 476 2163
1983B163m04j539p1j761k036K018L283m00j468N82J180j32j687k683R6K213K24
$$ 2163 1759 220 149 -1612 -3648 -1630 1653 1253 -215 367 1547 1415 -272 -2955 -2859 -646 -422
2000d22m03K392P32k175n70Q40j065j439q5R79J813J391n22r29K71n97j108m25
$$ -422 -825 1567 2299 124 -446 394 -671 -2110 -2195 -1216 597 1988 1466 537 808 211 -897 -1322
2018a322o2n34K375K227r77j446R77O0k289j007M60R60J434J98Q5J281l65l006
$$ -1322 -1384 -1918 457 2684 1707 261 1238 1298 -991 -1998 -1538 -578 856 1054 1139 2420 2055 -951
2036i51l75J525j276j631K163K537L97p45j407p05O63k83j929k42J639J477J477
$$ -951 -1326 199 -1077 -2708 -545 1992 2389 1644 237 -468 195 -88 -2017 -2259 -620 857 2334
2053B334J83k493j416J683P2k418k99J683R06J374R13r57j709j283k70J402P48
$$ 2334 2517 24 -1392 291 363 -2055 -2354 -671 235 1609 2522 1565 -144 -1427 -1697 -295 453
2070D53k133q81M181K953k632k709p03N62R26j97j291j04K482J542J25r13k446
$$ 453 -1680 -2561 1620 4573 1941 -768 -1471 -909 17 -180 -1471 -1575 907 2449 2574 1661 -785
2087g85j583J511J264j342L47J392O9P39J176j775l136p36J899J222K47r02J89
$$ -785 -2368 -857 407 -935 -588 804 873 1612 2788 1013 -2123 -2859 -960 262 509 -393 -204
2104b04K370N97k930j643P19m60o98K082J471m69k62J58n00N14j808k044R05K120
$$ -204 2166 2763 -167 -1810 -1091 -1551 -2249 -167 1304 835 573 731 231 745 -1063 -3107 -2202 -82
2122h2J352r1J06j471k40J896r09k974n26K283J950P14q4j336l51M14j180k29
$$ -82 1270 1179 1285 -186 -426 1470 561 -2413 -2939 -656 1294 2008 1924 588 237 651 -529 -758
2140g58j9j087L43M135J514l178j931P41P76q35j138p12J807K269N6p86J51j457
$$ -758 -777 -1864 -1521 2614 4128 950 -981 -240 536 -299 -1437 -2149 -342 1927 1983 1197 1348 -109
2158a09j240O70o4j678J311K740L86j353J20j20j002j138q47Q78J669M91p54J393
$$ -109 -1349 -679 -743 -2421 -1110 1630 2016 663 783 663 -339 -1477 -2324 -1446 223 714 -40 1353
2176A353P12k257j079Q12q96j753K037K686L33j062j266P86J150j594l035N06
$$ 1353 2065 -192 -1271 -459 -1355 -3108 -1071 1615 1948 886 -380 406 1556 -38 -3073 -2567
2192b567K812R79L52J74q84r89J055l54k013p87J235J729J728j52j963j18R43
$$ -2567 245 1224 1576 1750 866 -123 932 578 -1435 -2222 -987 742 2470 2318 355 237 1180
2209A180j320j322N26l07O94K084Q29j554m19K13r93j004n10O5J534J695m25q43
$$ 1180 -140 -1462 -936 -1243 -549 1535 2364 810 391 604 -389 -1393 -1903 -1838 -304 1391 966 123
2227A23J122n20j688p98j53Q6J510J533j091k53J445K3j759j418q41Q07K392N71
$$ 123 1245 725 -963 -1761 -1914 -1828 -318 1215 124 -129 1316 1339 -420 -1838 -2679 -1872 520 1091
2245A091j232P21R83p46n76q18k005M1K962J274p90q69L92J103j82k283k202J495
$$ 1091 -141 580 1563 817 241 -577 -2582 -2541 421 1695 905 36 428 1531 1349 -934 -3136 -1641
2263a641K440l85QQ43k89l95N71j303k302J74J832J168K50n62j01J330q5l071
$$ -1641 799 414 422 1265 976 581 1152 -151 -2453 -2279 -447 721 971 409 308 1638 1553 -1518
2281a518j238J504Q91j15Q47N94m92P95l7k058j381J58J290J484l7j150J040K096
$$ -1518 -2756 -1252 -361 -476 371 965 473 1268 1231 -827 -2208 -2050 -760 724 687 -463 577 2673
2299B673r24l249p10J205J79J264P87r86L64J628j8j829k164l92J791J923r77
$$ 2673 1749 -1500 -2210 -1005 -826 438 1225 239 603 2231 2213 384 -1780 -2172 -381 1542 565
2316E65j110K043J721j708j697q4p88j57K086M42m73J58P86N64q02k758j385K430
$$ 565 -545 1498 3219 1511 -186 -270 -1058 -1215 871 1313 840 998 1784 2348 1546 -1212 -2597 -167
2334a67J698j745l03K442P72j412j018j042n59R5O14N76O22j53K28J833j138l441
$$ -167 1531 -214 -517 1925 2697 1285 267 -775 -1334 -1239 -625 -49 573 420 648 2481 1343 -2098
2352b098p02K558N02j477K36K028Q94l86j392j618J18K15q7R96Q84q39R01K071
$$ -2098 -2800 -242 260 -1217 -981 1047 1941 1555 163 -1455 -1337 -1122 -1209 -213 671 -168 733 2804
2370B804j387l129k8J332J70o51M57Q25J917j90j875j065P4k95n4J039l17m00
$$ 2804 1417 -1712 -1740 -408 -238 -889 -432 393 2310 2120 245 -820 -746 -1041 -1095 -56 -373 -773
2388g73K240J387k030k075R0L00k5k52j97J009J981J23j255q14j086o44J198P94
$$ -773 1467 2854 824 -1251 -1161 -861 -886 -1138 -1335 -326 1655 1778 523 -291 -1377 -2021 -823 -29
2406b9j706N80K563J060j822j487o57N38M24o99l74J871J232l28K06q86k002l13
$$ -29 -1735 -1155 1408 2468 646 -841 -1498 -960 -536 -1235 -1609 262 1494 1166 1372 486 -1516 -1829
2424a829J828m33r56Q46J974Q03n82j727j064J086j46j195L88J639M23L66O71
$$ -1829 -1 -434 -1390 -544 1430 2233 1651 -76 -1140 -54 -200 -1395 -1007 632 1055 1421 2092
2441B092j280j937O50N33j072m41P11J569J691o10k206m42Q54n16j048N75M33
$$ 2092 812 -1125 -475 58 -1014 -1455 -744 825 2516 1906 -300 -742 112 -404 -1452 -877 -444
2458d44K98J827L59j539j193L23m97k42K19NR37J489O9r39m33o89j127O59N17
$$ -444 -146 1681 2040 501 -692 -369 -866 -1108 -889 -884 53 1542 1611 672 239 -450 -1577 -918 -401
2477d01p26Q99K076k21j240m2k37p85n10j57Q89J641K31r05M09Q82j801q58L03
$$ -401 -1127 -228 1848 1627 387 345 108 -677 -1187 -1344 -455 1186 1417 512 921 1803 2 -856 -553
2496e53p60L54J779J082p18o98K76k8l47j599j279J781J921J09l59N07p42r16
$$ -553 -1313 -959 820 1902 1184 486 762 734 387 -1212 -2491 -710 1211 1320 961 1468 726 -190
2514a90O00k45k078j67K184J779K98j213j421J113Q54k005k010J686J291L46P74
$$ -190 410 165 -1913 -2080 104 1883 2181 968 -453 660 1514 -491 -2501 -815 476 822 1596
2531A596M31j410o21M44l03q74n91M33J787J825j371j215O48k00j579J63K81l34
$$ 1596 2027 617 -4 440 137 -737 -1328 -895 892 2717 1346 131 779 579 -1000 -837 -556 -890
2549h90O91J811L80q57r85o17o0O0r29q0K023R15r56L21M78j450j211L69J82Q9
$$ -890 -199 1612 1992 1135 150 -467 -527 -467 -1396 -1476 547 1462 506 827 1305 -145 -1356 -987 -805 -716
2569g16O31L82L61Q36n02j475k74k33n85Q33J219k90j32J532O0j753q74k67qP47
$$ -716 -85 297 658 1494 992 -483 -757 -990 -1575 -742 477 187 55 1587 1647 -106 -980 -1247 -1255 -508
2589e08N08k4R03N88o81j83n67j755k83J727P93o61N40J027l05j12j054j409l74
$$ -508 0 -24 879 1467 786 603 36 -1719 -2002 -275 518 -143 397 1424 1119 1007 -47 -1456 -1830
2608a830J107N89L23M22m04J34R37p70k621J93J242j0M20R88J5j24m8o67n24p50
$$ -1830 -723 -134 189 611 207 341 1278 508 -2113 -1920 -678 -688 -268 720 735 611 563 -104 -628 -1378
2628a378n45P70J904L14r58M57Q42j065j252p3k11J27J288P36J30J48p23l97L72
$$ -1378 -1923 -1153 751 1065 107 564 1406 341 -911 -984 -1195 -1068 220 956 1086 1234 511 114 486
2647D86r85j401R73J664P7k92J153l52j465k96J17n95j74M37Q27J586l4j638k19
$$ 486 -499 -1900 -927 737 814 522 1675 1323 -142 -438 -321 -916 -1090 -653 174 1760 1726 88 -131
2666a31N21j101r67O42L60K42J517O26r06j197k32j66q5j27o75J270J767l67n91
$$ -131 390 -711 -1678 -1036 -676 -434 1083 1709 803 -394 -626 -792 -877 -1004 -1679 -409 1358 991 400
2685D00M4m24j511L84Q08n72j52J441J091L39r98j773J28R38n39r78J093J218
$$ 400 444 20 -1491 -1107 -299 -871 -1023 418 1509 1848 850 -923 -795 143 -396 -1374 -281 937
2703I37r4P39P1j764r23M36K52j5M04r1Q81J116n61j440j65n89o68R92J258q49
$$ 937 843 1582 1653 -111 -1034 -598 -346 -361 43 -48 833 1949 1388 -52 -217 -806 -1474 -482 776 -73
2723g3j90J608L86j210j168p21N6J115r1j04J177L90q02N3J24j516j003Q29J135
$$ -73 -263 1345 1731 521 -647 -1368 -1312 -197 -288 -392 785 1175 373 426 550 -966 -1969 -1140 -5
2742eK04K97M43m80K58m36j168m80J40O8J458J341n79j111J019J14j715n20K15
$$ -5 199 496 939 459 717 281 -887 -1367 -1227 -1159 299 1640 1061 -50 969 1083 -632 -1152 -937
2761i37J04Q20R26J89J71m76j200j18O94j231m22J262J293j12k3K7p86m82o5m87
$$ -937 -833 -13 913 1102 1273 797 -403 -521 173 -1058 -1480 -218 1075 963 940 967 181 -301 -366 -853
2781h53m03R28O86N31O02n26j047J16p60r16N76J354m30J02J207Mq65n94m84k76
$$ -853 -1256 -328 358 889 1491 965 -82 34 -726 -1642 -1066 288 -142 -40 1167 1171 306 -288 -772 -1048
2801a048o0K4Q98J279K79j107j26P42j382j161P19L82L61R28O51n82k78m43n88
$$ -1048 -1108 -1084 -186 1093 1372 265 139 881 -501 -1662 -943 -561 -200 728 1379 797 519 76 -512
2820e12o9p86l43J415J611n81p30N90k5j575k48M38l40J75J104Q53L86q33j459
$$ -512 -581 -1367 -1710 -295 1316 735 5 595 570 -1005 -1253 -815 -1155 -980 124 977 1363 530 -929
2839i29K63R79j494r21J426J419m21N2O61r53p78l73j80M10P59m27P42J189o63
$$ -929 -666 313 -1181 -2102 -676 743 322 374 1035 82 -696 -1069 -1249 -839 -80 -507 235 1424 761
2858G61j040K75j87j379qJ387M03r0P06o9j57m52j036m60O12K5M5J446O67j294
$$ 761 -279 -4 -191 -1570 -1578 -191 212 122 828 759 602 150 -886 -1346 -734 -709 -664 782 1449 155
2878A55L2O89j153j209J63O93N69Q38k72k04N61l83r79k64K8o48R41J855m54p18
$$ 155 187 876 -277 -1486 -1323 -630 -61 777 505 301 862 479 -500 -764 -736 -1384 -443 1412 958 240
2898B40O50k10q83n58k63J67P16N32K41N09N3j241l36J96r10m03J497R64n79J94
$$ 240 890 680 -203 -761 -1024 -857 -141 391 632 1141 1194 -47 -383 -187 -1097 -1500 -3 961 382 576
2918E76N19k30r09q38n74O63J010l64K24Q72J1p11j00n81j530M52J345J92J3J36
$$ 576 1095 865 -44 -882 -1456 -793 217 -147 77 949 960 249 149 -432 -1962 -1510 -165 27 40 176
2938A76j27N47k06j538r55P61P85j40J002M04p62K74N38j281j336L30O24O59P15
$$ 176 49 596 390 -1148 -2103 -1342 -557 -697 305 709 -53 221 759 -522 -1858 -1528 -904 -245 470
2957D70k55k83J030p2j339m66mq6Q82R46k92J47O97k82j351m32J01j16P33N44
$$ 470 215 -68 962 890 -449 -915 -919 -1005 -123 823 531 678 1375 1093 -258 -690 -589 -705 28 572
2977E72j2O06M47j023m07k99p65K4J181N34m65K52R43l45j106q14l17M94O67k51
$$ 572 560 1166 1613 590 183 -116 -881 -857 324 858 393 645 1588 1243 137 -677 -994 -500 167 -84
2997h4J70J328k11p08j07n94j361M22J348l09N6P55M51k5p32j321j94Q99K1o45
$$ -84 86 1414 1203 495 388 -206 -1567 -1145 203 -106 -50 705 1156 1131 399 -922 -1116 -217 -196 -841
3017h41J130Q32l19N0J21j288p88K09R36J52o2K1R29P50j502j616M28P29p58j1
$$ -841 289 1121 802 852 973 -315 -1103 -894 42 194 132 153 1082 1832 330 -1286 -858 -129 -887 -898
3037h98R87K71Q6M97m06j134n37j73M36O27m48r9J252R38j665j144M56k03k03
$$ -898 89 360 446 943 537 -597 -1134 -1307 -871 -244 -692 -791 461 1399 -266 -1410 -954 -1157 -1360
3056a360K05L96J25O59L70m60p38o98l71Q23N28j017M19J611K90j100m25o4p36
$$ -1360 -1155 -759 -634 25 395 -65 -803 -1501 -1872 -1049 -521 -1538 -1119 492 782 -318 -743 -807 -1543
3075a543O83K48m62P13J216n4l28r9j205k43P71k27o42J160J092m1k56m7r81m47
$$ -1543 -860 -612 -1074 -361 855 801 473 374 -831 -1074 -303 -530 -1172 -12 1080 1039 783 736 -245 -692
3095f92N45j46k80P41N25N80J73q48j231K96M87j078J73J003L75j6M80l33j084
$$ -692 -147 -293 -573 168 693 1273 1446 598 -633 -337 150 -928 -755 248 623 607 1087 754 -330
3114c30J11m77k28M76K78L05J021L91j424m81O60q25q13N42Q29M27M29O9m84o0
$$ -330 -219 -696 -924 -448 -170 135 1156 1547 123 -358 302 -523 -1336 -794 35 462 891 960 476 416
3134D16n43o33J78J4m06J309J731p85j379J00O28o29o17k85L53J253O72p04N5
$$ 416 -127 -760 -582 -568 -974 335 2066 1281 -98 2 630 1 -616 -901 -548 705 1377 673 728
3153G28m6j028O1O50r88q51J625J351m33n63l76k99K48k68j105J24J044N41J63
$$ 728 682 -346 -285 365 -623 -1474 151 1502 1069 506 130 -169 79 -189 -1294 -1170 -126 415 578
3172E78K88q03q41M15L21j366l07J269Q65J88J37p58k34J06o23n24O79K11KQ40
$$ 578 866 63 -778 -363 -42 -1408 -1715 -446 419 607 744 -14 -248 -142 -765 -1289 -610 -399 -397 443
3192D43P86j076j74N7o29p54M90O30L42Q32k06j66jm69r53J50J95l3O55R07j39
$$ 443 1229 153 -21 36 -593 -1347 -857 -227 115 947 741 575 574 105 -848 -698 -503 -536 119 1026 887
3213H87n23K79j71j019l02K94Q9J139N2l03J45O68j358o19J86l33n9J050P46o90
$$ 887 364 643 472 -547 -849 -555 -466 673 725 422 567 1235 -123 -742 -556 -889 -948 102 848 158
3233A58J59M69n54q03m06k82P72P24k63R1Q38k93r34J2j49j169N47J501J92k31
$$ 158 317 786 232 -571 -977 -1259 -487 237 -26 65 903 610 -324 -312 -461 -1630 -1083 418 610 379
3253C79k39K78J31l39j318o66J418N95k59N59L04m86j87M95j063j073L03J126
$$ 379 140 418 549 210 -1108 -1774 -356 239 -20 539 843 357 170 665 -398 -1471 -1168 -42
3271d2N81K55k95j92O24m54j389O5O38m14M83J363j69q37J00M8o55m55m81K76
$$ -42 539 794 499 307 931 477 -912 -847 -209 -623 -140 1223 1054 217 317 365 -290 -745 -1226 -950
3291i50J283L39o20L91N11q44j006O28l33l34P09P09r8M14l69n93k53L1o67L91
$$ -950 333 672 52 443 954 110 -896 -268 -601 -935 -226 483 385 799 430 -163 -416 -385 -1052 -661
3311f61Q21l71M31R84l36j232j00L84m51m9M71Q5O77L95j99k89m91p34k97R63
$$ -661 160 -211 220 1204 868 -364 -464 -80 -531 -580 -109 -24 653 1048 849 560 69 -665 -962 1
3331AK67o18O55R76m12o29r2q29j34O79j51J51M50K83o7L80r09j252L93O78k56
$$ 1 268 -350 305 1281 869 240 148 -681 -815 -136 -287 -136 314 597 530 910 1 -1251 -858 -180 -436
3352d36m2R68L17l09J68m89q48m0j40L58P39J66j67L27M38r90q02K28r5k34P11
$$ -436 -478 490 807 498 666 177 -671 -711 -851 -493 246 412 245 572 1010 20 -782 -554 -649 -883 -172
3373a72M96J66K73J25o65k48k40q33L26R04M6J56Q94k92r32j61P1o16m1M96L87
$$ -172 324 490 763 888 223 -25 -265 -1098 -772 132 178 334 1228 936 4 -157 -86 -702 -743 -247 140
3394A40M11L71m32j75J68r84m18L94K73k99J001P68o27n18J26m95n87J47K44M44
$$ 140 551 922 490 315 483 -501 -919 -525 -252 -551 450 1218 591 73 199 -296 -883 -736 -492 -48
3414d8M77L90m37N72n78j123q6P14l43J03J259J98j78j87m09m33k9m98L9R42M47
$$ -48 429 819 382 954 376 -747 -833 -119 -462 -359 900 1098 920 733 324 -109 -138 -636 -597 345 792
3435G92l83L33L90r56p04L69k04n13P76O45K82O0k41m81K35o35q02M03Q49j5R9
$$ 792 409 742 1132 176 -528 -159 -363 -876 -100 545 827 887 646 165 400 -235 -1037 -634 215 200 299
3456B99J058l08j162j21P0m62j25J58L80Q44K85m50k07O4p00n90O93Oj69P79R21
$$ 299 1357 1049 -113 -234 -164 -626 -751 -593 -213 631 916 466 259 323 -377 -967 -274 -268 -437 342 1263
3477A263m05n05l55m99J0o6nL50R87Om28M80m47p83k92L98j86J59O28M57l02M28
$$ 1263 858 353 -2 -501 -491 -557 -562 -212 775 781 353 833 386 -397 -689 -291 -477 -318 310 767 465 893
3499H93p15n37J05m51j92J015L58m40K79M46n70p97J65m37o3L53M26K62K70k33
$$ 893 178 -359 -254 -705 -897 118 476 36 315 761 191 -606 -441 -878 -941 -588 -162 100 370 137
3519A37k33j0n07o86J25Q80j38J23J010j75o35ol30m93N2L94J52Q97J78m67K02
$$ 137 -96 -106 -613 -1299 -1174 -294 -432 -309 701 526 -109 -115 -445 -938 -886 -492 -340 557 735 268 470
3540D70Q6j098j78L70L10l12O64P40m04j27qo04r0j41j12O39M09l7j66P13k55
$$ 470 556 -542 -720 -350 -40 -352 312 1052 648 521 513 -91 -181 -322 -434 205 614 577 411 1124 869
3561H69j090k92L57p8O3P80J55j37R7n40l1l23p46p4J146M33l29Q6N59m24p96
$$ 869 -221 -513 -156 -234 -171 609 764 627 724 184 153 -170 -916 -990 156 589 260 346 905 481 -315
3582c15l6k05j25L54N23L77J50j27l60M20p73q97K85R32K36q2O78K04n84j26l79
$$ -315 -351 -556 -681 -327 196 573 723 596 236 656 -117 -1014 -729 203 439 357 1035 1239 655 529 150
3603A50n23J78K26K8Q19M26o98J58K06j164m13M77K58l96O89L51l5j43l10p06
$$ 150 -373 -195 31 59 878 1304 606 764 970 -194 -607 -130 128 -268 421 772 737 594 284 -422
3623d22k00J5m01P40N49k57j57P02k62j097k69L30j47J99N53J58K72rl32n03P5
$$ -422 -622 -607 -1008 -268 281 24 -133 569 307 -790 -1059 -729 -876 -677 -124 34 306 297 -35 -538 -463
3644d63n39k10R11N24k77L27P36o29p53k00l1K29L38p5L55R26l02l67Nn04q33
$$ -463 -1002 -1212 -301 223 -54 273 1009 380 -373 -573 -604 -375 -37 -112 243 1169 867 500 505 1 -832
3665h32L04Q45l00J36P94K30l29m69n04k74M44Jk06P08L12l81J50K26j073n02
$$ -832 -528 317 17 153 947 1177 848 379 -125 -399 45 46 -160 548 860 479 629 855 -218 -720
3685g20K59J92q9K12N30K06J71n51q16r0J91k99L45N32RJ66L78j76j136m8K94
$$ -720 -461 -269 -358 -146 384 590 761 210 -606 -696 -505 -804 -459 73 82 248 626 450 -686 -734 -440
3706d40j95M97J98j5N73L55p08m74qm81J6M57O51n12Q10L19n32m59l43m7j25K65
$$ -440 -635 -138 60 45 618 973 265 -209 -217 -698 -682 -225 426 -86 724 1043 511 52 -291 -338 -463 -198
3728a98k00N95P02n9p24n6k00q56L64O67m39rQ88K60m77k54o73j96K54j16N9P18
$$ -198 -398 197 899 840 116 60 -140 -996 -632 35 -404 -413 475 735 258 4 -669 -865 -611 -727 -668 50
3750E0P16n96P3l7p42o07N51O0K1K92P02K41p0n90p65O32k61n81K55J292j5j98
$$ 50 766 170 243 206 -536 -1143 -592 -532 -511 -219 483 724 654 64 -701 -69 -330 -911 -656 636 621 423
3772D23L37k07n03k84J69j65K6K45N07Q09j80r62j95M62o46n13N91L96j02Q03
$$ 423 760 553 50 -234 -65 -230 -204 41 548 1357 1177 215 20 482 -164 -677 -86 310 208 1011
3792A011K16n05o08j00k30j85J3J49M48J061m88q18J11Jm26j09K78k09L95P35
$$ 1011 1227 722 114 14 -216 -401 -388 -239 209 1270 782 -36 75 76 -350 -459 -181 -390 5 740
3812G40q4l15k46m45k07J05Qk41P42P03k15j70J71p06k79K29l63Q9O27M81P7J33
$$ 740 656 341 95 -350 -557 -452 -444 -685 57 760 545 375 546 -160 -439 -210 -573 -484 143 624 701 834
3834H34n81m65K28R4r88M28Q61K16k50K07q1o33L9j05m85J39O08J42N10j96m82
$$ 834 253 -212 16 110 -878 -450 411 627 377 584 503 -130 -91 -196 -681 -542 66 208 718 522 40
3855D0q8K46p13q45R26M23K1L52L92m17l24k22m03J19j49Q3P62O13m39n22K35
$$ 40 -48 198 -515 -1360 -434 -11 10 362 754 337 13 -209 -612 -493 -642 -559 203 816 377 -145 90
3876I0N07j102l91M30K59N41K33l06R2L8m49r2j95j30k72J249N65p89j17M80m16
$$ 90 597 -505 -896 -466 -207 334 567 261 353 391 -58 -150 -345 -475 -747 502 1067 278 161 641 225
3897B25n53j31j35L10N38N0J64J61l07o48K69j15p60K84J042L47n46k0K5l03K3
$$ 225 -328 -459 -594 -284 254 304 468 629 322 -326 -57 -172 -932 -648 394 741 195 175 200 -103 -80
3918h0m36k39K17L75J92K81M50n18l90J34m51m40M91K14K79L38K83j26k12l67
$$ -80 -516 -755 -538 -163 29 310 760 242 -148 -14 -465 -905 -414 -200 79 417 700 574 362 -5
3938em87j40N04j90M54P32o8n98L30l84n58k14K95K60K11K55j14K12j6m30p44
$$ -5 -492 -632 -128 -318 136 868 800 202 532 148 -410 -624 -329 -69 142 397 283 495 479 49 -695
3959f95K37j41J68O37K43k81K37L66o05p77l6k14M98N05j5n6M92j32n75j53j9
$$ -695 -458 -599 -431 206 449 168 405 771 166 -611 -647 -861 -363 142 127 71 563 431 -144 -297 -316
3980c16p86M96P83M5k14N36P7l84m81l68j30P11J16j34O51J0k19k32j22m56m73
$$ -316 -1102 -606 177 222 8 544 621 237 -244 -612 -742 -31 85 -49 602 612 393 161 39 -417 -890
4001h90O60L64j50L09J49o3J41l50p96K26J49k52N01N41j59m01M25k33q76j03
$$ -890 -230 134 -16 293 442 379 520 170 -626 -400 -251 -503 -2 539 380 -21 404 171 -705 -808
4021h08K63J47N16J54J40O1r2o67k72K00M1l55O08N60k61PN43q08n30pR0J41M16
$$ -808 -545 -398 118 272 412 473 381 -286 -558 -358 -317 -672 -64 496 235 242 785 -23 -553 -560 -470 -329 87
4044H7R8K18N48l73p51J93j44m54j7P08o0K41M84j73l23j80n09j02K56K06j62
$$ 87 185 403 951 578 -173 20 -124 -578 -595 113 53 294 778 605 282 102 -407 -509 -253 -47 -209
4065b09Q60K11o91p3q1k10m86K81J49L50O9M62k05L8l63p77L40J31l92J79P43
$$ -209 651 862 171 98 17 -193 -679 -398 -249 101 170 632 427 465 102 -675 -335 -204 -596 -417 326
4086C26L76n95J05l2o12j29qQ3N46J38k1K22P4m93n47K79k03j51M26N21QJ39R
$$ 326 702 107 212 180 -432 -561 -569 -486 60 198 177 399 473 -20 -567 -288 -491 -642 -216 305 313 452 461
4109D61j46n13k43l8J31L46K85o8M96r5n89k02O4m11LM05L82Q8K39j11k84j17
$$ 461 315 -198 -441 -479 -348 -2 283 215 711 616 27 -175 -111 -522 -519 -114 268 356 595 484 200 83
4131H3m25k22L08M4l7P91K21m78m14J86m36k13J90l7J80M38J75K03On51o43J45
$$ 83 -342 -564 -256 -212 -249 542 763 285 -129 57 -379 -592 -402 -439 -259 179 354 557 563 12 -631 -486
4153d86K27l21K62P22O6l37Q9r4m93K7r2q5P29M9j2L02M8o28m63L60k19k83N61
$$ -486 -259 -580 -318 404 470 133 222 128 -365 -338 -430 -515 214 263 251 553 601 -27 -490 -130 -349 -632 -71
4176g1N02j16J50l7l76j56j53k32PM80j81J84P18r5p95J09l5n70N7L68L02J75
$$ -71 431 315 465 428 52 -104 -257 -489 -482 -2 -183 1 719 624 -171 -62 -97 -667 -610 -242 60 235
4198B35J71J54k73j6p84j53K38J19l0O54L06n57k8J34m12m44j59M23J41O54J26
$$ 235 406 560 287 271 -513 -666 -428 -309 -339 315 621 64 36 170 -242 -686 -845 -422 -281 373 499
4219D99l10J98k47n28P8J26m21M39P32O9p3j60N0n38o2k96Q1M45Q5L31Q4L68q37
$$ 499 189 387 140 -388 -310 -184 -605 -166 566 635 562 402 452 -86 -148 -444 -363 82 167 498 582 950 113
4242A13m91L70l63k06M64M98O2M0J37k97j05m01l17J05O16k23Q4O61r5n17j25
$$ 113 -378 -8 -371 -577 -113 385 447 487 624 327 222 -179 -496 -391 225 2 86 747 652 135 10
4263A0j12m23m4L02j8O14J43j78p8j35n04j39K52J26j89L62O01l87K0L2m02l38
$$ 10 -102 -525 -569 -267 -285 329 472 294 216 81 -423 -562 -310 -184 -373 -11 590 203 223 255 -147 -485
4285d85J49j60M49K84J48P4L45q29n27N2M66k33n8M50K14j30M7j84k92j19j77
$$ -485 -336 -496 -47 237 385 459 804 -25 -552 -500 -34 -267 -325 125 339 209 256 72 -220 -339 -516
4306e16j80O02K57k11L29L43n99m08P6j77l9K12M60j43K01L06l56l60j23m03J16
$$ -516 -696 -94 163 -48 281 624 25 -383 -307 -484 -523 -311 149 6 207 513 157 -203 -326 -729 -613
4327f13O76k19K7N86J1m17j24L0n62p3K68M69K94k3j03M9Kn90k94N08j51K2M72
$$ -613 63 -156 -129 457 468 51 -73 -43 -605 -678 -410 59 353 330 227 276 278 -312 -606 -98 -249 -227 245
4350B45K41j85Qo9m50k18J37J11L8M75Pj39N13m81o07P8K35k33j30O62J55Jr2
$$ 245 486 301 309 240 -210 -428 -291 -180 -142 333 340 201 714 233 -374 -296 -61 -294 -424 238 393 394 302
4373C02O6n28j44k27j8M52L74l43N83K76o30m56J59j49l99M13K88K12L13j82k75
$$ 302 368 -160 -304 -531 -549 -97 277 -66 517 793 163 -293 -134 -283 -682 -269 19 231 544 362 87
4394H7n7k85l82K02K99L1Q2P12O1p51q8p6k77K0Q6J34M38N7j58R5J70n75l90K14
$$ 87 30 -255 -637 -435 -136 -105 -23 689 750 -1 -89 -165 -442 -422 -336 -202 236 293 135 230 400 -175 -565 -351
4418c51L90o11M32N42J54l46l9m84r8K93k64M5L39J76PL15k69p08Q7L04l68L7
$$ -351 39 -572 -140 402 556 210 171 -313 -411 -118 -382 -337 2 178 185 500 231 -477 -390 -86 -454 -417
4440d17L96J45K18J08m30k63oj24k30N14K30p7M32J58o46k00K07j91n7p0K65J89
$$ -417 -21 124 342 450 20 -243 -249 -373 -603 -89 141 64 496 654 8 -192 15 -176 -233 -303 -38 151
4462A51L83j17l39K51k44n32j83L78K62n6O30m9m24o3o0l76O2o5L3M23N32l99
$$ 151 534 417 78 329 85 -447 -630 -252 10 -46 584 535 111 48 -12 -388 -326 -391 -358 65 597 198
4484A98j26K58m25m36L54Qj39M40M30k36Rn6n32O1m5k62J11O85K7m8K38j10o69
$$ 198 72 330 -95 -531 -177 -169 -308 132 562 326 335 279 -253 -192 -237 -499 -388 297 324 276 514 404 -265
4507b65j36J63r2n9M73L32J12p2l95P7M4n84K7J53L71n8N11j45k86m29K07k20
$$ -265 -401 -238 -330 -389 84 416 528 456 61 138 182 -402 -375 -222 149 91 602 457 171 -258 -51 -271
4529b71l27J90L61K30L09j00l75J90j42n05j19L53Q1J85L77J17m78Kj2l95Q5k2
$$ -271 -598 -408 -47 183 492 392 17 207 65 -440 -559 -206 -125 60 437 554 76 78 66 -329 -244 -266
4551b66J48K38K52j45J10J4l83l37P7Q9j63N38L48o4r6k86j68r1k13j06K15N39
$$ -266 -118 120 372 227 337 351 -32 -369 -292 -203 -366 172 520 456 360 74 -94 -185 -398 -504 -289 250
4573B50k5p8M45k61m27r2j99k37L70K65J18J50K64m17o2j79l55j48M01J63j5K21
$$ 250 225 147 592 331 -96 -188 -387 -624 -254 11 129 279 543 126 64 -115 -470 -618 -217 -54 -69 152
4595A52L99l12l03K3j78m42J85M39K22K33k70l6K72j98q22r8N50J22J1L16M3m6
$$ 152 551 239 -64 -41 -219 -661 -476 -37 185 418 148 112 384 186 -636 -734 -184 -62 -51 265 308 262
4617B62L9l01k84j7k55J79O36J46k73J48L04n72m26L54j40k05M88L85k65J09j76
$$ 262 301 0 -284 -301 -556 -377 259 405 132 280 584 12 -414 -60 -200 -405 83 468 203 312 136
4638A36j92lj53l45J60O17j88K1K72l6j80k01k21j44P1M92q2L88j60j57j0p4k62
$$ 136 -56 -59 -212 -557 -397 220 32 53 325 289 109 -92 -313 -457 -386 106 24 412 252 95 85 11 -251
4661b51n41N73K33j10K30M15k03k14j61k75k8P9j41M64M13k38j46K54j45n71j52
$$ -251 -792 -219 14 -96 134 549 346 132 -29 -304 -332 -253 -394 70 483 245 99 353 208 -363 -515
4682e15M03J4Q9N22k19J08k22p7l85p4J80p1L78K79l68R2K09l46n85J63K17Qj0
$$ -515 -112 -98 -9 513 294 402 180 103 -282 -356 -176 -247 131 410 42 134 343 -3 -588 -425 -208 -200 -210
4705b10M42p2J69j61k19o7Q1m42J97O15l71J10J87J49l60j88o8k16J59J10J44
$$ -210 232 160 329 168 -51 -118 -37 -479 -282 333 -38 72 259 408 48 -140 -208 -424 -265 -155 -11
4726a1K97K42k62j57j2k07m00K17N15l18K19L14J3k08j95k44j38K02J4O3M78r7
$$ -11 286 528 266 109 97 -110 -510 -293 222 -96 123 437 450 242 47 -197 -335 -133 -119 -56 422 325
4748C25nPk48l08j13JJ08K06K04J22L1J20o79j27J45qPJ81L58k72L92p4n24j70
$$ 325 320 327 79 -229 -342 -341 -233 -27 177 299 330 450 -229 -356 -211 -219 -212 -31 327 55 447 373 -151 -321
4772c21J68J38n06K72K72L94K00k35m22k52R1k96J40M64j14P9L76k9m82j07j57
$$ -321 -153 -15 -521 -249 23 417 617 382 -40 -292 -201 -497 -357 107 -7 72 448 419 -63 -170 -327
4793c27O5R8J04N3K22L39j92k93K6k44m14K57K36q6L15L20k94n7o5m36O2Lj39
$$ -327 -262 -164 -60 -7 215 554 362 69 95 -149 -563 -306 -70 -156 159 479 185 128 63 -373 -311 -308 -447
4816d47K85M60q2j39J47K51p67k35L20n0j9N36K9j30J31m11k57M41l79q9L62K04
$$ -447 -162 298 216 77 224 475 -292 -527 -207 -257 -276 260 289 159 290 -121 -378 63 -316 -405 -43 161
4838A61R9j02L09l69k84k21J89k44M81J83J44J86lo02n9Q0l09N3N52r7K4J36J95
$$ 161 260 158 467 98 -186 -407 -218 -462 19 202 346 532 529 -73 -132 -52 -361 -308 244 147 171 307 502
4861E02m24J22n41O3q9K10P0K39N25m99r6N0l80k34J97K31j54J55L19K1rp0l57
$$ 502 78 200 -341 -278 -367 -157 -87 152 677 178 82 132 -248 -482 -285 -54 -208 -53 266 287 278 208 -149
4884a49j84J2j85N76K25P9l52M23O7p95j37K48j33J81R5M74j32L26m71l76K77
$$ -149 -333 -321 -506 70 295 374 22 445 512 -283 -420 -172 -305 -124 -29 445 313 639 168 -208 69
4905F9k02j36L20K20j49J88k5j41l29q2k13K98K84n9R6K17l6l98L9j02l38r1N58
$$ 69 -133 -269 51 271 122 310 285 144 -185 -267 -480 -182 102 43 139 356 320 -78 -39 -141 -479 -570 -12
4928a2n9K14R7R2j49j99k70j72J73J34Q2K26O5j59j3N1j97l84L50o3qM17m7J99
$$ -12 -71 143 240 332 183 -16 -286 -458 -285 -151 -69 157 222 63 50 101 -96 -480 -130 -193 -201 216 169 368
4952C68om17k60J09R1k29J32L78J82k61P1J94l32k86K4l0K05L59j20r1J28k36
$$ 368 362 -55 -315 -206 -115 -344 -212 166 348 87 158 352 20 -266 -242 -272 -67 292 172 81 209 -27
4974b7l01P2R5m61M12L06l9R4L37l59j84l6m53J46L00k17M92J91j01k77Q9n9n38
$$ -27 -328 -256 -161 -622 -210 96 57 151 488 129 -55 -91 -544 -398 -98 -315 177 368 267 -10 79 20 -518
4997e18J19M02N9r3K73Lr3k9k07j82K4J65o7J84L63j78k11L16k42m59J61J08j47
$$ -518 -399 3 62 -31 242 245 152 123 -84 -266 -242 -77 -144 40 403 225 14 330 88 -371 -210 -102 -249
5020b49M52J06j54K21k33k42j56L01m45N1O37j50m8J79K1n38L4j29N0J7L50n9
$$ -249 203 309 155 376 143 -99 -255 46 -399 -348 289 139 91 270 291 -247 -213 -342 -292 -275 75 16
5042A6J71K70m74k7j62q7q2L30J74m2K85m1l05j94J0k27J32J72J49j26M77k19
$$ 16 187 457 -17 -44 -206 -293 -375 -45 129 87 372 331 26 -168 -158 -385 -253 -81 68 -58 419 200
5064B00j5k42Pl04J49R0J71k07M14K33k04j42l43j13K57k2j82N29J89k51%P6l72
$$ 200 185 -57 -50 -354 -205 -115 56 -151 263 496 292 150 -193 -306 -49 -71 -253 276 465 214 214 290 -82
5087h2j28r7K4J53N2K38Q1J81l19n39L42k7l39J15M64R4k09K44Q3k88k67j27j17
$$ -82 -210 -307 -283 -130 -78 160 241 422 103 -436 -94 -121 -460 -345 119 213 4 248 331 43 -224 -351 -468
5110d68K10K04J48O5K41j95m19J27j23k16K79L68j97J18K84j44j26k43k74J41
$$ -468 -258 -54 94 159 400 205 -214 -87 -210 -426 -147 221 24 142 426 282 156 -87 -361 -220
5130b20K74o9J09L25M8m74Q7j9j66l11J75J79K74R1j21J85l12m5l55K39o3l1L25
$$ -220 54 -15 94 419 467 -7 80 61 -105 -416 -241 -62 212 303 182 367 55 10 -345 -106 -169 -200 125
5153A25J20M8k34P7k42j02j30n9K04L37M2J06K10l36l68M1O5l51J38N25j0M6M2
$$ 125 245 293 59 136 -106 -208 -338 -397 -193 144 186 292 502 166 -202 -161 -96 -447 -309 216 206 252 294
5176B94J6k01l26J32j01K09O6l1L58m5j48m38L45j23m73K55N10k42J18J01j49
$$ 294 310 109 -217 -85 -186 23 89 58 416 371 223 -215 130 7 -466 -211 299 57 175 276 127
5197A27O6k12l49Q4K09j02K79R2p3Q5k04J75o29l1K12p3N53ko0K3Mk75j84P1r7
$$ 127 193 -19 -368 -284 -75 -177 102 194 121 206 2 177 -452 -483 -271 -344 209 207 147 170 174 -101 -285 -214 -311
5222c11J21N6N11j18j21j8j90m1j11j55o3M44J08J44J6N5m27n9j09q4K32J58K56
$$ -311 -190 -134 377 259 138 120 -70 -111 -222 -377 -440 4 112 256 272 327 -100 -159 -268 -352 -120 38 294
5245B94j43L74l35J8j63l41k7K20J56j17J98K95k45q7j59l1l11K20K68OJ80J68
$$ 294 151 525 190 208 45 -296 -323 -103 53 -64 134 429 184 97 -62 -93 -404 -184 84 90 270 438
5267D38j89m4j29m67O7K13r3Q5M58j2k99J79k39j40j81J23J51R1L55k24J78q2
$$ 438 249 205 76 -391 -324 -111 -204 -119 339 327 28 207 -32 -172 -353 -230 -79 12 367 143 321 239
5289B39l31p9MK1k00M39Q7J2o0J96j21j82j60j76R0M48j89r3L90j66l68Q1q6j55
$$ 239 -92 -171 -167 -146 -346 93 180 192 132 328 207 25 -135 -311 -221 227 38 -55 335 169 -199 -118 -204 -359
5313c59n9L24L47j14J6J57k29j21j69l36K76K15j15K92M43n43J62j82j94l74L54
$$ -359 -418 -94 253 139 155 312 83 -38 -207 -543 -267 -52 -167 125 568 25 187 5 -189 -563 -209
5334b09J18J80J43r1j29K95k60n15qN10jO5J20K02l65K51j96m63J77j05J62K47
$$ -209 -91 89 232 141 12 307 47 -468 -476 34 33 98 218 420 55 306 110 -353 -176 -281 -119 128
5356A28K86j35l9K33m23l66J52J70l75K19L30j58J87k7l36K06o3k70J46K23J2
$$ 128 414 279 240 473 50 -316 -164 6 -369 -150 180 22 209 182 -154 52 -11 -281 -135 88 100
5377A00p8K27L6m92O4j94Q2j70J69K26L42L4j18j25k01k61j17M06mk7L40J00o3
$$ 100 22 249 285 -207 -143 -337 -255 -425 -256 -30 312 346 228 103 -98 -359 -476 -70 -74 -101 239 339 276
5400B76l89M4p3j30o7K60P2K06J09k53J30l10j78j06M05j58k7L88J61n4o1k51
$$ 276 -113 -69 -142 -272 -339 -79 -7 199 308 55 185 -125 -303 -409 -4 -162 -189 199 360 306 245 -6
5422fk23l9R6oJ22K73j29J80K1m12l16M41j42j83J06L76JL7j78k3k07J02k57R7
$$ -6 -229 -268 -172 -178 -56 217 88 268 289 -123 -439 2 -140 -323 -217 159 160 197 19 -4 -211 -109 -366 -269
5446b69K77O3P3L06o8n12J10j07k65J91O0J08M21j81M8j55M5k98k05K05K79k27
$$ -269 8 71 144 450 382 -130 -20 -127 -392 -201 -141 -33 388 207 255 100 145 -153 -358 -153 126 -101
5468a01K47J46k62o1K7k06l06L37o4K02K51n0j14L19k98l14k24L47k46K56L37
$$ -101 146 292 30 -31 -4 -210 -516 -179 -243 -41 210 160 46 365 67 -247 -471 -124 -370 -114 223
5489B23j8K1k50J10k54k80J28K01N9J79p5Q6P9j85m12K21J15n52N03J43K85j72
$$ 223 205 226 -24 86 -168 -448 -320 -119 -60 119 44 130 209 24 -388 -167 -52 -604 -101 42 327 155
5511A55P4k07n8j1j73m5K03J81k9M13k14m19Q0J00l36J26J35J90J69q4j7j40P6
$$ 155 229 22 -36 -47 -220 -265 -62 119 90 503 289 -130 -50 50 -286 -160 -25 165 334 250 233 93 169
5534A69j92j63K59j12j51L29K56j52n4j8k73j40m7K00J13J66j83o8L12j48n22
$$ 169 -23 -186 73 -39 -190 139 395 243 189 171 -102 -242 -289 -89 24 190 7 -61 251 103 -419
5555d19J61K48j47j4M48j8j84K98k66j31j00o1j4Q5K09r6J75K32n19j38J32Jk58
$$ -419 -258 -10 -157 -171 277 259 75 373 107 -24 -124 -185 -199 -114 95 -1 174 406 -113 -251 -119 -118 -376
5578c76J31L30J37K7p4j53j6l98Q1J51P8J89j23R6K5l5j49j92j33N2K22J22J51
$$ -376 -245 85 222 249 175 22 6 -392 -311 -160 -82 107 -16 80 105 70 -79 -271 -404 -352 -130 -8 143
5601A43m9M9k54K37j49m59K90k4j8L95K84k74k5q3k84j55J04j51K26L98P1l08
$$ 143 94 143 -111 126 -23 -482 -192 -216 -234 161 445 171 146 63 -221 -376 -272 -423 -197 201 272 -36
5623c6K31J02l37l20M29j76J52O8K09j29q3j71N9k24J90p1M5M32j50j1P2J7n88
$$ -36 195 297 -40 -360 69 -107 45 113 322 193 110 -61 -2 -226 -36 -107 -62 370 220 209 281 298 -290
5646b90K23k4k36K38K1Q1K20J44l75Kj21k63J62L30j18K36R8Pm17j46J50r5j64
$$ -290 -67 -91 -327 -89 -68 13 233 377 2 4 -117 -380 -218 112 -6 230 328 335 -82 -228 -78 -173 -337
5669c37L11j31L76Q5j4k99J16j65l14L17P7n9K1K04O3Q3l25O8m08K12j6R2J53
$$ -337 -26 -157 219 304 290 -9 107 -58 -372 -55 22 -37 -16 188 251 334 9 77 -331 -119 -135 -43 110
5692A10J33q3k8r2j50J28Jj37j17M65m4o8J00k09%j20j02j96K43K62p9O2K84j90
$$ 110 243 160 132 40 -110 18 19 -118 -235 230 186 118 218 9 9 -111 -213 -409 -166 96 17 79 363 173
5716A73m90J48J0l3n4K43J13K58k83J00k9j71j55J1q6K67k4L81r7k05j26k43J35
$$ 173 -317 -169 -159 -192 -246 -3 110 368 85 185 156 -15 -170 -159 -245 22 -2 379 282 77 -49 -292 -157
5739a57O8q8K74Q2K4l2q1J83k39l78J51J00k9L33J3j65J30j7k67n1L6J8L3K4R9
$$ -157 -89 -177 97 179 203 171 90 273 34 -344 -193 -93 -122 211 224 59 189 172 -95 -146 -110 -92 -59 -35 64
5764F4N3M1K2m38O3m4PP9K9J00R3K12l66jpj36k33K36K98q0K26l8n7k39j34Q1
$$ 64 117 158 180 -258 -195 -239 -232 -153 -124 -24 69 281 -85 -86 -93 -229 -462 -226 72 -8 218 180 123 -116 -250 -169
5790a69O0j08J91J74N6L9j80k70L72m68l3L75j47J10J39O9k6j94k79K10j30Q7
$$ -169 -109 -217 -26 148 204 243 63 -207 165 -303 -336 39 -108 2 141 210 184 -10 -289 -79 -209 -122
5812a22L4K75K07p4j11N9l34j79j61K50j1O5M93j16k65k4l18J62J69m12K33K28
$$ -122 -88 187 394 320 209 268 -66 -245 -406 -156 -167 -102 391 275 10 -14 -332 -170 -1 -413 -180 48
5834D8J44j26J05j31k10N5p4n9J35K2J29p1K52j21r5j10k16j46J91N21k38J44
$$ 48 192 66 171 40 -170 -115 -189 -248 -113 -91 38 -33 219 98 3 -107 -323 -469 -278 243 5 149
5856A49o1L1j06P0k54p6J44Q8Q5J46q5r5l4Q5j67p3jr5K70K25N6k27J3j47j65
$$ 149 88 119 13 83 -171 -247 -103 -15 70 216 131 36 2 87 -80 -153 -154 -249 21 246 302 75 88 -59 -224
5881b24N9r6Q4L52J44j25l1l1j25m41K90M0j35J64R5Q1J00M7m61Q9J78m54K42
$$ -224 -165 -261 -177 175 319 194 163 132 7 -434 -144 -104 -239 -75 20 101 201 248 -213 -124 54 -400 -158
5904a58M08j09j08J36j43l69L45j21k28K43J43K1K33p2k41o7J70p9k97J05L10
$$ -158 250 141 33 169 26 -343 2 -119 -347 -104 39 60 293 221 -20 -87 83 4 -293 -188 122
5925A22K54k39N5O2r8k47M2j79J68R3OJ55K59m73kn1j21j77K75J08j20J34J93
$$ 122 376 137 192 254 156 -91 -49 -228 -60 33 39 194 453 -20 -22 -73 -194 -371 -96 12 -108 26 219
5948B19j98L2k43j8P5O0j88K39J67j08L9K56l43n8k07K71l1q0M45k46J89j38p3
$$ 219 21 53 -190 -208 -133 -73 -261 -22 145 37 76 332 -11 -69 -276 -5 -36 -116 329 83 272 134 61
5971F1q7M6j98j04N78j63j74L55j91jm02K26p7J91l4j33M33j00j0l29J01P8l85
$$ 61 -26 20 -178 -282 296 133 -41 314 123 122 -280 -54 -131 60 26 -107 326 226 216 -113 -12 66 -319
5994c19K9J86J75J02O3m03Q3j50O5j63K71K80k53L70n7k36J22j90l9l45K11K38
$$ -319 -290 -104 71 173 236 -167 -84 -234 -169 -332 -61 219 -34 336 279 43 165 -25 -64 -409 -198 40
6016D0M2J79j06J62r4k41j20R2j77l2K23M67k97J6K9R6n35j9J72m7K12n8J00K43
$$ 40 82 261 155 317 223 -18 -138 -46 -223 -255 -32 435 138 154 183 279 -256 -275 -103 -150 62 4 104 347
6040C47n4m68m9L8j81J86L25j32J67J27k55q5q2k66L71l5k03J90K37Q7l09O9n0
$$ 347 293 -175 -224 -186 -367 -181 144 12 179 306 51 -34 -116 -382 -11 -46 -249 -59 178 265 -44 25 -25
6063b5n1k34J83K15j07R7L03l23p9o5k97K60O6o2K7L82q5l22J20Lk60kr8L12n5
$$ -25 -76 -310 -127 88 -19 78 381 58 -21 -86 -383 -123 -57 -119 -92 290 205 -117 3 6 -254 -256 -354 -42 -97
6088i7J40J20LJ94l97k53M03k42o8J46J75Q8r6K17l53k47J39j3J25N4K9l3K54
$$ -97 43 163 166 360 -37 -290 113 -129 -197 -51 124 212 116 333 -20 -267 -128 -141 -16 38 67 34 288
6111B88r7l37J23k14O6j00K52J1J3M01k57j97o7k65J06K60N3K3J29Q6p2k28Q7
$$ 288 191 -146 -23 -237 -171 -271 -19 -8 5 406 149 -48 -115 -380 -274 -14 39 62 191 277 205 -23 64
6134F4l11L1K6N1J15K21K26k09j55o3J01j31j26N4m9L83J12l94K60k1k78j50L4
$$ 64 -247 -216 -190 -139 -24 197 423 214 59 -4 97 -34 -160 -106 -155 228 340 -54 206 185 -93 -243 -209
6157b09jJ82o8N9K34L4l18m5p8J53k93K13L16o7rJ73k33n8K1l41K38L9K44k40
$$ -209 -210 -28 -96 -37 197 231 -87 -132 -210 -57 -350 -137 179 112 103 276 43 -15 6 -335 -97 -58 186 -54
6181e4K20j5m35J62rj65M3L18j22K26j01R7j49O8l97R6J8rJ19J91J57%l07J69
$$ -54 166 151 -284 -122 -131 -296 -253 65 -57 169 68 165 16 84 -313 -217 -199 -208 -89 102 259 259 -48 121
6205A21j35j59j4J39N4L08l2j52L4k47j25J34L0r8K17k8J36K4m5j29l13K69j00
$$ 121 -14 -173 -187 -48 6 314 282 130 164 -83 -208 -74 -44 -142 75 47 183 207 162 33 -280 -11 -111
6228a11l1J22K32m8m8j17L6k25K57k05l5J55J02R6k72K50j87O7j14j69l7L86q8
$$ -111 -142 -20 212 164 116 -1 35 -190 67 -138 -173 -18 84 180 -92 158 -29 38 -76 -245 -282 104 16
6251A6r2M67j84k54K2j2k90N6J89J47K19q9j8j79Oj87l4L07l43L2L06J91j72M
$$ 16 -76 391 207 -47 -25 -37 -327 -271 -82 65 284 195 177 -2 4 -183 -217 90 -253 -221 85 276 104 108
6275A08j25j54j35L38l1j13J2J06j68L00jm00J93M4o2j99N55r2m3M9j3k87p4K28
$$ 108 -17 -171 -306 32 1 -112 -100 6 -162 138 137 -263 -70 -26 -88 -287 268 176 133 182 169 -118 -192 36
6299C6j12K87j42K60r5O8k00k34J99j48r6K81J46p9k8J93l65p1Q7k70j7M70n5
$$ 36 -76 211 69 329 234 302 102 -132 67 -81 -177 104 250 171 143 336 -29 -100 -13 -283 -300 170 115
6322A15J25J08q8k79J96p5k66j1J38J02O6j78R0n2k8m1k03Q6J82M4P0J14o9j8
$$ 115 240 348 260 -19 177 102 -164 -175 -37 65 131 -47 43 -9 -37 -78 -281 -195 -13 31 101 215 146 128
6346A28j72n4j64J24o3K19J58P3r1K5m3j80k86J41j14L86O3mo4K15k89rl04O7
$$ 128 -44 -98 -262 -138 -201 18 176 249 158 183 140 -40 -326 -185 -299 87 150 146 82 297 8 -1 -305 -238
6370b38K15J28P5j55J87J43l77q9N7N9k12NK93j09J84Q2m21J28K28m02J25J48
$$ -238 -23 105 180 25 212 355 -22 -111 -54 5 -207 -202 91 -18 166 248 -173 -45 183 -219 -94 54
6392E4P0J42j25R9m15K21j00r8K9L27l41K91J42J8j91j54p3j53Q3o5J16J13L99
$$ 54 124 266 141 240 -175 46 -54 -152 -123 204 -137 154 296 314 123 -31 -104 -257 -174 -239 -123 -10 389
6415C89j41j45J36l88N0L7j72J74J50R9M7o2q6l85J28M6j52K22J58Kq0M4P7l52
$$ 389 248 103 239 -149 -99 -62 -234 -60 90 189 236 174 88 -297 -169 -123 -275 -53 105 107 27 71 148 -204
6439b04k1P6j02M13K5j24j36J97n7j88k9j69J78K77k7R3j9k10N4K4k13j96K91
$$ -204 -225 -149 -251 162 187 63 -73 124 67 -121 -150 -319 -141 136 109 202 183 -27 27 51 -162 -358 -67
6462f7O2N0q9L43j63j70J36j71l1j35K17j7J49K42k25L3j10j06j16K36j09j74
$$ -67 -5 45 -44 299 136 -34 102 -69 -100 -235 -18 -35 114 356 131 164 54 -52 -168 68 -41 -215
6484b15J90L08j89O0J6j46k28P2J87j50r2M25k67R3%k11J70j41mO4J82o7K0J27
$$ -215 -25 283 94 154 170 24 -204 -132 55 -95 -187 238 -29 64 64 -147 23 -118 -122 -58 124 57 77 204
6508B04q3k93j45R3J13k6K08Q3R4J04k47j93LJ4j64J24J1P4J76n8o6R1L0k88P6
$$ 204 121 -172 -317 -224 -111 -137 71 154 248 352 105 -88 -85 -71 -235 -111 -100 -26 150 92 26 117 147 -141 -65
6533f5m8R6J45M4P1l85J70p9k33L5K50q4Q1J82p5J9l7q8j69j08J58N5j16M46m2
$$ -65 -113 -17 128 172 243 -142 28 -51 -284 -249 1 -83 -2 180 105 124 87 -1 -170 -278 -120 -65 -181 265 223
6558B23j39k05K30j37j70j17J62L44j29L5R7Q8l79j26J74k39L92j26P0K30j49
$$ 223 84 -121 109 -28 -198 -315 -153 191 62 97 194 282 -97 -223 -49 -288 104 -22 48 278 129
6579A29k72J89r2j3j54jK46j39L11K52m59q6MM1j02QJ94K2J67k10j27Q1m1k50
$$ 129 -143 46 -46 -59 -213 -214 32 -107 204 456 -3 -89 -85 -44 -146 -138 56 78 245 35 -92 -11 -52 -302
6603c02J51J78L3m6K69j62q9R5q4j57j77J19m4M07L7k12J59k02M5j43K86j80j89
$$ -302 -151 27 60 14 283 121 32 127 43 -114 -291 -172 -216 191 228 16 175 -27 18 -125 161 -19 -208
6626b08K41J20N8k9r1j72o8J12j02J70J54n7N4J31k52j35j05J97q4Q2L0j1J70
$$ -208 33 153 211 182 91 -81 -149 -37 -139 31 185 128 182 313 61 -74 -179 18 -66 16 46 35 205
6649B05n7j44k02J85j79j81L69R0r0J56J02j36j47j24o8M3R1J9K56J15k58r5J45
$$ 205 148 4 -198 -13 -192 -373 -4 86 -4 152 254 118 -29 -153 -221 -178 -87 -68 188 303 45 -50 95
6672I5k09k13K52nJ49r9K11l2j70j29N8n6j89J78Q2J67r5Q9J33m3j06j86p3J22
$$ 95 -114 -327 -75 -80 69 -30 181 149 -21 -150 -92 -148 -337 -159 -77 90 -5 84 217 174 68 -118 -191 -69
6696f9K4Q8J98P9r3L6k55j86M8j73J56M10N0l52K40j34j21l7J7j79J29j42L86
$$ -69 -45 43 241 320 227 263 8 -178 -130 -303 -147 263 313 -39 201 67 -54 -91 -74 -253 -124 -266 120
6719A20k1J81l08q9J00j45j09rL08j57J95J78p2k00L1k05P3jJ84r5L06j37j72
$$ 120 99 280 -28 -117 -17 -162 -271 -280 28 -129 66 244 172 -28 3 -202 -129 -130 54 -41 265 128 -44
6742d4J98k58k54J68J04j42K52Q6m4l1J00j33j98O3J7Q0J55M7r3P9m7m40K52P1
$$ -44 154 -104 -358 -190 -86 -228 24 110 66 35 135 2 -196 -133 -116 -36 119 166 73 152 105 -335 -83 -12
6766a2k86J97J13J79J88k16J16m70J68o3j43J55J44J9J58J09l76o7J32k05QJ67
$$ -12 -298 -101 12 191 379 163 279 -191 -23 -86 -229 -74 70 89 247 356 -20 -87 45 -160 -152 15
6788A5nm2O2K74j94k98K41l60J18K42N9k27L02O1k95m8R9J6l35K09J25J7K29J0
$$ 15 10 -32 30 304 110 -188 53 -307 -189 53 112 -115 187 248 -47 -95 4 20 -315 -106 19 36 265 275
6812B75o8q4j64j49l4L25k89J40P8L12k71m8j31j04N2q5M5K83R4j21O9K1j32k37
$$ 275 207 123 -41 -190 -224 101 -188 -48 30 342 71 23 -108 -212 -160 -245 -200 83 177 56 125 146 14 -223
6836b23L2K2J70m2N5Q9J69k72m5l7j8k00J26L41Ro8J6L8mk07%j96L30q8rL20k87
$$ -223 -191 -169 1 -41 14 103 272 0 -45 -82 -100 -300 -174 167 176 108 124 162 158 -49 -49 -245 85 -3 -12 308 21
6863B1j44K8L16l14p2J96j29K7L54j6j78j04n3j32m9J80n5k9L91p8p2q8J11l57
$$ 21 -123 -95 221 -93 -165 31 -98 -71 283 267 89 -15 -68 -200 -249 -69 -124 -153 238 160 88 0 111 -246
6887b46J35N8NP4N2M4j44J2j61J24j37Nj09K93J46o7j31J82j58k42K3Q4j17J86
$$ -246 -111 -53 -48 26 78 122 -22 -10 -171 -47 -184 -179 -288 5 151 84 -47 135 -23 -265 -242 -158 -275 -89
6911h9K51Q3o4j85M6j25K01p8o2J4K81k46K21k42k6l2r5q2K59n5J99o4K36j89
$$ -89 162 245 181 -4 42 -83 118 40 -22 -8 273 27 248 6 -20 -52 -147 -229 30 -25 174 110 346 157
6935A57p7j5r8k45K17L3L1O9J52k78N6j15j29K13p9R8N4R6j2j75l0M0k16%J14
$$ 157 80 65 -33 -278 -61 -28 3 72 224 -54 2 -113 -242 -29 -108 -10 44 140 128 -47 -77 -37 -253 -253 -139
6960a39J52MQ3l4m2kRq2J10k66j50K91J66K9Q7j12r3j05m5K9j46L02J0j00K80
$$ -139 13 17 100 66 24 22 31 -51 59 -207 -357 -66 100 129 216 104 11 -94 -139 -110 -256 46 56 -44 236
6985B36j33j26k7J86k71P4K43L8j18J79j30J06k62j77J35jn0k1K20N8J4j22mj65
$$ 236 103 -23 -50 136 -135 -61 182 220 102 281 151 257 -5 -182 -47 -48 -98 -119 101 159 173 51 47 -118
7009a18J2j3J78q2k5J82j41Mj1l38L41l7n4NL31j42k4L06k03J1k48r0L3j11N8
$$ -118 -106 -119 59 -23 -48 134 -7 -3 -14 -352 -11 -48 -102 -97 234 92 68 374 171 182 -66 -156 -123 -234 -176
7034a76L42m5j70J78m58M07K9l44L37mj17K34L5l75J4R0j16Q8O3K2nK12j60k69
$$ -176 166 121 -49 129 -329 78 107 -237 100 96 -21 213 248 -127 -113 -23 -139 -51 12 34 29 241 81 -188
7058a88R2L4k71P5K52J72q1M4K22l37K4r9j33J25j05J54K92j07o5R8l17o6j3J58
$$ -188 -96 -62 -333 -258 -6 166 85 129 351 14 38 -61 -194 -69 -174 -20 272 165 100 198 -119 -185 -198 -40
7082d0N6k9J92j3q1j8k9j56k6L32k74j13M14k86R9J39l11J26j75J06J8R4J22j17
$$ -40 16 -13 179 166 85 67 38 -118 -144 188 -86 -199 215 -71 28 167 -144 -18 -193 -87 -69 25 147 30
7106C0P1K14l17j23R7j73l5K54J21oj68L57k11k01q2p3R2R6J76j36K04m6l25K05
$$ 30 101 315 -2 -125 -28 -201 -236 18 139 133 -35 322 111 -90 -172 -245 -153 -57 119 -17 187 141 -184 21
7130B1j34r9j33R7K35Q6O5Ol6P5k03j39J02Nl8J96J16O3l53KJ05q9J2LP1Q1J75
$$ 21 -113 -212 -345 -248 -13 73 138 144 108 183 -20 -159 -57 -52 -90 106 222 285 -68 -66 39 -50 -38 -35 36 117 292
7157B92l86Q6J01Pl59K62r4J55j7J78r7J03k97R3j87n1N7j7L58j86J49j38j34
$$ 292 -94 -8 93 100 -259 3 -91 64 47 225 128 231 -66 27 -160 -211 -154 -171 187 1 150 12 -122
7180a22n2J73k00K8J1J50J3J56J48j92j05j35p2jJ46J55K03k70P9K8k16N0j26
$$ -122 -174 -1 -201 -173 -162 -12 1 157 305 113 8 -127 -199 -200 -54 101 304 34 113 141 -75 -25 -151
7203a51j46J82K75J30k26N4q9J54m35OK34M1j83J12J68j55J15p4r4k52J32K18
$$ -151 -297 -115 160 290 64 118 29 183 -252 -246 -12 29 -154 -42 126 -29 86 12 -82 -334 -202 16
7225A6L0K8j15J51M8k09q0o9J34n7j20K81Q4n8J75k92L0l2Lk71K95K7QK79j27
$$ 16 46 74 -41 110 158 -51 -131 -200 -66 -123 -243 38 122 64 239 -53 -23 -55 -52 -323 -28 -1 7 286 159
7250A59j76j11J36l43J29Q2R1J00O9m6J58l24Q6j80J71Q9o6J33l5L7j25j34o2
$$ 159 -17 -128 8 -335 -206 -124 -33 67 136 90 248 -76 10 -170 1 90 24 157 122 159 34 -100 -162
7273a62j79J35R4O7K51r9j50K43j06j83j44L47j85m5Q3Q4R1j64M5p6j57J47m5
$$ -162 -341 -206 -112 -45 206 107 -43 200 94 -89 -233 114 -71 -116 -33 51 142 -22 23 -53 -210 -63 -108
7296a08L6J47q0J41R7j65k64J16j66J79m9K18Km4J66k33j23l3J08l2J19%j3O1
$$ -108 -72 75 -5 136 233 68 -196 -80 -246 -67 -116 102 104 60 226 -7 -130 -163 -55 -87 32 32 19 80
7320H0k4J0j03N3k33J16P7J6J02o0L18l43j72P9k41J30K51j66K44p3O5j88l5P5
$$ 80 56 66 -37 16 -217 -101 -24 -8 94 34 352 9 -163 -84 -325 -195 56 -110 134 61 126 -62 -97 -22
7344b2j23j12N7L2L53j51j10J61K1k10p1j35K4K03R6J23R7j03j93j06M6n3J04
$$ -22 -145 -257 -200 -168 185 34 -76 85 106 -104 -175 -310 -286 -83 13 136 233 130 -63 -169 -123 -176 -72
7367g2LK12j49J32k2J1k18l7l8O6j19L85N9k26K70l13P5j12j63J22K06RO7JK91
$$ -72 -69 143 -6 126 104 115 -103 -140 -178 -112 -231 154 213 -13 257 -56 19 -93 -256 -134 72 81 148 149 440
7392D40l04k26p3k49K00Q0P5J32k8L9N3o7kl24nJ81J69q1M3Q7j02j10%k1l3P0
$$ 440 136 -90 -163 -412 -212 -132 -57 75 47 86 139 72 70 -254 -259 -78 91 10 53 140 38 -72 -72 -93 -126 -56
7418e6J23ok4L0J41j56j05j42K61j81q1M70j56J19ml2j35j28%j27J66K20j33j66
$$ -56 67 61 37 67 208 52 -53 -195 66 -115 -196 274 118 237 233 201 66 -62 -62 -189 -23 197 64 -102
7442a02L43J15l91p7N6j71m9Q0K69J83n0%k22j4j83K6K89J05j12j20K84l26j7
$$ -102 241 356 -35 -112 -56 -227 -276 -196 73 256 206 206 -16 -30 -213 -187 102 207 95 -25 259 -67 -84
7465h4J79k22j84J26K66p9P3J64j11j52O4k00k44M43j12N1N1J35j46k2j29J47
$$ -84 95 -127 -311 -185 81 2 75 239 128 -24 40 -160 -404 39 -73 -22 29 164 18 -4 -133 14
7487A4j28J70r0K10Nj10K47j74j60r4J30Q6j40J7j0J89O7j3k51M1p3j18Q1K31
$$ 14 -114 56 -34 176 181 71 318 144 -16 -110 20 106 -34 -17 -27 162 229 216 -35 6 -67 -185 -104 127
7511A27%j58J16j07K3Pj57J47m01L66K9K52j29P3k62%k07lQ7L55j62K51r5K6j1
$$ 127 127 -31 85 -22 1 8 -149 -2 -403 -37 -8 244 115 188 -74 -74 -281 -284 -197 158 -4 247 152 178 167
7536A67k56k34J23J76lr3J99J95j27j37J42k49k48L46j1J26q7J57p8R0J1m4k12
$$ 167 -89 -323 -200 -24 -27 -120 79 274 147 10 152 -97 -345 1 -10 116 29 186 108 198 209 165 -47
7559d7k29J60M6O4N2J51r6j71l06J66J54j40J79J37KM1l2R3k69j28p0O3L40J08
$$ -47 -276 -116 -70 -6 46 197 101 -70 -376 -210 -56 -196 -17 120 122 163 131 224 -45 -173 -243 -180 160 268
7583B68k76K18Q3n54J8K13j50J20M8P2mQ0l7p1m4k15J47o1L40l26R5K53k83K17
$$ 268 -8 210 293 -261 -243 -30 -180 -60 -12 60 56 136 99 28 -16 -231 -84 -145 195 -131 -36 217 -66 151
7607A51k65J88l13J42J27m9L87j74n1J6n5j42j68L2P5n9K78Mj38qj16J01J20l58
$$ 151 -114 74 -239 -97 30 -19 368 194 143 159 104 -38 -206 -174 -99 -158 120 124 -14 -22 -138 -37 83 -275
7631b75J14J59J40j54O0L06l25p2j70J91k83L78Q1j05P5j7m6m8k55O2j8L72k20
$$ -275 -161 -2 138 -16 44 350 25 -47 -217 -26 -309 69 150 45 120 103 57 9 -246 -184 -202 170 -50
7654e0K0L91k80j28j05R5o5j4O0J29l3M4R2k62K08k15r2n9L13J6r1K32M6k22k16
$$ -50 -30 361 81 -47 -152 -57 -122 -136 -76 53 20 64 156 -106 102 -113 -205 -264 49 65 -26 206 252 30 -186
7679a86J30p5k6J12Q8L3j4n3jN4j94r6m0J32J82J95r5l6k10M6J31m3q1q1J55K72
$$ -186 -56 -131 -157 -45 43 76 62 9 8 62 -132 -228 -268 -136 46 241 146 110 -100 -54 77 34 -47 -128 27 299
7705B99k28q6K10k17j48J17P8p4J19j39K44j66K39j05l33J8N8j21M30j44j67L59
$$ 299 71 -15 195 -22 -170 -53 25 -49 70 -69 175 9 248 143 -190 -172 -114 -235 195 51 -116 243
7727B43M8l82J04j45j4J06j27J74M0K42j99m7j14l4J9l9pm9J49l2K85j17q1k50
$$ 243 291 -91 13 -132 -146 -40 -167 7 47 289 90 43 -71 -105 -86 -125 -132 -181 -32 -64 221 104 23 -227
7751b27M9K14k2k65M65k38j31K95j71k3J2J6r5J87J00k80K14j07M2j94L2l8J99
$$ -227 -178 36 14 -251 214 -24 -155 140 -31 -54 -42 -26 -121 66 166 -114 100 -7 35 -159 -127 -165 34
7774C4k59L71j54L33k34O5j88P2k34M8J19n4K41q9p6R4r2J06m78K71J1J13Q8k8
$$ 34 -225 146 -8 325 91 156 -32 40 -194 -146 -27 -81 160 71 -5 89 -3 103 -375 -104 -93 20 108 80
7798H0R3kl70m3R8J11j96K87J72j90L5n2N1l31K02Q4j14J38o9J34k17Q2L3n1j33
$$ 80 173 171 -199 -242 -144 -33 -229 58 230 40 75 23 74 -257 -55 29 -85 53 -16 118 -99 -17 16 -35 -168
7823a68%K36k09J56J95m9Ko7j46o2j2K70j46J55j56NJ87l27j3K52j71j11K14m9
$$ -168 -168 68 -141 15 210 161 163 96 -50 -112 -124 146 0 155 -1 4 191 -136 -149 103 -68 -179 35 -14
7847a4OQ8K3j81Pj41P3M0J55r5J08K10k30k1j25J8j89J41P1m0K01J6J34k89o2
$$ -14 -8 80 103 -78 -71 -212 -139 -99 56 -39 69 279 49 28 -97 -79 -268 -127 -56 -96 105 121 255 -34 -96
7872i6J09j71J09P2%J28j21J00qJ8k98J89j29k6K79O5j26P9qj98N4q2K5n3p6K78
$$ -96 13 -158 -49 23 23 151 30 130 122 140 -158 31 -98 -124 155 220 94 173 165 -33 21 -61 -36 -89 -165 113
7898A13m0Q5m0p2q1q4J35j89J20J81K3j2M8J02m15O4k00J62L9K91k45J54K0j78
$$ 113 73 158 118 46 -35 -119 16 -173 -53 128 151 139 187 289 -126 -62 -262 -100 -61 230 -15 139 159 -19
7922a9k6m1j50K13j85K24P6J64k17n9J04j22j50L3J03K79j41m3LJ87k39j69K7
$$ -19 -45 -86 -236 -23 -208 16 92 256 39 -20 84 -38 -188 -155 -52 227 86 43 46 233 -6 -175 -148
7945a48J99j03J10N3N2j24K2r7p8j66K40J8k3J45J2J1j9J10l55O0j16J06j91M47
$$ -148 51 -52 58 111 163 39 61 -36 -114 -280 -40 -22 -45 100 112 123 104 214 -141 -81 -197 -91 -282 165
7969A65j83q9J86r4p7k22K05j72K69O8M8JR0j85j99K77k34o6J47K44j65Q1O3p2
$$ 165 -18 -107 79 -15 -92 -314 -109 -281 -12 56 104 105 195 10 -189 88 -146 -212 -65 179 14 95 158 86
7993H6k08K3j09RJ35J11J82k8j30l5J2R9l18J93j75J70N9J35l92K90k74J87Qm1
$$ 86 -122 -99 -208 -199 -64 47 229 201 71 36 48 147 -171 22 -153 17 76 211 -181 109 -165 22 30 -11
8017a1pr5K10J42j55k03J33o5j03K9M2j24J26L15k13N1j92Q3L8k02J26J1J47j30
$$ -11 -18 -113 97 239 84 -119 14 -51 -154 -125 -83 -207 -81 234 21 72 -120 -37 1 -201 -75 -64 83 -47
8041d7J97r2J01j59p4R1n5K40p5j63K6Q7j2k62K74k25J03o3J03r1J88K03j29q2
$$ -47 150 58 159 0 -74 17 -38 202 127 -36 -10 77 65 -197 77 -148 -45 -108 -5 -96 92 295 166 84
8065H4j45r4l5P5K17n5J51Q2l83R5m7q7j95L79N5K6K1q0j14J6K3J32k08m2J25
$$ 84 -61 -155 -190 -115 102 47 198 280 -103 -8 -55 -142 -337 42 97 123 144 64 -50 -34 -11 121 -87 -129 -4
8090dq6K46k7j71J24l3l06L05j01j26M56j96O4M0j17K7j08o2j09L6N0J13P0nj2
$$ -4 -90 156 129 -42 82 49 -257 48 -53 -179 277 81 145 185 68 95 -13 -75 -184 -148 -98 15 85 80 68
8115F8k53P2K10j47j2K45k05K60q6j14L6j3k68J30K25P8j59o8M1j59K86l27P5
$$ 68 -185 -113 97 -50 -62 183 -22 238 152 38 74 61 -207 -77 148 226 67 -1 40 -119 167 -160 -85
8138h5qJ45N9j41L12j70pj79N6r6m9K36j08QL15j64l7kj09n4LL9QJ01K09r1n7
$$ -85 -93 52 111 -30 282 112 105 -74 -18 -114 -163 73 -35 -27 288 124 87 85 -24 -78 -75 -36 -28 73 282 191 134
8165A34j27L8j57n0J09J19M2j46Q0K09k40l9m3l8K7r5J79R4KoL5m1j56R8j42j6
$$ 134 7 45 -112 -162 -53 66 108 -38 42 251 11 -28 -71 -109 -82 -177 2 96 98 92 127 86 -70 28 -114 -130
8191a30
$$ Imaginary data points
##PAGE= N=2
##DATA TABLE= (X++(I..I)), XYDATA
0@%%%%%%%Qj6J6j6J6k4L2l2M0n4O2p2Q8j04J20j36J56j80K04k32K65l00L39l83
$$ 0 0 0 0 0 0 0 0 8 -8 8 -8 8 -16 16 -16 24 -30 32 -40 48 -56 64 -72 84 -96 108 -124 141 -159 180 -203
31b03M31m83N39o01O70p44Q28r20J020j130J248j381J530j697J884k093K331k605
$$ -203 228 -255 284 -317 353 -391 437 -483 537 -593 655 -726 804 -893 991 -1102 1229 -1376
49a376K923l298L751m303M998n912P165q989J1905j7324L0698j21260k10069K54623
$$ -1376 1547 -1751 2000 -2303 2695 -3217 3948 -5041 6864 -10460 20238 -101022 -311091 -56468
63e6468J98666r9907j83575M0389J13688k827o7128K3310K1131p6201m7874J22635
$$ -56468 142198 42291 -141284 -100895 12793 9966 -57162 -33852 -12721 -88922 -136796 -14161
75a4161J10146q2558j25926M8226J06400k5586r7380N152Q3287K4293n1013j3171
$$ -14161 95985 13427 -112499 -64273 42127 16541 -80839 -75687 7600 31893 -19120 -32291
87c2291M2240O783l6847O078K5895l2193k9646O1535O4711m1189p5333J2171O5491
$$ -32291 9949 16732 -20115 -14037 11858 -20335 -49981 11554 76265 35076 -40257 -28086 37405
100C7405O676n0596p562M4737m415n4679K1303Q9173o178j15320m3665R2739Q2288
$$ 37405 44081 -6515 -14077 30660 26245 -28434 -7131 82042 75864 -39456 -83121 9618 91906
113I1906m1691q9216r855O0680K8044k3546p456N848l1610k2605M7321N0135l2326
$$ 91906 50215 -39001 -48856 11824 39868 16322 8866 14714 -16896 -39501 7820 57955 25629
126B5629o6831l937O0684M0408l0846m7872Q843L5024q024k9795O027L0718J3095
$$ 25629 -41202 -45139 15545 55953 25107 -22765 -13922 21102 13078 -16717 -10690 20028 33123
139C3123j5108k5395j288L2915J7411l2700l9977M691M2693M0117m213m6074k6717
$$ 33123 18015 -7380 -8668 24247 41658 8958 -31019 -26328 16365 56482 52269 6195 -20522
152b0522K3873K5131j0714j9827l934J1663J9798R694j1119j5689j0831p843L693
$$ -20522 3351 28482 17768 -2059 -5993 5670 25468 35162 24043 8354 -2477 -10320 -6627
165f627Q202p796j659K7564J5694l2570m0140M324L6863J4826l7931m3858K2119
$$ -6627 1575 -6221 -7880 19684 35378 2808 -37332 -33008 3855 18681 -19250 -63108 -40989
178d0989O6375J7606m9397m7571k406K8210K4998m871k3066o592J3482J3605J1855
$$ -40989 25386 42992 -6405 -53976 -56382 -28172 -3174 -8045 -31111 -37703 -24221 -10616 1239
191A239j360k9745k9385J1115L5299K0043j0025k2591k542K0852P476j7257p134
$$ 1239 -121 -29866 -59251 -48136 -12837 7206 -2819 -25410 -27952 -7100 376 -16881 -24015
204b4015P756m613j970K2128J7543j2878k1802k381J5166R365j3188j3483J3814
$$ -24015 -16259 -20872 -22842 -714 16829 3951 -17851 -20232 -5066 4299 -8889 -22372 -8558
217h558J8441n004r950O32j190K557J1196p175k6672k190L2774K4047j7638l7757
$$ -8558 9883 4879 -5071 -4439 -5629 -3072 8124 949 -25723 -27913 4861 28908 11270 -26487
231b6487o013L7198K3764k6687l2442K294J7078J4165J3764m595k8459j2856K2323
$$ -26487 -32500 4698 28462 1775 -30667 -28373 -11295 2870 16634 12039 -16420 -29276 -6953
244f953K4371p981l2594j2520K9547L0069j0466k1855L478P760p048m440L540
$$ -6953 17418 9437 -23157 -35677 -6130 23939 13473 -8382 -4904 2856 -4192 -8632 -5092
257e092J563L171N824J239q46j72k275j055l232j2230M58K1360J1284j1478o632
$$ -5092 -3529 -358 5466 6705 5859 5687 3412 2357 -875 -13105 -12647 8713 19997 8519 1887
272A887M529l32n062l146l639J140O612M384L365L464n571q231l36m096q923P090
$$ 1887 6416 6084 1022 -2124 -5763 -4623 1989 6373 9738 13202 7631 -600 -936 -5032 -13955 -6865
288f865J6066j00q140j89L227J223k979j1777q919P774J2680O224J624o121r499
$$ -6865 9201 9101 961 772 3999 5222 2243 -9534 -18453 -10679 2001 8225 9849 3728 -5771
303e771K701O904q270q620N981O639J501M818K745m402m317m381m002K690M432
$$ -5771 -3070 3834 -4436 -13056 -7075 -436 1065 5883 8628 4226 -91 -4472 -8474 -5784 -1352
318a352j57L595M702m490j633P848l501j4262k227R008M719J584Q28j562R32J104
$$ -1352 -1509 2086 6788 2298 665 8513 5012 -9250 -11477 -2469 2250 3834 4662 3100 4032 5136
334E136m450l674p77l907K018J1135J339p757L694O951p705j0243M13L252K303
$$ 5136 686 -2988 -3765 -7672 -5654 5481 6820 -937 2757 9708 2003 -8240 -7827 -4575 -2272
349b272K747k46J505M273k057l706N3n571q002P897J1740l442m737O781L164n488
$$ -2272 475 229 1734 6007 3950 244 297 -5274 -13276 -5379 6361 2919 -1818 4963 8127 2639
365B639n306k684m21K792Q49J701P778J696o685M18J549r181n606Q696N105l417
$$ 2639 -2667 -5351 -5772 -2980 -2131 -430 7348 9044 2359 2777 4326 -4855 -10461 -1765 3340 -77
381g7J776N813J128l081o424n237K101K180k784M932Q733k930l932L979k206j0140
$$ -77 1699 7512 8640 5559 -865 -6102 -4001 -1821 -4605 327 9060 6130 2198 6177 3971 -6169
397f169r10M368P11J664L975K009J930k089p682k541L518l496k592Q210M553k526
$$ -6169 -7079 -2711 -2000 -336 3639 5648 7578 5489 -2193 -4734 -1216 -4712 -7304 906 5459 2933
413B933J924K042o228n501M37KQ64K823J771L773M748m652o991J728n07o353J893
$$ 2933 4857 6899 671 -4830 -4393 -4391 -3527 -704 1067 4840 9588 4936 -2055 -327 -834 -7187 -5294
430e294O883L08J58N081o81n457l601k798m22L059j74L05P177K327o392j339K346
$$ -5294 1589 1897 2055 7136 6455 998 -2603 -5401 -5823 -2764 -2938 -2633 4544 6871 479 -860 1486
447A486o867o249M660M500J05K083K220k53j022m048m844J165O4l352N424R174
$$ 1486 -5381 -11630 -6970 -2470 -2365 -282 1938 1685 663 -3385 -8229 -7064 -7000 -10352 -4928 4246
463D246k731n672L524Q39p502l775J726J623L357L109Q32K273r43o291o24K792
$$ 4246 1515 -4157 -633 206 -7296 -11071 -9345 -7722 -4365 -1256 -424 1849 906 -5385 -6009 -3217
479c217o035l485R946P602l720j315K298k083k900j324k907k2L630L538N519L073
$$ -3217 -9252 -12737 -2791 4811 1091 -224 2074 -9 -2909 -4233 -7140 -7162 -3532 6 5525 8598
495H598p976o475O080K740r407l889O221N233L516K451l499n666j050O16P10q81
$$ 8598 622 -5853 227 2967 -6440 -10329 -4108 1125 4641 7092 3593 -2073 -3123 -2507 -1797 -2678
511b678n039K78J2723P159q820p827N93P0l6J424l627k925P052R356P00p048r802
$$ -2678 -7717 -7439 5284 12443 3623 -4204 -3611 -3541 -3577 -2153 -5780 -8705 -1653 7703 8403 1355 -8447
528h447k381Q784L037q495k533Q942N230P06P54n533r090M68O888L207j193k867
$$ -8447 -10828 -2044 993 -7502 -10035 -1093 4137 4843 5597 64 -9026 -8558 -1670 1537 344 -2523
544b523N48R499N523q775r751M80K618K594N074q41l521M349O191k227n810m499
$$ -2523 -1975 7524 13047 4272 -5479 -4999 -2381 213 5287 4446 925 5274 11465 9238 3428 -1071
560a071k953L067P022K387m10m22k926J127O851m616j4723j553J3029Q175k476
$$ -1071 -4024 -957 6065 8452 8042 7620 4694 5821 12672 8056 -6667 -8220 4809 12984 10508
575A0508n528k626L737M573n236q785j218K444N279P791Q0q948j833N255n67m783
$$ 10508 4980 2354 6091 10664 5428 -3357 -4575 -2131 3148 10939 11019 2071 238 5493 4926 143
591A43k541k050K786R369M992n173o553r27M617L389r071j0501R808J7594l040
$$ 143 -2398 -4448 -1662 7707 12699 7526 973 46 4663 8052 -1019 -11520 -1712 15882 12842
606A2842j3877J070J0134q10j0461o728M517R030J088l645K861K461n892k569
$$ 12842 -1035 35 10169 9359 -1102 -7830 -3313 5717 6805 3160 6021 8482 2590 21
620B1L490m432p401M248R919K733l661n220k168M643J187q652q431K130R951J0053
$$ 21 3511 -921 -8322 -4074 5845 8578 4917 -303 -2471 2172 3359 -5293 -13724 -11594 -1643 8410
636H410j926j6152o529J4722Q183j5217j4893N842J3490N663m019n878Q0j47m487
$$ 8410 6484 -9668 -16197 -1475 6708 -8509 -23402 -17560 -4070 1593 -2426 -8304 -8224 -8371 -12858
651a2858O34N819m380q647O166J4184K580p976r336l597O364P880l326p338J755
$$ -12858 -12224 -6405 -10785 -19432 -13266 918 3498 -4478 -13814 -17411 -11047 -3167 -6493 -13831 -12076
666a2076Q580O690j00p978o485K762K808r31N274N217p730m467J4333J1654j3179
$$ -12076 -3496 3194 3094 -4884 -11369 -8607 -5799 -6730 -1456 3761 -3969 -8436 5897 17551 4372
681D372k2415q30K4095J6193j6780k3001R839K6840K657j9904j4409O26J0706
$$ 4372 -18043 -18873 5222 21415 4635 -18366 -8527 18313 20970 1066 -13343 -12717 -2011
694b011J1718R30j1073q157M276J3804Q576j3521k3078l49K1629J2718o681j2068
$$ -2011 9707 10637 -436 -8593 -4317 9487 18063 4542 -18536 -18885 2744 15462 8781 -3287
708c287n628Q191J4536j314j8949j1566J0014J7686M799j2428r713J0642J2981
$$ -3287 -8915 -724 13812 12498 -6451 -18017 -8003 9683 14482 2054 -7659 2983 15964
721A5964j0077j6673M378J2501k31n634L255Q097J001r487o180P337M611j0718
$$ 15964 5887 -10786 -6408 6093 5862 228 3483 11580 12581 3094 -3086 4251 8862 -1856
735a856n310J3626J0166o929q159J526L211k621o264j007P308J252p493L381J3776
$$ -1856 -7166 6460 16626 9697 1538 3064 6275 3654 -2610 -3617 3691 4943 -2550 831 14607
750A4607j654j8351q959Q966J1211K3j0275n994R505J1418k415r716q182l347
$$ 14607 12953 -5398 -14357 -5391 5820 5843 -4432 -10426 -921 10497 8082 -1634 -9816 -13163
764a3163O549J0038k999q786M167J0014k517r930j954N320K211p155m416J1296
$$ -13163 -6614 3424 425 -8361 -4194 5820 3303 -6627 -8581 -3261 -1050 -8205 -12621 -1325
778a325J2362o683j0676L156L441o357k34Q926k64j0019n97J6130J1669j4043
$$ -1325 11037 4354 -6322 -3166 275 -6082 -6316 2610 2346 -7673 -8270 7860 19529 5486
792E486k2949M067K4344K655k0245n940J5557J1665l001j0247p408K369P461J876
$$ 5486 -17463 -13396 10948 13603 -6642 -12582 2975 14640 11639 1392 -6016 -3647 3814 5690
806E690n463o106O33J3196J1176j0807k0250J25J5088N162o926p356k000O998
$$ 5690 227 -5879 -5246 7950 19126 8319 -11931 -11806 3282 8444 1518 -5838 -7838 -840
820h40J1254K736j1161j3917l461J2627J3755o076j5861K161J5612L305r187n944
$$ -840 10414 13150 1989 -11928 -15389 -2762 10993 4917 -10944 -8783 6829 10134 947 -4997
834d997j176K23N46K158N393M148m470o967L042N728k613o156k789N62P850Q939
$$ -4997 -6173 -5950 -5404 -3246 2147 6295 1825 -5142 -2100 3628 1015 -5141 -7930 -7368 482 9421
850I421k304r203j851M333J024l306m884j384Q126P995j900o229l511m87M655
$$ 9421 7117 -2086 -3937 396 1420 -1886 -6770 -8154 -28 7967 6067 -162 -3673 -4160 495
865D95L208r046j0147P817J7003M294j1811j3084p8J3005P035j0570j2159K753
$$ 495 3703 -5343 -15490 -7673 9330 13624 1813 -11271 -11349 1656 8691 -1879 -14038 -11285
879a1285J2642R584j179j2463r594O720R540l204p366J39N070N050J819l919l538
$$ -11285 1357 10941 9762 -2701 -12295 -5575 3965 761 -6605 -6466 -1396 3654 5473 1554 -1984
894a984J12j448j888J909J127J518N590J232p698l145O195K053o248n229K016
$$ -1984 -1872 -3320 -5208 -3299 -2172 -654 4936 6168 -1530 -4675 1520 3573 -2675 -7904 -5888
909e888P925O634k877o808j86K170j176j273j048k283M004P908j654o880Q87M808
$$ -5888 2037 8671 5794 -1014 -1200 970 -206 -1479 -2527 -4810 -806 7102 5448 -1432 -545 4263
925D263j325o525m518L355R311L858n783l655K207R80M44Qo554n256P062J0529
$$ 4263 2938 -3587 -8105 -4750 4561 8419 2636 -1019 1188 2168 2612 2620 -3934 -9190 -2128 8401
941H401O28o529l558J048L034j816n795K13N814J147o01K427L12l432j196j426
$$ 8401 9029 2500 -1058 -10 3024 1208 -4587 -4374 1440 2587 1986 4413 4725 1293 97 -1329
957a329m978N97P701L665k541l528m84M694K104p684p414L299O857K037J117m21
$$ -1329 -6307 -5710 1991 5656 3115 -413 -897 3797 5901 -1783 -9197 -5898 959 2996 4113 3692
973C692m006m2L651k518n945p72M334M970J340l662j085N234L58q146l732L786
$$ 3692 -314 -356 3295 777 -5168 -5940 -1606 3364 4704 1042 -43 5191 5549 -2597 -6329 -2543
989b543K949K287K491j951k938K929K831k871n719l684L329Q613K102n943q18
$$ -2543 406 2693 5184 3233 295 3224 6055 3184 -2535 -6219 -2890 5723 7825 1882 1064
1004A064M706j354m856j056K9m69K834K820l14J51N86j111j939l457l716L714
$$ 1064 5770 4416 -440 -1496 -1467 -1936 898 3718 3404 3555 4141 3030 1091 -2366 -6082 -2368
1020b368P103j825m554K652M342j472l821l208k445K174L763R02L47P13r94K99
$$ -2368 4735 2910 -1644 1008 5350 3878 57 -3151 -5596 -3422 341 1243 1590 2303 1309 1608
1036A608P11m203m294L236L803j235Q22L016N88r68j483m471j121K945J643NJ014
$$ 1608 2319 -1884 -6178 -2942 861 -374 448 3464 4052 3084 1601 -2870 -3991 -1046 597 602 1616
1053A616N87J147K661k138o754r67L672J87J64K743L09k7J445r67m807j760L25
$$ 1616 2203 3350 6011 3873 -2881 -3848 -176 11 175 2918 3227 3200 4645 3678 -1129 -2889 -2564
1070b564J369K386N43j715L725K787n051n140J238M12j445K206K603q4J77J475
$$ -2564 -1195 1191 1734 19 3744 6531 1480 -3660 -2422 -2010 -3455 -1249 1354 1270 1447 2922
1086B922q59j903l516l249L364M695j600j206M863R31m760j574J394k302j688
$$ 2922 2063 160 -3356 -6605 -3241 1454 -146 -1352 3511 4442 -318 -1892 -498 -2800 -4488
1101d488J457K714L431N30k505m73J075l499k988L161J545k389K583N208q43l767
$$ -4488 -3031 -317 3114 3644 1139 666 1741 -1758 -4746 -1585 -40 -2429 154 5362 4519 752
1117G52j426k29j48q66j921J936N018L66j644Q77j090n021K30K849k031j962L783
$$ 752 -674 -903 -1051 -1917 -3838 -1902 3116 3482 1838 2715 1625 -3396 -3166 -317 -2348 -4310 -527
1134e27M475J83k116l923j114K039j185k572K426L217k72K188K104m164m600J491
$$ -527 3948 4131 2015 -1908 -3022 -983 -2168 -4740 -2314 903 631 2819 4923 759 -3841 -2350
1150b350J635j412k75J035K945L592q55m172q49J76j944L28L115q60m12M739K417
$$ -2350 -715 -2127 -2402 -1367 1578 5170 4315 143 -706 -530 -2474 -2146 969 109 -303 4436 6853
1167F853l644l220j135k58J257R33o12J736K819j73l93K80m886l650L568L104
$$ 6853 3209 -11 -1146 -1404 -147 786 174 1910 4729 4556 4163 4443 -443 -4093 -525 2579
1183B579j359J83K629K16O8p6k953l083l58J012L604K913k405j870M083J547n285
$$ 2579 1220 1403 4032 4248 4316 4240 1287 -1796 -2154 -1142 2462 5375 2970 1100 5183 6730 1445
1200A445l781P90R63K006K850m6j565N06O63n44j995m799j142O323M077k634j579
$$ 1445 -2336 -1546 -583 1423 4273 4227 2662 3168 3831 3287 1292 -3507 -4649 1674 5751 3117 1538
1217A538K206m58j598J71k641l211J839N048K961j075l843j273M096L31p044k455
$$ 1538 3744 3286 1688 1859 -782 -3993 -2154 2894 5855 4780 937 -336 3760 4091 -2953 -5408
1233e408N016K866k03J622l39k519j46N8k043j430q62J542N168K560m026k352
$$ -5408 -392 2474 2271 3893 3554 1035 889 947 -1096 -2526 -3388 -1846 3322 5882 1856 -496
1249d96K446o98k654n74o25m36M520M513j709m028j377J401J753k216n227J267
$$ -496 1950 1252 -1402 -1976 -2601 -3037 1483 5996 4287 259 -1118 283 2036 -180 -5407 -4140
1265d140P442K298k966m36l39l207P1K029j468k038J245L558M010K29o208m276
$$ -4140 3302 5600 2634 2198 1859 -1348 -1277 752 -716 -2754 -1509 2049 6059 6288 80 -4196
1281d196L153K482k015j552l13J532N241L397n894o536J116K954O96j272j816
$$ -4196 -1043 1439 -576 -2128 -2441 -909 4332 7729 1835 -4701 -3585 -631 65 -1207 -3023
1296c023J096M265J981j692j851l521m525K913P969j174o916P0P164M783l296
$$ -3023 -1927 2338 4319 2627 776 -2745 -7270 -4357 3612 2438 -4478 -4408 2756 7539 4243
1311D243q879m731N762O246q41k437j072P45M292L629n361q717L76N275M149J341
$$ 4243 -4636 -9367 -3605 2641 1800 -637 -1709 -964 3328 6957 1596 -7121 -6745 -1470 2679 4020
1327D020k729l715K403M975k38m995o558j258P953Q660m124r177J917P662R90
$$ 4020 1291 -2424 -21 4954 4716 -279 -6837 -8095 -142 8518 4394 -4783 -2866 4796 5786
1342E786o276o004n79O025M930q49k673M58o98k3J720k183m654J31M251L841J973
$$ 5786 -490 -6494 -7073 -1048 3882 3033 360 818 120 97 1817 -366 -5020 -4889 -638 3203 5176
1359E176j934n761J85N057p03n841j306L839M774J979k614k635K113k76m316j85
$$ 5176 3242 -2519 -2334 2723 2020 -3821 -5127 -1288 3486 5465 2851 216 2329 2053 -2263 -2448
1375b448M113m94j874K996L422Lk490l761k009K914J745j681N0K108J280J819
$$ -2448 1665 1171 -703 2293 5715 5718 3228 -533 -2542 372 2117 436 486 2594 3874 5693
1391E693p84n512k383L866J316l509R97M394J368j913j826m90N21k185l650K801
$$ 5693 4909 -603 -2986 880 2196 -1313 -316 4078 5446 3533 1707 1217 1738 -447 -4097 -1296
1407a296N929k208l831M503L517n843n853J752M617K01m185j102O569N454n129
$$ -1296 4633 2425 -1406 3097 6614 771 -5082 -3330 1287 1488 -2697 -3799 2770 8224 3095
1422C095p032L91K839L31L07j375k110L848O464r57o506m105R85M451J913l904
$$ 3095 -3937 -3546 -707 -376 -69 -1444 -3554 294 6758 5801 -705 -4810 -3825 626 2539 -1365
1438a365k291M152L809L5r10m118o079J505Q476J414o369l130N266P385l26r733
$$ -1365 -3656 496 4305 4340 3430 -688 -6767 -5262 3214 4628 -1741 -4871 395 7780 7454 -2279
1454b279o376N302O149j305k953O77J065K541J652l701m585n91J201J361K825
$$ -2279 -8655 -3353 2796 1491 -1462 -785 280 2821 4473 772 -3813 -4404 -3203 -1842 983
1469I83P17j732j93J065r6p33j999m051J259O316J479k577M25M46j756j009O88
$$ 983 1700 -32 -225 840 744 11 -1988 -6039 -4780 1536 3015 438 863 1309 -447 -1456 -768
1486g68q57j256m39K181N588J931o253m686L663L629k591l248r08K438O105K672
$$ -768 -1625 -2881 -3320 -1139 4449 6380 127 -4559 -896 2733 142 -3106 -4014 -1576 4529 7201
1502G201m884n677Q37L446J366k656m610J687P837K866m999l286n12n46J339J748
$$ 7201 2317 -3360 -2523 923 2289 -367 -4977 -3290 4547 7413 2414 -872 -1384 -1930 -591 1157
1518A157k413j923L108M228J073k904n267j033M522N10m284K48M900J570j191
$$ 1157 -1256 -3179 -71 4157 5230 2326 -2941 -3974 548 1058 -3226 -2978 1922 3492 2301
1533B301j519j714m78J321j911k241K315L962J418p24k718k159J794J702l726
$$ 2301 782 -932 -1410 -89 -2000 -4241 -1926 2036 3454 2730 12 -2147 -353 1349 -2377
1548b377k610L167L458J305N65k057l349J108J932j758k661J62L044M657O21n174
$$ -2377 -4987 -1820 1638 2943 3508 1451 -1898 -790 1142 -616 -3277 -3115 -71 4586 5207 33
1564C3k524L372Q52l154j633O81J545M074K157l597l674K54K057J58k341k626
$$ 33 -2491 881 1733 -1421 -3054 -2373 -828 3246 5403 1806 -1868 -1614 443 601 -1740 -4366
1580d366K729N700j87l935K66J218k960j935J609O61J77J629J073J25p93j628
$$ -4366 -1637 4063 3876 -59 207 1425 -1535 -3470 -1861 -1200 -1023 606 1679 1804 1011 -617
1596f17RM06l314k355N487N677l443m153J829K943j014l506k542J164L555J914
$$ -617 -608 -202 -3516 -5871 -384 5293 1850 -2303 -474 2469 1455 -2051 -4593 -3429 126 2040
1612B040P5k5j587j827K429R62n702k814N789N007j291l348k27K026J223l316
$$ 2040 2115 2090 503 -1324 1105 2067 -3635 -6449 -660 4347 3056 -292 -519 1507 2730 -586
1628e86l963J170L203J137J713P21l521j338L449L5m870k007K886L874J567j840
$$ -586 -4549 -3379 -176 961 2674 3395 -126 -1464 1985 2020 -2850 -4857 -1971 1903 3470 1630
1644A630j920J605J014l395k466J437J072O98K186m8j634J225J220k854l130j26
$$ 1630 -290 1315 2329 -1066 -3532 -2095 -1023 -325 1861 1813 179 1404 2624 -230 -3360 -3486
1660c486J500L429J773k626j253K747Q16k501k293j377K47M174K268k486r93K403
$$ -3486 -1986 1443 3216 590 -663 2084 2900 399 -1894 -3271 -3024 1150 3418 932 -61 2342
1676B342J88k193k024j334R35L139P09j102O15R58o92o77j655l599J122M811R56
$$ 2342 2530 337 -1687 -3021 -2086 1053 1762 660 1275 2233 1541 864 -791 -4390 -3268 1543 2499
1693B499k583J97J784O07j159l023k384J688K129L31Q01R57j405j50J271k369
$$ 2499 -84 113 1897 2504 1345 -1678 -4062 -2374 -245 86 887 1844 439 289 1560 -809
1709h09l809J474L074O37q43L63J139J581j509m193o55K024L39J15J988J45j064
$$ -809 -4618 -3144 -70 567 -276 87 1226 2807 1298 -2895 -3550 -1526 -1187 -1072 916 1061 -3
1726cJ801M94l211k644N35J588J714L65p96J299J880j887l108M24J37j273J688
$$ -3 1798 2292 -919 -3563 -3028 -1440 274 639 -157 1142 3022 1135 -1973 -1549 -1412 -2685 -997
1743i97J994o86N69J843j172k869j464J66J628J205j153j00L237J216l179j326
$$ -997 997 311 880 2723 1551 -1318 -2782 -2616 -988 217 -936 -1036 2201 3417 238 -1088
1759a088J06j803R7K281P02q14J683J288n75j855k604k05K415M21k263J512L953
$$ -1088 -982 -2785 -2688 -407 295 -519 1164 2452 1877 22 -2582 -2787 -372 49 -2214 -702 3251
1776C251l19k232k85j381j977J238J730k22j53J193J520J156k321m166N91L120
$$ 3251 2932 700 415 -966 -2943 -1705 25 -197 -350 843 2363 3519 1198 -2968 -2377 743
1792G43j272j746K692K097m18l07n85j962j079K06K47J018O57l02J904K111k990
$$ 743 -529 -2275 417 2514 2096 1789 1204 -758 -1837 -1631 -1384 -366 291 -11 1893 4004 1014
1809A014l584Q17J252j150J30J432M30J087J084j273j667j218j094R53J972m55
$$ 1014 -2570 -1753 -501 -1651 -1521 -89 341 1428 2512 1239 -428 -1646 -2740 -1787 185 -270
1825b70p26K836J275k278j219nj484q15J855J243J97J083j75k89K18j869k195
$$ -270 -996 1840 3115 837 -382 -387 -1871 -2686 -831 412 609 1692 1517 1228 1446 -423 -2618
1842b618Q26J185j57J467K000j132j095J036p71k522n54N38J372K071M94j197
$$ -2618 -1792 -607 -764 703 2703 1571 476 1512 741 -1781 -2335 -1797 -425 1646 2140 943
1858I43M63j25j849n00K58j806n0L829J911j671j215K67l7o73j174j592J103K394
$$ 943 1406 1281 -568 -1068 -810 -2616 -2666 1163 3074 1403 188 455 418 -255 -1429 -3021 -1918 476
1876D76P31P02K86k333j529K053k86l033m5K785K006L95n76j480l53J43j185k89
$$ 476 1207 1909 2195 -138 -1667 386 100 -2933 -2978 -193 1813 2208 1632 152 -201 -58 -1243 -1532
1894a532O99m71R76L403N56l382j314J088j87r31l74L35J513K052N39j210j053
$$ -1532 -833 -1304 -328 3075 3631 249 -1065 23 -164 -1095 -1469 -1134 379 2431 2970 1760 707
1911G07k016o64J870L43k081O43L457O21j414p56j507r89K99N89L95N91j6O39
$$ 707 -1309 -1973 -103 240 -1841 -1198 2259 2880 1466 710 -797 -1786 -1487 -898 -503 88 72 711
1929G11K562q24m247j555J931R84o77R17M60o7J917N61k650k341o36R57K656N15
$$ 711 3273 2449 -1798 -3353 -1422 -438 -1115 -198 262 195 2112 2673 23 -2318 -2954 -1997 659 1174
1947A174j730N74K581k12k078n41j588j258K041K867j13j717J97J347J180j688
$$ 1174 -556 18 2599 2387 309 -232 -1820 -3078 -1037 1830 1717 0 197 1544 2724 1036
1963A036m358k29L492J340r17O03O86p65K22J45k413j732P32J883J824M32j163
$$ 1036 -3322 -3551 -59 1281 364 967 1653 888 1110 1255 -1158 -2890 -2158 -275 1549 1981 818
1980H18p93J111p17j866j17k97n55K502L116j240k467K43R13n17j674j481J047
$$ 818 25 1136 419 -1447 -1564 -1861 -2416 86 3202 1962 -505 -262 651 134 -1540 -3021 -1974
1997a974K965P39j225J186L92k642j133J215k35j024J187J710P10N62j124j910
$$ -1974 991 1730 505 1691 2083 -559 -1692 -477 -712 -1736 -549 1161 1871 2433 1309 -601
2013f01J82K8j089L02J020L46J564J532k145k284R25L10j765m90J645J506P93
$$ -601 -419 -391 -1480 -1178 -158 188 1752 3284 1139 -1145 -220 90 -1675 -2165 -520 986 1779
2030A779k17r17L61n54k574l29K318J27j653K296K321j100j800j391l97J006K70
$$ 1779 1562 645 1006 452 -2122 -2451 -133 -6 -1659 637 2958 1858 58 -1333 -1730 -724 -454
2047d54j107K58K290J113j54o03k531j421K182P56j891J13K627Q88k88j00j529
$$ -454 -1561 -1303 987 2100 1946 1343 -1188 -2609 -427 329 -1562 -1449 1178 2066 1778 1678 149
2064A49j902j0O34J364R99j724n87L461K077l951l649P92J655J117l3p95J30K362
$$ 149 -1753 -1763 -1129 235 1234 -490 -1077 2384 4461 510 -3139 -2347 -692 425 392 -403 -273 2089
2082B089O31j678j772j479p13K518J686j072j15J414k70o44K54j731k657Q90K797
$$ 2089 2720 1042 -730 -2209 -2922 -404 1282 210 95 1509 1239 595 849 -882 -3539 -2649 148
2099A48J292j2j328j89J665k58l300j052K141O15k50J712J232j266j062j36n60
$$ 148 1440 1428 100 -89 1576 1318 -1982 -3034 -893 -278 -528 1184 2416 1150 88 -48 -608
2116f08Q2q23q79J515L005M24j335n57j363l75J459m05k577N60L537J147n81j412
$$ -608 -526 -1349 -2228 -713 2292 2716 1381 824 -539 -914 545 140 -2437 -1877 1660 2807 2226 814
2134H14j324l81M07m36k66Q31L9N39K845K30l971k457K117J209r85n08L68K035
$$ 814 -510 -891 -484 -920 -1186 -355 -316 223 3068 3298 -673 -3130 -1013 196 -789 -1297 -929 1106
2152A106J541q51k093l40q04p30J374Q54q39R04K311k89k416n61M00r41j84O2
$$ 1106 2647 1796 -297 -637 -1441 -2171 -797 57 -782 122 2433 2144 -272 -833 -433 -1374 -1558 -1496
2170a496J196J969R0j441P26m1k228o23J570j11r76K285K287r05k076r32K34J035
$$ -1496 -300 1669 1759 318 1044 1003 -1225 -1848 -278 -389 -1365 920 3207 2302 226 -706 -472 563
2188E63j087k072J433L392N78j313m88j169j032R72J87j602m6K027J667O47j369
$$ 563 -524 -2596 -1163 2229 2807 1494 1006 -163 -1195 -223 -36 -1638 -1684 343 2010 2657 1288
2205A288k309l6J040r85j108J237J044N18J356k32k231r55N22l08p05L89J066
$$ 1288 -1021 -1057 -17 -1002 -2110 -873 171 689 2045 1813 -418 -1373 -851 -1159 -1864 -1475 -409
2222d09J225R87j040j294L04j25j595K17P49R10R15J253j353j324J141j84j808
$$ -409 816 1803 763 -531 -227 -352 -1947 -1730 -981 -71 844 2097 744 -580 561 377 -1431
2239a431r29O22J805K051j28j750j4O23j127j128J57n66M79L088J082k020j430
$$ -1431 -2360 -1738 67 2118 1990 240 226 849 -278 -1406 -1249 -1815 -1336 1752 2834 814 -616
2256f16N87N14n20j911j118K248K701n84j126O08n18j159K96o67j533J140K568
$$ -616 -29 485 -35 -1946 -3064 -816 1885 1301 175 783 265 -894 -598 -1265 -2798 -1658 910
2273I10Q58p48j010l39N37l87k454l19K565J360p41N50K89r82k91J51j777q34
$$ 910 1768 1020 10 -329 208 -179 -2633 -2952 -387 973 232 782 1071 89 -202 -51 -1828 -2662
2291b662J423K227P42m80j313J95J727j748k776K27K178Q74M71M95q75m52J054
$$ -2662 -1239 988 1730 1250 -63 132 1859 111 -2665 -2438 -260 614 1085 1580 705 253 1307
2308A307o70k201r34R12K197J608r70j704J159J229k380j547M18N12L04J785O01
$$ 1307 637 -1564 -2498 -1586 611 2219 1249 -455 704 1933 -447 -1994 -1576 -1064 -760 1025 1626
2325A626j261m26L68lj349j742l57L140K027k256p98K191K04k095j224r0L71P69
$$ 1626 365 -61 307 304 -1045 -2787 -3144 -4 2023 -233 -1031 1160 1364 -731 -1955 -2045 -1674 -905
2343i05J146K16K92p3n09L88q76k504k05L587R13j595m3J615J82j167j623p50
$$ -905 241 457 749 676 167 555 -321 -2825 -3030 557 1470 -125 -168 1447 1629 462 -1161 -1911
2361a911M98J173O36P32M52q06k48J386j647k941M75K968N7p46N12O63N38n56
$$ -1911 -1413 -240 396 1128 1580 774 526 1912 265 -2676 -2201 767 824 78 590 1253 1791 1235
2379A235j957j130J089M18R4R56L4m95J573K54k780j790R95J368J90o9J52P47
$$ 1235 -722 -1852 -763 -345 -251 705 739 244 1817 2071 -709 -2499 -1504 -136 54 -15 137 884
$$ [...]
8191G5
##END NTUPLES=NMR FID
##END=
