##TITLE=1H_Pr 5-4-2
 CDCl3, 8 sc, 
 27.6.2019
##JCAMPDX= 6.0         $$ Bruker NMR JCAMP-DX V2.0
##DATA TYPE= NMR FID
##DATA CLASS= NTUPLES
##ORIGIN= UXNMR, Bruker Analytische Messtechnik GmbH
##OWNER= root
$$ XWIN-NMR		Version 3.5
$$ Thu Jun 27 16:21:06 2019 Russian Standard Time (UT+4h)  she@DPX200
##.OBSERVE FREQUENCY= 200.13155
##.OBSERVE NUCLEUS= ^1H
##.DELAY= (6, 6)
##.ACQUISITION MODE= SIMULTANEOUS
##.ACQUISITION SCHEME= undefined
##.AVERAGES= 8
##.DIGITISER RES= 18
##SPECTROMETER/DATA SYSTEM= spect
##.PULSE SEQUENCE= zg30
##.SOLVENT NAME= CDCl3
##.SHIFT REFERENCE= (INTERNAL, CDCl3, 0, 15.7039)
##AUDIT TRAIL= $$ (NUMBER, WHEN, WHO, WHERE, WHAT)
$$ ##TITLE= Audit trail, XWIN-NMR		Version 3.5
$$ ##JCAMPDX= 5.01
$$ ##ORIGIN= Bruker BioSpin GmbH
$$ ##OWNER= she
$$ F:/spectra/data/she/nmr/H-F/1/audita.txt
$$ ##AUDIT TRAIL=  $$ (NUMBER, WHEN, WHO, WHERE, WHAT)
(   1,<2019-06-27 16:19:23.43 +0400>,<she>,<DPX200>,
      <created by zg, POWCHK disabled, PULCHK disabled
       configuration hash MD5:
       00 E9 B6 7A A2 85 ED C7 34 08 36 98 17 FE 4E 26
       data hash MD5: 16K
       FF 5C 23 2C E1 3D 04 54 7D 30 84 F6 0A FC 39 30>)
$$ ##END=
$$ 
$$ hash MD5
$$ 87 1E 67 4A 9B E0 9E FD F3 D5 69 A2 74 23 6A 6A
##$RELAX= 
##$RELAX= 
##$RELAX= 
##$RELAX= 
##$RELAX= 
##$RELAX= 
$$ Bruker specific parameters
$$ --------------------------
##$DU= <F:/spectra>
##$EXPNO= 1
##$NAME= <H-F>
##$PROCNO= 1
##$TYPE= <nmr>
##$USER= <she>
##$AMP= (0..31)
100 100 100 100 100 100 100 100 100 100 100 100 100 100 100 100 100 100 
100 100 100 100 100 100 100 100 100 100 100 100 100 100 
##$AQSEQ= 0
##$AQ_mod= 1
##$AUNM= <au_zg>
##$AUTOPOS= <>
##$BF1= 200.13
##$BF2= 200.13
##$BF3= 200.13
##$BF4= 200.13
##$BF5= 200.13
##$BF6= 200.13
##$BF7= 200.13
##$BF8= 200.13
##$BYTORDA= 1
##$CFDGTYP= 0
##$CFRGTYP= 5
##$CHEMSTR= <none>
##$CNST= (0..31)
1 1 145 1 1 1 1 1 1 1 1 1 1 1 1 1 1 1 1 1 1 1 1 1 1 1 1 1 1 1 1 1 
##$CPDPRG= <>
##$CPDPRG1= <>
##$CPDPRG2= <>
##$CPDPRG3= <>
##$CPDPRG4= <mlev>
##$CPDPRG5= <mlev>
##$CPDPRG6= <mlev>
##$CPDPRG7= <mlev>
##$CPDPRG8= <mlev>
##$CPDPRGB= <>
##$CPDPRGT= <>
##$D= (0..31)
0 1.2 0 0 0 0 0 0 0 0 0 0.03 0 0 0 0 0 0 0 0 0 0 0 0 0 0 0 0 0 0 0 0 
##$DATE= 1561637962
##$DBL= (0..7)
120 120 120 120 120 120 120 120 
##$DBP= (0..7)
150 150 150 150 150 150 150 150 
##$DBP07= 0
##$DBPNAM0= <>
##$DBPNAM1= <>
##$DBPNAM2= <>
##$DBPNAM3= <>
##$DBPNAM4= <>
##$DBPNAM5= <>
##$DBPNAM6= <>
##$DBPNAM7= <>
##$DBPOAL= (0..7)
0.5 0.5 0.5 0.5 0.5 0.5 0.5 0.5 
##$DBPOFFS= (0..7)
0 0 0 0 0 0 0 0 
##$DE= 6
##$DECBNUC= <off>
##$DECIM= 24
##$DECNUC= <off>
##$DECSTAT= 4
##$DIGMOD= 1
##$DIGTYP= 9
##$DL= (0..7)
0 120 120 120 120 120 120 120 
##$DP= (0..7)
150 150 150 150 150 150 150 150 
##$DP07= 0
##$DPNAME0= <>
##$DPNAME1= <>
##$DPNAME2= <>
##$DPNAME3= <>
##$DPNAME4= <>
##$DPNAME5= <>
##$DPNAME6= <>
##$DPNAME7= <>
##$DPOAL= (0..7)
0.5 0.5 0.5 0.5 0.5 0.5 0.5 0.5 
##$DPOFFS= (0..7)
0 0 0 0 0 0 0 0 
##$DQDMODE= 0
##$DR= 18
##$DS= 0
##$DSLIST= <SSSSSSSSSSSSSSS>
##$DSPFIRM= 0
$$ [...]
##$SUBNAM2= <"">
##$SUBNAM3= <"">
##$SUBNAM4= <"">
##$SUBNAM5= <"">
##$SUBNAM6= <"">
##$SUBNAM7= <"">
##$SUBNAM8= <"">
##$SUBNAM9= <"">
##$SW= 24.9336996594482
##$SWIBOX= (0..15)
0 0 2 0 0 0 0 0 0 0 0 0 0 0 0 0 
##$SW_h= 4990.01996007984
##$TD= 16384
##$TD0= 1
##$TE= 0
##$TE2= 300
##$TE3= 300
##$TEG= 300
##$TL= (0..7)
0 120 120 120 120 120 120 120 
##$TP= (0..7)
150 150 150 150 150 150 150 150 
##$TP07= 0
##$TPNAME0= <>
##$TPNAME1= <>
##$TPNAME2= <>
##$TPNAME3= <>
##$TPNAME4= <>
##$TPNAME5= <>
##$TPNAME6= <>
##$TPNAME7= <>
##$TPOAL= (0..7)
0.5 0.5 0.5 0.5 0.5 0.5 0.5 0.5 
##$TPOFFS= (0..7)
0 0 0 0 0 0 0 0 
##$TUNHIN= 0
##$TUNHOUT= 0
##$TUNXOUT= 0
##$USERA1= <user>
##$USERA2= <user>
##$USERA3= <user>
##$USERA4= <user>
##$USERA5= <user>
##$V9= 5
##$VALIST= <valist>
##$VCLIST= <CCCCCCCCCCCCCCC>
##$VD= 0
##$VDLIST= <DDDDDDDDDDDDDDD>
##$VPLIST= <PPPPPPPPPPPPPPP>
##$VTLIST= <TTTTTTTTTTTTTTT>
##$WBST= 1024
##$WBSW= 4
##$XGAIN= (0..3)
0 0 0 0 
##$XL= 0
##$YL= 0
##$YMAX_a= 901843
##$YMIN_a= -1178980
##$ZGOPTNS= <>
##$ZL1= 120
##$ZL2= 120
##$ZL3= 120
##$ZL4= 120
##$ABSF1= 10
##$ABSF2= 0
##$ABSG= 5
##$ABSL= 3
##$ALPHA= 0
##$AQORDER= 0
##$ASSFAC= 0
##$ASSFACI= 0
##$ASSFACX= 0
##$ASSWID= 0
##$AUNMP= <proc_1d>
##$AZFE= 0.1
##$AZFW= 0.1
##$BCFW= 1
##$BC_mod= 2
##$BYTORDP= 1
##$COROFFS= 0
##$CY= 11.3945322036743
##$DATMOD= 1
##$DC= 2
##$DFILT= <>
##$DTYPP= 0
##$F1P= 18.9103706918063
##$F2P= -1.10871071338519
##$FCOR= 0.5
##$FTSIZE= 0
##$FT_mod= 4
##$GAMMA= 1
##$GB= 0.15
##$INTBC= 1
##$INTSCL= 1
##$ISEN= 128
##$LB= 0.24
##$LEV0= 0
##$LPBIN= 0
##$MAXI= 10000
##$MC2= 0
##$MEAN= 0
##$ME_mod= 0
##$MI= 1.114404
##$NCOEF= 0
##$NC_proc= 0
##$NLEV= 6
##$NOISF1= 3.799351
##$NOISF2= 2.8
##$NSP= 1
##$NTH_PI= 0
##$NZP= 0
##$OFFSET= 15.70392
##$PC= 1
##$PHC0= -8499.63
##$PHC1= 15.00098
##$PH_mod= 1
##$PKNL= yes
##$PPARMOD= 0
##$PSCAL= 0
##$PSIGN= 0
##$REVERSE= no
##$SF= 200.130013532006
##$SI= 16384
##$SIGF1= 3
##$SIGF2= 2
##$SINO= 400
##$SIOLD= 16384
##$SREGLST= <1H.CDCl3>
##$SSB= 0
##$STSI= 0
##$STSR= 0
##$SW_p= 3612.71676300578
##$SYMM= 0
##$S_DEV= 0
##$TDeff= 0
##$TDoff= 0
##$TI= <>
##$TILT= no
##$TM1= 0
##$TM2= 0
##$TOPLEV= 0
##$USERP1= <user>
##$USERP2= <user>
##$USERP3= <user>
##$USERP4= <user>
##$USERP5= <user>
##$WDW= 1
##$XDIM= 8192
##$YMAX_p= 0
##$YMIN_p= 0
$$ End of Bruker specific parameters
$$ ---------------------------------
##NTUPLES= NMR FID
##VAR_NAME=  TIME,          FID/REAL,        FID/IMAG
##SYMBOL=    X,             R,               I
##VAR_TYPE=  INDEPENDENT,   DEPENDENT,       DEPENDENT
##VAR_FORM=  AFFN,          ASDF,            ASDF
##VAR_DIM=   8192,          8192,            8192
##UNITS=     SECONDS,       ARBITRARY UNITS, ARBITRARY UNITS
##FACTOR=    0.0002004,     1,               1
##FIRST=     0,             0,               0
##LAST=      1.6414764,     0,               0
##MIN=       0,             -1178980,        0
##MAX=       1.6414764,     901843,          0
$$ Real data points
##PAGE= N=1
##DATA TABLE= (X++(R..R)), XYDATA
$$ plain form
0 0 0 0 0 -8 16 -16 16 -32 40 -48 64 -80 96 -120 146 -176 216 -256 298 -354 418 -483 559 -647 745
25 745 -852 972 -1107 1254 -1419 1598 -1797 2015 -2254 2515 -2804 3121 -3468 3845 -4265 4726
41 4726 -5232 5791 -6412 7105 -7877 8752 -9743 10886 -12207 13760 -15622 17909 -20765
54 -20765 24486 -29542 36854 -48405 69522 -120611 485284 312721 -699686 194760 901843
65 901843 719280 67121 -47355 107558 270292 206045 286983 239108 -174675 -435303 87265
76 87265 431550 -21612 -431657 -160966 82341 -29023 -213490 -247571 -162560 -75060 -175666
87 -175666 -213641 -79141 -96288 -197890 -14896 42407 -271047 -281978 147263 233359 -68660
98 -68660 -138092 67920 190357 133701 60000 193891 315531 28046 -163946 365695 790373
$$ packed form
0@%%%qK4l2L2m8P2q8J12j44J76k16K66l22L92m72N54o52P72r01J042j206J392
25G45j597J824k079K361k673L017l395L812m269M769n319N925o589P313q110Q991
41D726r958J1023j2203J3517j4982J6629j8495K0629k3093K5967k9382L3531l8674
54b0765M5251n4028O6396q5259J17927j90133O05895j72563j012407Q94446P07083
65I01843j82563o52159j14476J54913J62734o4247Q0938m7875m13783k60628N22568
76H7265L44285m53162m10045K70691K43307j11364j84467l4081Q5011Q7500j00606
87a75666l7975J34500j7147j01602J82994N7303l13454j0931M29241Q6096l02019
98f8660o9432K06012J22437n6656p3701J33891J21640k87485j91992N29641M24678
$$ plain form
109 790373 262777 -314521 1857 578557 595458 189929 -105678 23251 342284 373330
119 373330 221285 184535 38762 -160232 74162 411874 184394 -230459 -213772 34425
129 34425 152907 62387 -182673 -263720 -67529 -20783 -196304 -197134 -89919 -118047 -139560
140 -139560 -170854 -284632 -171264 86346 -36186 -352774 -297509 -7591 129340 51661
150 51661 -164550 -233459 31856 205079 42576 -27058 86058 62330 51873 213604 246247
161 246247 130383 115298 132007 145111 239376 230682 117949 180117 257532 123265 79419
172 79419 220766 221879 94794 21045 -25530 59093 245093 145710 -149850 -149395 24919 11749
184 11749 -69635 -108790 -177690 -171351 -116041 -159122 -145026 -70248 -225935 -415752 -272185 -72762
$$ packed form
109G90373n27596n77298L16378N76700J6901m05529k95607J28929L19033L1046
119C73330j52045l6750j45773j98994K34394L37712k27480m14853J6687K48197
129C4425J18482r0520k45060q1047J96191M6746j75521q30J07215k8128k1513
140a39560l1294j13778J13368K57610j22532l16588N5265K89918J36931p7679
150E1661k16211o8909K65315J73223j62503o9634J13116k3728j0457J61731L2643
161B46247j15864j5085J6709J3104R4265q694j12733O2168P7415j34267m3846
172G9419J41347J113j27085p3749m6575Q4623J86000r9383k95560M55J74314j3170
184A1749q1384l9155o8900O339N5310m3081J4096P4778j55687j89817J43567J99423
$$ plain form
196 -72762 -112215 -208668 -284467 -327673 -171224 2516 -103637 -269458 -264527 -194851 -46348
207 -46348 112642 -9923 -226653 -130459 77456 100200 58924 -3881 -71268 63041 251594
218 251594 179378 47624 89574 146835 181939 214509 104020 30831 224708 333359 140314
229 140314 28294 126387 193783 200258 141354 -6739 -6047 156499 162829 61354 48212 -20865
241 -20865 -101240 25421 114958 -40782 -145251 -91416 -59531 -16182 12366 -106901 -186315
252 -186315 -108166 -88392 -100129 -16649 -44437 -177281 -122859 7616 -7269 -29404 -38006 -117990
264 -117990 -73082 96009 96363 665 14927 32941 53077 155188 139331 11946 61153 183606
276 183606 153357 127526 163121 129166 137321 202909 130981 60371 159460 197578 115749 114014
$$ packed form
196g2762l9453r6453p5799m3206J56449J73740j06153j65821M931O9676J48503
207d6348J58990j22565k16730R6194K07915K2744m1276o2805o7387J34309J88553
218B51594p2216j31754M1950N7261L5104L2570j10489p3189J93877J08651j93045
229A40314j12020R8093O7396O475n8904j48093O92J62546O330j01475j3142o9077
241b0865q0375J26661Q9537j55740j04469N3835L1885M3349K8548j19267p9414
252a86315P8149J9774j1737Q3480k7788j32844N4422J30475j4885k2135q602p9984
264a17990M4908J69091L54r5698J4262J8014K0136J02111j5857j27385M9207J22453
276A83606l0249k5831L5595l3955Q155O5588p1928p0610R9089L8118q1829j735
$$ plain form
288 114014 116047 63092 118190 158488 28550 -34381 40444 42578 25300 48350 -35734 -109161
300 -109161 -19323 3081 -99072 -103676 -81849 -135289 -102048 -45455 -116651 -137134 -75574 -127679
312 -127679 -173390 -87625 -72814 -125285 -82747 -69893 -110029 -33750 19215 -74507 -88749 -6533
324 -6533 -7640 10269 78308 29981 -9911 88113 111536 45905 76842 100087 57572 110129
336 110129 164258 99630 100982 162500 104818 63070 124929 106824 59046 108877 99823 30701
348 30701 71529 94379 9932 -2761 20404 -38453 -32738 26000 -38277 -89813 -28399 -46549
360 -46549 -115415 -82745 -81622 -142947 -107290 -73790 -129254 -109073 -58430 -119235 -139163 -76072
372 -76072 -99405 -120412 -49177 -54941 -97945 -26020 7765 -51612 -26057 16701 -25877 1037
$$ packed form
288A14014K033n2955N5098M0298j29938o2931P4825K134j7278K3050q4084p3427
300a09161Q9838K2404j02153m604K1827n3440L3241N6593p1196k0483O1560n2105
312a27679m5711Q5765J4811n2471M2538J2854m0136P6279N2965r3722j4242Q2216
324f533j107J7909O8039m8327l9892R8024K3423o5631L0937K3245m2515N2557
336A10129N4129o4628J352O1518n7682m1748O1859j8105m7778M9831r054o9122
348C0701M0828K2850q4447j2693K3165n8857N715N8738o4277n1536O1414j8150
360d6549o8866L2670J123o1325L5657L3500n5464K0181N0643o0805j9928O3091
372g6072k3333k1007P1235n764m3004P1925L3785n9377K5555M2758m2578K6914
$$ plain form
384 1037 71423 35513 28890 104625 87680 48766 101528 99983 55851 108019 127340 69085 104522
397 104522 151723 86316 70026 111050 60696 35176 92853 61741 5089 52674 54094 -9736
409 -9736 4833 4215 -65414 -50002 -15185 -78445 -86963 -34268 -78338 -116605 -71495 -98249 -148767
422 -148767 -99185 -91387 -146065 -107108 -66818 -114484 -103475 -64306 -109760 -109802 -45359 -65844 -83874
435 -83874 -16597 -12840 -43076 11918 24945 -27998 10123 56032 15305 34422 93626 60307
447 60307 51623 106834 79865 42382 89416 85036 43470 87860 101898 45676 67145 92804
459 92804 27111 15897 52660 3957 -19089 32456 4478 -45167 -9470 -19671 -77199 -54220
471 -54220 -52479 -117898 -97091 -51892 -100177 -110767 -73853 -116470 -136817 -81191 -103456 -151309
$$ packed form
384A037P0386l5910o623P5735j6945l8914N2762j545m4132N2168J9321n8255L5437
397A04522M7201o5407j6290M1024n0354k5520N7677l1112n6652M7585J420o3830
409i736J4569o18o9629J5412L4817o3260q518N2695m4070l8267M5110k6754n0518
422a48767M9582P798n4678L8957M0290m7666J1009L9169m5454m2O4443k0485j8030
435h3874O7277L757l0236N4994J3027n2943L8121M5909m0727J9117N9204l3319
447F0307q684N5211k6969l7483M7034m380m1566M4390J4038n6222K1469K5659
459I2804o5693j1214L6763m8703k3046N1545k7978m9645L5697j0201n7528K2979
471e4220J741o5419K0807M5199m8285j0590L6914m2617k0347N5626k2265m7853
$$ plain form
483 -151309 -102322 -81268 -108336 -64584 -48200 -107112 -82077 -22012 -56768 -62307 -8310 -22583
495 -22583 -24358 44252 36054 -9317 33677 50487 15588 55998 84428 35874 59864 119001
507 119001 76642 49233 88215 67966 46349 86999 62344 19721 77425 94619 21856 16321
519 16321 37257 -3274 3729 31458 -30225 -53165 8464 -2550 -46206 -30813 -59736 -103724
531 -103724 -48450 -23526 -88277 -86908 -49768 -71161 -51843 -18697 -84502 -109873 -28644 -15228
543 -15228 -53981 -25751 -13475 -25179 26696 36506 -26817 99 62816 34865 33952 84854 62542
556 62542 52908 114996 103493 54683 86902 94644 64825 117876 147060 71296 57009 112558
568 112558 107506 95584 87873 15385 8863 108745 108118 18639 10717 15791 -12726 26680 44363
$$ packed form
483a51309M8987K1054k7068M3752J6384n8912K5035O0065l4756n539N3997j4273
495b2583j775O8610q198m5371M2994J6810l4899M0410K8430m8554K3990N9137
507A19001m2359k7409L8982k0249k1617M0650k4655m2623N7704J7194p2763n535
519A6321K0936m0531P003K7729o1683k2940O1629j1014m3656J5393k8923m3988
531a03724N5274K4924o4751J369L7140k1393J9318L3146o5805k5371Q1229J3416
543a5228l8753K8230J2276j1704N1875R810o3323K6916O2717k7951r13N0902k2312
556F2542r634O2088j1503m8810L2219P742k9819N3051K9184p5764j4287N5549
568A12558n052j1922p711p2488o522R9882o27q9479p922N074k8517L9406J7683
$$ plain form
581 44363 -46286 -88531 -45547 -24953 1589 2434 -112450 -164986 -43476 15927 -74629 -132746
593 -132746 -125307 -86477 -4208 -6211 -124132 -138822 -40317 -22997 -50367 -45387 -73249 -65545
605 -65545 30594 42559 -38858 -37746 4605 7644 45146 60262 -11609 -13073 82129 106097 68882
618 68882 38787 -9675 17011 138328 128612 -6918 -9778 84653 97433 74081 48680 -5870
630 -5870 -4955 40353 28028 29469 57720 -21065 -95258 3021 81962 -7704 -97655 -100188 -60453
643 -60453 18346 29043 -86910 -133110 -50674 -21789 -49899 -50159 -88380 -116977 -38760 8818
655 8818 -46085 -61984 -46343 -64759 -29755 18325 -39385 -77563 -3398 43683 24045 2600
667 2600 -35387 -19232 87956 85859 -49419 -50586 82514 118153 57467 4939 -15636 38974
$$ packed form
581D4363r0649m2245M2984K0594K6542Q45j14884n2536J21510N9403r0556n8117
593a32746P439L8830Q2269k003j17921j4690R8505J7320k7370M980k7862P704
605f5545R6139J1965q1417J112M2351L039L7502J5116p1871j464R5202K3968l7215
618F8882l0095m8462K6686J21317r716j35530k860R4431J2780k3352k5401n4550
630e870R15M5308j2325J441K8251p8785p4193R8279P8941q9666q9951k533L9735
643f0453P8799J0697j15953m6200Q2436K8885k8110k60l8221k8597P8217M7578
655H818n4903j5899J5641j8416L5004M8080n7710l8178P4165M7081j9638k1445
667B600l7987J6155J07188k097j35278j167J33100L5639o0686n2528k0575N4610
$$ plain form
679 38974 103129 43900 -22909 28707 51837 4584 27599 60163 4342 -31412 -17845 -22097
691 -22097 439 20777 -42613 -74766 -14725 -16223 -69591 -47246 -33900 -87110 -96615 -67454
703 -67454 -50899 -15188 -34212 -137151 -129628 -1962 9491 -85147 -107375 -71070 -25483 20573
715 20573 -9296 -65828 -22908 18712 -26954 -13767 58803 42818 2797 28519 49165 70596
727 70596 109801 67365 1770 53103 121674 106076 93366 87490 57812 89455 136248 88609
739 88609 52247 88340 76371 52408 104315 107533 30798 27922 78564 70292 28842 -14785 -18579
752 -18579 72533 105097 -41840 -119592 17640 104331 7158 -96390 -106730 -41233 49535
763 49535 36224 -73159 -99550 -45643 -21538 11119 20276 -77558 -125588 -12346 71323 30960
$$ packed form
679C8974O4155n9229o6809N1616K3130m7253K3015L2564n5821l5754J3567m252
691b2097K2536K0338o3390l2153O0041j498n3368K2345J3346n3210r505K9161
703f7454J6555L5711j9024j02939P523J27666J1453r4638k2228L6305M5587M6056
715B0573k9869n6532M2920M1620m5666J3187P2570j5985m0021K5722K0646K1431
727G0596L9205m2436o5595N1333O8571j5598j2710n876k9678L1643M6793m7639
739H8609l6362L6093j1969k3963N1907L218p6735k876N0642q272m1450m3627l794
752a8579R1112L2564j46937p7752J37232Q6691r7173j03548j0340O5497R0768
763D9535j3311j09383k6391N3907K4105L2657R157r7834m8030J13242Q3669m0363
$$ plain form
775 30960 -17520 -44544 -41803 33336 75568 18036 -10696 15918 25249 64022 105521 45545
787 45545 -5042 52068 73203 33954 61624 95022 49790 25647 52470 70782 79852 41594
799 41594 -33509 6302 107411 52661 -55169 -8430 66314 26584 -33868 -59347 -50589 7660
811 7660 20714 -57617 -86479 -46592 -41266 -26722 -3516 -86080 -161468 -70619 30898 -4356
823 -4356 -73984 -107201 -89272 2853 45854 -43634 -102004 -49355 9 32590 53671 -9193
835 -9193 -55538 25606 80595 25990 10669 49855 51119 50069 61889 55521 83305 103991 33434
848 33434 553 84000 112821 53740 45626 58918 36259 52294 74848 32187 3435 10390
860 10390 -2270 13792 43964 -10282 -56002 -4858 2532 -63416 -64262 -30497 -45952 -54881 -59683
$$ packed form
775C0960m8480k7024K741P5139M2232n7532k8732K6614R331L8773M1499n9976
787D5545n0587N7110K1135l9249K7670L3398m5232k4143K6823J8312R070l8258
799D1594p5103L9811J01109n4750j07830M6739P4744l9730o0452k5479Q758N8249
811G660J3054p8331k8862L9887N326J4544K3206q2564p5388R0849J01517l5254
823d356o9628l3217J7929R2125M3001q9488n8370N2649M9364L2581K1081o2864
835i193m6345Q1144N4989n4605j5321L9186J264j050J1820o368K7784K0686p0557
848C3434l2881Q3447K8821n9081q114J3292k2659J6035K2554m2661k8752O955
860A0390j2660J6062L0172n4246m5720N1144P390o5948q46L3765j5455q929m802
$$ plain form
873 -59683 -88751 -61610 -11362 -56602 -112491 -87882 -65317 -50259 -13850 -46410 -109313 -58368
885 -58368 16380 -10081 -45240 -37482 -35928 -5845 34266 10779 864 45589 32401 -3709 43265
898 43265 74784 37453 38977 59464 38781 58845 105804 77771 33301 31851 30502 59194 106065
911 106065 51822 -29199 15760 79958 47764 9269 -9347 -38464 -13752 30248 -6460 -47889
923 -47889 -29285 -30104 -41602 -25953 -55105 -92319 -46711 -22694 -78600 -81839 -31514 -35312 -53679
936 -53679 -55441 -77704 -65183 -9312 -17434 -51459 -24947 -10941 -23130 14946 30141 -23400
948 -23400 -22193 35063 40531 33631 52724 41846 37871 64893 50590 36341 80918 78296 20878
961 20878 43140 96881 77976 54829 51774 20648 21541 64861 51484 12660 15217 6723 3035
$$ packed form
873e9683k9068K7141N0248m5240n5889K4609K2565J5058L6409l2560o2903N0945
885e8368P4748k6461l5159P758J554L0083M0111k3487r915M4725j3188l6110M6974
898D3265L1519l7331J524K0487k0683K0064M6959k8033m4470j450j349K8692M6871
911A06065n4243q1021M4959O4198l2194l8495j8616k9117K4712M4000l6708m1429
923d7889J8604q19j1498J5649k9152l7214M5608K4017n5906l239N0325l798j8367
936e3679j762k2263J2521N5871q122l4025K6512J4006j2189L8076J5195n3541
948b3400J207N7256N468o900J9093j0878l975K7022j4303j4249M4577k622n7418
961B0878K2262N3741j8905k3147l055l1126Q93M3320j3377l8824K557q494l688
$$ plain form
974 3035 40546 19930 -56532 -47477 1253 -22485 -44480 -30199 -45203 -52875 -32441 -54770 -77318
987 -77318 -47135 -49519 -79539 -54398 -39253 -64824 -40016 -13362 -59214 -74036 -24073 -12396
999 -12396 -22657 -11767 -22101 -17394 34141 33375 -9608 10672 38609 16740 32288 66124 42852
1012 42852 35800 69513 57132 38139 61944 57433 37129 57336 53393 27732 59842 75086
1024 75086 19358 3017 33795 21065 7762 19122 -7595 -25053 9194 4280 -34856 -28670
1036 -28670 -30745 -60707 -42240 -24637 -61876 -62539 -29073 -51890 -72634 -47086 -53629 -69543 -45512
1049 -45512 -49656 -68262 -28631 -6915 -42314 -38521 -12689 -28556 -17178 17065 -4371 -14748
1061 -14748 30542 38851 20896 40281 37951 16108 47186 66370 35774 47662 78933 54895
$$ packed form
974C035L7511k0616p6462R055M8730k3738k1995J4281j5004p672K0434k2329k2548
987g7318L0183k384l0020K5141J5145k5571K4808K6654m5852j4822M9963J1677
999a2396j0261J0890j0334M707N1535p66m2983K0280K7937k1869J5548L3836k3272
1012D2852p052L3713j2381j8993K3805m511k0304K0207l943k5661L2110J5244
1024G5086n5728j6341L0778j2730j3303J1360k6717j7458L4247m914l9136O186
1036b8670k075k9962J8467J7603l7239o63L3466k2817k0744K5548o543j5914K4031
1049d5512m144j8606L9631K1716l5399L793K5832j5867J1378L4243k1436j0377
1061a4748M5290Q309j7955J9385k330k1843L1078J9184l0596J1888L1271k4038
$$ plain form
1073 54895 47970 74052 52050 32280 60465 50631 23247 49137 55835 21688 28332 34225 -3502
1086 -3502 -2629 17786 -13774 -26001 2629 -16006 -41083 -19299 -29545 -62960 -45370 -42678 -75495
1099 -75495 -57249 -30662 -60088 -66485 -43515 -61386 -65336 -35803 -53543 -73682 -33886 -18465
1111 -18465 -38277 -20387 -12281 -37119 -14231 15171 -13502 -14845 24839 21368 15233 42856 31041
1124 31041 10948 43177 48985 18432 35126 54453 34479 46028 62852 25361 16564 48979
1136 48979 30892 6463 26338 17571 -3192 22875 20811 -23329 -20043 -7344 -36443 -34575 -17294
1149 -17294 -49521 -58310 -26680 -41136 -66607 -50299 -60131 -85069 -56438 -44065 -75569 -63970
1161 -63970 -41207 -60874 -54457 -31571 -59745 -67513 -23841 -21970 -39301 -14704 -9365 -20907 9510
$$ packed form
1073E4895o925K6082k2002j9770K8185r834k7384K5890O698l4147O644N893l7727
1086c502Q73K0415l1560j2227K8630j8635k5077K1784j0246l3415J7590K692l2817
1099g5495J8246K6587k9426o397K2970j7871l950K9533j7740k0139L9796J5421
1111a8465j9812J7890Q106k4838K2888K9402k8673j343L9684l471o135K7623j1815
1124C1041k0093L2229N808l0553J6694J9327j9974J1549J6824l7491q797L2415
1136D8979j8087k4429J9875q767k0763K6067k064m4140L286J2699k9099J868J7281
1149a7294l2227q789L1630j4456k5471J6308r832k4938K8631J2373l1504J1599
1161f3970K2763j9667O417K2886k8174p768M3672J871j7331K4597N339j1542L0417
$$ plain form
1174 9510 18316 -18336 -6647 30347 21711 25417 45246 22411 20336 64233 55829 17215 30209
1187 30209 42065 33732 57097 58101 14912 19206 49867 28705 11214 18299 -7320 -13568 25487
1200 25487 15151 -28391 -21704 -14989 -35085 -25930 -28471 -67025 -57148 -22471 -43917 -61680 -44099
1213 -44099 -58953 -70904 -42501 -49720 -76746 -51827 -32928 -49191 -33413 -20688 -50041 -41027
1225 -41027 -3229 -16203 -27646 -1877 -508 2747 38366 29597 -5679 20980 49142 31577
1237 31577 37873 51352 33115 46532 79663 57339 34585 52489 44817 34085 62329 54891
1249 54891 17703 33521 53259 27694 21123 20353 -11870 -6789 26165 -873 -33860 -13219 -8352
1262 -8352 -26000 -23582 -42978 -69384 -37985 -20438 -60056 -65518 -38254 -49688 -52078 -33397 -57837
$$ packed form
1174I510Q806l6652J1689L6994q636L706J9829k2835k075M3897q404l8614J2994
1187C0209J1856q333K3365J004m3189M294L0661k1162j7491P085k5619o248L9055
1200B5487j0336m3542O687O715k0096R155k541l8554R877L4677k1446j7763J7581
1213d4099j4854j1951K8403p219k7026K4919J8899j6263J5778J2725k9353R014
1225d1027L7798j2974j1443K5769J369L255L5619q769l5276K6659K8162j7565
1237C1577O296J3479j8237J3417L3131k2324k2754J7904p672j0732K8244p438
1249E4891l7188J5818J9738k5565o571p70l2223N081L2954k7038l2987K0641M867
1262h352j7648K418j9396k6406L1399J7547l9618n462K7264j1434k390J8681k4440
$$ plain form
1275 -57837 -78564 -45209 -29410 -37898 -25429 -35744 -54304 -9953 23837 -20587 -43377 -10370
1287 -10370 10338 27744 39125 2790 -8987 44841 60750 27082 24706 29705 22805 56219
1299 56219 76344 34824 20381 46605 40510 35125 48515 17980 -7959 30334 47940 16194
1311 16194 1704 -9316 -22085 8159 15031 -45938 -61116 -12230 -8135 -33667 -37174 -56779
1323 -56779 -67581 -34745 -32221 -65667 -60394 -52553 -65403 -33311 -5957 -55391 -85742 -46177
1335 -46177 -18513 -13331 -13092 -48041 -54528 15653 45443 -4969 -26359 -7484 6239 40530 56012
1348 56012 10419 -1518 45805 57789 45043 50751 26237 3427 48280 78679 43427 22642
1360 22642 26221 25553 50807 55726 -6648 -28552 27524 40035 221 -13044 -17765 -18431 7106
$$ packed form
1275e7837k0727L3355J5799q488J2469j0315j8560M4351L3790m4424k2790L3007
1287a0370K0708J7406J1381l6335j1777N3828J5909l3668k376M999o900L3414
1299E6219K0125m1520j4443K6224o095n385J3390l0535k5939L8293J7606l1746
1311A6194j4490j1020j2769L0244O872o0969j5178M8886M095k5532l507j9605
1323e6779j0802L2836K524l3446N273P841j2850L2092K7354m9434l0351L9565
1335d6177K7664N182K39l4949o487P0181K9790n0412k1390J8875J3723L4291J5482
1348E6012m5593j1937M7323J1984j2746N708k4514k2810M4853L0399l5252k0785
1360B2642L579o68K5254M919o2374k1904N6076J2511l9814j3265m721o66K5537
$$ plain form
1373 7106 -7524 -62246 -55153 -20028 -35221 -44620 -32506 -56812 -69528 -39259 -40557 -61795 -53658
1386 -53658 -61390 -72637 -28048 -5561 -52505 -64568 -29264 -23249 -21005 -11760 -30432 -27244 15939
1399 15939 15114 -4513 23679 28346 -5527 11613 48111 38429 32294 39886 27411 44253 74584
1412 74584 42750 11962 43290 53444 29506 39019 44375 26369 36388 38073 -245 3033 33701
1425 33701 9373 -19161 -4200 -3867 -8990 4746 -19302 -54353 -31569 -16404 -44862 -39716 -23801
1438 -23801 -53122 -56803 -19391 -24098 -51218 -52378 -53568 -38154 -4043 -25471 -62679 -21016 20248
1451 20248 -13654 -34245 -11705 -1630 11086 23288 -2349 -5125 41518 48892 21475 25825
1463 25825 24629 14560 50488 71184 31477 19107 45952 47575 50197 57450 20287 -3317 33387
$$ packed form
1373G106j4630n4722P093L5125j5193r399J2114k4306j2716L0269j298k1238Q137
1386e3658p732j1247M4589K2487m6944j2063L5304O015K244R245j8672L188M3183
1399A5939q25j9627K8192M667l3873J7140L6498r682o135P592j2475J6842L0331
1412G4584l1834l0788L1328J0154k3938R513N356j8006J0019J685l8318L278L0668
1425C3701k4328k8534J4961L33n123J3736k4048l5051K2784J5165k8458N146J5915
1438b3801k9321l681L7412m707k7120j160j190J5414L4111k1428l7208M1663M1264
1451B0248l3902k0591K2540J0075J2716J2202k5637k776M6643P374k7417M350
1463B5825j196j0069L5928K0696l9707j2370K6845J623K622P253l7163k3604L6704
$$ plain form
1476 33387 50927 30847 25335 7394 -14568 17288 35527 -13085 -34670 -11367 -16735 -22855
1488 -22855 -5362 -19435 -44409 -38748 -42202 -46016 -20065 -33001 -78859 -55605 -6455 -25109
1500 -25109 -52213 -44383 -44208 -34627 -12466 -29391 -46111 -12258 3298 -11071 441 608 -21783
1513 -21783 5433 41627 13850 -5781 22572 38752 45701 53688 22347 858 42561 67274
1525 67274 42810 33228 29653 20665 53394 75471 24749 -9231 19838 33804 25035 24940 4647
1538 4647 -11089 12289 12222 -18220 -11005 -6236 -40493 -37592 -6364 -19971 -37848 -26893 -39084
1551 -39084 -51831 -30385 -31583 -50717 -38351 -36225 -50163 -22332 -4173 -41040 -48714 -15008
1563 -15008 -15104 -22662 -6106 -9753 -10575 19094 17331 -6473 12634 30735 14457 22222 35419 18717
$$ packed form
1476C3387J7540k0080n512j7941k1962L1856J8239m8612k1585K3303n368o120
1488b2855J7493j4073k4974N661l454l814K5951j2936m5858K3254M9150j8654
1500b5109k7104P830J75R581K2161j6925j6720L3853J5556j4369J1512J67k2391
1513b1783K7216L6194k7777j9631K8353J6180O949P987l1341k1489M1703K4713
1525F7274k4464r582l575q988L2729K2077n0722l3980K9069J3966q769r5k0293
1538D647j5736K3378o7l0442P215M769l4257K901L1228j3607j7877J0955j2191
1551c9084j2747K1446j198j9134J2366K126j3938K7831J8159l6867p674L3706
1563a5008r6p558J6556l647q22K9669j763k3804J9107J8101j6278P765J3197j6702
$$ plain form
1577 18717 32933 67629 44905 15151 34522 45236 40207 49477 33877 10907 39311 58382
1589 58382 27304 17463 24769 2550 2863 28163 7911 -16059 2126 1517 -19661 -10752 -13312
1602 -13312 -36175 -28430 -25654 -49368 -33985 -7135 -36052 -58433 -37313 -35970 -41737 -25596 -38499
1615 -38499 -59186 -28895 -5144 -22764 -22981 -17506 -31175 -13738 14077 -6482 -16978 16210
1627 16210 21402 10003 26860 25387 10387 32321 41152 15723 27150 54591 42139 35458 44200
1640 44200 25984 24415 53065 38003 6871 23917 36423 21696 28089 23943 -7375 -2598 16068
1653 16068 -5647 -15388 94 -15044 -26352 -6426 -17239 -41655 -26234 -25345 -52844 -42103
1665 -42103 -21226 -35474 -36520 -27363 -45832 -43170 -15033 -27448 -45853 -24574 -17931 -23095 2373
$$ packed form
1577A8717J4216L4696k2724k9754J9371J0714n029R270j5600k2970K8404J9071
1589E8382l1078r841P306k2219L13K5300k0252k3970J8185o09k1178Q909k560
1602a3312k2863P745K776k3714J5383K6850k8917k2381K1120J343n767J6141j2903
1615c8499k0687L0291K3751j7620k17N475j3669J7437K7815k0559j0496L3188
1627A6210N192j1399J6857j473j5000K1934Q831k5429J1427K7441j2452o681Q742
1640D4200j8216j569K8650j5062l1132J7046J2506j4727O393m146l1318M777J8666
1653A6068k1715r741J5482j5138j1308J9926j0813k4416J5421Q89k7499J0741
1665d2103K0877j4248j046R157j8469K662K8137j2415j8405K1279O643n164K5468
$$ plain form
1678 2373 4912 -24576 -10928 17484 3925 1019 20315 15623 18325 40402 29325 18477 43259
1691 43259 40261 16260 33025 48665 31668 39319 52112 27052 21585 42890 32005 16048
1703 16048 23317 12884 6748 31087 22285 -13287 -4868 7337 -16799 -19806 -7774 -26916 -31186
1716 -31186 -12565 -24990 -38930 -24868 -33220 -49513 -33637 -33263 -50693 -29058 -14097 -42076
1728 -42076 -42143 -15417 -22482 -30407 -16964 -22461 -21447 6801 6196 -9807 8581 15434 -1513 14573
1742 14573 30988 10596 15206 43437 34811 25319 41533 37139 28090 41573 34120 18544 42304
1755 42304 50971 23447 24187 37963 19438 16060 27695 5990 -6809 14031 11350 -5227 1750
1768 1750 -7768 -27544 -12902 -8192 -36909 -34363 -16481 -32063 -35837 -18325 -32150 -45936 -29932
$$ packed form
1678B373K539k9488J3648K8412j3559k906J9296m692K702K2077j1077j0848K4782
1691D3259k998k4001J6765J5640j6997P651J2793k5060n467K1305j0885j5957
1703A6048P269j0433o136K4339q802l5572Q419J2205k4136l007J2032j9142m270
1716c1186J8621j2425j3940J4062q352j6293J5876L74j7430K1635J4961k7979
1728d2076o7K6726p065p925J3443n497J014K8248o05j6003J8388O853j6947J6086
1742A4573J6415k0392M610K8231q626r492J6214m394r049J3483p453j5576K3760
1755D2304Q667k7524P40J3776j8525l378J1635k1705j2799K0840k681j6577O977
1768A750r518j9776J4642M710k8717K546J7882j5582l774J7512j3825j3786J6004
$$ plain form
1781 -29932 -32874 -44140 -26568 -23094 -37450 -20290 -7804 -27181 -21234 -1891 -17336 -18675 7660
1794 7660 5760 -2199 17280 19302 9312 24948 26423 8517 25434 43849 26518 27155 44733
1807 44733 33712 30332 45603 29271 12113 32566 36701 19804 27611 26225 5497 15853 25632
1820 25632 -3090 -12711 2374 -7141 -12268 1196 -15004 -33294 -15791 -15303 -37933 -33372 -29165
1833 -29165 -44054 -30539 -16266 -39689 -44035 -22462 -30909 -40886 -25181 -29348 -36976 -12710 -5788
1846 -5788 -22759 -11270 -4 -13574 -3416 13657 -2056 -1370 25610 24388 16319 32099 26279
1859 26279 13359 33928 40781 21036 28672 41928 29837 35777 47213 23265 13535 33285 26932
1872 26932 11903 22812 17371 2126 18372 19598 -10322 -11269 -396 -15394 -15809 -5169 -25196
$$ packed form
1781b9932k942j1266J7572L474j4356J7160J2486j9377N947J9343j5445j339K6335
1794G660j900p959J9479K022r990J5636J475j7906J6917J8415j7331O37J7578
1807D4733j1021l380J5271j6332j7158K0453M135j6897P807j386k0728J0356R779
1820B5632k8722r621J5085r515n127J3464j6200j8290J7503M88k2630M561M207
1833b9165j4889J3515J4273k3423m346K1573q447r977J5705m167p628K4266O922
1846e788j6971J1489J1266j3570J0158J7073j5713O86K6980j222q069J5780n820
1859B6279j2920K0569O853j9745P636J3256j2091N940J1436k3948r730J9750o353
1872B6932j5029J0909n441j5245J6246J226k9920r47J0873j4998m15J0640k0027
$$ plain form
1885 -25196 -32447 -9810 -16757 -37947 -31557 -33604 -44402 -25697 -19501 -44165 -38008 -16803 -25892
1898 -25892 -29061 -19367 -32977 -33513 -3534 -4188 -19475 -3445 4497 -5232 10450 17948 -2810 3897
1912 3897 27814 21820 22026 37359 24980 17968 41464 38449 17506 28222 34321 23802 36892
1925 36892 42328 16165 15907 33782 18617 5917 15527 5107 -2744 15819 9997 -14732 -8235
1938 -8235 -5183 -23214 -17369 -12006 -35325 -34861 -11902 -21146 -34627 -27593 -37426 -42736 -20403 -23795
1952 -23795 -47640 -33053 -13396 -22522 -20052 -13295 -27871 -21607 1476 -7562 -14977 6138 8543
1965 8543 1861 20305 21995 3511 15274 29451 18705 24573 37647 23688 26598 48813 34563
1978 34563 15594 29838 33581 23607 31978 27431 11434 26975 35784 7960 365 12689 963
$$ packed form
1885b5196p251K2637o947k1190O390k047j0798J8705O196k4664O157K1205r089
1898b5892l169R694j3610n36K9979o54j5287J6030P942r729J5682P498k0758O707
1912C897K3917n994K06J5333j2379p012K3496l015k0943J0716O099j0519J3090
1925C6892N436k6163k58J7875j5165j2700R610j0420p851J8563n822k4729O497
1938h235L052j8031N845N363k3319M64K2959r244j3481P034r833n310K2333l392
1952b3795k3845J4587J9657r126K470O757j4576O264K3083r038p415K1115K405
1965H543o682J8444J690j8484J1763J4177j0746N868J3074j3959K910K2215j4250
1978C4563j8969J4244L743r974Q371m547j5997J5541Q809k7824p595J2324j1726
$$ plain form
1991 963 -4936 7566 -5042 -18357 -4853 -8145 -24736 -16617 -21148 -43831 -31877 -12841 -28207
2004 -28207 -37138 -27784 -32810 -30397 -17028 -34035 -47654 -21720 -10709 -24535 -16380 -9011 -19188
2017 -19188 -8183 5346 -9072 -9085 9931 6238 7632 28887 21515 4966 22547 33963 22634
2030 22634 24884 25211 17096 37633 53798 25516 11445 31701 33733 23629 25617 12775 4171
2043 4171 25622 28907 5696 3464 3852 -12952 -5825 9019 -13161 -30364 -15579 -11503 -14462
2056 -14462 -11682 -33158 -50241 -24081 -11031 -34178 -38084 -27003 -29998 -20979 -11560 -31947 -37494
2069 -37494 -15507 -14944 -21987 -5440 -4415 -15374 672 12119 -1248 2272 10175 2204 15133
2082 15133 36137 19136 8587 32419 37469 24348 27403 23883 17288 36388 42730 21697 23221
$$ packed form
1991I63n899J2502j2608j3315J3504l292j6591Q119m531k2683J1954J9036j5366
2004b8207q931R354n026K413J3369j7007j3619K5934J1011j3826Q155P369j0177
2017a9188J1005J3529j4418j3J9016l693J394K1255p372j6549J7581J1416j1329
2030B2634K250L27q115K0537J6165k8282j4071K0256K032j0104J988j2842q604
2043D171K1451L285k3211k232L88j6804P127J4844k2180j7203J4785M076k959
2056a4462K780k1476j7083K6160J3050k3147l906J1081k995R019R419k0387n547
2069c7494K1987N63p043J6547J025j0959J6046J1447j3367L520P903p971J2929
2082A5133K1004j7001j0549K3832N050j3121L055l520o595J9100O342k1033J524
$$ plain form
2095 23221 34203 18794 16951 30603 14124 -3622 9463 13861 7592 11213 -3577 -24849 -7460
2108 -7460 5837 -18645 -29911 -20965 -24422 -19594 -9205 -28351 -43193 -25344 -23838 -36809 -26926
2121 -26926 -23815 -36280 -24173 -10694 -23390 -23347 -12186 -21576 -19370 618 -5661 -12765 9859
2134 9859 15185 8 8371 17505 9953 18678 26201 12543 20774 42280 31384 19578 32543
2147 32543 28139 19631 31502 28834 15084 27874 33985 12693 13750 25116 9760 -45 7405
2160 7405 -1377 -5015 8378 -1800 -18208 -8454 -10371 -27386 -18199 -12589 -35298 -35132 -15596 -20910
2174 -20910 -27472 -23017 -34855 -37347 -17555 -21942 -35974 -19988 -12632 -24568 -13903 -178 -13951
2187 -13951 -14636 -1226 -6867 -3468 17155 13246 3560 17453 19890 13405 28094 27476 7761 19423
$$ packed form
2095B3221J0982j5409j843J3652j6479j7746J3085M398o269L621j4790k1272J7389
2108g460J3297k4482j1266Q946l457M828J0389j9146j4842J7849J506j2971R883
2121b6926L111j2465J2107J3479j2696M3J1161r390K206J9988o279p104K2624
2134I859N326j5177Q363R134p552Q725P523j3658Q231K1506j0896j1806J2965
2147C2543m404q508J1871k668j3750J2790O111k1292J057J1366j5356r805P450
2160G405q782l638J3393j0178j6408R754j917j7015R187N610k2709J66J9536n314
2174b0910o562M455j1838k492J9792m387j4032J5986P356j1936J0665J3725j3773
2187a3951o85J3410n641L399K0623l909r686J3893K437o485J4689o18j9715J1662
$$ plain form
2201 19423 41216 30739 25080 33766 24651 20059 32315 25067 12430 22740 21998 10644 21253
2214 21253 20495 -2308 1452 14058 -5738 -17417 -3308 -3696 -11423 -8912 -20663 -29523 -13461
2227 -13461 -15505 -37065 -32368 -23002 -32731 -24925 -12123 -30090 -38441 -21237 -20855 -26676 -16811 -19147
2241 -19147 -24085 -5819 430 -12281 -2592 6330 -8040 -3679 16515 11805 9459 23479 17853
2254 17853 11374 28753 30309 15832 20553 24366 18179 32271 40124 18142 13688 29610 21456
2267 21456 11882 19102 11330 2094 15024 13617 -2578 1898 3040 -14405 -14082 -7670 -21241 -20595
2281 -20595 -7331 -20885 -32683 -18789 -20295 -31950 -26374 -29015 -39582 -24461 -12215 -26605
2293 -26605 -26971 -16642 -23126 -20749 -6934 -15887 -20019 108 2954 -5797 7529 14490 3278 8766
$$ packed form
2201A9423K1793j0477n659Q686r115m592J2256p248j2637J0310p42j1354J0609
2214B1253p58k2803L760J2606j9796j1679J4109l88p727K511j1751q860J6062
2227a3461k044k1560M697R366r729P806J2802j7967q351J7204L82n821R865k336
2241a9147m938J8266O249j2711R689Q922j4370M361K0194m710k346J4020n626
2254A7853o479J7379J556j4477M721L813o187J4092P853k1982m454J5922q154
2267B1456r574P220p772r236J2930j407j6195M476J142j7445L23O412j3571O46
2281b0595J3264j3554j1798J3894j506j1655N576k641j0567J5121J2246j4390
2293b6605l66J0329o484K377J3815q953m132K0127K846q751J3326O961j1212N488
$$ plain form
2307 8766 16381 9162 18929 34217 22106 17158 33003 32051 26168 35024 26695 12967 29174 40332
2321 40332 25323 23076 26173 14646 17654 25500 7615 -1907 11176 6384 -4080 4607 -525
2334 -525 -16263 -10137 -9271 -27772 -23936 -12177 -23395 -28216 -20328 -27655 -28917 -16649 -28264 -42437
2348 -42437 -26093 -17024 -25673 -18086 -13400 -24497 -16203 -2104 -13398 -16107 -1199 -2714 -2976 13340
2362 13340 11585 3368 17349 19924 6701 15763 27686 19410 22505 32042 21080 21725 37105 26528
2376 26528 11615 21456 23675 15676 24434 21866 5422 10953 17362 521 -3264 4206 -8533 -13614
2390 -13614 -399 -7496 -19552 -10482 -14797 -30918 -24140 -19378 -29968 -25306 -19366 -32811 -28668
2403 -28668 -12406 -23531 -34498 -22497 -22250 -25062 -9483 -8713 -20906 -8969 1986 -6881 -3481
$$ packed form
2307H766P615p219R767J5288j2111m948J5845r52n883Q856q329j3728J6207J1158
2321D0332j5009k247L097j1527L008P846j7885r522J3083m792j0464Q687n132
2334e25j5738O126Q66j8501L836J1759j1218m821P888p327j262J2268j1615j4173
2348d2437J6344R069q649P587M686j1097Q294J4099j1294k709J4908j515k62J6316
2362A3340j755q217J3981K575j3223R062J1923q276L095R537j0962O45J5380j0577
2376B6528j4913R841K219p999Q758k568j6444N531O409j6841l785P470j2739n081
2390a3614J3215p097j2056R070m315j6121O778M762j0590M662N940j3445M143
2403b8668J6262j1125j0967J2001K47k812J5579P70j2193J1937J0955q867L400
$$ plain form
2416 -3481 4571 -4315 2042 20510 12684 6492 24729 25339 12482 20443 24476 16277 25549 30852
2430 30852 17396 21481 33145 20547 15463 23472 11339 2702 18237 16905 -223 3849 6481
2443 6481 -5216 -2958 -3460 -21074 -19217 -7312 -19823 -26287 -13837 -21007 -32822 -23376 -25864 -38891
2457 -38891 -29226 -22738 -34166 -29119 -19433 -27534 -24943 -14847 -26425 -28655 -9783 -10044 -17629 -2484
2471 -2484 2128 -7888 2096 11205 1656 4749 14648 8579 15082 29934 20485 13744 28705 25733
2485 25733 14105 24775 28343 15025 20614 29573 19837 19777 22646 7071 5033 18742 8630 -4505
2499 -4505 5788 5046 -5062 1249 -2218 -20795 -15847 -6913 -20035 -22472 -14691 -22909 -22930 -11262
2513 -11262 -22981 -35450 -21989 -18664 -28145 -18973 -14540 -25113 -15973 -2446 -12825 -16551 -7896
$$ packed form
2416c481Q052q886O357J8468p826o192J8237O10j2857P961M033q199R272N303
2430C0852j3456M085J1664j2598n084Q009j2133q637J5535j332j7128M072K632
2443F481j1697K258n02j7614J857J1905j2511o464J2450p170j1815R446k488j3027
2457c8891R665O488j1428N047R686q101K591J0096j1578k230J8872k61p585J5145
2471b484M612j0016R984R109r549L093R899o069O503J4852r449o741J4961k972
2485B5733j1628J0670L568j3318N589Q959r736o0K869j5575k038J3709j0112j3135
2499d505J0293p42j0108O311l467j8577M948Q934j3122k437P781q218k1J1668
2513a1262j1719j2469J3461L325r481R172M433j0573R140J3527j0379l726Q655
$$ plain form
2526 -7896 -10274 -5126 11293 3026 -6612 13090 21256 8968 11887 17049 9705 18446 30370 20468
2540 20468 18838 29262 22918 19444 30008 21186 7797 20369 26655 14722 16899 18521 4613
2553 4613 7503 14778 -628 -8538 765 -3728 -8101 297 -9381 -23124 -12690 -9415 -25867 -24319
2567 -24319 -18451 -27047 -22636 -11638 -22746 -29069 -18859 -22178 -24728 -13096 -17523 -26944 -9150
2580 -9150 2307 -10379 -10647 -2521 -6354 173 10812 636 -455 17737 18417 11843 20587 17096
2594 17096 7765 21179 29207 14955 16776 27165 21106 21872 28830 14660 6633 19749 17346 7535
2608 7535 13303 10052 -1162 8932 11662 -8744 -12736 -3820 -10832 -12891 -6769 -17854 -23683 -10788
2622 -10788 -15379 -29077 -22733 -22181 -32417 -21638 -13200 -26307 -26420 -14427 -19546 -20813 -11794 -20868
$$ packed form
2526g896k378N148J6419q267r638J9702Q166j2288K919N162p344Q741J1924r902
2540B0468j630J0424o344l474J0564q822j3389J2572O286j1933K177J622j3908
2553D613K890P275j5406p910R303m493m373Q398r678j3743J0434L275j6452J548
2567b4319N868q596M411J0998j1108o323J0210l319k550J1632m427r421J7794
2580i150J1457j2686k68Q126l833O527J0639j0176j091J8192O80o574Q744l491
2594A7096r331J3414Q028j4252J821J0389o059P66O958j4170q027J3116k403r811
2608G535N768l251j1214J0094K730k0406l992Q916p012k059O122j1085n829J2895
2622a0788m591j3698O344N52j0236J0779Q438j3107j13J1993n119j267R019r074
$$ plain form
2636 -20868 -23356 -3795 -810 -11026 -3063 2298 -4126 5654 12478 -1666 1787 19566 16866 13946
2650 13946 23229 17133 12310 25983 24237 11292 18604 24353 15656 22400 28304 10954 7807 19728
2664 19728 11660 3378 9391 2991 -3271 9427 5646 -12786 -8830 -3600 -16356 -16014 -10016 -21096
2678 -21096 -21093 -9473 -18115 -25769 -16564 -21991 -30105 -17866 -15663 -27386 -18644 -9134 -17867 -14214 -6316
2693 -6316 -16871 -16345 604 -2181 -9187 4547 7375 2131 12665 13114 1540 10978 22149 11993
2707 11993 14160 26366 18741 16526 28538 21911 11282 20055 19723 11995 21412 21931 6300 11568
2721 11568 19674 5359 -994 4901 -2759 -4707 5148 -3756 -15909 -4905 -4731 -19753 -16658 -14208
2735 -14208 -25587 -20214 -10796 -22217 -24134 -13371 -20555 -25037 -13601 -18853 -27998 -13873 -5971
$$ packed form
2636b0868k488J9561K985j0216P963N361o424R780O824j4144L453J7779k700k920
2650A3946R283o096m823J3673j746j2945P312N749q697O744N904j7350l147J1921
2664A9728q068q282O013o400o262J2698l781j8432L956N230j2756L42N998j1080
2678b1096LJ1620q642p654R205n427q114J2239K203j1723Q742R510q733L653P898
2693f316j0555N26J6949k785p006J3734K828n244J0534M49j1574R438J1171j0156
2707A1993K167J2206p625k215J2012o627j0629Q773l32p728R417N19j5631N268
2721A1568Q106j4315o353N895p660j948R855q904j2153J1004J74j5022L095K450
2735a4208j1379N373R418j1421j917J0763p184m482J1436n252r145J4125P902
$$ plain form
2748 -5971 -14525 -8841 -4479 -12530 -4603 7092 -5095 -6657 9781 10132 7432 18378 15135 6405
2762 6405 18536 23050 11500 17043 24237 15621 20206 31063 19533 12740 21144 15618 9620 19326
2776 19326 14309 1686 12365 17205 1373 -475 3620 -6611 -7464 -214 -10897 -14933 -3469
2789 -3469 -10470 -20474 -11241 -13849 -28247 -20281 -11892 -21789 -20177 -12771 -19308 -16354 -6973 -17872
2803 -17872 -22571 -7269 -5983 -11875 141 2169 -7496 3410 12599 2004 2507 12227 8496 12483
2817 12483 24582 17375 12231 24396 22059 12906 23066 23934 10921 18987 29613 18003 15151
2830 15151 21346 12598 8867 15422 6593 1494 12241 6568 -6251 3411 5667 -11270 -12132 -5988
2844 -5988 -15093 -15436 -8122 -16546 -19620 -10419 -17454 -25208 -15040 -17293 -28519 -16926 -8845 -19790
$$ packed form
2748e971q554N684M362q051P927J1695j2187j562J6438L51k700J0946l243q730
2762F405J2131M514j1550N543P194q616M585J0857j1530o793Q404n526n998R706
2776A9326n017j2623J0679M840j5832j848M095j0231q53P250j0683m036J1464
2789c469p001j0004R233k608j4398P966Q389r897J612P406o537K954R381j0899
2803a7872m699J5302J286n892J2016K028r665J0906R189j0595N03R720l731L987
2817A2483J2099p207n144J2165k337r153J0160Q68j3013Q066J0626j1610k852
2830A5151O195q748l731O555q829n099J0747n673j2819R662K256j6937q62O144
2844e988r105l43P314q424l074R201p035p754J0168k253j1226J1593Q081j0945
$$ plain form
2858 -19790 -16338 -5781 -12466 -13347 -4955 -10530 -10124 4570 1615 -4316 8549 10892 2826 11970
2872 11970 16743 3513 8378 23706 18200 15438 22849 17492 15709 25166 18691 8892 19389 20682
2886 20682 8836 17137 23468 8109 5031 12444 3608 -283 6965 -792 -7276 2582 -995 -11569
2900 -11569 -4723 -6798 -22105 -15925 -6251 -17160 -18277 -10070 -16525 -18010 -8485 -15962 -23516 -11726
2914 -11726 -10139 -17518 -6986 -2573 -11919 -4419 3941 -7921 -7582 6576 3393 711 10826 8991
2928 8991 5550 18244 16222 3503 11929 18756 10004 15409 23780 11883 10656 22683 15507 7309
2942 7309 13773 9285 2209 13009 12279 -703 4524 8390 -6384 -7020 593 -9608 -12654 -3895
2956 -3895 -11508 -17590 -5636 -9787 -23248 -17645 -15212 -23384 -16060 -10120 -21862 -19171 -7208 -15001
$$ packed form
2858a9790L452J0557o685q81Q392n575M06J4694k955n931J2865K343q066R144
2872A1970M773j3230M865J5328n506k762P411n357j783R457o475r799J0497J293
2886B0682j1846Q301O331j5359l078P413q836l891P248p757o484R858l577j0574
2900a1569O846k075j5307O180R674j0909j117Q207o455j485R525p477p554J1790
2914a1726J587p379J0532M413r346P500Q360j1862L39J4158l183k682J0115j835
2928H991l441J2694k022j2719Q426O827q752N405Q371j1897j227J2027p176q198
2942G309O464m488p076J0800p30j2982N227L866j4774o36P613j0201l046Q759
2956c895p613o082J1954m151j3461N603K433q172P324N940j1742K691J1963p793
$$ plain form
2970 -15001 -18411 -8402 -13324 -18311 -4248 -1970 -9375 281 5303 -4401 1568 10335 1806 4329
2984 4329 16844 9990 8307 22966 20434 11751 19595 19095 10968 21483 25834 13374 16832 25725
2998 25725 17042 14519 21089 10425 4805 15940 11758 1462 11194 11477 -2114 1069 3684 -7659
3012 -7659 -5926 489 -10724 -12786 -1950 -7531 -13959 -6421 -12940 -22833 -10936 -6078 -17594 -14004
3026 -14004 -6517 -12881 -9421 -1638 -12287 -14165 -1133 -3628 -8051 4409 4758 -3079 6844 10355
3040 10355 -81 5756 15067 6738 7646 18001 13663 12983 21738 13474 4821 17097 19000 7708
3054 7708 13200 16836 7333 11128 17621 5318 36 7328 940 -2374 6391 85 -8660 1329 -175
3069 -175 -14644 -10712 -4999 -15708 -15447 -8205 -14901 -14604 -6102 -14789 -21301 -10636 -13055 -19890 -9244
$$ packed form
2970a5001l410J0009m922m987J4063K278p405R656N022r704N969Q767q529K523
2984D329J2515o854j683J4659k532q683P844n00q127J0515M351j2460L458Q893
2998B5725q683k523O570j0664n620J1135m182j0296R732K83j3591L183K615j1343
3012g659J733O415j1213k062J0836n581o428P538o519r893J1897M858j1516L590
3026a4004P487o364L460P783j0649j878J3032k495m423J2460L49p837R923L511
3040A0355j0436N837R311q329R08J0355m338o80Q755q264q653J2276J903j1292
3054G708N492L636r503L795O493j2303n282P292o388l314Q765o306q745R989j504
3069a75j4469L932N713j0709K61P242o696K97Q502q687o512J0665k419o835J0646
$$ plain form
3084 -9244 -6948 -16213 -7772 1000 -8231 -7586 740 -4774 -4085 7021 4136 2287 14145 12045 2995
3099 2995 13425 18142 7599 11609 19392 12059 15647 25660 16666 10325 17914 14080 9851 18186
3113 18186 12793 2049 12420 17801 4277 1978 6234 -2738 -3997 2188 -6446 -10562 -1294 -6674
3127 -6674 -15349 -8036 -11564 -22619 -15044 -10879 -22667 -20161 -10333 -16336 -18602 -12603 -19721 -21299
3141 -21299 -8822 -11661 -19357 -7941 -3319 -10533 -3058 1855 -8005 -4635 6429 1135 1064 12400
3155 12400 9040 5572 16008 13964 6339 15355 16813 6713 14877 23192 12945 12645 19974 11638
3169 11638 7749 15276 8931 2270 11347 9215 -229 7318 7052 -7069 -4491 997 -9781 -11883
3183 -11883 -3313 -9287 -12745 -6258 -12792 -19462 -9538 -12023 -23235 -15570 -8420 -15901 -11733 -5742
$$ packed form
3084i244K296r265Q441Q772r231O45Q326n514O89J1106k885j849J1858k100r050
3099B995J0430M717j0543M010P783p333L588J0013q994o341P589l834m229Q335
3113A8186n393j0744J0371N381j3524k299M256q972j259O185q634m116R268n380
3127f674q675P313l528j1055P575M165j1788K506R828o003k266N999p118j578
3141b1299J2477k839p696J1416M622p214P475M913r860L370J1064n294p1J1336
3155A2400l360l468J0436k044p625R016J458j0100Q164Q315j0247l00P329q336
3169A1638l889P527o345o661R077k132r444P547k66j4121K578N488j0778k102
3183a1883Q570n974l458O487o534o670R924k485j1212P665P150p481M168N991
$$ plain form
3197 -5742 -15393 -14130 -2824 -8641 -12644 -2135 -1868 -4815 6373 7148 -2599 5470 12404 3589 6843
3212 6843 16519 10469 10926 22583 17617 10858 18760 17017 10987 19088 18221 7977 16073 22938 10030
3227 10030 7283 13728 5998 1989 8787 2104 -4311 4206 1661 -7819 -2611 -3847 -17070 -12613
3241 -12613 -5295 -15812 -17027 -8951 -15030 -17812 -8952 -15458 -23345 -14278 -12281 -18651 -10051 -7083
3255 -7083 -15816 -8670 235 -9275 -10557 371 -2755 -3566 8106 6851 1520 10191 12095 5264 12398
3270 12398 15504 5831 12817 24494 15631 11666 20655 16539 11657 18057 13299 5524 14858 16403
3284 16403 6381 9524 11552 65 820 7475 -3569 -8886 -70 -3336 -9768 -3432 -8046 -18192
3298 -18192 -11634 -9563 -19900 -16493 -11364 -19223 -15558 -6834 -16535 -21968 -11024 -12250 -17810 -9757
$$ packed form
3197e742r651J263J1306n817m003J0509K67k947J1188P75r747Q069O934q815L254
3212F843R676o050M57J1657m966o759P902j743o030Q101q67j0244Q096O865j2908
3227A0030k747O445p730m009O798o683o415Q517k545r480N208j236j3223M457
3241a2613P318j0517j215Q076o079k782Q860o506p887R067J997o370Q600K968
3255g083q733P146Q905r510j282J0928l126q11J1672j255n331Q671J904o831P134
3270A2398L106r673O986J1677q863l965Q989m116m882O400m758p775R334J545
3284A6403j0022L143K028j1487P55O655j1044n317Q816l266o432O336m614j0146
3298a8192O558K071j0337L407N129p859L665Q724r701n433J0944j226n560Q053
$$ plain form
3312 -9757 -8841 -12933 -3450 593 -7751 -3156 3866 -3732 -807 11025 6198 2865 14181 14471 8949
3327 8949 15007 14575 7299 15647 20446 11103 13885 21617 13331 11815 18810 9933 3507 12579 10656
3342 10656 2525 7941 7594 -1856 2304 3563 -8659 -8704 -2393 -10554 -11718 -3606 -10945 -18120 -9603
3357 -9603 -10759 -20266 -16194 -14772 -20723 -13428 -8229 -17951 -15713 -6809 -13160 -15393 -5936 -8575 -12051
3372 -12051 -906 1874 -4217 3011 6097 -1034 4678 11307 3898 6238 16657 12559 10795 19303
3386 19303 15156 8718 17467 17507 8768 14181 18776 10994 12983 17026 7324 5235 11261 3903 -1118
3401 -1118 6818 2801 -4946 1435 1291 -10038 -8033 -5922 -15290 -12908 -7165 -15811 -16422 -7834 -14423
3416 -14423 -20530 -13002 -15084 -21376 -13567 -10690 -17304 -11003 -4558 -12643 -10757 -2737 -8379 -8839 1704
$$ packed form
3312i757R16m092R483M043q344M595P022p598K925J1832m827l333J1316K90n522
3327H949O058m32p276Q348M799r343K782P732q286j516O995q877o426R072j923
3342A0656q131N416l47r450M160J259j2222m5O311q161j164Q112p339p175Q517
3357i603j156r507M072J422n951P295N199r722K238Q904o351k233R457k639l476
3372a2051J1145K780o091P228L086p131N712O629p409K340J0419m098j764Q508
3386A9303m147o438Q749M0q739N413M595p782J989M043r702k089O026p358n021
3401a118P936m017p747O381j44j1329K005K111r368K382N743q646o11Q588o589
3416a4423o107P528k082o292P809K877o614O301O445q085J886Q020n642m60J0543
$$ plain form
3431 1704 -468 -3002 7609 7706 1363 8683 11946 4133 9014 16442 10143 11987 19710 14002 11083
3446 11083 19369 13234 6850 15087 15293 6634 11574 14551 5418 6510 9594 -847 -2490 4048 -2959
3461 -2959 -7166 406 -3794 -12180 -6008 -7278 -17231 -13477 -10632 -18681 -15003 -8307 -15889 -17400 -9243
3476 -9243 -14138 -18366 -10310 -11640 -16478 -6751 -2834 -9672 -3946 1531 -5653 -3214 5491 572 1073
3491 1073 11389 9117 6373 15625 14937 7575 15037 18104 10210 15056 21380 14860 15881 21898 13912
3506 13912 10180 17728 12660 5917 12637 11574 3472 8204 9088 -1636 -1143 2031 -7396 -7885 -1092
3521 -1092 -8514 -13227 -5302 -9195 -17077 -11778 -13124 -21238 -15248 -10872 -18551 -15309 -8301 -15725 -16593
3536 -16593 -8195 -12434 -15472 -5952 -6341 -10242 70 2512 -4788 239 5745 5 3403 11725 6571
$$ packed form
3431A704k172k534J0611R7o343P320L263p813M881P428o299J844P723n708k919
3446A1083Q286o135o384Q237K06q659M940K977r133J092L084j0441j643O538p007
3461b959m207P572m200q386O172j270r953L754K845q049L678O696p582j511Q157
3476i243m895m228Q056j330m838R727L917o838N726N477p184K439Q705m919N01
3491A073J0316k272k744R252o88p362P462L067p894M846O324o520J021O017p986
3506A3912l732P548n068o743O720j063q102M732Q84j0724M93L174r427m89O793
3521a092p422m713P925l893p882N299j346q114N990M376p679L242P008p424q68
3536a6593Q398m239l038R520l89l901J0312K442p300N027N506n740L398Q322n154
$$ plain form
3551 6571 6615 16784 14022 10010 17495 15199 8148 15540 18610 10922 14644 19436 11492 11764 16351
3566 16351 7418 3508 10635 6293 -476 5828 4850 -3373 -208 -766 -10992 -8589 -4402 -12323 -12967
3581 -12967 -6304 -12603 -15565 -8360 -12455 -19922 -13745 -12596 -18047 -10983 -6576 -14070 -10779 -4055 -9833
3596 -9833 -9259 -1434 -5467 -6813 4124 4700 991 8058 9366 2735 9102 14822 8030 10034 17459
3611 17459 13277 13972 21225 14601 9146 16841 15377 8032 13402 14629 7379 10380 12264 2861 1940
3626 1940 6339 -1694 -5266 587 -3786 -8919 -2716 -5858 -15717 -12457 -10861 -18473 -16191 -12925 -20252
3641 -20252 -18142 -10645 -16655 -20692 -14272 -16899 -20194 -11710 -10870 -16016 -8169 -3718 -9533 -6293 344
3656 344 -4519 -3690 4846 2432 2811 12814 11225 5752 13206 14342 8843 14619 18463 11570 14491
$$ packed form
3551F571M4J0169k762m012P485k296p051P392L070p688L722M792p944K72M587
3566A6351q933l910P127m342o769O304r78q223L165n58j0226K403M187p921o44
3581a2967O663o299k962P205m095p467O177J149n451P064M407p494L291O724n778
3596i833N74P825m033j346J0937N76l709P067J308o631O367N720o792K004P425
3611A7459m182O95P253o624n455P695j464p345N370J227p250L001J884r403r21
3626A940M399q033l572N853m373n133O203l142r859L260J596p612K282L266p327
3641b0252K110P497o010m037O420k627l295Q484Q40n146P847M451n815L240O637
3656C44m863Q29Q536k414L79J0003j589n473P454J136n499N776L844o893K921
$$ plain form
3671 14491 21842 16069 14234 18890 12724 8714 15697 12582 5774 11336 11637 2989 5111 7149 -2252
3686 -2252 -2853 853 -6610 -7984 -502 -5706 -12566 -7532 -9878 -16244 -10753 -10996 -19000 -14226 -7595
3701 -7595 -13705 -12999 -7333 -12584 -14215 -5627 -7824 -10850 -2087 -441 -4718 1706 4784 -1420 2974
3716 2974 9263 2887 4645 14544 11869 9812 16248 12914 8556 16350 16443 8364 12498 16667 11058
3731 11058 13223 17104 8126 4987 11252 5446 651 6266 3424 -3084 2079 1323 -7654 -5678 -4180
3746 -4180 -13014 -12253 -6623 -12843 -14455 -8041 -13387 -18758 -11389 -12637 -18782 -13781 -11666 -15704 -9266
3761 -9266 -4200 -12173 -10748 -2261 -7264 -8259 693 -614 -2672 5928 7354 2404 8662 10760 4657
3776 4657 9015 15191 10059 11920 19746 14147 11313 18527 15365 9201 14898 14376 8096 12953 15643
$$ packed form
3671A4491P351n773j835M656o166m010O983l115o808N562L01q648K122K038r401
3686b252o01L706p463j374P482n204o860N034k346o366N491k43q004M774O631
3701g595o110P06N666n251j631Q588k197l026Q763J646m277O424L078o204M394
3716B974O289o376J758R899k675k057O436l334m358P794R3q079M134M169n609
3731A1058K165L881q978l139O265n806m795N615k842o508N163p56q977J976J498
3746d180q834P61N630o220j612O414n346n371P369j248o145N001K115m038O438
3761i266N066p973J425Q487n003r95Q952j307k058Q600J426m950O258K098o103
3776D657M358O176n132J861P826n599k834P214l162o164N697n22o280M857K690
$$ plain form
3791 15643 7252 7823 10519 2381 415 5226 -759 -4784 2568 -1562 -9219 -4462 -4098 -12735 -11630
3806 -11630 -9604 -16008 -12247 -6315 -14296 -16770 -9301 -12062 -16253 -10246 -12350 -16731 -8213 -3950 -9463
3821 -9463 -6271 -2368 -7248 -4052 3035 -2620 -3412 6112 6193 3456 10432 9787 4304 10724 13479 6575
3837 6575 9684 16179 11186 11759 16582 10865 8065 13996 9953 3941 9778 10083 3126 6505 7953
3852 7953 -482 -648 1929 -5047 -5569 -511 -6585 -10588 -3857 -5992 -12621 -9224 -10251 -17087 -11956
3867 -11956 -8114 -14569 -13075 -7671 -12613 -12445 -5546 -10474 -14188 -6180 -4468 -7366 -1226 232 -5125
3882 -5125 1162 5854 -895 456 7976 5787 5982 13014 10012 7357 15093 13551 6750 11550 14754
3897 14754 9432 12942 16428 9273 9388 14273 7701 3968 8722 5138 274 6776 5443 -2612 -10
$$ packed form
3791A5643q391N71K696q138j966M811n985m025P352m130p657M757L64q637J105
3806a1630K026o404L761N932p981k474P469k761m191O007k104m381Q518M263n513
3821i463L192L903m880L196P087n655p92R524Q1k737O976o45n483O420K755o904
3837F575L109O495m993N73M823n717k800N931m043o012N837L05o957L379J448
3852G953q435j66K577o976n22N058o074m003O731k135o629L397j027o836N131
3867a1956L842o455J494N404m942J68O899m928l714Q008J712k898O140J458n357
3882e125O287M692o749J351P520k189J95P032l002k655P736j542o801M800L204
3897A4754n322L510L486p155J15M885o572l733M754l584m864O502j333q055K602
$$ plain form
3912 -10 873 -6640 -5771 -3714 -11281 -10277 -3619 -9290 -13555 -7276 -10145 -16350 -11689 -11007 -15754 -10532
3928 -10532 -7328 -12794 -9620 -4104 -9835 -10449 -3364 -6109 -7655 807 857 -2477 4280 6313 334
3943 334 4764 8924 4021 6742 12904 8838 9278 16462 12196 7240 13540 12488 6816 11840 13295
3958 13295 6827 9467 12392 5584 4877 7261 233 -1604 5281 838 -5772 -38 -592 -7625 -5601
3973 -5601 -5819 -13545 -10476 -6265 -12705 -12518 -6885 -11859 -14277 -8241 -12084 -16955 -9517 -7724 -12634
3988 -12634 -7235 -3621 -9241 -5631 56 -5836 -5253 1961 204 -235 8268 6301 1825 9394 11124
4003 11124 4485 8233 12457 7964 10920 16334 11019 9850 15433 10321 5967 12125 10191 3648 9588
4018 9588 10928 3587 4863 6522 -1503 -1568 2699 -3917 -6534 -519 -4027 -8844 -4074 -6766 -14011
$$ packed form
3912a0Q83p513Q69K057p567J004O658n671m265O279k869o205M661O82m747N222
3928a0532L204n466L174N516n731o14P085k745j546Q462N0l334O757K033n979
3943C34M430M160m903K721O162m066M40P184m266m956O300j052n672N024J455
3958A3295o468K640K925o808p07K384p028j837O885m443o610N734n54p033K024
3973e601k18p726L069M211o440J87N633m974k418O036l843m871P438J793m910
3988a2634N399L614n620L610N687n892N83P214j757m39Q503j967m476P569J730
4003A1124o639L748M224m493K956N414n315j169N583n112m354O158j934o543N940
4018I588J340p341J276J659q025o5M267o616k617O015l508m817M770k692p245
$$ plain form
4033 -14011 -9521 -8463 -15133 -11768 -7052 -12854 -12035 -6048 -10939 -13344 -7513 -8919 -11493 -4112 -2800
4048 -2800 -7990 -1440 2588 -3873 -1308 4261 122 1555 9191 5732 4650 12464 10808 5497 11248
4063 11248 11730 5910 10724 14677 8842 10226 14889 8785 6853 11611 6282 1815 7853 6352 368
4078 368 4616 4088 -3403 -1562 388 -7921 -7782 -2749 -8464 -10258 -4592 -8084 -13204 -8264 -9834 -15576
4094 -15576 -10458 -8533 -14255 -9953 -4760 -10338 -9976 -4028 -8494 -9576 -1922 -3358 -5905 1906 2964
4109 2964 -1688 3596 6518 880 3731 9607 5521 6587 13675 9734 7637 14187 10720 5776 11471
4124 11471 11578 6111 10688 12774 5710 6908 10729 3475 675 5557 1189 -2884 2603 642 -5412
4139 -5412 -1743 -2677 -9972 -7335 -5352 -12401 -11202 -5664 -10163 -12397 -6772 -10769 -14473 -8796 -9658
$$ packed form
4033a4011M490J058o670L365M716n802Q19N987m891k405N831j406k574P381J312
4048b800n190O550M028o461K565N569m139J433P636l459j082P814j656n311N751
4063A1248M82n820M814L953n835J384M663o104j932M758n329m467O038j501n984
4078C68M248n28p491J841J950q309J39N033n715j794N666l492n120M940j570n742
4094a5576N118J925n722M302N193n578L62N948m466j082P654j436k547P811J058
4109B964m652N284K922n638K851N876m086J066P088l941k097O550l467m944N695
4124A1471J07n467M577K086p064J198L821p254k800M882m368m073N487j961o054
4139e412L669r34p295K637J983p049J199N538m499k234N625l997l704N677q62
$$ plain form
4154 -9658 -14133 -7973 -5273 -10080 -5883 -1539 -7188 -6080 327 -3659 -3967 3842 3057 677 7846
4169 7846 7872 2651 7901 10305 5062 8405 13606 8173 9546 15600 10900 7411 12619 9574 4910
4184 4910 10259 10089 3764 7646 9161 1570 2219 5190 -2115 -3601 1696 -2766 -6232 -1022 -4018
4199 -4018 -9495 -5303 -6469 -13420 -9957 -6750 -12431 -10968 -5775 -11062 -11973 -6103 -10050 -13077 -6068
4214 -6068 -6304 -9891 -3396 -1076 -6364 -1966 2379 -3156 -1338 4841 1512 1496 9321 7440 4176 10370
4230 10370 9557 4007 9005 11287 5552 9418 13601 7595 7908 12777 6685 3199 8645 5259 1038
4245 1038 6418 5774 -1147 2273 2980 -4767 -3552 -778 -7366 -7801 -2212 -6816 -9501 -4432 -7848 -13377
4261 -13377 -7737 -7715 -14024 -9688 -5605 -10640 -8193 -3170 -9014 -9521 -2849 -5973 -7804 100 -177 -3775
$$ packed form
4154i658m475O160K700m807M197M344n649J108O407l986l08P809p85k380P169
4169G846K6n221N250K404n243L343N201n433J373O054m700l489N208l045m664
4184D910N349j70o325L882J515p591O49K971p305j486N297m462l466N210k996
4199d018n477M192j166o951L463L207n681J463N193n287r11N870l947l027P009
4214f068k36l587O495K320n288M398M345n535J818O179l329j6P825j881l264O194
4230A0370q13n550M998K282n735L866M183o006L13M869o092l486N446l386m221
4245A038N380o44o921L420P07p747J215K774o588m35N589m604k685N069l416n529
4261a3377N640K2o309M336M083n035K447N023n844n07O672l124j831P904k77l598
$$ plain form
4277 -3775 3080 5415 -668 3350 7187 1960 4660 10522 6970 6784 13449 10385 5794 11832 10445
4292 10445 5334 10576 12267 6026 8884 12398 5450 4851 8561 2257 -637 5199 1924 -2562 2093
4307 2093 147 -6469 -2896 -2194 -9976 -9380 -4936 -10326 -10043 -4988 -10216 -12884 -7086 -10011 -14802 -8902
4323 -8902 -8050 -13283 -7105 -3290 -9343 -6995 -1928 -6441 -6790 420 -2330 -3086 4510 3591 -427 5848
4339 5848 7404 1756 5901 9087 4660 7473 13661 8907 7144 12494 9226 5443 10744 9009 3503
4354 3503 9153 10440 3633 5688 8387 656 -99 3796 -1199 -3824 1854 -1662 -6456 -1634 -3579
4369 -3579 -10132 -6184 -5665 -12538 -9596 -4600 -9658 -10151 -5080 -9334 -11696 -5725 -7610 -11392 -4555
4384 -4555 -3506 -7418 -1919 1123 -4623 -2239 2919 -1246 -713 6824 4078 2328 9149 8644 4535
$$ packed form
4277c775O855K335o083M018L837n227K700N862l552j86O665l064m591O038j387
4292A0445n111N242J691o241K858L514o948n99L710o304k894N836l275m486M655
4307B093j946o616L573P02p782N96M444n390K83N055n228k668N798k925m791N900
4323h902Q52n233O178L815o053K348N067m513l49P210k750p56P596r19m018O275
4339E848J556n648M145L186m427K813O188m754j763N350l268l783N301j735n506
4354C503N650J287o807K055K699p731p55L895m995k625N678l516m794M822j945
4369c579o553L948N19o873K942M996n058m93N071m254k362N971j885l782O837
4384d555J049l912N499L042n746K384N158m165N33P537k746j750O821n05m109
$$ plain form
4399 4535 9131 9256 3847 8701 12893 7412 8825 13441 7755 6534 11602 6985 2071 7711 6300
4414 6300 1763 5116 5319 -1294 587 2072 -5946 -5708 -745 -5832 -8018 -3100 -6636 -10823 -5759
4429 -5759 -7597 -14317 -9947 -7708 -12489 -9190 -5039 -10615 -10150 -4160 -8472 -9956 -3501 -5095 -7215
4444 -7215 94 1075 -3667 1528 4183 -974 1849 7281 2868 4522 11233 7714 6012 12880 10229
4459 10229 5196 10367 11050 6610 10259 12795 6572 8025 11902 5069 3130 7376 2569 -912 4873
4474 4873 2872 -2874 1009 897 -7075 -5009 -2823 -8829 -7953 -3699 -9210 -10170 -4768 -8496 -12996 -7947
4490 -7947 -8779 -13673 -7630 -5112 -10586 -7256 -2563 -7263 -6553 -1576 -5120 -4698 2604 852 -1747 5304
4506 5304 6244 944 5561 7613 3375 6623 11394 6745 7425 13389 9864 7059 11928 8656 4156
$$ packed form
4399D535M596J25n409M854M192n481J413M616n686j221N068m617m914N640j411
4414F300m537L353K03o613J881J485q018K38M963n087k186M918l536m187N064
4429e759j838o720M370K239m781L299M151n576M65N990m312j484O455j594k120
4444g215P309R81m742N195K655n157K823N432m413J654O711l519j702O868k651
4459A0229n033N171O83m440L649K536o223J453L877o833j939M246m807l481N785
4474D873k001n746L883j12p972K066K186o006Q76M254n511r60N402l728m500N049
4490g947q32m894O043K518n474L330M693m700P10M977l544M22P302j752k599P051
4506E304R40n300M617K052m238L248M771m649O80N964l525k805M869l272m500
$$ plain form
4521 4156 9956 10575 4419 7304 9012 2504 3719 6204 -1096 -2591 2663 -1171 -4241 313 -2590
4536 -2590 -8084 -3892 -4965 -11486 -8408 -5490 -11791 -10351 -4946 -9708 -10916 -6118 -9631 -12669 -6134
4551 -6134 -6772 -10705 -4518 -1506 -6510 -3160 1167 -3937 -2369 3531 99 196 7345 5992 3242 9141
4567 9141 8841 3040 8267 11058 5753 8241 12434 7639 8510 13176 6918 3663 9199 7002 2463
4582 2463 6770 5939 237 3679 5078 -2783 -2614 269 -5493 -6033 -1195 -5384 -8355 -3438 -5902 -11741
4598 -11741 -7259 -7375 -13344 -9221 -5647 -10759 -9239 -3961 -8588 -9741 -4345 -7117 -8638 -1479 -1559
4613 -1559 -5398 1235 3470 -1908 1309 5558 447 2645 8219 5232 5251 11519 8734 5063 10720
4628 10720 10153 4852 9591 11479 5970 8434 12112 6449 5195 8931 3473 921 5969 3038 -2024
$$ packed form
4521D156N800O19o156K885J708o508J215K485p300j495N254l834l070M554k903
4536b590n494M192j073o521L078K918o301J440N405m762j208M798l513l038O535
4551f134o38l933O187L012n004L350M327n104J568N900l432R7P149j353k750N899
4567I141l00n801N227K791n305K488M193m795Q71M666o258l255N536k197m539
4582B463M307q31n702L442J399p861J69K883n762n40M838m189k971M917k464n839
4598a1741M482j16n969M123L574n112J520N278m627j153N396k772j521P159q0
4613a559l839O633K235n378L217M249n111K198N574k987J9O268k785l671N657
4628A0720n67n301M739J888n509K464L678n663j254L736n458k552N048k931n062
$$ plain form
4643 -2024 3135 2233 -3849 -1716 -1101 -8350 -7057 -3035 -8602 -9436 -4287 -7996 -10857 -6351 -9067 -13126
4659 -13126 -7723 -7491 -12755 -7768 -3388 -8515 -7201 -2363 -6555 -6846 -664 -2528 -3963 2830 2321
4674 2321 -555 4921 6310 886 4587 8981 3932 5671 11677 7987 7043 12280 8517 5341 10225
4689 10225 9337 4140 8656 10346 4491 6784 8690 1721 805 4844 85 -2534 1838 -607 -4668
4704 -4668 -677 -2445 -8540 -5613 -4595 -10732 -8682 -4249 -9491 -9697 -4735 -8595 -11095 -5952 -8127
4719 -8127 -11018 -5092 -4378 -8224 -3590 -244 -5478 -3357 1930 -2599 -2374 4342 2609 1195 7612
4734 7612 6940 2967 7975 8924 3790 7648 11059 6535 8415 13432 8123 6631 10834 7278 3367
4749 3367 8223 6607 2330 5985 6155 80 1635 3541 -3528 -3888 359 -4542 -6428 -1308 -4164
$$ packed form
4643b024N159r02o082K133O15p249J293M022n567q34N149l709k861M506k716m059
4659a3126N403K32n264M987M380n127J314M838m192k91O182j864j435O793n09
4674B321k876N476J389n424L701M394n049J739O006l690r44N237l763l176M884
4689A0225q88n197M516J690n855K293J906o969r16M039m759k619M372k445m061
4704d668L991j768o095K927J018o137K050M433n242k06M962l860k500N143k175
4719h127k891N926P14l846M634L346n234K121N287m529K25O716j733j414O417
4734G612o72l973N008R49n134L858L411m524J880N017n309j492M203l556l911
4749C367M856j616m277L655J70o075J555J906p069l60M247m901j886N120k856
$$ plain form
4764 -4164 -8801 -4709 -6387 -11759 -7805 -6687 -11685 -8676 -4405 -9471 -9183 -4112 -8097 -10151 -4043
4779 -4043 -5283 -7628 -1503 27 -3859 416 2948 -1618 777 5596 1769 2802 9391 6928 5029
4794 5029 10549 9116 4843 9796 10123 5161 8946 11685 6511 8085 11344 5259 3284 7997 4027
4809 4027 496 4962 3705 -1133 2091 1987 -4685 -3102 -1303 -7789 -6927 -2739 -7402 -8998 -4273
4824 -4273 -7420 -11769 -7255 -8136 -12159 -7853 -5577 -10624 -7076 -3259 -7823 -7285 -2339 -5470 -6472
4839 -6472 643 -250 -2568 3471 4349 -73 3824 6461 2094 4527 9215 5836 6372 11682 8148 5951
4855 5951 11171 9044 4198 8828 9509 4513 7728 9643 3682 4158 6674 1271 -241 3622 -244
4870 -244 -3137 1777 -519 -6094 -3117 -2730 -9006 -7224 -4801 -10121 -9004 -4685 -8780 -10371 -5677
$$ packed form
4764d164m637M092j678n372L954J118m998L009M271n066K88N071l985k054O108
4779d043j240k345O125J530l886M275K532m566K395M819l827J033O589k463j899
4794E029N520j433m273M953L27m962L785K739n174J574L259o085j975M713l970
4809D027l531M466j257m838L224j04o672J583J799o486Q62M188m663j596M725
4824d273l147m349M514q81m023M306K276n047L548L817m564N38M946l131j002
4839f472P115q93k318O039Q78m422L897K637m367K433M688l379N36N310l534k197
4855E951N220k127m846M630O81m996L215J915n961M76K516n403j512L863l866
4870b44k893M914k296n575K977L87o276J782K423n320J117M319m095j591M694
$$ plain form
4885 -5677 -8508 -11497 -6450 -6897 -10522 -5525 -2474 -6551 -3914 -310 -4755 -3641 1440 -997 -1373
4900 -1373 5238 3711 1917 7415 7458 2639 6550 8973 4813 7098 11346 7134 7467 12074 7698 4986
4916 4986 9138 6673 2895 7467 7406 1990 4379 6242 -353 -621 1777 -3250 -4307 -37 -3429 -6605
4932 -6605 -2439 -4965 -9681 -6508 -6311 -11666 -8657 -5438 -10151 -9043 -4609 -8447 -9419 -4716 -7335
4947 -7335 -9365 -3407 -3368 -6036 -1440 1006 -3226 -239 3263 -633 589 6277 3791 3275 9252 7369
4963 7369 4719 9399 9019 4823 8582 10532 6114 8487 11819 6585 6231 9481 5335 2719 6825
4978 6825 4074 428 4655 3785 -1930 476 738 -5488 -4739 -1874 -6441 -7194 -2671 -6086 -8864 -5340
4994 -5340 -7510 -11711 -7803 -6812 -11165 -7780 -4379 -8611 -7081 -3062 -7021 -7247 -2205 -3578 -5396
$$ packed form
4885e677k831k989N047m47l625M997L051m077K637L604m445J114N081k437l76
4900a373O611j527j794N498M3m819L911K423m160K285M248m212L33M607m376k712
4916D986M152k465l778M572o1n416K389J863o595k68K398n027j057M270l392l176
4932f605M166k526m716L173J97n355L009L219m713J108M434l838r72M703k619
4947g335k030N958L9k668M596K446m232K987L502l896J222N688k486n16N977j883
4963G369k650M680l80m196L759J950m418K373L332n234l54L250m146k616M106
4978F825k751l646M227q70n715K406K62o226P49K865m567p53M523l415k778L524
4994e340k170m201L908R91m353L385L401m232J530M019l959k26N042j373j818
$$ plain form
5009 -5396 539 842 -1721 3222 4349 -97 2760 6149 2860 4796 9540 6677 6178 11140 9029
5024 9029 5095 9528 8892 4777 8478 9905 5080 6538 9169 3583 2538 5605 1280 -1250 3254
5039 3254 704 -3059 369 -472 -6354 -4168 -3295 -8496 -7486 -4097 -7942 -8831 -4587 -7806 -10264 -6120
5055 -6120 -7535 -11634 -6313 -4812 -8395 -4955 -1735 -5638 -4399 -317 -3584 -3437 1788 296 -736
5070 -736 5507 5416 1845 6104 7085 3023 6148 9133 5591 6752 11480 7927 6704 10167 7479 3804
5086 3804 8035 7503 2955 6797 7544 2102 3110 4813 -847 -1511 1774 -2080 -4264 -569 -2438 -6408
5102 -6408 -3200 -4665 -10219 -7001 -5132 -10292 -8765 -5137 -8842 -8421 -4372 -7865 -10161 -4965 -5972
5117 -5972 -8318 -3344 -1723 -5213 -1657 1344 -2764 -1428 3128 9 738 6282 4987 3586 8841
$$ packed form
5009e396N935L03k563M943J127m446K857L389l289J936M744k863m99M962k111
5024I029l934M433o36m115L701J427m825J458K631n586j045L067m325k530M504
5039C254k550l763L428q41n882K186Q73n201J010L389l845q89M244l219k458M144
5055f120j415m099N321J501l583L440L220l903J239M082l267J47N225j492j032
5070g36O243r1l571M259R81m062L125K985l542J161M728l553j223L463k688l675
5086C804M231n32m548L842P47n442J008J703n660o64L285l854k184L695j869l970
5102f408L208j465n554L218J869n160J527L628l705M21M049l493k296N196j007
5117e972k346M974J621l490L556L001m108J336M556l119P29N544j295j401N255
$$ plain form
5132 8841 7627 3671 7891 8704 4735 7850 10748 6324 7310 10511 6664 4125 7688 4940 1767
5147 1767 5732 4615 191 3488 3317 -2527 -1687 358 -5123 -5790 -2073 -5417 -6755 -3443 -6157 -9873
5163 -9873 -6388 -6817 -11218 -7625 -6057 -9942 -7421 -3494 -7479 -7762 -3579 -6071 -7183 -1609 -2166 -4316
5179 -4316 1053 2608 -1531 1933 4166 688 2745 6842 3930 4621 10058 7901 5313 9332 8340
5194 8340 4719 8173 9283 4635 7526 9667 5052 5366 7941 2798 977 4818 2043 -1345 2551
5209 2551 1170 -3236 -1141 -1265 -6975 -5459 -3301 -8233 -7709 -3711 -7006 -8752 -4909 -7656 -10790
5224 -10790 -6466 -6539 -10103 -6243 -3933 -7157 -4809 -1961 -5809 -4915 -183 -2706 -2871 2530 2345 29
5240 29 4551 5416 1906 5086 7126 3528 5726 9772 6566 6555 10760 7601 5000 9000 7446 3696
$$ packed form
5132H841j214l956M220Q13l969L115K898m424R86L201l847k539L563k748l173
5147A767L965j117m424L297j71n844Q40K045n481o67L717l344j338L312k714l716
5163i873L485m29m401L593J568l885K521L927l985k83M183k492j112N574n57k150
5179d316N369J555m139L464K233l478K057M097k912O91N437k157k588M019r92
5194H340l621L454J110m648K891K141m615L14K575n143j821L841k775l388L896
5209B551j381m406K095j24n710J516K158m932N24L998l295j746L843k747l134
5224a0790M324p3l564L860K310l224K348K848l848Q94M732k523j65N401j85k316
5240B9M522Q65l510L180K040l598K198M046l206j1M205l159k601M000j554l750
$$ plain form
5256 3696 7166 7651 3636 5788 7072 1504 1082 3548 -996 -2488 1119 -1789 -4338 -1301 -2969
5271 -2969 -7645 -4953 -4505 -9625 -7730 -5297 -8875 -7979 -4437 -7957 -9392 -5239 -6953 -9594 -4696
5286 -4696 -4486 -7162 -2691 -539 -4211 -1860 1116 -2235 -839 3784 1610 1352 6837 5997 3341 7491
5302 7491 7410 3900 7111 9037 5493 7621 11077 6693 5989 9732 6223 3265 6490 4864 1623 5032
5318 5032 4963 379 1767 2545 -3073 -2952 -551 -4710 -5403 -1608 -4426 -7423 -3825 -5772 -10222 -6802
5334 -6802 -6355 -10238 -7624 -4561 -8204 -7414 -3650 -7356 -7901 -3231 -5046 -6945 -1359 -345 -2895 805
5350 805 2602 -915 1658 4461 1427 2735 7999 5719 4563 9586 7793 4884 8355 8153 4517
5365 4517 8206 9513 5190 6679 9615 4655 3423 6348 2808 -64 3960 2292 -1209 2018 1066
$$ packed form
5256C696L470M85m015K152J284n568m22K466m544j492L607k908k549L037j668
5271b969m676K692M48n120J895K433l578Q96L542l520j435M153j714k641M898
5286d696K10k676M471K152l672K351K976l351J396M623k174k58N485q40k656M150
5302G491q1l510L211J926l544K128L456m384p04L743l509k958L225j626l241L409
5318E032o9m584J388P78n618J21K401m159o93L795k818k997L598j947m450L420
5334f802M47l883K614L063l643P90L764l706n45M670j815j899N586J014k550L700
5350H05J797l517K573K803l034J308N264k280j156N023j793k909L471k02l636
5365D517L689J307m323J489K936m960j232K925l540k872M024j668l501L227r52
$$ plain form
5380 1066 -4170 -2320 -1555 -6990 -6136 -3139 -6563 -7345 -3486 -6396 -9144 -5490 -6688 -10439 -6730 -5067
5396 -5067 -8267 -5563 -2676 -6325 -4952 -1189 -4146 -4692 395 -679 -2004 3434 3807 417 4211
5411 4211 5444 2222 4476 7421 4476 5749 10532 7380 5429 9460 7389 4152 7646 7506 3577
5426 3577 6847 7832 2992 4019 5747 937 -267 2662 -648 -2882 1108 -1223 -4883 -1689 -2774
5441 -2774 -7698 -6331 -4653 -8958 -7377 -4628 -8072 -8265 -4312 -7496 -9712 -5589 -6016 -8790 -4158
5456 -4158 -2485 -5730 -2678 -159 -3572 -2138 1659 -1286 -579 4731 3404 1831 6684 6374 3073
5471 3073 6195 7374 3968 6544 9768 5842 6753 10164 6516 4650 7859 5471 2303 6154 5504
5486 5504 1675 4234 4533 -531 114 1542 -3381 -3952 -698 -3741 -5583 -1938 -4451 -8219 -4852 -5852
$$ packed form
5380A066n236J850P65n435Q54K997l424p82L859k910k748L654j198l751L709J663
5396e067l200K704K887l649J373L763k957n46N087j074j325N438L73l390L794
5411D211J233l222K254K945k945J273M783l152j951M031k071l237L494j40l929
5426C577L270R85m840J027J728m810j204K929l310k234L990k331l660L194j085
5441b774m924J367J678m305J581K749l444j93L953l184k216M123m27k774M632
5456d158J673l245L052K519l413J434L797k945P07N310j327j573M853l10l301
5471C073L122J179l406K576L224l926R11L411l648j866L209k388l168L851o50
5486E504l829K559K99n064O45J428m923n71L254l043j842L645k513l768L367j000
$$ plain form
5502 -5852 -9929 -7589 -5272 -8976 -7319 -3884 -7348 -7691 -3736 -6480 -7611 -2844 -3069 -5227 -556
5517 -556 1048 -2459 742 2989 -585 864 4816 2916 3073 8055 6520 4298 8307 7433 3876 6977
5533 6977 8285 4411 7199 9386 5269 5437 8288 4280 1884 5563 2499 -238 3512 2054 -1780
5548 -1780 266 591 -4961 -3893 -2248 -6631 -6348 -2641 -6096 -7944 -3656 -6349 -10052 -6339 -6270 -9722
5564 -9722 -5991 -4240 -7826 -5959 -2457 -5759 -5533 -1413 -3600 -4545 1213 726 -1367 2829 4152 541
5580 541 3613 5874 2219 3887 8267 5561 5764 9515 7233 4842 8586 7589 3703 7118 7973 4073
5596 4073 6185 7758 2578 2291 4809 549 -1058 2372 -86 -2798 406 -695 -5551 -3594 -3466
5611 -3466 -7805 -6264 -4081 -8372 -7269 -3610 -6878 -8380 -4767 -7015 -9229 -5081 -4788 -7641 -3661
$$ packed form
5502e852m077K340K317l704J657L435l464l43L955k744j131M767k25k158M671
5517e56J604l507L201K247l574J449L952j900J57M982j535k222M009q74l557L101
5533F977J308l874K788K187m117J68K851m008k396L679l064k737L750j458l834
5548a780K046L25n552J068J645m383K83L707l455j848M288k693l703L713O9l452
5564i722L731J751l586J867L502l302K26M120k187r45N758m87k093M196J323l611
5580E41L072K261l655J668M380k706K03L751k282k391L744r97l886L415Q55l900
5596D073K112J573n180k87K518m260j607L430k458k712L204j101m856J957J28
5611c466m339J541K183m291J103L659l268j502L613k248k214M148K93k853L980
$$ plain form
5626 -3661 -1243 -4982 -2920 57 -3412 -2529 2400 132 -382 4881 4465 2233 5847 6345 2966 5665
5642 5665 7790 4700 6151 9786 6664 5648 9680 6453 3472 7078 5703 2300 5532 5646 1607
5657 1607 2620 3693 -1475 -1192 1060 -3207 -4043 -464 -3049 -6099 -2612 -4241 -8493 -5984 -5229 -9223
5673 -9223 -6836 -4443 -7699 -7077 -3548 -6589 -7886 -3618 -5077 -7001 -2395 -1500 -4392 -409 1547
5688 1547 -1765 246 3512 375 1342 6034 4238 3350 8173 6590 3951 7656 7758 4153 6800 8768
5704 8768 5409 6714 9498 4935 3942 7046 3513 1121 4486 3383 -197 2548 2671 -2312 -1277
5719 -1277 -292 -4890 -4734 -1933 -5486 -6221 -2887 -5730 -8522 -4837 -6365 -9846 -6532 -5075 -8649 -6096
5735 -6096 -3388 -6904 -5753 -2253 -5237 -5697 -1028 -2164 -3243 1428 2192 -774 2831 4215 432
$$ packed form
5626c661K418l739K062K977l469Q83M929k268n14N263m16k232L614M98l379K699
5642E665K125l090J451L635l122j016M032l227k981L606j375l403L232J14m039
5657A607J013J073n168K83K252m267q36L579k585l050L487j629m252K509P55l994
5673i223K387K393l256O22L529l041j297M268j459j924M606Q95k892L983J956
5688A547l312K011L266l137R67M692j796q88M823j583k639L705J02l605K647J968
5704H768l359J305K784m563r93L104l533k392L365j103l580K745J23m983J035
5719a277R85m598J56K801l553p35L334k843k792L685j528l481L314J457l574K553
5735f096K708l516J151L500k984m60M669j136j079M671P64k966L605J384l783
$$ plain form
5750 432 2530 6250 3445 4416 8690 6087 5054 8798 7055 3927 7513 7167 3536 6727 8228 3531
5766 3531 4432 6395 2159 986 3845 235 -1737 1691 344 -3462 -652 -1615 -6452 -4809 -3396
5781 -3396 -8134 -7253 -3661 -6977 -7598 -4106 -6962 -9451 -5448 -6378 -9082 -5097 -3516 -6695 -4000 -1278
5797 -1278 -4599 -3739 571 -2524 -2552 2633 1737 476 5024 4852 1338 5099 6558 2681 5047 8005
5813 8005 5272 5925 9481 6349 4496 7899 5720 2829 6504 5705 2363 4959 5647 702 1324 2967
5829 2967 -1732 -2548 759 -2593 -4534 -695 -2409 -6513 -4154 -4329 -8728 -6798 -4724 -8467 -6726
5844 -6726 -3445 -7429 -7735 -3628 -6121 -8184 -3899 -4010 -6258 -1684 -498 -3793 -499 1844 -2028
5859 -2028 -402 3410 1154 1501 6461 5080 3430 7423 6940 3261 6562 7666 3831 6720 9780
$$ packed form
5750D32K098L720k805R71M274k603j033L744j743l128L586l46l631L191J501m697
5766C531R01J963m236j173K859l610j972L428j347l806K810r63m837J643J413
5781c396m738Q81L592l316o21L492k856k489M003r30k704L985J581l179K695K722
5797a278l321Q60M310l095k8N185q96j261M548j72l514L761J459l877K366K958
5813H005k733O53L556l132j853L403k179k891L675p99l342K596O88m945O22J643
5829B967m699q16L307l352j941L839j714m104K359j75m399J930K074l743J741
5844f726L281l984l06M107k493k063M285j11k248M574J186l295L294K343l872
5859b028J626L812k256L47M960j381j650L993m83l679L301J104l835K889L060
$$ plain form
5874 9780 5580 5290 8348 4788 2791 5801 3507 770 4356 3654 -466 1654 1851 -3311 -2643 -801
5890 -801 -4873 -5173 -1833 -4809 -6679 -3323 -5126 -8814 -5658 -6036 -9441 -6572 -4076 -7679 -5857 -2595
5906 -2595 -6379 -6573 -2170 -4228 -5594 -436 -450 -2682 1549 2890 -907 2309 4437 939 2716 7160
5922 7160 4701 4463 8449 6908 4766 7756 7161 3659 6895 7987 4217 6107 8171 3759 3441 5919
5938 5919 1739 146 3599 1029 -2181 1455 393 -4045 -1925 -1418 -6303 -5321 -3042 -6753 -6521 -2875
5954 -2875 -6483 -8102 -4284 -6084 -9562 -5926 -5075 -7845 -4575 -2798 -5927 -4176 -843 -4074 -3937
5969 -3937 589 -870 -1647 2938 2621 571 4636 5262 1243 4356 6884 3320 4863 8899 5698 5449
5985 5449 8954 5860 3403 6871 5776 2567 5574 6011 1934 3178 4751 397 -426 1876 -1798
$$ packed form
5874I780m200k90L058l560j997L010k294k737L586p02m120K120J97n162O68J842
5890h01m072l00L340k976j870L356j803l688L156l78l405K869K496l603J822L262
5906b595l784j94M403k058j366N158j4k232M231J341l797L216K128l498J777M444
5922G160k459k38L986j541k142K990n95l502L236J092l770J890K064m412l18K478
5938E919m180j593L453k570l210L636j062m438K120N07m885R82K279l711K32L646
5954b875l608j619L818j800l478L636Q51k770L270J777l129J751L333l231J37
5969c937M526j459p77M585l17k050M065O26m019L113K528l564J543M036l201k49
5985E449L505l094k457L468j095l209L007M37m077J244J573m354q23K302l674
$$ plain form
6000 -1798 -3246 365 -2391 -5043 -1669 -2870 -7474 -5432 -4585 -8538 -6439 -3924 -7761 -6945 -3626
6015 -3626 -6596 -8182 -4015 -5560 -7725 -3514 -2339 -4849 -1266 424 -2857 -998 2467 -435 -243
6030 -243 4565 3297 2328 6836 5976 3189 6922 7104 3090 6517 8646 5280 6358 9119 5948 4528
6046 4528 7324 4483 2011 5492 4125 577 3788 3763 -723 237 1110 -3301 -3276 -784 -4419 -5121 -1725
6063 -1725 -4204 -7081 -3903 -5183 -9099 -5920 -5093 -8429 -5916 -3484 -6589 -6035 -2610 -5307 -6590
6078 -6590 -1849 -2484 -4279 64 551 -1507 1877 3024 -352 1825 4944 2366 3037 7307 5232 4409
6094 4409 8225 6528 3805 7159 6869 3834 6370 8124 4055 5069 7227 3110 2049 4515 1730
6109 1730 -384 3235 1737 -2097 526 310 -4534 -3347 -2197 -6502 -5521 -2560 -6298 -6897 -3369 -5419
$$ packed form
6000a798j448L611k756k652L374j201m604K042Q47l953K099K515l837Q16L319
6015c626k970j586M167j545k165M211J175k510L583J690l281J859L465k902J92
6030b43M808j268r69M508q60k787L733J82m014L427K129l366J078K761l171j420
6046D528K796k841k472L481j367l548L211k5m486R60Q73m411K5K492l635p02L396
6063a725k479k877L178j280l916L179Q27l336K513K432l105N54L425k697j283
6078f590M741o35j795M343M87k058L384J147l376K177L119k578O71M270k075q23
6094D409L816j697k723L354k90l035K536J754m069J014K158m117j061K466k785
6109A730k114L619j498l834K623k16m844J187J150m305R81K961l738n99L528k050
$$ plain form
6125 -5419 -8488 -5116 -5677 -8765 -4958 -3728 -6572 -4010 -1333 -4809 -4134 -248 -2901 -3174 1221 555
6141 555 -612 3637 4049 803 3957 5408 1884 3946 7284 4338 4797 8862 5998 4445 7849 6002
6157 6002 3175 6434 5938 2518 4955 6073 1673 1980 3713 -586 -1383 1973 -1296 -3228 -106 -2065
6173 -2065 -5441 -2954 -3264 -7606 -5631 -3817 -7734 -6526 -3212 -6639 -7232 -3992 -6200 -8183 -4167
6188 -4167 -4590 -6457 -2554 -1064 -4550 -1709 405 -2605 -1626 2189 368 -26 4787 3914 2346 6020
6204 6020 5757 2552 5565 6757 3593 5784 8199 5381 5421 8096 4830 3056 6232 4429 1310 4443
6220 4443 4333 1017 2400 3148 -1384 -1435 783 -3324 -4012 -944 -3520 -5235 -2089 -4187 -7279 -4849
6236 -4849 -4912 -8182 -5993 -4095 -7049 -5829 -2742 -5698 -6600 -2795 -4589 -5783 -1657 -1654 -3560 278
$$ packed form
6125e419l069L372n61l088L807J230k844K562K677l476O75L886k653k73M395o66
6141E55j167M249M12l246L154J451l524K062L338k946M59M065k864j553L404j847
6157F002k827L259m96l420K437J118m400L07J733m299p97L356l269j932L122j959
6173b065l376K487l10m342J975J814l917J208L314l427n93L240k208j983M016
6188d167m23j867L903J490l486K841K114l010R79L815j821l94M813q73j568L674
6204F020k63l205L013J192l164K191K415k818M0K675l266j774L176j803l119L133
6220D443j10l316J383P48m532n1K218m107o88L068k576j715L146k098l092K430
6236d849o3l270K189J898k954J220L087k956r02L805j794j194M126Lj906L838
$$ plain form
6252 278 1732 -1735 715 3167 -67 1859 5118 3556 3117 6825 5697 3601 6737 6628 3217 6006
6268 6006 7543 3921 6106 7811 4096 3973 6052 2613 917 3710 1932 -710 2098 1865 -2203
6283 -2203 -600 -415 -4826 -3974 -1983 -5374 -5636 -2538 -4842 -6838 -3953 -5297 -8300 -5308 -4665 -7669
6299 -7669 -4848 -2475 -5705 -4471 -1509 -4153 -4477 -478 -1567 -2642 1615 1775 2 3093 3930 809
6315 809 2864 5547 2347 3713 7255 5020 4549 8186 6121 3366 6637 5722 2878 5362 6712 2774
6331 2774 4177 5508 1152 878 3466 -109 -1823 1674 -347 -2961 -96 -1311 -5534 -3475 -3146
6346 -3146 -6903 -5783 -3308 -6294 -6543 -3209 -5978 -7580 -4060 -5571 -7583 -3914 -3106 -5704 -2482
6361 -2482 -435 -3556 -2050 719 -1692 -1201 2568 1260 809 4762 4540 1902 5086 5705 2539 4619
$$ packed form
6252B78J454l467K450K452l234J926L259j562m39L708j128k096L136j09l411K789
6268F006J537l622K185J705l715j23K079l439j696K793j778k642K808k33m068
6283b203J603J85m411Q52J991l391k62L098k304j996K885j344l003K992O43l004
6299g669K821K373l230J234K962k644l24L999j089j075M257J60j773L091Q37l121
6315H09K055K683l200J366L542k235m71L637k065k755L271r15k844K484J350l938
6331B774J403J331m356k74K588l575j714L497k021k614K865j215m223K059L29
6346c146l757J120K475k986k49L334k769j602L520j511k012L669Q08k598L222
6361b482K047l121J506K769k411M91L769j308m51L953k22k638L184O19l166K080
$$ plain form
6377 4619 7281 4069 5357 8197 5129 4490 6954 4860 2248 5261 4722 1401 3870 4245 686 1077
6393 1077 2374 -1657 -2012 126 -2936 -3945 -1064 -2858 -5671 -2812 -3919 -7732 -5417 -4158 -7817
6408 -7817 -5735 -3015 -6225 -6196 -3127 -5344 -6520 -2676 -3627 -5261 -1322 -514 -2686 48 1887 -1391
6424 -1391 256 3311 1011 1426 5311 3875 2864 6648 5527 2888 5560 6419 3465 5355 7570
6439 7570 4236 4516 6977 3656 2637 4870 2577 22 3267 2371 -1122 923 1208 -2735 -2441 -981
6455 -981 -4876 -4711 -1676 -4934 -6082 -3047 -4794 -7665 -4795 -5117 -8085 -5503 -3980 -7003 -5005 -2285
6471 -2285 -5250 -5159 -2094 -4031 -4606 -739 -896 -2573 1179 2074 -453 2009 3382 311 2013 5211
6487 5211 3424 3437 7089 5441 3227 6753 5372 2452 5162 5703 2488 4485 6318 2569 2517 4471
$$ packed form
6377D619K662l212J288K840l068o39K464k094k612L013n39l321K469L75l559L91
6393A077J297m031l55K138l062j009K881j794k813K859j107l813K315J259l659
6408g817K082K720l210K9L069k217j176L844r51j634L939Q08k172K734J839l278
6424a391J647L055k300M15L885j436j011L784j121k639K672Q59k954J890K215
6439G570l334K80K461l321j019K233k293k555L245q96l493K045K85l943K94J460
6455i81l895J65L035l258j148L035j747k871K870l22k968K582J523l023J998K720
6471b285k965R1L065j937n75L867j57j677L752Q95k527K462J373l071J702L198
6487E211j787J3L652j648k214L526j381k920K710N41l215J997J833l749n2J954
$$ plain form
6503 4471 885 -469 2144 -521 -2157 639 -245 -3647 -1879 -1854 -5531 -4617 -3095 -6186 -5885 -3204
6519 -3204 -5537 -6377 -3437 -5416 -7255 -4451 -4573 -6595 -3453 -1860 -4544 -2679 63 -2592 -2616 831
6535 831 -591 -1062 3135 2551 727 4528 4643 1661 4122 5774 2871 4767 7134 4486 4623 7216
6551 7216 5008 3437 6067 4848 1766 4514 4663 1433 3045 3821 -192 -177 1502 -2189 -2669 -7
6567 -7 -2427 -3909 -1561 -2743 -5830 -4191 -3884 -7107 -5633 -3611 -6613 -5988 -3084 -5592 -6477 -3381
6583 -3381 -4803 -6456 -2795 -2647 -4606 -1245 251 -2291 -516 1986 -730 -203 3411 1671 1740 5210
6599 5210 4317 2598 5559 5442 2322 5011 6264 3564 5067 7288 4283 4193 6057 3297 1419 4213
6615 4213 2931 421 2715 2848 -778 455 954 -3267 -2511 -712 -3958 -4327 -1372 -3324 -5616 -2877
$$ packed form
6503D471l586j354K613k665j636K796q84l402J768K5l677R14J522l091L01K681
6519c204k333q40K940j979j839K804j22k022L142J593k684J865K742k655k4L447
6535H31j422m71M197n84j824L801J15k982K461J652k903J896K367k648J37K593
6551G216k208j571K630j219l082K748J49l230J612P76m013J5J679l691m80K662
6567gk420j482K348j182l087J639L07l223J474K022l002O25K904k508q85L096
6583c381j422j653L661J48j959L361J496k542J775K502k716N27L614j740O9L470
6599E210q93j719K961j17l120K689J253k700J503K221l005r0J864k760j878K794
6615D213j282k510K294J33l626J233M99m221P56J799l246l69K955j952k292K739
$$ plain form
6631 -2877 -4351 -6886 -5235 -4354 -7154 -4895 -2880 -5464 -4984 -1839 -4414 -4977 -1647 -2937 -3721 -31
6647 -31 342 -1617 1529 2424 -169 1054 3629 1454 2305 5320 3541 3350 6619 4960 2669 5376
6663 5376 4928 2506 4660 5438 2779 3672 5277 1756 1079 3283 715 -991 1464 409 -2499 -122
6679 -122 -633 -4430 -3171 -2187 -5729 -5072 -3117 -5915 -5999 -3063 -5163 -7182 -4598 -5305 -7836 -4735 -3769
6696 -3769 -6302 -3498 -1377 -3925 -3371 -778 -2928 -2727 750 -10 -916 3025 3147 622 3346 4295
6712 4295 1628 3359 5809 3365 4241 7443 4985 4002 6621 4832 2720 5195 4738 2176 4060 5123
6728 5123 1798 2276 3523 -602 -714 1523 -1393 -2935 -63 -1396 -4021 -2163 -2417 -6142 -4451 -3305
6744 -3305 -6745 -5562 -2982 -5596 -5748 -2955 -5145 -6274 -3435 -4008 -5826 -2430 -1414 -3634 -1514
$$ packed form
6631b877j474k535J651Q81k800K259K015k584M80L145k575n63L330j290p84L690
6647c1L73j959L146Q95k593J223K575k175Q51L015j779j91L269j659k291K707
6663E376m48k422K154P78k659Q93J605l521o77K204k568j706K455j055k908K377
6679a22n11l797J259R84l542O57J955k798q4K936k100k019K584p07k531L101R66
6696c769k533K804K121k548N54K593k150K01L477p60r06L941J22k525K724R49
6712D295k667J731K450k444Q76L202k458r83K619j789k112K475m57k562J884J063
6728E123l325M78J247m125j12K237k916j542K872j333k625J858k54l725J691J146
6744c305l440J183K580k614j52K793k190j129K839n73j818L396J016k220K120
$$ plain form
6759 -1514 510 -1923 -1135 1486 -236 261 3604 2888 1974 5048 4893 2366 4648 5341 2777 4359
6775 4359 6516 4408 4876 6642 4417 2496 5102 3394 1183 3684 3127 435 1930 2375 -1624 -931
6791 -931 148 -2882 -3484 -1002 -3199 -4407 -2276 -3600 -6153 -3957 -4205 -7193 -5167 -3822 -6496 -4740
6807 -4740 -2529 -4716 -5092 -2238 -3970 -5229 -1020 -1610 -2911 347 1459 -916 1065 2791 538
6822 538 1127 4467 2782 2841 5982 4847 3454 6377 5533 2720 5195 5608 3239 4973 6439 3735
6838 3735 3437 5299 2033 773 3200 1333 -659 1423 853 -1849 -514 -474 -4156 -3730 -2134 -5088
6854 -5088 -5141 -2370 -4711 -5665 -3230 -5174 -7074 -4233 -4784 -6959 -4075 -2520 -5024 -3629 -1247 -3645
6870 -3645 -3268 -289 -2048 -2452 1356 1275 -106 2788 3321 1039 2836 4532 2196 3478 6308 4150
$$ packed form
6759a514K024k433P88K621j722M97L343p16r14L074j55k527K282O93k564J582
6775D359K157k108M68J766k225j921K606j708k211K501n57k692J495M45l999O93
6791i31J079l030o02K482k197j208K131j324k553K196k48k988K026J345k674J756
6807d740K211k187l76K854j732j259M209n90j301L258J112k375J981J726k253
6822E38N89L340j685N9L141j135j393K923q44k813K475M13k369J734J466k704
6838C735k98J862l266j260K427j867j992K082n70k702J335M0l682M26J596k954
6854e088n3K771k341r54K435j944j900K841n51k175K884J555k504J395K382k398
6870c645L77K979j759m04L808q1j381K894N33k282J797J696k336J282K830k158
$$ plain form
6886 4150 4234 7052 5004 3231 5643 4981 2277 4667 5159 2301 3622 4524 1391 1079 2497 -528
6902 -528 -1801 892 -976 -2873 -102 -1526 -4333 -3024 -2719 -6270 -4829 -3329 -5636 -5562 -2908 -5322
6918 -5322 -6018 -3485 -4869 -6153 -3465 -3013 -5061 -1981 -521 -2696 -1382 933 -1202 -1127 2181 943
6934 943 633 4028 3887 1932 4589 5186 2397 4513 5858 3371 4881 7297 4660 4046 6327 3949
6950 3949 2278 4758 3638 985 3424 3508 353 1226 2183 -1281 -1402 44 -2581 -3709 -1008 -3092
6966 -3092 -4861 -2528 -3767 -6320 -4575 -3811 -6982 -5265 -2999 -5130 -4737 -2457 -4463 -5644 -2437
6981 -2437 -3131 -4377 -959 -420 -2300 424 1660 -432 393 2903 929 1322 4710 3317 3079 5531
6997 5531 5028 2823 5393 5376 2767 4782 6355 3738 4616 6362 3502 2815 4453 2246 392 2746
$$ packed form
6886D150Q4K818k048j773K412o62k704K390M92k858J321R02l133l12J418l025
6902e28j273K693j868j897K771j424k807J309L05l551J441J500k307P4K654k414
6918e322o96K533j384j284K688M52k048L080J460k175J314K315k135P5L308j238
6934I43l10L395j41j955K657N97k789K116J345k487J510K416k637o14K281k378
6950C949j671K480j120k653K439Q4l155Q73R57l464j21J446k625j128K701k084
6966c092j769K333j239k553J745P64l171J717K266k131L93K280k006j181L207
6981b437o94j246L418N39j880K724J236k092Q25K510j974L93L388j393k38K452
6997E531n03k205K570j7k609K015J573k617Q78J746k860o87J638k207j854K354
$$ plain form
7013 2746 1849 -658 1256 1094 -2107 -1222 -639 -4069 -3978 -1798 -4297 -4643 -2143 -4023 -5927 -3609 -4251
7030 -4251 -6958 -4359 -3635 -5743 -3403 -1928 -4167 -3403 -649 -3074 -3393 81 -488 -1627 1897 2317
7046 2317 506 3116 3593 1408 3139 5283 2887 4042 6555 4766 3965 6494 5223 3102 5493
7061 5493 5174 2907 4854 5758 2504 2802 4373 1101 328 2030 -14 -1633 739 -537 -2584 -929
7077 -929 -1205 -4657 -3609 -2852 -5615 -4993 -2597 -5084 -5387 -2721 -4490 -6310 -3581 -3930 -5714 -3094
7093 -3094 -1828 -3895 -2097 112 -2541 -1627 1173 -583 -800 2543 2363 1344 4231 4134 2076 4366
7109 4366 5277 2853 4287 6382 4030 4508 7298 4641 3468 5703 3859 2025 4274 4276 1793 3264
7125 3264 3513 194 404 1563 -1837 -2189 -21 -2008 -3531 -1142 -2473 -5193 -3151 -3408 -6587 -4831
$$ packed form
7013B746q97k507J914j62l201Q85N83l430R1K180k499l46K500j880j904K318o42
7030d251k707K599P24k108K340J475k239P64K754k425l19L474n69j139L524M20
7046B317j811K610M77k185J731K144k396J155K513j789q01K529j271k121K391
7061E493l19k267J947R04l254K98J571l272p73J702k044j619K372j276k047J655
7077i29k76l452J048P57k763O22K396k487l03K666j769j820K729l49j784K620
7093c094J266k067J798K209k653R14K800j756k17L343j80j019K887r7k058K290
7109D366R11k424J434K095k352M78K790k657j173K235j844j834K249Kk483J471
7125C264K49l319K10J159l400l52K168j987j523K389j331k720K042k57l179J756
$$ plain form
7141 -4831 -3585 -5948 -5055 -2644 -4832 -5632 -2673 -4250 -5633 -2604 -2317 -3950 -1432 209 -2034 -418
7157 -418 1657 -789 260 3009 1059 1609 4925 3787 2597 5580 4881 2397 4796 5286 2812 4563
7173 4563 6251 3638 3606 5218 2652 1350 3269 2028 -25 2338 1782 -1100 422 810 -2793 -2722
7189 -2722 -1299 -4176 -4255 -1723 -3849 -4906 -2752 -3851 -6728 -4272 -4100 -6853 -4478 -2585 -5172 -3921
7205 -3921 -1653 -3481 -3864 -1182 -2528 -3228 471 298 -1162 2155 3069 643 2247 3953 1843 2759
7221 2759 5641 3867 4044 6335 5339 3624 6009 5298 2621 5024 5593 2592 4320 5541 2236 1900
7237 1900 3906 981 -399 1628 359 -1717 1096 -254 -3328 -1704 -1671 -5279 -4103 -2525 -5094
7252 -5094 -5230 -2460 -4611 -5729 -3127 -4522 -6577 -3734 -3184 -5347 -2742 -1330 -3619 -2012 186
$$ packed form
7141d831J246k363Q93K411k188q00K959j577j383L029K87j633K518J641k243J616
7157d18K075k446J049K749j950N50L316j138j190K983o99k484K399M90k474J751
7173D563J688k613l2J612k566j302J919j241k053K363n56k882J522L88l603P1
7189b722J423k877p9K532k126j057K154j099k877K456J72k753K375J893k587J251
7205c921K268j828l83K682j346p00L699j73j460L317R14k426J604J706k110R16
7221B759K882j774J77K291r96j715K385p11k677K403N69l001J728J221l305l36
7237A900K006k925j380K027j269k076K813j350l074J624L3l608J176J578k569
7252e094j36K770k151j118K602j395k055K843N50k163K605J412k289J607K198
$$ plain form
7267 186 -2190 -1928 1214 147 -403 2968 2840 1233 3642 4278 1598 3785 5153 2968 4195 7058
7283 7058 4875 4065 6732 4416 2729 5221 4060 1614 3955 4302 1226 2459 3214 -262 -521 1136
7299 1136 -1433 -2473 -216 -1601 -3362 -1442 -2428 -5414 -3752 -3121 -6152 -4832 -2678 -5196 -4933 -2512
7315 -2512 -4352 -5364 -2473 -3716 -4981 -1911 -1059 -2882 -808 1223 -1469 -163 1857 -191 524
7330 524 3316 2718 1929 4877 4819 2409 5120 5193 2454 4437 5796 3499 4195 6482 3755 2573 4601
7347 4601 2681 849 3210 1990 62 1988 1806 -1518 -453 325 -3459 -3284 -1157 -3524 -4080 -2133
7363 -2133 -3828 -5524 -3248 -4108 -6666 -4677 -3753 -6091 -4583 -2273 -4550 -4340 -1824 -3580 -4396 -1197
7379 -1197 -1909 -3284 420 1094 -705 1608 2497 73 1539 3586 1794 2449 5500 4078 3175 5895
$$ packed form
7267A86k376K62L142j067n50L371j28j607K409O36k680K187J368k185J227K863
7283G058k183q10K667k316j687K492j161k446K341L47l076J233P55l476k59J657
7299A136k569j040K257j385j761J920r86k986J662O31l031J320K154k518K63K421
7315b512j840j012K891j243j265L070Q52j823K074K031k692J306K020k048P15
7330E24K792n98p89K948n8k410K711P3k739J983J359k297O96K287k727j182K028
7347D601j920j832K361j220j928J926j82l324J065P78l784J75K127k367n56J947
7363b133j695j696K276q60k558J989R24k338J508K310k277K10K516j756q16L199
7379a197p12j375L704O74j799K313Q89k424J466K047j792O55L051j422r03K720
$$ plain form
7395 5895 4951 2789 4907 4987 2302 4219 5644 2657 3201 4856 1533 1104 2783 608 -773 1681
7411 1681 680 -2180 -158 -418 -3659 -3020 -1426 -4769 -4193 -2067 -4325 -5090 -2352 -4315 -5906 -3693
7427 -3693 -4063 -6160 -3788 -2721 -4558 -2808 -766 -3676 -2931 -127 -1779 -2215 1447 997 -316 2937
7443 2937 3100 803 3526 4426 1579 3170 5556 3766 3723 6181 4083 3154 5445 4374 1876 4287
7459 4287 4225 1579 3433 4367 901 1335 2480 -574 -1452 346 -1203 -2507 142 -1362 -4012 -2293
7475 -2293 -2480 -5237 -4115 -2788 -5402 -4507 -2535 -4469 -5277 -2633 -4073 -5629 -2806 -3065 -4717 -1745
7491 -1745 -430 -2705 -884 1128 -1343 -821 1946 529 781 3763 3213 1805 4593 4484 2427 3735
7507 3735 5234 2434 3826 6113 3843 3716 5568 3439 2177 4176 2872 687 2965 3094 -26
$$ packed form
7395E895r44k162K118Q0k685J917J425k987N44J655l323m29J679k175j381K454
7411A681j001k860K022k60l241O39J594l343N76K126k258p65K738j963j591K213
7427c693l70k097K372J067j837J750K042k910P45K804j652m36L662m50j313L253
7443B937J63k297K723R00k847J591K386j790m3K458k098r29K291j071k498K411
7459D287o2k646J854R34l466M34J145l054q78J798j549j304K649j504k650J719
7475b293j87k757J122J327k614Q95J972j934q08K644j440j556K823k59j652K972
7491a745J315k275J821K012k471N22K767j417K52K982n50j408K788j09k057J308
7507C735J499k800J392K287k270j27J852k129j262J999j304k185K278J29l120
$$ plain form
7522 -26 1263 1908 -1576 -1238 10 -2886 -2960 -879 -2815 -4130 -2060 -3148 -5532 -3857 -3524 -6543 -4339
7539 -4339 -2770 -5122 -4177 -1650 -4096 -4469 -1924 -2819 -3909 -559 -704 -1981 221 1903 -500 921
7555 921 3099 563 1237 4285 2734 2511 5759 4393 3095 5112 4814 1882 4422 5411 2857 4134
7571 4134 5491 2920 2631 4145 1833 372 2493 1406 -1222 1475 913 -2049 -1049 -618 -3864 -3534
7587 -3534 -1696 -4305 -4511 -2049 -3945 -5467 -2788 -4262 -5708 -4046 -3494 -5461 -3327 -1481 -3877
7602 -3877 -2847 -657 -2714 -3164 24 -984 -1437 1421 1597 -126 2744 3427 862 2584 4313 2374
7618 2374 2915 5596 4001 3296 5839 4348 2606 4755 4299 2058 4063 4497 1608 2435 3625 685
7634 685 103 1634 -589 -1551 454 -600 -2909 -814 -1263 -4212 -3077 -2500 -5425 -4333 -2722 -4506
$$ packed form
7522b6J289O45l484L38J248k896p4K081j936j315K070j088k384J675L33l019K204
7539d339J569k352R45K527k446l73K545q95j090L350j45j277K202J682k403J421
7555I21K178k536O74L048j551k23L248j366j298K017k98k932K540R89k554J277
7571D134J357k571k89J514k312j461K121j087k628K697n62k962J000M31l246L30
7587c534J838k609k06K462j896j522K679j474j446J662N52j967K134J846k396
7602c877J030K190k057m50L188j008m53K858J76j723K870O83k565J722J729j939
7618B374N41K681j595p05K543j491j742K149m56k241K005M34k889Q27J190k940
7634F85n82J531k223r62K005j054k309K095m49k949J135N77k925J092J611j784
$$ plain form
7650 -4506 -5040 -2281 -4353 -5430 -2853 -3675 -5568 -2943 -1920 -4001 -1546 -28 -2140 -1166 1056 -1323
7666 -1323 -711 2352 1250 505 3708 3293 1872 4112 4411 2039 3432 5218 3299 3769 6202 3832
7682 3832 3100 5034 3027 1243 3456 2936 434 2289 2585 -286 493 1243 -1761 -1963 -173 -2534
7698 -2534 -3099 -616 -2211 -4365 -2292 -2844 -5883 -4191 -3016 -5676 -4284 -2591 -4459 -4371 -1836 -3862
7714 -3862 -4516 -1647 -1927 -3197 -826 459 -1607 593 1913 -441 682 2770 1477 1562 4449 3495
7730 3495 2568 5521 4683 2303 4845 5075 2735 4306 5341 3332 3387 5457 2333 1426 3609 1896
7746 1896 198 2354 1860 -840 702 737 -2262 -1591 -779 -3356 -3506 -1545 -3558 -4413 -1845 -3401 -5289
7763 -5289 -3201 -3233 -5869 -3870 -2351 -4400 -3265 -1206 -3037 -3190 -413 -2140 -2464 485 52 -1116
$$ packed form
7650d506n34K759k072j077K577q22j893K625J023k081K455J518k112R74K222k379
7666a323O12L063j102p45L203m15j421K240K99k372J393J786j919M70K433k370
7682C832p32J934k007j784K213n20k502J855K96k871P79P50l004k02J790k361
7698b534n65K483j595k154K073n52l039J692J175k660J392J693j868Q8K535k026
7714c862o54K869k80j270K371J285k066K200J320k354J123K088j293Q5K887r54
7730C495r27K953q38k380K542K30k340J571J035k009N5K070l124r07K183j713
7746A896j698K156m94k700J542L5k999O71Q12k577j50J961k013q55K568j556j888
7763e289K088l2k636J999J519k049J135K059j831j53K777j727l24K949m33j168
$$ plain form
7779 -1116 2048 2527 295 2275 3347 1217 2528 4527 2828 3306 5419 4129 2652 5037 4254 1946
7795 1946 4196 4761 2048 3676 4732 1454 1999 3256 672 -377 1665 34 -1641 465 -382 -2681
7811 -2681 -1287 -1626 -4492 -3528 -2236 -4689 -4652 -2356 -3794 -4729 -2357 -3465 -5428 -2943 -3336 -4784
7827 -4784 -2145 -839 -3050 -1747 222 -1826 -1541 1096 -268 -494 2769 2146 1048 3645 3666 1669
7843 1669 3169 4392 2505 3393 5331 3485 3370 5274 3592 2150 4215 3501 1270 3066 3026 882
7859 882 2016 2879 -337 -299 1221 -1804 -2536 -104 -1994 -3548 -1417 -2325 -4653 -3165 -3150 -5445 -4270
7876 -4270 -2642 -4781 -4036 -2195 -3777 -4393 -2172 -2973 -4354 -1462 -1264 -2957 -776 715 -1128 346
7892 346 1950 -268 668 2889 1788 1806 4403 3863 2451 4283 4365 2214 4032 5032 2646 4057 5311
$$ packed form
7779a116L164M79k232J980J072k130J311J999j699M78K113j290j477K385p83k308
7795A946K250N65k713J628J056l278N45J257k584j049K042j631j675K106q47k299
7811b681J394l39k866R64J292k453L7K296j438r35K372j108j963K485l93j448
7827d784K639J306k211J303J969k048K85K637j364k26L263o23j098K597K1j997
7843A669J500J223j887Q88J938j846j15J904j682j442K065p14k231J796m0k144
7859H82J134Q63l216L8J520l025p32K432j890j554K131r08k328J488J5k295J175
7876d270J628k139P45J841j582o16K221q01j381K892J98j693K181J491j843J474
7892C46J604k218R36K221j101J8K597n40j412J832Q2k151J818J000k386J411J254
$$ plain form
7909 5311 3189 2714 4629 2424 1013 2817 1928 64 1882 1536 -670 -59 448 -2554 -2341 -929
7925 -929 -3088 -3364 -1031 -2695 -4194 -2683 -3111 -5458 -3561 -2715 -5378 -3530 -1832 -3805 -3233 -1134
7941 -1134 -3071 -3309 -663 -1617 -2143 656 605 -700 1760 2249 252 1431 3478 1564 2063 4682 3148
7958 3148 3001 5174 4035 2468 4452 4220 2029 3491 4628 2339 2934 4281 1544 1266 2474 620
7974 620 -805 1269 83 -1532 17 -49 -3241 -2151 -1651 -4211 -3346 -1825 -4076 -4013 -2031 -3511 -4968
7991 -4968 -2761 -3286 -5371 -2909 -2132 -3989 -2112 -482 -2650 -1938 87 -1415 -1671 1368 476 -141
8007 -141 2467 2848 1100 3143 3480 1398 2923 4874 2940 3274 5511 3365 3059 5010 3532 1722
8023 1722 3885 3141 1180 3008 3310 951 1219 2110 -382 -803 607 -1480 -2515 -106 -1472 -3768
$$ packed form
7909E311k122m75J915k205j411J804q89j864J818l46k206O11N07l002K13J412
7925i29k159k76K333j664j499J511m28k347J897Q46k663J848J698j973N72K099
7941a134j937k38K646r54n26K799n1j305K460M89j997J179K047j914M99K619j534
7958C148j47K173j139j567J984k32k191J462J137k289N95J347k737k78J208j854
7974F20j425K074j186j615J549o6l192J090N00k560Q65J521k251O3J982j480j457
7991d968K207n25k085K462P77j857J877J630k168P12K025j502k56L039q92o17
8007a41K608L81j748K043L37k082J525J951j934L34K237k146l06J951j478j810
8023A722K163p44j961J828L02k359K68Q91k492m21J410k087j035K409j366k296
$$ plain form
8039 -3768 -1744 -2166 -4470 -3487 -2734 -4795 -3995 -1989 -4434 -4355 -2344 -3340 -4595 -2367 -2379 -4029 -1535
8056 -1535 -591 -2032 -771 822 -851 -561 1831 224 159 3203 2283 1565 4109 3932 1978 3420 4374
8073 4374 2171 3700 4601 2635 3104 5030 2700 1940 3248 2185 759 2442 2071 23 1140 1733
8089 1733 -981 -836 185 -2476 -2722 -1011 -2474 -3628 -1771 -2893 -4816 -3152 -2982 -5497 -3870 -2273
8105 -2273 -4568 -3328 -1627 -3760 -3474 -1424 -2643 -3409 -746 -844 -1977 386 1535 -559 1037 2500
8121 2500 450 1393 3423 2125 1826 4699 3387 2421 4449 3964 2033 3958 3998 2376 3268 4592 2454
8138 2454 2095 3392 1334 486 1732 969 -779 962 415 -2068 -573 -793 -3212 -2560 -1737 -3674 -3413
8155 -3413 -2015 -3186 -4200 -2309 -3331 -4797 -3387 -2921 -4724 -2959 -1874 -3470 -2307 -649 -2293
$$ packed form
8039c768K024m22k304R83P53k061Q00K006k445P9K011r96j255K228j2j650K494
8056a535R44j441J261J593j673K90K392j607o5L044r20p18K544j77j954J442R54
8073D374k203J529R01j966M69J926k330p60J308j063j426J683l71k048J117N93
8089A733k714J45J021k661k46J711j463j154J857j122j923J664J70k515J627J597
8105b273k295J240J701k133K86K050j219p66K663r8j133K363J149k094J596J463
8121B500k050R43K030j298k99K873j312r66K028m85j931J925M0j622Q92J324k138
8138B454l59J297k058q48J246p63j748J741n47k483J495k20k419O52Q23j937K61
8155c413J398j171j014J891j022j466J410M66j803J765J085j596J163J658j644
$$ plain form
8170 -2293 -2098 200 -1046 -1262 1138 1222 283 2277 2565 746 2009 3657 1467 2489 4721 3212
8186 3212 3085 4729 3579 2411 3980
8191 3980
$$ packed form
8170b293J95K298j246k16K400Q4r39J994K88j819J263J648k190J022K232j509
8186C212j27J644j150j168J569
8191C980
$$ Imaginary data points
##PAGE= N=2
##DATA TABLE= (X++(I..I)), XYDATA
$$ plain form
0 0 0 0 0 8 -8 0 -8 16 -16 16 -32 32 -40 48 -64 72 -89 102 -121 145 -168 191 -225 258 -295 335 -383 432
28 432 -489 550 -619 694 -776 866 -964 1074 -1193 1322 -1464 1627 -1797 1988 -2200 2440
44 2440 -2703 3003 -3343 3735 -4187 4717 -5352 6134 -7101 8356 -10046 12448 -16109 22366
58 22366 -35071 71039 -395854 -1178980 -297805 509973 17753 -732438 -720202 -348340 -154752
69 -154752 -256815 -308732 -338669 -577903 -669681 -147253 183872 -299083 -683135 -292008 57142
80 57142 -104869 -293811 -232504 -80531 23437 -35284 -75799 67363 110227 4325 119564
91 119564 218251 -12261 -19926 387031 445712 75747 1699 262238 362073 242164 139774
$$ packed form
0@%%%Qj6QqK4l2L2m8O4p2Q8j12J36j61J91k23K66l13L59m16M83n53O30p18Q15
28D32r21J039j169J313j470J642j830K038k267K515k786L091l424L785m188M640
44B440n143N706o346P078p922Q904j0069J1486j3235J5457j8402K2494k8557L8475
58B2366n7437J06110m66893p83126Q81175Q07778m92220p50191J2236L71862J93588
69a54752j02063n1917k9937k39234r1778N22428L31125m82955l84052L91127L49150
80E7142j62011j88942O1307J51973J03968n8721m0515J43162M2864j05902J15239
91A19564R8687k30512p665M06957N8681l69965p4048K60539R9835j19909j02390
$$ [...]
8191c78
##END NTUPLES=NMR FID
##END=
