##TITLE=1H_Pr 5-3-1
 CDCl3, 8 sc, 
 23.7.2019
##JCAMPDX= 6.0         $$ Bruker NMR JCAMP-DX V2.0
##DATA TYPE= NMR FID
##DATA CLASS= NTUPLES
##ORIGIN= UXNMR, Bruker Analytische Messtechnik GmbH
##OWNER= root
$$ XWIN-NMR		Version 3.5
$$ Tue Jul 23 16:01:27 2019 Russian Standard Time (UT+4h)  she@DPX200
##.OBSERVE FREQUENCY= 200.13155
##.OBSERVE NUCLEUS= ^1H
##.DELAY= (6, 6)
##.ACQUISITION MODE= SIMULTANEOUS
##.ACQUISITION SCHEME= undefined
##.AVERAGES= 8
##.DIGITISER RES= 18
##SPECTROMETER/DATA SYSTEM= spect
##.PULSE SEQUENCE= zg30
##.SOLVENT NAME= CDCl3
##.SHIFT REFERENCE= (INTERNAL, CDCl3, 0, 15.7039)
##AUDIT TRAIL= $$ (NUMBER, WHEN, WHO, WHERE, WHAT)
$$ ##TITLE= Audit trail, XWIN-NMR		Version 3.5
$$ ##JCAMPDX= 5.01
$$ ##ORIGIN= Bruker BioSpin GmbH
$$ ##OWNER= she
$$ F:/spectra/data/she/nmr/H-F/1/audita.txt
$$ ##AUDIT TRAIL=  $$ (NUMBER, WHEN, WHO, WHERE, WHAT)
(   1,<2019-07-23 16:00:15.40 +0400>,<she>,<DPX200>,
      <created by zg, POWCHK disabled, PULCHK disabled
       configuration hash MD5:
       00 E9 B6 7A A2 85 ED C7 34 08 36 98 17 FE 4E 26
       data hash MD5: 16K
       BD 41 C2 8C 86 D5 40 81 89 D7 DB B5 EF 42 DE 6A>)
$$ ##END=
$$ 
$$ hash MD5
$$ D3 9D AB F6 D7 35 C3 0F 7E A8 6E 96 5B 30 DD 4A
##$RELAX= 
##$RELAX= 
##$RELAX= 
##$RELAX= 
##$RELAX= 
##$RELAX= 
$$ Bruker specific parameters
$$ --------------------------
##$DU= <F:/spectra>
##$EXPNO= 1
##$NAME= <H-F>
##$PROCNO= 1
##$TYPE= <nmr>
##$USER= <she>
##$AMP= (0..31)
100 100 100 100 100 100 100 100 100 100 100 100 100 100 100 100 100 100 
100 100 100 100 100 100 100 100 100 100 100 100 100 100 
##$AQSEQ= 0
##$AQ_mod= 1
##$AUNM= <au_zg>
##$AUTOPOS= <>
##$BF1= 200.13
##$BF2= 200.13
##$BF3= 200.13
##$BF4= 200.13
##$BF5= 200.13
##$BF6= 200.13
##$BF7= 200.13
##$BF8= 200.13
##$BYTORDA= 1
##$CFDGTYP= 0
##$CFRGTYP= 5
##$CHEMSTR= <none>
##$CNST= (0..31)
1 1 145 1 1 1 1 1 1 1 1 1 1 1 1 1 1 1 1 1 1 1 1 1 1 1 1 1 1 1 1 1 
##$CPDPRG= <>
##$CPDPRG1= <>
##$CPDPRG2= <>
##$CPDPRG3= <>
##$CPDPRG4= <mlev>
##$CPDPRG5= <mlev>
##$CPDPRG6= <mlev>
##$CPDPRG7= <mlev>
##$CPDPRG8= <mlev>
##$CPDPRGB= <>
##$CPDPRGT= <>
##$D= (0..31)
0 1.2 0 0 0 0 0 0 0 0 0 0.03 0 0 0 0 0 0 0 0 0 0 0 0 0 0 0 0 0 0 0 0 
##$DATE= 1563883214
##$DBL= (0..7)
120 120 120 120 120 120 120 120 
##$DBP= (0..7)
150 150 150 150 150 150 150 150 
##$DBP07= 0
##$DBPNAM0= <>
##$DBPNAM1= <>
##$DBPNAM2= <>
##$DBPNAM3= <>
##$DBPNAM4= <>
##$DBPNAM5= <>
##$DBPNAM6= <>
##$DBPNAM7= <>
##$DBPOAL= (0..7)
0.5 0.5 0.5 0.5 0.5 0.5 0.5 0.5 
##$DBPOFFS= (0..7)
0 0 0 0 0 0 0 0 
##$DE= 6
##$DECBNUC= <off>
##$DECIM= 24
##$DECNUC= <off>
##$DECSTAT= 4
##$DIGMOD= 1
##$DIGTYP= 9
##$DL= (0..7)
0 120 120 120 120 120 120 120 
##$DP= (0..7)
150 150 150 150 150 150 150 150 
##$DP07= 0
##$DPNAME0= <>
##$DPNAME1= <>
##$DPNAME2= <>
##$DPNAME3= <>
##$DPNAME4= <>
##$DPNAME5= <>
##$DPNAME6= <>
##$DPNAME7= <>
##$DPOAL= (0..7)
0.5 0.5 0.5 0.5 0.5 0.5 0.5 0.5 
##$DPOFFS= (0..7)
0 0 0 0 0 0 0 0 
##$DQDMODE= 0
##$DR= 18
##$DS= 0
##$DSLIST= <SSSSSSSSSSSSSSS>
##$DSPFIRM= 0
$$ [...]
##$SUBNAM2= <"">
##$SUBNAM3= <"">
##$SUBNAM4= <"">
##$SUBNAM5= <"">
##$SUBNAM6= <"">
##$SUBNAM7= <"">
##$SUBNAM8= <"">
##$SUBNAM9= <"">
##$SW= 24.9336996594482
##$SWIBOX= (0..15)
0 0 2 0 0 0 0 0 0 0 0 0 0 0 0 0 
##$SW_h= 4990.01996007984
##$TD= 16384
##$TD0= 1
##$TE= 0
##$TE2= 300
##$TE3= 300
##$TEG= 300
##$TL= (0..7)
0 120 120 120 120 120 120 120 
##$TP= (0..7)
150 150 150 150 150 150 150 150 
##$TP07= 0
##$TPNAME0= <>
##$TPNAME1= <>
##$TPNAME2= <>
##$TPNAME3= <>
##$TPNAME4= <>
##$TPNAME5= <>
##$TPNAME6= <>
##$TPNAME7= <>
##$TPOAL= (0..7)
0.5 0.5 0.5 0.5 0.5 0.5 0.5 0.5 
##$TPOFFS= (0..7)
0 0 0 0 0 0 0 0 
##$TUNHIN= 0
##$TUNHOUT= 0
##$TUNXOUT= 0
##$USERA1= <user>
##$USERA2= <user>
##$USERA3= <user>
##$USERA4= <user>
##$USERA5= <user>
##$V9= 5
##$VALIST= <valist>
##$VCLIST= <CCCCCCCCCCCCCCC>
##$VD= 0
##$VDLIST= <DDDDDDDDDDDDDDD>
##$VPLIST= <PPPPPPPPPPPPPPP>
##$VTLIST= <TTTTTTTTTTTTTTT>
##$WBST= 1024
##$WBSW= 4
##$XGAIN= (0..3)
0 0 0 0 
##$XL= 0
##$YL= 0
##$YMAX_a= 136141
##$YMIN_a= -332086
##$ZGOPTNS= <>
##$ZL1= 120
##$ZL2= 120
##$ZL3= 120
##$ZL4= 120
##$ABSF1= 10
##$ABSF2= 0
##$ABSG= 5
##$ABSL= 3
##$ALPHA= 0
##$AQORDER= 0
##$ASSFAC= 0
##$ASSFACI= 0
##$ASSFACX= 0
##$ASSWID= 0
##$AUNMP= <proc_1d>
##$AZFE= 0.1
##$AZFW= 0.1
##$BCFW= 1
##$BC_mod= 2
##$BYTORDP= 1
##$COROFFS= 0
##$CY= 11.3945322036743
##$DATMOD= 1
##$DC= 2
##$DFILT= <>
##$DTYPP= 0
##$F1P= 18.9103706918063
##$F2P= -1.10871071338519
##$FCOR= 0.5
##$FTSIZE= 0
##$FT_mod= 4
##$GAMMA= 1
##$GB= 0.15
##$INTBC= 1
##$INTSCL= 1
##$ISEN= 128
##$LB= 0.24
##$LEV0= 0
##$LPBIN= 0
##$MAXI= 10000
##$MC2= 0
##$MEAN= 0
##$ME_mod= 0
##$MI= 1.114404
##$NCOEF= 0
##$NC_proc= 0
##$NLEV= 6
##$NOISF1= 3.799351
##$NOISF2= 2.8
##$NSP= 1
##$NTH_PI= 0
##$NZP= 0
##$OFFSET= 15.70392
##$PC= 1
##$PHC0= -8862.849
##$PHC1= 14.00096
##$PH_mod= 1
##$PKNL= yes
##$PPARMOD= 0
##$PSCAL= 0
##$PSIGN= 0
##$REVERSE= no
##$SF= 200.130013532006
##$SI= 16384
##$SIGF1= 3
##$SIGF2= 2
##$SINO= 400
##$SIOLD= 16384
##$SREGLST= <1H.CDCl3>
##$SSB= 0
##$STSI= 0
##$STSR= 0
##$SW_p= 3612.71676300578
##$SYMM= 0
##$S_DEV= 0
##$TDeff= 0
##$TDoff= 0
##$TI= <>
##$TILT= no
##$TM1= 0
##$TM2= 0
##$TOPLEV= 0
##$USERP1= <user>
##$USERP2= <user>
##$USERP3= <user>
##$USERP4= <user>
##$USERP5= <user>
##$WDW= 1
##$XDIM= 8192
##$YMAX_p= 0
##$YMIN_p= 0
$$ End of Bruker specific parameters
$$ ---------------------------------
##NTUPLES= NMR FID
##VAR_NAME=  TIME,          FID/REAL,        FID/IMAG
##SYMBOL=    X,             R,               I
##VAR_TYPE=  INDEPENDENT,   DEPENDENT,       DEPENDENT
##VAR_FORM=  AFFN,          ASDF,            ASDF
##VAR_DIM=   8192,          8192,            8192
##UNITS=     SECONDS,       ARBITRARY UNITS, ARBITRARY UNITS
##FACTOR=    0.0002004,     1,               1
##FIRST=     0,             0,               0
##LAST=      1.6414764,     0,               0
##MIN=       0,             -332086,         0
##MAX=       1.6414764,     136141,          0
$$ Real data points
##PAGE= N=1
##DATA TABLE= (X++(R..R)), XYDATA
$$ [...]
$$ plain form
2267 1849 136 -659 -968 -1826 -2019 -260 680 520 2282 1902 477 -333 -932 -2141 -2102 -715 -414 546
2285 546 2171 1853 394 440 -871 -2212 -2291 -1262 -705 861 2410 1817 1132 916 -680 -1957 -1479 -1468
2303 -1468 -1049 581 1842 1531 1941 1359 -609 -1389 -1249 -1575 -703 737 1474 1496 1737 1107 -325 -896
2321 -896 -1173 -2199 -1053 524 1019 1271 1837 793 -328 -312 -1621 -2393 -1508 42 290 1480 2293 954
2339 954 -167 -454 -1591 -2299 -1181 -660 -390 1519 2166 1075 431 295 -1441 -2391 -1273 -786 -561 1574
2357 1574 1866 1180 1287 333 -1134 -1450 -875 -1137 17 1523 1503 1591 1839 238 -1162 -1193 -996 -2036 -330
2376 -330 1403 1238 1640 1865 52 -641 -1042 -2162 -1866 -441 340 601 1589 1707 -96 -552 -1011 -2101
2394 -2101 -2060 -412 -73 385 1982 1583 546 -49 -799 -2040 -1519 -798 -296 906 2034 1539 816 892
$$ packed form
2267A849j713p95l09q58j93J759R40j60J762l80j425q10n99j209L9J387L01R60
2285E46J625l18j459M6j311j341p9J029N57J566J549n93o85k16j596j277M78J1
2303a468M19J630J261l11M10n82j968p80J40l26Q72J440P37K2K41o30j432n71
2321h96k77j026J146J577M95K52N66j044j121J6j309p72Q85J550K48J190Q13j339
2339I54j121k87j137p08J118N21K70J909O47j091o44j36j736r50J118M87K25K135
2357A574K92o86J07r54j467l16N75k62J154J506k0Q8K48j601j400l1J97j040J706
2376c30J733j65M02K25j813o93m01j120K96J425P81K61R88J18j803m56m59j090
2394b101M1J648L39M58J597l99j037n95p50j241N21P21N02J202J128m95p23P6
$$ plain form
2412 892 -667 -2007 -1356 -753 -703 618 1612 1514 1357 977 -742 -1432 -1163 -1166 -1019 799 1394 1129 1618 1243
2432 1243 -585 -1256 -1156 -1775 -1165 221 850 1449 1721 882 -582 -468 -1197 -1884 -1217 140 138 966 1952
2451 1952 852 -265 -254 -1462 -2154 -877 -207 242 1230 1967 1188 356 -273 -1526 -1565 -994 -931 69 1861
2470 1861 2289 917 844 172 -1231 -1408 -983 -990 -105 1658 1474 1359 1386 221 -1231 -1368 -1434 -1266 10
2489 10 856 1164 1571 1578 75 -1025 -1113 -1480 -1746 -296 413 874 1389 1783 28 -208 -1118 -2123 -1649 -97
2509 -97 -88 487 1415 1536 462 16 -679 -2140 -1623 -550 -25 580 1887 1441 752 526 -700 -1550 -1045
2528 -1045 -779 -531 1098 1813 1414 915 988 -388 -1397 -1043 -1209 -145 898 1528 1250 1611 890 -486
2546 -486 -1121 -1172 -1443 -936 760 1236 1180 1585 558 -718 -793 -1264 -1751 -1111 291 645 1311 1600 858 -248
$$ packed form
2412H92j559j340O51O03N0J321R94r8j57l80j719o90K69lJ47J818N95k65M89l75
2432A243j828o71J00o19O10J386O29N99K72q39j464J14p29o87O67J357kQ28R86
2451A952j100j117J1j208o92J277O70M49R88P37p79q32o29j253l9N71O3J000J792
2470A861M28j372p3o72j403j77M25pQ85J763j84j15K7j165j452j37o6J68J276
2489A0Q46L08M07Pj503j100q8l67k66J450P09M61N15L94j755k36r10j005M74J552
2509i7RN75R28J21j074m46o95j461N17J073N25O05J307m46o89k26j226q50N05
2528a045K66K48J629P15l99m99P3j376j009L54j66J064J043O30k78L61p21j376
2546d86o35n1k71N07J696M76n6M05j027j276p5m71m87O40J402L54O66K89p42j106
$$ plain form
2566 -248 -283 -1407 -2036 -959 -315 208 1222 1646 710 -58 -370 -1237 -1460 -731 -243 340 1376 1731 1064
2585 1064 914 -129 -1693 -1440 -971 -620 382 1521 1560 1071 1171 298 -1028 -945 -1104 -1019 386 1102 835
2604 835 1339 1947 -52 -967 -814 -1574 -1377 -378 774 772 1428 1323 -19 -734 -876 -1691 -1373 -444 372 995
2624 995 1658 1478 83 -304 -676 -1908 -1065 -288 79 792 1627 1295 480 194 -684 -1619 -1179 -513 -292
2643 -292 843 1542 1183 844 686 -797 -1192 -923 -809 -723 612 1578 1257 1197 843 -498 -1313 -954 -1561
2662 -1561 -456 891 1133 881 1587 731 -927 -1168 -1153 -1512 -830 193 445 915 1271 505 -473 -791 -1080
2681 -1080 -1949 -729 106 672 1581 1644 710 289 -6 -1079 -1825 -268 -264 230 1466 1296 982 715 -200
2700 -200 -1613 -1365 -1010 -660 -37 1393 1234 780 935 73 -1284 -820 -1043 -809 66 1321 1501 916 1093
$$ packed form
2566b48l5j124o29J077O44N23J014M24r36p68l12q67k23P29M88N83J036L55o67
2585A064j50j043j564K53M69L51J002J139L9m89J00q73j326Q3j59Q5J405P16k67
2604H35N04O08j999r15J53p60J97R99J152kO56j05j342p15j42q15L18R29Q16O23
2624I95O63j80j395l87l72j232Q43P77L67P13Q35l32q15k86q78r35M40O66K21
2643b92J135O99l59l39j58j483l95K69J14Q6J335R66l21o0l54j341q15L59o07
2662a561J105J347K42k52P06q56j658k41J5l59O82J023K52M70L56p66r78l18k89
2681a080q69J220Q35N66R09O3r34m21k95j073p46J557MM94J236j70l14k67r15
2700b00j413K48L55L50O23J430j59m54J55q62j357M64k23K34Q75J255J80n85J77
$$ plain form
2719 1093 -322 -1188 -1177 -1463 -1324 255 774 610 1669 1400 -247 -1082 -902 -1497 -1382 -336 275 381
2737 381 1253 923 86 -430 -691 -1675 -1251 -332 -51 777 1691 1346 458 -59 -608 -1767 -877 -324 -45 1113
2757 1113 1355 1529 787 308 -651 -1449 -809 -718 -216 1012 1355 677 1085 561 -515 -882 -904 -1147 -511 756
2777 756 1046 969 1082 276 -720 -1077 -1192 -1703 -761 665 498 971 1715 819 -652 -792 -1272 -1473 -836 120
2797 120 269 1245 1372 599 -34 -359 -1201 -1281 -461 -137 221 1468 1363 433 372 78 -1125 -1507 -582 -287
2817 -287 319 1238 1519 701 1078 104 -1111 -748 -623 -1024 -102 1329 1087 892 633 -357 -1239 -922 -1471
2836 -1471 -1293 -65 804 1018 1244 911 -408 -1121 -952 -1496 -1174 67 767 250 958 955 -94 -661 -913
2855 -913 -1574 -1077 47 288 948 1726 1021 269 74 -656 -1333 -752 -119 71 868 1474 836 470 238 -581
$$ packed form
2719A093j415q66J1k86J39J579N19j64J059k69j647q35J80n95J15J046O11J06
2737C81Q72l30q37n16k61r84M24R19K81Q28R14l45q88n17n49j159Q90N53K79J158
2757A113K42J74p42m79r59p98O40R1N02J228L43o78M08n24j076l67k2k43O36J267
2777G56K90p7J13q06r96l57j15n11R42J426j67M73P44q96j471j40m80k01O37R56
2797A20J49R76J27p73o33l25q42q0Q20L24L58J247j05r30o1k94j203l82R25K95
2817b87O06R19K81q18L77r74j215L63J25m01R22J431k42j95k59r90q82L17n49
2836a471J78J228Q69K14K26l33j319p13J69n44L22J241P00n17P08lj049n67k52
2855i13o61M97J124K41O60P78p05p52j95p30o77N81O33J90P97O06o38l66k32q19
$$ plain form
2875 -581 -1554 -556 -467 -90 905 1166 752 1241 496 -1116 -1011 -762 -866 -402 1044 1148 882 898 368 -951
2895 -951 -1058 -677 -1325 -583 313 405 1217 1129 176 -665 -675 -1251 -1578 -285 427 389 1209 1195 557 -309 -479
2916 -479 -1036 -1275 -473 -83 568 1296 1038 479 215 -296 -1187 -906 -150 -515 430 1266 1210 712 632 -59 -1188
2937 -1188 -1164 -488 -429 300 881 923 858 746 -273 -914 -838 -819 -916 54 1422 601 916 828 100 -784 -1006 -1262
2959 -1262 -695 77 434 747 1095 885 -393 -785 -720 -1427 -580 344 247 1077 1514 717 175 -211 -681 -1025
2979 -1025 -827 -120 81 1113 1470 861 178 204 -698 -1103 -681 -376 -378 768 1029 1026 685 319 -867 -1250
2999 -1250 -864 -640 -14 872 1034 934 1081 161 -708 -961 -637 -1286 -504 776 625 714 958 137 -910
3018 -910 -1077 -1001 -1341 -157 351 181 876 942 631 8 -167 -990 -1373 -360 264 549 1259 1233 555 44
$$ packed form
2875e81r73R98Q9L77R95K61m14M89p45j612J05K49j04M64J446J04k66J6n30j319
2895i51j07L81o48P42Q96R2Q12q8r53q41j0n76l27J293P12l8Q20j4o38q66j70
2916d79n57k39Q02L90O51P28k58n59k64n11q91K81P56l65R45Q36n6m98q0o91j129
2937a188K4O76N9P29N81M2o5j12j019o41P6J9r7R70J368q21L15q8p28q84k22k56
2959a262N67P72L57L13L48k10j278l92O5p07Q47R24r7Q30M37p97n42l86m70l44
2979a025J98P07K01J032L57o09o83K6r02m05M22L05kJ146K61ll41l66j186l83
2999a250L86K24O26Q86J62j00J47r20q69k53L24o49P82J280j51Q9K44q21j047
3018i10j67P6l40J184N08j70O95O6l11o23j75q23l83J013O24K85P10k6o78n11
$$ plain form
3038 44 -498 -827 -926 -244 -75 484 1144 1321 166 274 -102 -1029 -737 -252 -429 551 1343 781 775 201 -352
3059 -352 -1147 -632 -868 -554 187 858 416 539 677 -555 -924 -938 -978 -855 335 475 721 903 581 -374
3079 -374 -773 -857 -1231 -816 356 592 640 1357 522 -161 -333 -580 -1156 -554 340 439 1056 1555 644 65 72
3100 72 -857 -1028 -453 -352 205 972 1458 427 199 266 -915 -1102 -924 -667 -12 953 677 750 694 111 -684
3121 -684 -969 -723 -832 68 896 663 451 984 -76 -842 -1125 -891 -1018 -380 618 630 692 750 275 -232 -665
3142 -665 -1147 -1043 -32 649 498 1121 1414 280 -197 -417 -964 -761 -140 -25 607 1383 1000 416 135
3161 135 -495 -1162 -691 -196 -6 405 1124 828 569 179 -477 -1048 -921 -662 -477 387 801 700 694 305 -380
3182 -380 -867 -713 -1130 -428 453 640 287 900 547 -562 -648 -835 -1138 -706 453 533 696 1274 458 -20
$$ packed form
3038D4n42l29r9O82J69N59O60J77j155J08l76r27K92M85j77R80P92n62on74n53
3059c52p95N15k36L14P41O71m42J23J38j232l69j4m0J23J190J40K46J82l22r55
3079c74l99q4l74M15J172K36M8P17q35o83j72k47n76O02Q94R9O17M99r11n79P
3100G2r29j71N75J01N57P67M86j031k28O7j181j87J78K57O55R65k76P3n6n83p95
3121f84k85K46j09R00Q28k33k12N33j060p66k83K34j27O38R98J2O2N8m75n07m33
3142f65m82J04J011O81j51O23K93j134m77k20n47K03O21J15O32P76l83n84k81
3161A35o30o67M71M95J90M11P19k96k59l90o56n71J27K59J85Q64M14j01ol89o85
3182c80m87J54m17P02Q81J87l53O13l53j109q6j87l03M32J159Q0J63N78q16m78
$$ plain form
3202 -20 -173 -342 -1395 -585 76 373 850 1186 632 91 27 -532 -1072 -557 57 77 1204 1172 734 723 152
3223 152 -863 -1012 -559 -536 -329 657 1151 392 163 154 -910 -901 -742 -837 -42 839 693 575 645 100 -763 -851
3245 -851 -769 -698 -53 474 513 692 886 136 -517 -522 -1094 -739 395 424 343 1209 947 94 -301 -172 -895 -644
3267 -644 386 558 392 1019 775 152 239 -312 -1045 -598 -336 -46 618 899 863 383 279 -555 -1435 -789
3287 -789 -476 -622 188 991 972 591 213 -496 -881 -800 -853 -523 613 570 700 702 502 -291 -780 -528 -836 -349
3309 -349 531 686 877 913 469 -444 -512 -745 -923 -333 482 420 801 977 555 -56 165 -629 -1115 -600 -31
3330 -31 -98 944 1188 519 94 -362 -1008 -1223 -289 -478 -130 745 516 348 449 -114 -851 -648 -590 -720 14
3351 14 851 579 556 789 -52 -879 -522 -671 -643 80 775 391 556 645 -181 -569 -515 -512 -1033 251 444 755
$$ packed form
3202b0j53j69j053Q10O61K97M77L36n54n41o4n59n40N15O14K0J127l2m38j1n71
3223A52j015j49M53K3K07R86M94p59k29rj064RJ59r5P95Q81j46j18P0n45q63q8
3245h51Q2P1O45N27L9J79J94p50o53nn72L55J134K9q1Q66k62q53l95J29p23K51
3267f44J030J72j66O27k44o23Q7n51p33M47K62K90O64K81l6m80j04q34q80O46
3287g89L13j46Q10Q03j9l81l78p09l85Q1n3L30J136m3J30Kk00p93m89K52l08M87
3309c49Q80J55J91L6m44r13o8k33j78N90Q15o2L81J76m22o11K21p94m86N15N69
3330c1o7J042K44o69m25m56o46k15R34j89L48Q75k29j68J01n63p37K03N8j30P34
3351A4Q37k72k3K33q41q27L57j49K8P23O95l84J65Q9q26l88N4Ln21J284J93L11
$$ plain form
3373 755 893 798 132 -480 -328 -912 -716 152 116 423 931 813 4 228 -301 -982 -720 -170 106 528 1142
3394 1142 708 247 -57 -529 -820 -974 -31 -202 530 827 633 456 -12 -813 -1267 -595 -449 -49 765 750
3414 750 117 310 376 -510 -735 -571 -934 -279 308 547 522 880 182 -337 -384 -780 -722 125 348 500 658
3435 658 1132 389 -27 -309 -633 -503 -128 393 46 779 717 376 -81 -633 -926 -971 -374 -464 121 816 807 561
3457 561 148 -192 -783 -623 -379 -465 -93 862 862 666 350 -328 -807 -827 -555 -578 191 798 732 386 658 72
3479 72 -423 -823 -757 -432 301 535 623 924 738 -8 -348 -544 -863 -736 198 537 663 1111 609 -208 -70
3500 -70 -465 -1050 -327 196 44 698 684 353 139 213 -620 -1232 -580 -185 -524 383 905 384 128 278 -330
3521 -330 -776 -755 -570 -335 479 550 359 556 -15 -493 -656 -512 -632 -44 351 656 587 833 91 -562 -580
$$ packed form
3373G55J38r5o66o12J52n84J96Q68l6L07N08j18q09K24n29o81K62N50K76M22O14
3394A142m34m61l04m72k91j54R43j71P32K97j94j77m68q01m54O72J46M00Q14j5
3414G50o33J93O6q86k25J64l63O55N87K39k5L58o98n19m7l96N8Q47K23J52J58
3435F58M74p43m16k82l24J30L75N21l47P33o2l41m57n52k93m5N97r0N85O95rk46
3457E61m13l40n91J60K44q6L72R55%j96l16o78m79k0K72k3P69O07o6l46K72n86
3479G2m95m00O6L25P33K34Q8L01j86p46l40j96l19J27R34L39J26M48n02q17J38
3500g0l95n85P23N23j52O54j4l31k14P4q33o12O52L95l39R07N22n21k56J50o08
3521c30m46K1J85K35Q14P1j91J97n71m78j63J44j20N88L95L05o9K46p42o53j8
$$ plain form
3542 -580 -578 -671 -432 319 643 790 1065 62 -104 -196 -417 -797 -254 560 542 960 666 78 -344 18 -605
3563 -605 -708 123 -31 308 857 407 286 113 -319 -949 -579 -254 -92 -52 837 757 570 162 -165 -777 -1114
3584 -1114 -351 -156 351 563 504 619 490 -53 -456 -543 -862 -582 178 960 235 436 738 -83 -228 -619
3604 -619 -683 -359 -22 551 717 1025 496 -152 -96 -570 -863 -213 38 87 419 713 563 -160 -47 -319 -1039
3625 -1039 -196 -152 -56 328 662 521 135 336 -371 -922 -579 -485 -63 775 643 373 616 24 -462 -646 -447
3646 -447 -552 -162 548 702 468 725 258 -519 -560 -99 -520 -188 593 443 736 542 20 -387 -541 -370
3666 -370 -637 -125 44 290 334 564 208 -148 -475 -711 -712 -97 338 513 496 593 -62 -187 -164 -963 -715 -451
3688 -451 -389 322 899 658 311 229 -433 -779 -419 -263 -435 160 611 472 557 580 -131 -833 -636 -559 -365 328
$$ packed form
3542e80Kr3K39P51L24J47K75j003j66r2k21l80N43Q14j8M18k94n88m22L62o23
3563f05j03Q31j54L39N49m50j21j73m32o30L70L25J62M0Q89q0j87m08l27o12l37
3584a114P63J95N07K12n9J15j29n43m03q7l19K80P60P82p25K01L02q21j45l91
3604f19o4L24L37N73J66L08n29o48N6m74k93O50K51M9L32K94j50p23J13k72p20
3625a039Q43M4R6L84L34j41l86K01p07n51L43R4M22Q38j32k70K43n92m86j84J99
3646d47j05L90P10J54k34K57m67p77m1M61m21L32P81j50K93j94n22m07j54J71
3666c70k67N12J69K46M4K30l56l56l27k36jO15M35J75j7R7o55j25K3p99K48K64
3688d51O2P11N77k41l47q2o62l46L60J56j72N95M51j39Q5K3p11p02J97P7J94O93
$$ plain form
3710 328 569 365 671 422 19 -643 -740 -691 -625 258 644 377 861 326 -118 -162 -451 -868 -229 424 280
3731 280 450 532 487 228 96 -425 -976 -309 -56 99 473 715 319 -186 -160 -420 -637 -170 -87 -107 474 416
3753 416 67 -2 -65 -691 -581 -97 -303 -202 687 683 416 400 133 -393 -562 -372 -443 301 488 380 781 439
3775 439 126 -319 -489 -303 -605 -108 530 723 569 563 291 -471 -369 -882 -632 -127 -106 -137 429 578 86
3796 86 -208 -220 -958 -623 -221 -55 307 910 439 90 122 13 -782 -617 -362 -304 379 575 460 342 159
3817 159 -393 -391 -252 -366 -237 301 497 158 640 355 -135 -391 -442 -530 -46 241 560 492 618 400 -212 -427
3839 -427 -591 -630 -299 136 226 467 650 324 -206 -25 -457 -673 -467 -68 -11 177 620 38 -313 -159 -374
3860 -374 -754 -358 -46 -182 505 653 356 -160 -153 -404 -753 -432 -213 88 462 406 44 322 379 -418 -361 -507
$$ packed form
3710C28K41k04L06k49m03o62r7M9O6Q83L86k67M84n35m44m4k89m17O39O53j44
3731B80J70Q2m5k59j32n21n51O67K53J55L74K42l96n05K6k60k17M67Q3k0N81n8
3753D16l49o9o3o26J10M84k06J01Q89mk67j6k67n26j69J90p1P44J87j08M01l42
3775D39l13m45j70J86l02M97O38J93j54ok72p62J02n13K50N05K1l1N66J49m92
3796H6k94j2p38L35M02J66L62O03m71l49L2j09p95J65K55N8O83J96j15j18j83
3817A59n52KJ39j14J29N38J96l39M82k85m90k56n1q8M84K87L19o8J26k18o12k15
3839d27j64l9L31M35R0K41J83l26n30J81m32k16K06L99N7J88M43n82l51J54k15
3860c74l80L96L12j36O87J48k97n16Pk51l49L21K19L01L74n6l62K78N7p97N7j46
$$ plain form
3882 -507 -282 -144 732 622 755 831 -147 -465 -291 -343 -395 127 774 159 698 407 -82 24 -288 -524 -701
3903 -701 28 393 288 449 341 -17 -149 -183 -788 -623 447 86 111 263 340 1 100 -183 -829 -539 -105
3924 -105 -19 34 707 364 101 222 -104 -418 -106 -126 -91 450 578 428 647 194 -211 -232 -317 -597 -336 209
3946 209 496 285 586 520 -320 -353 -331 -722 -50 86 545 168 708 123 -98 -297 -505 -560 -84 163 357
3967 357 494 422 145 -70 -90 -751 -764 -505 -94 129 487 750 299 -69 -414 -320 -225 -399 -451 -33 562 588
3989 588 385 183 -4 -333 -404 -425 -214 128 515 748 288 606 172 -547 -304 -457 -283 95 146 145 549 217
4011 217 -83 -331 -344 -413 29 234 176 338 187 226 -255 -270 -452 -495 -522 97 219 21 681 570 -86 2 -649
4034 -649 -827 -444 9 -62 154 488 408 271 52 -241 -318 -29 -271 -98 357 645 161 496 282 -79 -82 -458
$$ packed form
3882e07K25J38Q76j10J33P6r78l18J74n2n2N22O47o15N39k91m89J06l12k36j77
3903g01P29L65j05J61j08l58j32l4o05J65J070l61K5J52P7l39R9k83o46K90M34
3924a05Q6N3O73l43k63J21l26l14L12k0L5N41J28j50K19m53m05k1q5k80K61N45
3946B09K87k11L01o6q40l3K2l91O72J36M59l77N40n85k21j99k08n5M76K47J94
3967C57J37p2k77k15k0o61j3K59M11K23L58K63m51l68l45R4R5j74n2M18N95K6
3989E88k03k02j87l29p1k1K11L42L87K33m60L18m34p19K43j53J74L78N1jM04l32
4011B17l00k48j3o9M42K05n8J62j51L9m81j5j82m3k7O19J22j98O60j11o56Q8o51
4034f49j78L83M53p1K16L34q0j37k19k93p7K89k42J73M55K88m84L35k14l61ll76
$$ plain form
4056 -458 -475 -33 500 370 540 460 232 -445 -224 -551 -430 -166 214 -27 245 431 33 -131 -273 -489 -494
4077 -494 -264 79 117 544 552 212 -32 -303 -200 -478 -318 136 231 621 660 276 -23 -306 -762 -746 43 -329
4099 -329 116 388 468 44 151 -79 -590 -411 -294 -105 521 698 607 296 505 221 -323 -167 -84 -451 383
4120 383 176 342 242 541 349 -638 -471 -333 -397 -256 730 88 496 427 139 -268 -109 -1044 -474 284 19
4141 19 278 926 151 17 -265 -134 -569 -244 -355 153 599 627 264 -78 -50 -225 -493 -489 -264 -11 253 388
4163 388 511 170 12 -57 -448 -319 -585 17 320 296 346 490 164 -310 -451 -443 -385 -46 560 214 106 284
4185 284 -60 -129 -210 -555 -154 -43 257 95 544 556 82 -417 -343 -367 -799 -72 -352 -20 312 350 -63 140
4207 140 -233 -689 -237 -150 202 33 728 741 176 473 119 -614 -291 -304 -349 94 479 569 55 323 42 -508
$$ packed form
4056d58j7M42N33j30J70q0k28o77K21l27J21K64L80k41K72J86l98j64j42k16n
4077d94K30L43L8M27Ql40k44k71J03k78J60M54R5L90L9l84k99k83m56J6P89l72
4099c29M45K72Q0m24J07k30n11J79J17J89O26J77r1l11K09k84n44J56Q3l67Q34
4120C83k07J66j00K99j92r87J67J38o4J41R86o42M08o9k88m07J59r35N70P58k65
4141A9K59O48p75j34k82J31m35L25j11N08M46K8l63l42K8j75k68MK25K53K64J35
4163C88J23l41j58o9l91J29k66O02L03k4N0J44l26m74j41QN8L39O06l46j08J78
4185B84l44o9q1l45M01J11L00j62M49J2m74m99P4k4m32P27k80L32L32L8m13K03
4207A40l73m56M52Q7L52j69O95J3n65K97l54p33L23j3m5M43L85R0n14K68k81n50
$$ plain form
4229 -508 -244 -464 -195 -32 118 290 391 325 70 -374 -531 -298 -390 -39 354 58 549 97 -152 -243 -385
4250 -385 -400 -436 20 75 338 681 186 30 -229 -179 -665 -223 74 94 376 427 331 262 -100 -239 -437 -518 33
4273 33 -264 297 567 181 64 132 -384 -473 -363 -384 -228 372 610 262 390 147 -289 -415 -479 -556 -314 48
4295 48 208 486 739 83 -559 -99 -541 -446 -296 136 299 51 205 84 -242 -202 -587 -52 -227 -1 180
4316 180 667 354 211 52 -121 -434 -638 -112 20 147 587 448 -175 -46 -236 -319 -424 -43 -236 348
4336 348 627 344 403 238 -192 -101 -125 -355 -57 237 386 404 184 335 -156 -338 -552 -452 -382 240 168 80
4358 80 397 286 -531 -455 -286 -627 -289 -22 -174 213 419 273 10 -157 -287 -583 -273 -196 87 396 536
4379 536 166 -137 -139 -84 -499 -47 55 357 324 405 209 87 63 -179 -629 -224 -270 -138 190 193 140 375 4
$$ packed form
4229e08K64k20K69J63J50J72J01o6k55m44j57K33r2L51L93k96M91m52k49r1j42
4250c85j5l6M56N5K63L43m95j56k59N0m86M42K97K0K82N1r6o9l62j39j98q1N51
4273C3k97N61K70l86j17O8n16q9J10k1J56O00K38l48J28k43m36j26o4p7K42L62
4295D8J60K78K53o56o42M60m42R5J50M32J63k48J54j21l26M0l85N35j75K26J81
4316A80M87l13j43j59j73l13k04N26J32J27M40j39o23J29j90q3j05L81j93N84
4336C48K79k83N9j65m30R1k4k30K98K94J49J8k20J51m91j82k14J00P0O22p2q8
4358H0L17j11q17P6J69l41L38K67j52L87K06j46k63j67j30k96L10P7K83L09J40
4379E36l70l03kN5m15M52J02L02l3Q1j96j22k4k42m50M05m6J32L28Ln3K35l71
$$ plain form
4402 4 -258 -375 -439 -177 136 596 424 155 192 -85 -451 2 -141 -399 35 37 67 349 528 -59 -162 -237 -254
4425 -254 -236 -45 76 200 425 449 -130 -124 -203 -218 -399 -237 57 45 364 322 315 70 -69 -375 -288 74 52 304
4449 304 406 509 152 403 -293 -466 -217 -277 -279 357 500 276 164 -139 -310 -376 -363 -361 -441 -261 286 426 144
4472 144 -159 -104 -609 -443 -550 -267 25 205 394 401 -6 -440 -204 -143 -518 -93 -192 110 461 263 293 148
4494 148 66 -396 -492 -148 35 139 335 211 201 223 110 -364 -456 -349 208 48 422 504 29 362 50 -626
4516 -626 -503 -194 -350 -98 410 337 333 331 255 -331 -330 -129 -87 73 298 74 -90 371 -122 -246 -217 -495 -688
4539 -688 40 53 -61 194 385 -74 -183 -99 -485 -347 -74 381 277 192 250 24 172 -272 -570 -105 166
4560 166 -55 87 254 184 287 210 -118 -413 -231 -226 0 200 116 249 127 372 -133 -176 -429 -234 -220 -50
$$ packed form
4402Dk62j17o4K62L13M60j72k69L7k77l66M53j43k58M34KL0K82J79n87j03p5j7
4425b54J8J91J21J24K25K4n79Op9j5j81J62K94j2L19m2pk45j39l06Q7L62k2K52
4449C04J02J03l57K51o96j73K49o0kO36J43k24j12l03j71o6J3Kq0J80N47J40k82
4472A44l03N5n05J66j07K83K92J80J89Pm07m34K36O1l75M25r9L02L51j98L0j45
4494A48q2m62r6L44J83J04J96j24j0K2j13m74r2J07N57j60L74Q2m75L33l12o76
4516f26J23L09j56K52N08p3mkp6n86JK01M2J60K25k24j64M61m93j24K9k78j93
4539f88P28J3j14K55J91m59j09Q4l86J38K73M55j04q5N8k26J48m44k98M65K71
4560A66k21J42J67p0J03p7l28k95J82NK26K00q4J33j22K45n05m3k53J95J4J70
$$ plain form
4582 -50 510 499 419 -92 -104 -621 -473 -377 -300 145 102 238 212 4 -152 -88 -244 -478 24 20 140 156 260 93
4606 93 -47 -111 -285 -263 101 244 421 561 353 299 33 -20 -205 -249 -218 105 297 360 467 121 385 -182 -320
4629 -320 -385 -165 -3 110 295 319 141 326 95 -13 -188 176 -271 -284 497 448 415 106 -151 -132 31 -167
4651 -167 -388 -9 287 144 246 177 143 -141 -447 -264 -414 5 244 133 367 265 -55 77 -190 -311 -138
4672 -138 -20 221 137 256 421 -235 -291 -206 -524 -205 -72 -67 328 163 296 143 -158 -191 -319 -334 -240 -116 189
4695 189 360 55 366 124 -176 -463 -152 -88 -163 87 553 -78 47 373 -239 -250 -206 -481 -120 -19 135
4716 135 491 657 131 60 -49 -133 -354 -421 105 151 340 461 27 -63 -42 -437 -289 -359 239 21 358 398 167
4739 167 21 -251 -232 -305 37 -109 -61 485 541 83 210 -48 -435 -89 -469 -18 154 686 217 133 579 26
$$ packed form
4582e0N60j1q0n11j2n17J48R6P7M45m3J36k6k08j56O4j56k34N02mJ20J6J04j67
4606I3j40o4j74K2L64J43J77J40k08n4k66n3j85m4L1L23J92O3J07l46K64n67j38
4629c20o5K20J62J13J85K4j78J85k31j08j75L64m47j3P81m9l3l09k57J9J63j98
4651a67k21L79K96j43J02o9l4k84l06J83j50M19K39j11K34j02l20J32k67j21J73
4672a38J18K41q4J19J65o56n6Q5l18L19J33NL95j65J33j53l01l3j28j5R4J24L05
4695A89J71l05L11k42l00k87L11O4p5K50M66o31J25L26o12j1M4k75L61J01J54
4716A35L56J66n26p1j09q4k21o7N26M6J89J21m34r0K1l95J48p0N98k18L37M0k31
4739A67j46k72J9p3L42j46M8N46N6m58J27k58l87L46l80M51J72N32m69q4M46n53
$$ plain form
4761 26 -190 -148 -407 -301 172 256 126 282 306 -110 -463 -136 -716 -341 -130 271 161 374 632 -99 -137 -244
4783 -244 -400 -282 86 167 391 236 204 55 -344 -82 -461 -283 -213 34 462 406 283 103 53 -307 -426 -97
4805 -97 -321 -447 10 265 211 247 317 -496 -400 -332 -133 -32 354 379 254 210 196 -160 -317 185 -589 -16 129
4828 129 57 187 186 277 -282 -202 -395 -444 113 73 304 88 120 86 -177 57 -572 -354 -341 120 189 188 426 316
4852 316 177 9 -224 -312 -120 -346 171 387 91 -23 92 -224 -296 -329 50 -347 276 308 74 127 216 -256
4874 -256 -342 -314 -193 39 -31 448 58 94 84 19 51 -475 -118 -228 103 252 48 216 328 -29 -83 -268 -293
4897 -293 -72 -108 58 418 313 251 45 -86 -125 -274 53 -78 135 260 374 485 -109 121 -21 -312 105
4918 105 7 -220 206 263 23 139 130 -243 -532 -149 -30 -40 365 354 259 98 126 92 -424 6 -440 168 153
$$ packed form
4761B6k16M2k59J06M73Q4j30J56K4m16l53L27n80L75K11M01j10K13K58p31l8j07
4783b44j56J18L68Q1K24j55l2j49l99K62l79J78P0K47M28n6j23j80n0l60j19L29
4805i7k24j26M57K55n4L6P0q13R6O8J99J01L86K5j25m4j4l56j57N02p74N73J45
4828A29p2J30jR1n59Q0j93m9N57m0K31k16L2l4k63K34o29K18J3M61O9jK38j10
4852C16j39j68k33q8J92k26N17K16k96j14J15l16p2l3L79l97O23L2k34N3Q9m72
4874b56q6K8J21K32p0M79l90L6j0o5L2n26L57j10L31J49k04J68J12l57n4j85k5
4897b93K21l6J66L60j05o2k06j31l9j49L27j31K13J25J14J11n94K30j42k91M17
4918A05r8k27M26N7k40J16rl73k89L83J19j0M05j1r5j61K8l4n16M30m46O08j5
$$ plain form
4941 153 344 405 -9 35 -249 34 104 -495 -316 233 81 199 463 65 -143 -251 161 -60 -445 215 71
4962 71 404 416 -227 -54 -39 -818 -336 -281 30 35 609 324 267 266 -185 -380 -427 -179 -171 -100 324 131 -57 381
4986 381 -113 -312 -264 -362 -147 264 306 205 345 316 -57 -301 -44 -355 -138 9 465 210 479 224 -35
5007 -35 -26 -266 -431 -384 212 141 331 72 66 -312 176 -164 -373 50 -316 85 129 185 368 201 38 -263 -301
5030 -301 -257 59 -164 339 144 11 116 46 -117 -316 -47 -279 -61 109 126 68 208 -13 -171 -270 -185 -387
5052 -387 -402 56 543 424 260 86 -232 -253 -292 -301 141 191 361 44 199 332 -117 114 -474 -331 222 -71
5074 -71 165 412 47 182 -347 -77 -459 -480 71 -257 329 450 456 191 310 37 -45 -585 -138 50 -301 358
5096 358 392 295 -73 217 -437 -308 -357 -451 89 -134 174 232 183 -172 -502 -31 -324 -243 67 236 204 189 419
$$ packed form
4941A53J91O1m14M4k84K83P0n99J79N49j52J18K64l98k08j08M12k21l85O60j44
4962G1L33J2o43J73J5p79M82N5L11NN74k85n7jm51j95m7K48QP1M24j93j88M38
4986C81m94j99M8r8K15M11M2j01J40k9l73k44K57l11K17J47M56k55K69k55k59
5007c5Rk40j65M7N96p1J90k59ol78M88l40k09M23l66M01M4N6J83j67j63l01l8
5030c01M4L16k23N03j95j33J05p0j63j99K69k32K18J70J7n8J40k21j58r9Q5k02
5052c87j5M58M87j19j64j74l18k1l9rM42N0J70l17J55J33m49K31n88J43N53k93
5074g1K36K47l65J35n29K70l82k1N51l28N86J21Ok65J19k73q2n40M47J88l51O59
5096C58L4r7l68K90o54J29m9r4N40k23L08N8m9l55l30M71k93Q1L10J69l2j5K30
$$ plain form
5119 419 80 -288 -144 -24 127 250 32 253 275 -155 119 -102 -223 -136 -162 217 228 -33 336 138 -88
5140 -88 -137 -68 -238 -279 -299 154 160 394 313 98 -206 -474 -216 -113 -148 -351 348 290 -237 1 103 -205 -409
5163 -409 -385 -153 118 320 360 467 186 300 -378 -330 -229 -81 -34 345 116 560 345 -104 -272 -93 -429
5184 -429 -242 -125 -5 226 270 361 99 -268 -253 -555 -276 -157 33 -175 183 -192 -245 108 -223 -369 -40
5205 -40 -190 -16 412 269 308 74 81 120 -684 -334 -283 -99 220 155 -18 195 -194 26 -99 -171 -253 67 146
5228 146 126 243 385 429 -42 -24 -247 -267 -390 236 41 129 183 225 -95 -86 -212 -135 -434 -113 -44 273 341 368
5252 368 134 32 -228 -232 -222 89 194 253 328 271 166 -301 -349 -434 -134 -177 -185 55 -18 253 -94 64 -160 73
5276 73 -384 -396 14 98 314 79 325 375 -384 63 227 139 -33 231 302 124 332 189 -61 -182 -253 -168 -70
$$ packed form
5119D19l39l68J44J20J51J23k18K21K2m30K74k21j21Q7k6L79J1k61L69j98k26
5140h8m9O9j70m1k0M53OK34q1k15l04k68K58J03l5k03O99n8n27K38J02l08k04
5163d09K4K32K71K02M0J07k81J14o78M8J01J48M7L79k29M44k15m49j68J79l36
5184d29J87J17J20K31M4R1k62l67J5l02K79J19J90k08L58l75n3L53l31j46L29
5205d0j50J74M28j43L9k34PL9q04L50N1J84L19o5j73K13l89K20j25p2q2L20P9
5228A46k0J17J42M4m71J8k23k0j23O26j95Q8N4M2l20Rj26P7k99L21O9L17O8K7
5252C68k34j02k60mJ0L11J05N9P5n7j05m67m8q5L00m3qK40p3K71l47J58k24K33
5276G3m57j2M10Q4K16k35K46N0p59M47J64q8j72K64P1j78K08j43k50j21p1Q5R8
$$ plain form
5299 -70 7 2 509 348 -107 -164 61 -94 -371 -57 51 289 219 419 102 248 -175 -354 -187 -56 -86 -275
5321 -275 169 303 -133 -31 30 -307 216 -100 -77 176 302 46 200 -65 -287 -187 -258 -300 137 159 241 -129
5343 -129 425 265 -298 -110 -46 -272 -230 323 -160 199 148 167 76 79 -160 -327 40 163 172 136 333 156 -109
5366 -109 -183 -34 -336 -300 85 51 301 103 214 30 103 -111 -535 160 -21 58 494 277 -85 258 -73 -416
5388 -416 -375 -26 215 226 316 127 236 63 -266 -56 -404 19 -240 180 -77 58 323 334 98 -188 34
5409 34 -404 -95 241 -88 322 -70 49 90 66 -163 -92 -318 -284 -73 41 -149 501 302 44 171 -271 -358
5431 -358 -119 195 -161 230 -4 -324 65 -19 -200 -92 145 -235 76 185 79 126 -148 -157 -253 -118 -69 -45
5453 -45 -75 334 165 164 441 -282 -205 -32 -194 -186 58 8 76 162 -196 -102 -255 -141 -149 -193 -24 -283 204 181 178 66
$$ packed form
5299g0P7nN07j61m55n7K25j55k77L14J08K38p0K00l17J46m23j79J67J31l0j89
5321b75M44J34m36J02O1l37N23l16K3K53J26k56J54k65k22J00p1m2M37K2Q2l70
5343a29N54j60n63J88O4k26M2N53m83L59n1J9r1Lk39j67L67J23Rl6J97j77k65
5366a09p4J49l02L6L85l4K50j98J11j84P3k14m24O95j81P9M36k17l62L43l31l43
5388d16M1L49K41J1R0j89J09j73l29K10l48M23k59M20k57J35K65J1k36k86K22
5409C4m38L09L36l29M10l92J19M1k4k29P1k26L4K11J14j90O50j99k58J27m42q7
5431c58K39L14l56L91k34l20L89q4j81J08K37l80L11J09j06M7k74rr6J35M9K4
5453d5l0M09j69jK77p23P7J73j62QK44n0O8Q6l58R4j53J14qm4J69k59M87k3lj12
$$ plain form
5479 66 -43 -262 -348 -11 -148 -32 -140 99 126 1 29 -178 -136 -278 179 96 28 243 141 249 160 -94 -212
5502 -212 -198 -35 -59 20 7 -85 18 204 -310 -266 -263 -254 -105 332 467 183 590 -1 257 -170 -156 -207 -133 124
5526 124 -46 -279 276 29 -188 -95 -527 -381 54 -82 468 76 468 141 -98 -196 -438 -294 -250 122 27
5547 27 254 142 -45 32 -422 -183 -419 -285 7 142 485 171 3 312 -477 -161 -173 -266 58 -32 295 109
5569 109 77 63 -186 -339 -443 -140 -259 134 107 202 194 220 -261 -138 -96 -245 -103 13 44 40 86 -95 105 -116
5593 -116 71 -311 -215 -81 -339 133 230 415 -342 73 -204 -142 -64 -102 72 426 350 -273 -77 -174 -127 -279 23
5616 23 -96 -95 281 415 276 -53 326 -136 -424 -144 225 -244 -11 115 103 -311 -181 -131 81 -100 -356 -68
5638 -68 239 160 207 398 98 -142 -222 7 -350 14 -41 149 375 427 -116 -202 -87 -153 -401 -258 164 -118 348
$$ packed form
5479F6j09k19q6L37j37J16j08K39K7j25K8k07M2j42M57q3o8K15j02J08q9k54j18
5502b12J4J63k4P9j3r2J03J86n14M4LRJ49M37J35k84M07n91K58m27J4n1P4K57
5526A24j70k33N55k47k17R3m32J46M35j36N50l92L92l27k39r8k42J44M4L72r5
5547B7K27j12j87P7m54K39k36J34K92J35L43l14j68L09p89L16j2r3L24r0L27j86
5569A09l2j4k49j53j04L03j19L93k7R5qK6m81J23M2j49J42J16L1mM6j81K00k21
5593a16J87l82R6J34k58M72R7J85p57M15k77O2P8l8J74L54p6o23J96r7M7j52L02
5616B3j19JL76J34j39l29L79m62k88K80L69m69K33J26j2m14J30N0K12j81k56K88
5638f8L07p9M7J91l00k40q0K29l57L64n5J90K26N2n43q6J15o6k48J43M22k82M66
$$ plain form
5661 348 371 2 -123 -396 -192 -310 -329 163 -228 481 201 189 161 -207 -311 -217 -115 187 61 80 -37 -107
5683 -107 221 -50 -337 -388 -206 -18 192 110 21 47 279 -169 -332 -143 -140 -51 -51 131 414 70 110 98 -474 -109
5707 -109 -220 -181 44 -60 397 96 193 106 261 -476 -309 -210 -239 117 14 332 82 181 -40 133 -331 -264
5729 -264 18 -41 59 199 18 -104 -71 29 -519 -292 -33 -64 59 175 272 -47 31 -185 -315 64 -356 -101
5751 -101 109 304 77 324 44 -252 16 -381 -176 -28 125 132 339 -60 28 -107 -43 -19 -101 90 263 62
5773 62 43 46 73 -117 -84 -245 -284 -355 -166 272 396 164 151 421 21 -93 -499 -167 85 58 48 256 -109 -204
5797 -204 -92 -506 70 -444 -57 285 190 163 246 243 -92 -217 -89 -198 86 137 272 131 203 149 323 -19 -156
5820 -156 -208 152 65 26 259 237 94 92 16 -429 -157 -42 -93 -89 99 -42 103 68 290 -13 -145 128 6 121
$$ packed form
5661C48K3l69j25k73K04j18j9M92l91P09k80j2k8l68j04R4J02L02j26J9j17p0
5683a07L28k71k87n1J82J88K10q2q9K6K32m48j63J89LQ9%J82K83l44M0j2n72L65
5707a09j11L9K25j04M57l01R7q7J55p37J67R9k9L56j03L18k50R9k21J73m64O7
5729b64K82n9J00J40j81j22L3J00n48K27K59l1J23J16R7l19P8k16j30L79m20K55
5751a01K10J95k27K47k80k96K68l97K05J48J53PK07l99Q8j35O4K4q2J91J73k01
5773F2j9LK7j90L3j61l9p1J89M38J24k32j3K70m00j14m06L32K52k7j0K08l65r5
5797b04J12m14N76n14L87L42r5k7Q3ll35j25J28j09K84N1J35j41P2n4J74l42j37
5820a56n2L60q7l9K33k2j43kp6m45K72J15n1MJ88j41J45l5K22l03j32K73j22J15
$$ plain form
5844 121 164 61 7 38 174 -159 -164 -21 -76 -220 119 88 123 56 53 -282 -104 65 -335 -170 109 219 -5 -272
5868 -272 168 -34 -337 -328 -152 2 216 125 219 137 126 -25 72 -258 -180 10 134 -63 -140 340 -146 -141 4 -182
5892 -182 72 258 -29 40 349 152 304 24 -149 34 -329 -189 201 -99 195 126 223 176 20 -393 -39
5913 -39 -96 -295 12 292 534 118 303 -260 -178 -138 12 33 17 -173 63 173 -62 326 -107 117 -313 29
5935 29 -196 506 210 48 278 84 40 -28 -124 36 15 318 259 298 286 9 -49 90 -308 -3 102 -321 -83
5958 -83 200 57 257 -128 -398 -100 -146 -161 43 287 131 160 -127 195 -54 -361 -47 80 -121 121 398
5979 398 -61 505 158 -362 -71 -267 -215 -220 358 -193 -58 209 284 -428 -47 -30 -265 124 147 -55 308 345
6001 345 245 77 -55 -55 -175 -130 -156 125 269 257 35 80 -90 -209 1 -92 -101 314 448 80 41 336 -139
$$ packed form
5844A21M3j03n4L1J36l33nJ43n5j44L39l1L5o7ll35J78J69m00J65K79J10k24k67
5868b72M40k02l03RJ76J54K14r1R4q2j1j51R7l30P8J90J24j97p7M80m86NJ45j86
5892a82K54J86k87O9L09j97J52k80j73J83l63J40L90l00K94o9R7m7j56m13L54
5913c9n7j99L07K80K42m16J85n63Q2M0J50K1j6j90K36J10k35L88m33K24m30L42
5935B9k25P02k96j62K30j94m4o8r6J60k1L03n9L9j2k77n8J39l98L05J05m23K38
5958h3K83j43K00l85k70K98m6j5K04K44j56K9k87L22k49l07L14J27k01K42K77
5979C98m59N66l47n20K91j96N2nN78n51J35K67P5p12L81J7k35L89K3k02L63L7
6001C45j00j68j32%j20M5k6K81J44j2k22M5j70j19K10r3rM15J34l68l9K95m75
$$ plain form
6024 -139 -215 118 -292 100 170 275 106 264 244 339 -287 154 11 -196 189 116 116 150 40 68 19 31 -108 -249
6048 -249 241 333 -168 188 62 -333 176 -91 -359 -156 -88 52 -61 324 -5 -4 -170 -239 31 237 -244 113
6070 113 253 410 -29 110 30 -264 37 94 -79 -54 -8 -63 114 -61 -39 -182 159 -4 -105 80 307 294
6092 294 270 -7 116 -88 73 16 98 -79 80 106 272 208 111 -445 -140 -16 -287 200 -110 127 130 257 -262
6115 -262 -16 -266 -371 -116 97 -134 1 171 170 2 -157 -20 -22 42 -35 204 113 97 355 303 305 183 -266 -223
6139 -223 251 27 38 -23 211 176 143 -168 -10 93 -164 142 -288 194 116 138 110 -484 -76 -19 -82 -99 -402
6162 -402 97 85 122 66 -100 -50 243 -158 153 213 12 189 192 -138 -30 -71 15 -135 -202 -8 -114 191 215 251
6186 251 100 66 86 -275 -37 -49 -334 172 278 -223 89 -86 -144 -233 -140 -83 181 -5 166 281 183 162 28
$$ packed form
6024a39p6L33m10L92P0J05j69J58k0R5o26M41j43k07L85p3%L4j10K8m9J2j39j41
6048b49M90R2n01L56j26l95N09k67k68K03O8J40j13L85l29Jj66o9K70K06m81L57
6070A13J40J57m39J39q0k94L01N7j73K5M6n5J77j75K2j43L41j63j01J85K27j3
6092B94k4k77J23k04J61n7Q2j77J59K6J66o4r7n56L05J24k71M87l10K37LJ27n19
6115b62K46k50j05K55K13k31J35J70jj68j59J37kO4p7K39r1j6K58n2Kj22m49M3
6139b23M74k24J1o1K34l5l3l11J58J03k57L06m30M82p8K2k8n94M08N7o3j7l03
6162d02M99j2L7n6j66N0K93m01L11O0k01J77Ll30J08m1Q6j50o7J94j06L05K4L6
6186B51j51l4K0l61K38j2k85N06J06n01L12j75n8q9R3N7K64j86J71J15r8k1j34
$$ plain form
6209 28 -41 -138 154 -341 -124 128 112 178 -154 61 -124 -289 -6 104 -54 -82 134 122 45 -274 -7 29 -284
6232 -284 145 -271 -116 255 189 -151 -10 18 -112 -85 -138 -265 -19 203 167 -121 159 -53 -85 -51 237 -69
6254 -69 164 316 167 185 -106 -23 10 1 97 -63 200 12 203 308 87 73 -169 91 -442 -249 311 164 -93
6277 -93 29 73 -375 -220 -129 -85 79 66 104 459 100 238 -324 -33 90 -84 -219 -200 421 241 86 -10 -133
6300 -133 -182 -86 -217 52 -241 39 -176 222 -13 23 336 207 -247 -263 -53 -8 -9 70 215 74 -12 -112 -348
6323 -348 -463 -365 -190 176 179 264 277 -198 -260 -54 5 -109 -38 -326 -36 183 100 13 54 -84 -408 -61 -11 -65
6347 -65 -151 93 96 43 -166 121 -292 -39 -53 87 -20 86 63 -185 -78 178 -111 -189 98 -107 -31 202 -63
6370 -63 -35 375 -31 -144 126 -98 79 -168 55 136 -216 187 -231 -90 -71 -136 -413 -95 183 -166 141 155
$$ packed form
6209B8o9r7K92m95K17K52j6O6l32K15j85j65K83J10j58k8K16j2p7l19K67L6l13
6232b84M29m16J55L71o6l40J41K8j30K7n3j27K46K22l6k88K80k12l2L4K88l06
6254f9K33J52j49J8k91Q3L3rR6j60K63j88J91J05k21j4k42K60n33J93N60j47k57
6277i3J22M4m48J55R1M4J64j3L8L55l59J38n62K91J23j74j35J9O21j80j55r6j23
6300a33m9R6j31K69k93K80k15L98k35L6L13j29m54j6K10M5jP9J45j41q6j00k36
6323c48j15R8J75L66LQ5J3m75o2K06N9j14P1k88K90K19q3q7M1j38l24L47N0n4
6347f5q6K44Ln3k09K87m13K53j4J40j07J06k3k48J07K56k89p8K87k05P6K33k65
6370f3K8M10m06j13K70k24J77k47K23Q1l52M03m18J41J9o5k77L18K78l49L07J4
$$ plain form
6392 155 -42 -409 -55 -55 -474 68 139 30 163 146 2 131 -310 -35 -349 -65 102 -31 302 -74 157
6413 157 -187 -140 -322 -431 241 -204 148 300 383 155 -31 121 -159 -178 38 -360 188 115 190 51 65 -149
6435 -149 116 -263 -45 137 -24 115 388 132 -131 -115 19 -164 -175 78 29 -35 139 379 35 -105 -38 -161
6457 -161 -205 95 -46 13 418 395 205 -77 242 -58 -91 185 2 121 205 126 224 -12 90 -332 -232 49
6479 49 -194 4 243 385 175 234 -228 -262 30 259 -266 108 99 242 118 90 34 -56 -142 -158 -158 125 -80 268
6503 268 350 106 -171 -145 -261 -309 -212 90 269 32 -31 -138 110 -265 -131 -275 -161 24 147 117 -111 -20
6525 -20 -232 163 55 -238 -145 241 -167 149 248 137 -91 467 -138 -248 15 -9 -139 151 164 50 224 66
6547 66 -294 45 -353 9 -244 103 -147 241 293 -3 9 -295 -221 -145 -258 -98 43 265 201 193 77 12 -131
$$ packed form
6392A55j97l67L54%m19N42P1j09J33j7j44J29m41K75l14K84J67j33L33l76K31
6413A57l44M7j82j09O72m45L52J52Q3k28j86J52k80j9K16l98N48p3P5j39J4k14
6435a49K65l79K18J82j61J39K73k56k63J6J34j83j1K53m9o4J74K40l44j40O7j23
6457a61m4L00j41N9M05k3j90k82L19l00l3K76j83J19Q4p9R8k36J02m22J00K81
6479D9k43J98K39J42k10N9m62l4K92K29n25L74rJ43j24k8n6r0q6j6%K83k05L48
6503B68Q2k44k77K6j16m8R7L02J79k37o3j07K48l75J34j44J14J85J23l0k28R1
6525b0k12L95j08k93R3L86m08L16R9j11k28N58o05j10K63k4j30K90J3j14J74j58
6547F6l60L39l98L62k53L47k50L88N2k96J2l04P4P6j13J60J41K22o4qj16o5j43
$$ plain form
6570 -131 -34 -116 205 -105 11 183 -157 -110 -91 -244 -215 -15 99 -11 61 -66 166 -104 -52 -117 -465 91 -234
6593 -234 -148 200 -218 95 184 -204 -199 -27 -333 69 120 125 230 -24 38 55 -17 -150 -117 -145 -133 128 253 203 71
6618 71 110 -157 92 1 -106 38 188 236 550 38 -158 -165 -39 -40 -373 -101 64 -183 377 187 48 48 -109
6641 -109 -110 -79 -19 -4 4 -55 92 284 248 -3 -165 -121 -141 137 -8 617 246 238 -50 -66 -88 42 -137 14 117
6666 117 143 -111 76 64 -370 -183 -60 155 0 -163 84 182 127 -54 36 -38 -193 -170 -189 22 44 210 -22
6689 -22 170 -59 -116 -94 -111 103 26 119 264 304 249 96 -18 -68 -174 -89 -41 66 184 34 46 78 157 -55 -82
6714 -82 17 -216 312 298 382 190 44 -118 -272 -341 -229 94 279 279 183 423 -143 -16 90 -271 -314 127 -32
6737 -32 -133 235 259 162 62 -165 -24 -154 -85 219 -50 141 218 168 127 87 -99 -289 -289 48 27 -65 319 140
$$ packed form
6570a31R7q2L21l10J16J72l40M7J9j53K9K00J14j10P2j27K32k70N2o5l48N56l25
6593b34Q6L48m18L13Q9l88NJ72l06M02N1NJ05k54O2J7p2j33L3k8J2K61J25n0j32
6618G1L9k67K49r1j07J44J50M8L14n12j96pJ26jl33K72J65k47N60j90j39%j57
6641a09jL1O0J5Qn9J47J92l6k51j62M4k0K78j45O25l71qk88j6k2J30j79J51J03
6666A17K6k54J87j2m34J87J23K15j55j63K47R8n5j81R0p4j55K3j9K11K2J66k32
6689b2J92k29n7K2j7K14p7R3J45M0n5j53j14n0j06Q5M8J07J18j50J2L2P9k12k7
6714h2R9k33N28j4Q4j92j46j62j54o9J12L23J85%r6K40n66J27J06l61m3M41j59
6737c2j01L68K4r7j00k27J41j30O9L04k69J91P7n0m1m0j86j90%L37k1r2L84j79
$$ plain form
6761 140 136 21 -278 -341 -74 -45 -178 -60 214 182 59 264 -194 174 -123 74 -170 -262 -32 146 -139 291
6783 291 324 -176 -417 -7 0 260 -47 195 19 -183 53 66 -200 -128 4 50 303 288 216 -2 -452 -60 -362
6806 -362 -222 -100 -112 98 180 11 -102 -75 -88 50 -104 -90 88 43 479 112 319 30 29 -156 -147 104 -60
6829 -60 -108 228 74 159 290 -184 -506 50 93 -51 102 96 150 174 -218 -235 62 -205 -17 -103 -5 327 223 50
6853 50 108 -18 244 -620 -24 99 -62 -163 6 486 288 174 -103 -348 -31 -55 -76 19 146 267 294 43
6875 43 -98 67 -464 -93 -109 87 50 407 362 501 401 72 -131 -137 26 -177 150 245 71 205 136 -228 -161
6898 -161 116 -305 -227 37 261 25 130 38 -101 254 -109 -248 12 124 180 132 19 -208 -47 -132 -207 63
6920 63 49 173 129 83 -104 -48 -115 -96 -185 68 195 -9 -80 264 84 45 -143 100 -171 -147 -244 -100 -62 -56 268
$$ packed form
6761A40mj15k99o3K67K9j33J18K74l2j23K05m58L68k97J97k44r2K30J78k85M30
6783B91L3n00k41M10PK60l07K42j76k02K36J3k66P2J32M6K53j5p2k18m50L92l02
6806c62J40J22j2K10Q2j69j13K7j3J38j54J4J78m5M36l67K07k89jj85RK51j64
6829f0m8L36j54Q5J31m74l22N56M3j44J53oN4K4l92j7K97k67J88q6R8L32j04j73
6853E0N8j26K62q64N96J23j61j01J69M80j98j14k77k45L17k4k1R5J27J21K7k51
6875D3j41J65n31L71j6J96l7L57m5J39j00l29k03oJ63k03L27R5j74J34o9l64O7
6898a61K77m21P8K64K24k36J05r2j39L55l63j39K60J12N6m8j13k27J61q5p5K70
6920F3j4J24m4m6j87N6o7J9q9K53J27k04p1L44j80l9j88K43k71K4r7J44L8OL24
$$ plain form
6945 268 206 -314 49 -347 -274 340 -12 82 -115 370 -129 -66 -68 -117 -130 -215 -238 33 276 -98 59 91 124 -15
6969 -15 -5 -5 -261 -246 115 170 202 190 -112 98 -232 -384 -95 42 206 485 352 146 40 0 -309 -103 -374
6992 -374 -168 134 160 93 12 107 86 -201 -225 -217 -21 -203 205 -65 250 -52 120 -223 -539 293 84 -72 223
7015 223 58 179 36 21 99 -76 179 -118 -177 166 35 35 178 -159 -48 -211 -246 -267 -204 296 -26 82 -3
7038 -3 30 -102 66 -127 -312 -61 -90 188 16 279 -117 216 -109 -5 -263 160 0 38 154 132 166 152 -207
7061 -207 -281 -292 -99 78 196 -5 -84 -30 262 96 -215 -169 -285 -392 -297 554 -33 209 214 -226 -220 191 -245
7084 -245 54 78 128 157 20 271 21 -3 -347 -280 -212 185 17 123 181 160 91 150 300 -264 -102 -118 335 87
7108 87 435 -156 133 -174 -247 -192 -229 -304 116 343 44 40 -307 -250 -198 335 -311 -118 135 101 70 -331 276 -162
$$ packed form
6945B68o2n20L63l96P3O14l52R4j97M85m99O3km9j3q5k3K71K43l74J57L2L3j39
6969a5J0%k56J5L61N5L2j2l02K10l30j52K89J37J64K79j33k06j06m0l09K06k71
6992c74K06L02K6o7q1R5k1k87k4QJ96j82M08k70L15l02J72l43l16Q32k09j56K95
7015B23j65J21j43j5P8j75K55k97n9L43j31%J43l37J11j63l5k1O3N00l22J08q5
7038cL3j32J68j93j85K51k9K78j72K63l96L33l25J04k58M23j60L8J16k2L4j4l59
7061b07p4j1J93J77J18k01p9N4K92j66l11M6j16j07R5Q51n87K42Nm40OM11m36
7084b45K99K4N0K9j37K51k50k4l44O7O8L97j68J06N8k1o9N9J50n64J62j6M53k48
7108H7L48n91K89l07p3N5l7p5M20K27k99ml47N7N2N33o46J93K53l4l1m01O07m38
$$ plain form
7132 -162 -46 -112 -202 -330 -4 20 22 132 18 175 -138 -425 -79 -97 -46 -310 190 -91 -12 352 27 77 -282
7155 -282 84 -26 -31 294 31 221 -135 -193 -422 -72 -82 -70 -205 47 -138 -48 223 132 -87 -257 139 -6
7177 -6 -16 -126 162 344 205 -170 -296 -289 82 -238 110 9 -131 24 234 38 -106 -256 -42 -415 -145 -27
7199 -27 -76 7 129 63 -241 -395 -35 -72 247 228 -100 239 79 249 -142 46 -118 -95 -236 5 190 17
7221 17 83 -32 18 -250 -245 -37 -134 -79 -328 51 356 163 -79 9 -348 201 -121 -143 -248 -170 -48 -103 60 13
7245 13 -244 -59 -180 -167 -9 94 190 166 78 144 -450 103 -137 100 26 140 396 213 328 7 -154 -52
7267 -52 -91 -99 296 101 69 83 10 148 5 -50 -208 -38 68 -40 427 61 -164 123 -27 76 -468 62 -104
7290 -104 -402 211 450 90 106 -30 66 -191 -242 -127 -115 96 75 -157 -35 -50 -54 127 12 -346 -204 48 254
$$ packed form
7132a62J16o6r0j28L26K4KJ10j14J57l13k87L46j8N1k64N00k81P9L64l25N0l59
7155b82L66j10nL25k63J90l56n8k29L50j0J2j35K52j85R0K71r1k19j70L96j45
7177fj0j10K88J82j39l75j26PL71l20L48j01j40J55K10j96j44j50K14l73K70J18
7199b7m9Q3J22o6l04j54L60l7L19j9l28L39j60J70l91J88j64K3j41K41J85j73
7221A7O6j15N0k68NK08r7N5k49L79L05j93k42Q8l57N49l22k2j05P8J22n5J63m7
7245A3k57J85j21J3J58J03R6k4q8O6n94N53k40K37p4J14K56j83J15l21j61J02
7267e2l9qL95j95l2J4p3J38j43n5j58J70J06j08M67l66k25K87j50J03n44N30j66
7290a04k98O13K39l60J6j36R6k57n1J15J2K11k1k32J22j5mJ81j15l58J42K52K06
$$ plain form
7313 254 202 42 347 -8 -194 -28 -136 -178 -100 314 334 288 276 82 135 62 -27 -246 -130 329 81 119 243
7336 243 206 67 -439 -32 36 63 278 50 -156 70 284 -27 -258 -24 -106 -97 47 138 369 88 -94 159
7358 159 -357 -160 95 92 -33 26 -149 -62 325 -4 -163 -100 -125 -290 -63 127 166 48 -106 -55 -5 41 -27 -51
7382 -51 -121 150 189 248 262 -152 16 -185 7 -156 168 -186 23 -78 -162 266 435 340 -500 -186 -160 -32 152
7405 152 63 187 101 -24 102 -210 -69 -243 -60 153 359 311 349 -136 26 -84 -172 -209 116 -54 62 -135
7427 -135 177 -244 82 -171 -214 -119 -28 138 -118 108 208 25 -159 -201 -88 -12 -241 186 179 196 144 276 99
7450 99 187 -10 -38 -272 -374 -84 112 149 116 132 108 -477 -344 -105 -93 47 67 207 -69 81 -246 -337 -93
7473 -93 -446 -242 -86 120 416 -108 -33 202 -87 -86 -320 12 328 -121 -268 140 460 9 -116 -270 54
$$ packed form
7313B54n2j60L05l55j86J66j08m2P8M14K0m6j2j94N3p3q9k19J16M59k48L8J24
7336B43l7j39n06M07O8K7K15k28k06K26K14l11k31K34q2RJ44R1K31k81j82K53
7358A59n16J97K55lj25N9j75Q7L87l29j59O3k5j65K27J90L9j18j54N1N0M6o8k4
7382e1p0K71L9N9J4m14J68k01J92j63L24l54K09j01q4M28J69r5q40L14K6J28J84
7405A52q9J24q6j25J26l12J41j74J83K13K06m8L8m85J62j10q8l7L25j70J16j97
7427a35L12m21L26k53m3R5R1J66k56K26J00j83j84m2J13P6k29M27pJ7n2J32j77
7450I9Q8j97k8k34j02K90J96L7l3J6k4n85J33K39J2J40K0J40k76J50l27r1K44
7473i3l53K04J56K06K96n24P5K35k89Jk34L32L16m49j47M08L20m51j25j54L24
$$ plain form
7494 54 -276 186 212 193 486 130 32 -226 -78 -219 -216 -5 -139 -55 57 261 -222 258 -272 -94 -210 -32
7516 -32 -33 136 -176 98 -47 0 -158 -81 -92 -369 45 -283 62 -11 -216 297 -104 -242 -164 -277 -96 96 213
7539 213 144 277 461 -109 -353 -109 201 -7 126 -131 -37 224 379 -239 -515 -70 -60 -245 294 201 -12
7560 -12 67 89 -136 -51 -14 -356 -12 92 163 279 202 277 3 -75 -371 -200 -169 -164 -62 334 234 -123 64 -254
7584 -254 -217 -72 -168 -123 -29 -88 -180 308 48 142 -39 99 -303 -209 113 72 217 126 -132 64 -253 -362 89
7607 89 -470 199 -181 142 -111 50 -320 -144 -4 76 -260 102 148 38 46 32 123 1 -12 -175 -476 -84 177
7630 177 -11 -175 248 -6 80 -306 -281 -129 28 202 271 142 -272 -147 -77 -235 -305 -101 -139 -185 450 -10
7652 -10 322 215 20 55 -234 -100 -4 -130 205 68 181 300 108 4 -191 -39 -447 -112 143 118 -5
$$ packed form
7494E4l30M62K6j9K93l56r8k58J48j41LK11j34Q4J12K04m83M80n30J78j16J78
7516c2jJ69l12K74j45M7j58P7j1k77M14l28L45p3k05N13m01j38P8j13J81J92J17
7539B13o9J33J84n70k44K44L10k08J33k57R4K61J55o18k76M45J0j85N39r3k13
7560a2P9K2k25Q5L7l42L44J04P1J16p7P5k74p8k96J71L1NJ02L96j00l57J87l18
7584b54L7J45r6M5R4n9r2M88k60R4j81J38m02R4L22m1J45r1k58J96l17j09M51
7607H9n59O69l80L23k53J61l70J76J40Q0l36L62M6j10Qj4R1j22j3j63l01L92K61
7630A77j88j64M23k54Q6l86K5J52J57J74O9j29m14J25P0j58p0K04l8m6O35m60
7652a0L32j07j95L5k89J34R6j26L35j37J13J19j92j04j95J52m08L35K55k5j23
$$ plain form
7673 -5 38 134 3 -105 -58 242 -316 -4 39 213 26 82 -125 208 -203 -304 75 -16 55 79 186 -8 68 -146
7697 -146 -478 -220 -94 43 -211 -30 -191 -58 134 -29 -60 -32 13 -117 207 376 -26 257 279 -136 -67 -72
7719 -72 -242 -228 223 259 28 341 87 -261 -246 13 -211 -151 -65 72 -38 44 480 -55 24 -94 -173 -110 -36 -257
7743 -257 177 160 -19 -36 -42 55 -171 -153 187 -257 -5 172 266 -49 127 -154 -179 -47 -272 154 -91 307 256
7766 256 438 -356 -236 -300 9 -201 -449 -84 31 -34 67 191 -84 -84 195 -121 -160 116 57 13 49 -112 48
7789 48 67 -428 -17 40 -115 188 244 305 -134 -63 44 -111 -286 -103 116 -126 175 72 -85 99 83 -374
7811 -374 21 40 250 74 320 158 84 185 123 146 -181 -199 66 215 -96 336 -207 195 -226 -248 -59 44
7833 44 -322 -158 116 68 324 16 249 77 -7 -97 -155 296 8 -139 -1 424 -16 98 -75 -548 -442 -39
$$ packed form
7673eM3R6j31j08M7L00n58L12M3J74j87N6k07L33m11j01L79r1P1K4J07j94P6k14
7697a46l32K58J26J37k54J81j61J33J92j63l1K8M5j30L24J69m02K83K2m15O9n
7719g2j70J4M51L6k31L13k54l48J5K59k24O0Q6J37j10Q2M36n35P9j18p9O3P4k21
7743b57M34j7j79j7oR7k26J8L40m44K52J77R4l15J76k81k5J32k25M26k45L98n1
7766B56J82p94J20o4L09k10k48L65J15o5J01J24k75%K79l16l9K76n9m4L6j61J60
7789D8J9m95M11N7j55L03N6O1m39P1J07j55j75J83K19k42L01j03j57J84j6m57
7811c74L95J9K10j76K46j62p4J01o2K3l27j8K65J49l11M32n43M02m21k2J89J03
7833D4l66J64K74m8K56l08K33j72q4r0n8M51k88j47J38M25m40J14j73m73J06M03
$$ plain form
7855 -39 -74 -133 88 88 124 -168 -173 -208 179 -257 -37 -129 225 149 -81 187 -190 -463 -188 91 304 181 261 -74
7879 -74 57 99 -459 110 -57 49 -9 92 101 -3 14 107 -268 -327 -327 -113 0 34 200 106 207 189 -63 -3 -98
7904 -98 104 200 222 121 115 69 156 -58 -220 3 -10 187 104 380 195 -100 134 113 -78 11 -210 -349 82 -114
7928 -114 106 121 -88 -131 35 -216 -181 -138 -444 195 270 424 191 9 -128 264 -7 116 -302 -74 319 245
7950 245 68 280 154 78 -121 -302 -211 328 156 -238 242 167 -48 48 48 -87 -53 -185 340 -50 294 12
7972 12 143 -59 -141 -346 -237 -56 81 142 26 -44 -100 -286 64 -499 -261 -282 49 -53 97 -216 8 1 14
7995 14 -310 -318 -103 -182 275 19 -30 428 -60 -142 -106 -74 -36 216 210 105 169 468 26 -91 -22 -319 -108 5
8019 5 229 -112 -226 449 315 -47 -278 -89 -583 327 -266 447 158 123 -261 -149 132 -168 -214 -125 -178 85
$$ packed form
7855c9l5n9K21%L6k92nl5L87m36K20r2L54p6k30K68l77k73K75K79K13j23Q0l35
7879g4J31M2n58N69j67J06n8J01Rj04J7R3l75n9%K14J13L4J66r4J01j8k52O0r5
7904i8K02R6K2j01om6Q7k14j62K23j3J97q3K76j85k95K34k1j91Q9k21j39M31j96
7928a14K20J5k09m3J66k51L5M3l06O39P5J54k33j82j37L92k71J23m18K28L93p4
7950B45j77K12j26p6j99j81R1N39j72l94M80p5k15R6%j35L4j32N25l90L44k82
7972A2J31k02q2k05J09J81J37O1j16p0n6j86L50n63K38k1L31j02J50l13K24pJ3
7995A4l24qK15p9M57k56m9M58m88q2L6L2L8K52oj05O4K99m42j17O9k97K11J13
8019EK24l41j14O75j34l62k31J89m94R10n93P13k89l5l84J12K81l00m6Q9n3K63
$$ plain form
8041 85 227 135 -150 55 -151 -111 -169 -343 -270 -98 258 -19 143 207 -97 211 51 -261 -95 -103 411 -47 213
8064 213 69 143 -186 168 -109 34 313 434 201 212 368 -248 -151 -170 -121 -84 68 -80 493 106 -69 -272
8086 -272 -210 -59 -113 -104 -270 -217 94 440 -333 142 -222 -94 -215 -300 138 85 191 19 0 -130 335 -48 -107
8109 -107 -216 -101 83 37 -106 183 13 96 68 -219 397 222 -134 300 -211 206 57 74 -129 7 -95
8130 -95 -178 88 72 31 67 113 122 -38 -397 -69 -510 -51 176 -348 186 224 -29 -2 89 -407 73 68 -225 268
8154 268 97 -74 -111 -47 89 -192 -79 -198 206 -313 -250 128 151 -25 -231 -49 -309 69 -139 325 67
8175 67 -67 244 -195 95 -407 -201 6 -85 334 96 10 289 146 -36 -173 -59
$$ packed form
8041H5J42r2k85K05k06M0n8j74P3J72L56k77J62O4l04L08j60l12J66qN14m58K60
8064B13j44P4l29L54k77J43K79J21k33J1J56o16R7j9M9L7J52j48N73l87j75k03
8086b72O2J51n4Rj66N3L11L46p73M75l64J28j21q5M38n3J06j72j9j30M65l83n9
8109a07j09J15J84m6j43K89j70Q3k8k87O16j75l56M34n11M17j49J7k03J36j02
8130i5q3K66j6m1L6M6Rj60l59L28m41M59K27n24N34L8k53K7R1m96M80nk93M93
8154B68j71j71l7O4J36k81J13j19M04n19O3L78K3j76k06J82k60L78k08M64k58
8175F7j34L11m39K90n02K06K07r1M19k38q6K79j43j82j37J14
8191e9
$$ Imaginary data points
##PAGE= N=2
##DATA TABLE= (X++(I..I)), XYDATA
$$ plain form
0 0 0 0 0 0 0 0 -3 8 -8 8 -8 13 -16 16 -24 26 -32 40 -48 56 -64 73 -85 98 -113 129 -147 165 -188 214
30 214 -239 270 -302 337 -375 417 -464 514 -571 632 -702 777 -859 950 -1055 1171 -1302 1453
48 1453 -1624 1825 -2064 2356 -2713 3170 -3776 4618 -5876 7960 -12037 23025 -115211 -332086
62 -332086 -90402 103283 51591 -114688 -122051 -26047 40753 7013 -33737 -49111 -59319 -70478
74 -70478 -25264 22926 9159 -33040 -28873 -5170 5206 -17128 -62998 -70734 4233 58785 14978
87 14978 -41379 -13204 49936 61167 9517 -47404 -49813 -3709 34095 51793 48361 7521 -22679
100 -22679 18587 62708 25044 -29079 -20082 15759 36689 51791 53409 32001 10259 4756 8200
113 8200 3790 -14272 -6009 42717 54162 -480 -16631 39575 57702 2249 -36904 -23721 3941
$$ packed form
0@%%%%%%lJ1j6J6j6K1k9L2m0N0n8P2q8J04j20J37j58J83k11K42k76L12l53M02
30B14m53N09n72O39p12P92q81R78j085J203j334J479j636J809k005K226k473K755
48A453l077L449l889M420n069N883o946Q394j0494J3836j9997L5062j38236k16875
62c32086K41684J93685n1692j66279p363R6004O6800l3740m0750j5374j0208j1159
74g0478M5214M8190j3767m2199M167K3703J0376k2334m5870p736P4967N4552m3807
87A4978n6357K8175O3140J1231n1650n6921k409M6104L7804J7698l432m0840l0200
100b2679M1266M4121l7664n4123Q997L5841K0930J5102J618k1408k1742n503L444
113H200m410j8062Q263M8726J1445n4642j6151N6206J8127n5453l9153J3183K7662
$$ plain form
126 3941 24556 30409 24100 20344 14461 174 -1015 7820 -1194 -14136 -4882 14730 36454 47902
140 47902 21318 -7286 13241 28608 -16770 -42942 10722 62157 41539 -1809 -3898 27124
152 27124 36929 4306 -21038 -8035 865 -2112 30538 65082 33878 -15806 -13510 10838 12313
165 12313 -289 -14169 -15187 9656 33453 27656 10422 -3153 -13169 -13464 -14551 -25523 -15435
178 -15435 14648 18516 3481 6210 924 -26719 -29308 -8707 -14355 -33257 -22194 8464 23873
191 23873 10706 -16785 -28339 -23341 -27270 -27326 -6269 -511 -18019 -6632 22138 10560 -19898
204 -19898 -23081 -19664 -27696 -22629 -3297 12186 14926 4260 -5208 -537 -2587 -21182 -22491 -8360
218 -8360 -9693 -6217 17429 24401 7226 -280 -5756 -21925 -23484 -8154 -2368 106 11244 17237
$$ packed form
126C941K0615N853o309l756n883j4287j189Q835r014j2942R254J9612K1724J1448
140D7902k6584k8604K0527J5367m5378k6172N3664N1435k0618m3348k089L1022
152B7124R805l2623k5344J3003Q900k977L2650L4544l1204m9684K296K4348J475
165A2313j2602j3880j018K4843K3797n797j7234j3575j0016k95j087j0972J0088
178a5435L0083L868j5035K729n286k7643k589K0601n648j8902J1063L0658J5409
191B3873j3167k7491j1554M998l929n6K1057N758j7508J1387K8770j1578l0458
204a9898l183L417q032N067J9332J5483K740j0666r468M671k050j8595j309J4131
218h360j333L476K3646O972j7175p506n476j6169j559J5330N786K474J1138N993
$$ plain form
232 17237 13490 3223 -11123 -11761 -4186 -15595 -25080 1351 25486 13720 5176 11836 -209
245 -209 -20927 -16538 -3396 -3343 -7441 -2807 13358 28220 16370 -7734 -10843 -8127 -17829 -11929
259 -11929 8463 9476 4796 17499 20762 3996 -5160 -5755 -12493 -11735 -1048 6413 14168 19831
273 19831 14937 10046 2770 -16495 -21684 -2229 3622 -4961 7043 22661 12450 780 4366
286 4366 -1577 -15985 -18519 -11157 1081 12763 12664 10119 12903 2655 -14616 -11458 -4612 -14682
300 -14682 -11955 9973 16387 10047 12812 8327 -10066 -17296 -12151 -7908 -2637 1777 5718 16523
314 16523 18606 1990 -6980 -2807 -12444 -20846 -4278 9191 5780 10674 19487 9340 -4855 -8885
328 -8885 -11736 -11073 -5543 -1746 4830 14427 12143 6186 7291 -3754 -23082 -17523 -1563 -4120 -3715
$$ packed form
232A7237l747j0267j4346o38P575j1409r485K6431K4135j1766q544O660j2045
245b09k0718M389J3142N3m098M634J6165J4862j1850k4104l109K716r702N900
259a1929K0392J013m680J2703L263j6766r156n95o738P58J0687P461P755N663
273A9831m894m891p276j9265n189J9455N851q583J2004J5618j0211j1670L586
286D366n943j4408k534P362J2238J1682r9k545K784j0248j7271L158O846j0070
300a4682K727K1928O414o340K765m485j8393p230N145M243N271M414L941J0805
314A6523K083j6616q970M173r637q402J6568J3469l411M894Q813j0147j4195m030
328h885k851O63N530L797O576R597k284n957J105j1045j9328N559J5960k557M05
$$ plain form
343 -3715 12744 17062 5570 433 -3935 -12554 -16034 -14646 -7733 6414 11138 5614 9005 11000
357 11000 -5844 -16855 -9324 -9870 -12577 887 12727 8573 8113 10942 1254 -9955 -13714 -13749 -6690
372 -6690 2526 4202 9804 18379 8584 -6000 -2683 -3337 -16944 -14073 3017 6987 6042 12818 12630
387 12630 3640 -3860 -11725 -15096 -9231 -4734 -753 11504 15353 4640 2204 2855 -11872 -20562
401 -20562 -8589 -3105 -5960 4078 14337 9800 2302 -2318 -8716 -11500 -13476 -14160 -2597 10486
415 10486 7473 4817 11429 4161 -12669 -12748 -7459 -11332 -6366 7519 10677 8713 9788 4816 -3244
430 -3244 -8324 -12468 -11025 -933 2612 4276 15436 16540 570 -5419 -1582 -9761 -16986 -5338
444 -5338 5819 6801 9806 11251 6411 710 -6458 -13639 -9742 -4403 -4965 3452 15665 11411 3308
$$ packed form
343c715J6459M318j1492n137m368q619l480J388O913J4147M724n524L391J995
357A1000j6844j1011P531n46k707J3464J1840m154m60K829r688j1209l759l5P059
372f690R216J676N602Q575r795j4584L317o54j3607K871J7090L970r45O776j88
387A2630q990p500p865l371N865M497L981J2257L849j0713k436O51j4727q690
401b0562J1973N484k855J0038J0259m537p498m620o398k784j976o84J1563J3083
415A0486l013k656O612p268j6830p9N289l873M966J3885L158j964J075m972q060
430c244n080m144J443J0092L545J664J1160J104j5970n989L837q179p225J1648
444e338J1157R82L005J445m840n701p168p181L897N339n62Q417J2213m254q103
$$ plain form
459 3308 5444 -1258 -15303 -12780 -3753 -3749 757 11835 13952 8628 3141 -4512 -7472 -6814 -11012 -7495
475 -7495 7789 12520 6690 10977 13109 -743 -9890 -5494 -6010 -6764 3284 11648 13156 14157 9883
490 9883 1898 -1841 -6747 -10166 -2128 5340 3794 9877 20096 11272 -1879 -641 -1896 -10890 -9232
505 -9232 657 5818 9915 12938 10688 6380 -146 -10860 -11462 -2527 -2279 -1962 10435 15383 7953
520 7953 5692 3776 -7826 -12350 -4433 -1295 -1539 5427 11826 12581 10069 1327 -7363 -6291 -7355
535 -7355 -9408 1123 11547 7021 5751 12888 7443 -6297 -9309 -7702 -7099 -1240 5118 6474 9731
550 9731 9975 3439 -1437 -5981 -13930 -12325 -957 1543 1610 9914 10816 -919 -5041 -4955 -12785 -16840
566 -16840 -9015 -1229 3455 5599 2462 401 573 -7848 -17110 -13107 -8197 -9152 -1130 9581 5874
$$ packed form
459C308K136o702j4045K523R027MM506J1078K117n324n487p653k960O58m198L517
475g495J5284M731n830M287K132j3852r147M396n16p54J0048Q364J508J001m274
490I883p985l739m906l419Q038P468j546O083J0219q824j3151J238j255q994J658
505i232R889N161M097L023k250m308o526j0714o02Q935K48L17J2397M948p430
520G953k261j916j1602m524P917L138k44O966O399P55k512q742q690J072j064
535g355k053J0531J0424m526j270P137n445j3740l012J607O03N859O358J356L257
550I731K44o536m876m544p949J605J1368K500O7Q304R02j1735m122Q6p830m055
566a6840P825P786M684K144l137k061J72q421r262M003M910r55Q022J0711l707
$$ plain form
581 5874 442 915 -5392 -14135 -12283 -8402 -6732 -470 6189 7106 6988 2230 -6716 -7461 -6264 -13055
597 -13055 -10592 3828 8101 3793 6769 7520 -2400 -8479 -9082 -10286 -6973 849 3923 7600 10180
612 10180 4513 -1593 -2956 -8347 -13382 -6081 592 -342 5905 13148 5914 -2547 -2736 -5290 -11044
627 -11044 -10113 -5155 2142 10046 9857 4256 4032 1241 -8820 -9781 -3237 -3898 -2208 9136 12903 8345
643 8345 6880 3097 -5013 -6401 -3308 -2986 315 7103 10850 13658 12084 1239 -5263 -1819 -2718
658 -2718 -7010 632 9461 8140 8562 12439 6651 -2630 -6223 -7299 -4939 1488 3268 4433 11493
673 11493 11948 3680 -122 -3948 -11568 -9098 145 1610 2004 8915 9009 2114 -827 -3944 -10549 -11131
689 -11131 -6528 -1903 5287 7538 2720 2713 4809 -3534 -12288 -9703 -6512 -5640 3069 10534 6945 3280
$$ packed form
581E874n432M73o307q743J852L881J670O262O659R17j18m758q946p45J197o791
597a3055K463J4420M273m308K976P51r920o079o03j204L313P822L074L677K580
612A0180n667o106j363n391n035P301O673r34O247P243p234q461j89k554n754
627a1044R31M958P297P904j89n601k24k791j0061r61O544o61J690J1344L767m558
643H345j465l783q110j388L093L22L301O788L747K808j574j0845o502L444q99
658b718m292P642Q829j321M22L877n788r281l593j076K360O427J780J165P060
673A1493M55q268l802l826p620K470R243J465L94O911R4o895k941l117o605n82
689a1131M603M625P190K251m818pK096q343q754K585L191Q72Q709P465l589l665
$$ plain form
705 3280 2704 -2803 -6925 -6709 -7923 -5097 2613 6658 6924 9364 4238 -5148 -5195 -3770 -9827 -8572
721 -8572 2270 7199 6923 8254 4788 -1887 -4386 -6817 -9780 -5545 -922 1021 7149 10570 3544
736 3544 -2281 -2691 -8166 -10985 -5172 -1787 -2230 4289 10284 5422 -131 -3638 -8283 -9166 -6840 -5905
752 -5905 32 8387 7148 2607 4831 1567 -7708 -8767 -4109 -4166 -1380 6519 9104 8255 7160 1538
768 1538 -4364 -4351 -5095 -5593 1675 7579 7054 8946 9432 1961 -2889 -2170 -5219 -7156 -70 6059 7042
785 7042 9116 8767 2710 -1775 -3936 -6799 -5519 -1787 -1000 4250 12206 8616 213 -1038 -2772 -9217
801 -9217 -8338 -1849 153 2617 7288 6515 4193 1904 -4874 -8945 -5953 -4784 -4289 3069 9148 6291
817 6291 4436 3258 -4618 -8806 -4694 -3905 -4393 1797 6608 6682 6955 3927 -3226 -5640 -6241 -7678 -3275
$$ packed form
705C280n76n507m122K16j214K826P710M045K66K440n126r386m7J425o057J255
721h572J0842M929k76J331l466o675k499k431k963M235M623J943O128L421p026
736C544n825m10n475k819N813L385m43O519N995m862n553l507m645q83K326R35
752e905N937Q355j239m541K224l264r275j059M658n7K786P899K585q49j095n622
768A538n902J3p44m98P268N904n25J892M86p471m850P19l049j937P086O129R83
785G042K074l49o057m485k161k863J280L732P87N250P956l590q403j251j734o445
801i217Q79O489K002K464M671p73k322k289o778m071K992J169M95P358O079k857
817F291j855j178p876m188M112P89m88O190M811P4K73l028p153k414o01j437M403
$$ plain form
834 -3275 3793 3837 4664 9071 5031 -3553 -4515 -5188 -8834 -6089 737 3492 5635 7465 3800 -1043
850 -1043 -3948 -8688 -8957 -2411 -835 -1974 4443 9745 4567 -268 -1796 -7395 -9678 -5560 -2368
865 -2368 1017 5877 6739 3607 3345 -369 -7132 -7582 -4733 -4381 491 6993 5694 4268 6705 1911
881 1911 -7516 -7521 -4236 -3001 -318 4072 5671 7847 6585 226 -3489 -3441 -7562 -7783 1456 6150 4377
898 4377 5805 6807 1006 -2773 -3601 -7036 -7189 -1869 1492 4109 7966 6332 1733 -893 -5046 -9899
914 -9899 -6342 -887 -818 2392 8121 5840 1007 435 -2828 -7822 -6871 -3423 -1233 3995 7152 5125
930 5125 4413 2700 -4145 -7147 -4301 -4962 -3410 4676 7843 4267 4702 4997 -1885 -6423 -5771 -5087 -1710
947 -1710 3198 4771 5757 7407 3001 -2717 -2620 -4292 -8941 -4816 2756 4017 5519 7551 3326 -2644
$$ packed form
834c275P068M4Q27M407m040q584r62o73l646K745O826K755K143J830l665m843
850a043k905m740k69O546J576j139O417N302n178m835j528n599k283M118L192
865b368L385M860Q62l132k62l714o763m50K849L52M872O502j299j426K437m794
881A911r427nL285J235K683M390J599K176j262o359l715M8m121k21R239M694j773
898D377J428J002n801l779q28l435j53N320L361K617L857j634m599k626m153m853
914i899L557N455O9L210N729k281m833n72l263m994R51L448K190N228L157k027
930E125p12j713o845l002K846o61J552Q086L167l576M35K95o882m538O52O84L377
947a710M908J573R86J650m406n718R7j672m649M125P572J261J502K032m225n970
$$ plain form
963 -2644 -3471 -6025 -8034 -4361 15 1824 5395 6180 2492 1031 -1604 -7998 -8608 -3189 -1246 -586
979 -586 6075 8082 2991 446 -627 -4807 -6768 -5438 -3670 1661 6992 6041 4257 4716 -12 -5983
995 -5983 -4539 -3441 -4559 -132 6530 6133 4739 5928 1001 -4239 -5228 -5450 -4718 313 3988 4863
1011 4863 7478 5461 -1873 -3290 -2875 -6783 -6997 -127 2867 3078 5955 5896 573 -2308 -4131 -7757
1027 -7757 -6033 -2091 -320 3707 7494 4428 927 620 -4030 -8430 -5114 -1092 -1388 2691 7759
1042 7759 6053 2859 990 -2720 -5168 -4417 -3941 -1964 4746 6726 4729 5267 3861 -3264 -5558 -3277
1058 -3277 -4429 -2860 4110 6100 4678 5783 3927 -2020 -4192 -4760 -5446 -2163 1929 2600 5708 8068
1074 8068 2288 -3116 -2486 -4297 -7940 -4162 1480 2268 4487 6070 3034 -618 -2612 -6155 -7085 -2808
$$ packed form
963b644q27k554k009L673M376J809L571P85l688j461k635o394o10N419J943O60
979e86O661K007n091k545j073m180j961J330J768N331N331r51j784M59m728n971
995e983J444J098j118M427O662l97j394J189m927n240r89k22P32N031L675Q75
1011D863K615k017p334j417M15l908k14O870K994K11K877n9n323k881j823l626
1027g757J724L942J771M027L787l066l501l07m650m400L316M022k96M079N068
1042G759j706l194j869l710k448P51M76J977O710J980j997N38j406p125k294K281
1058c277j152J569O970J990j422J105j856n947k172n68o86L283M092O71L108K360
1074H068n780n404O30j811l643L778N642P88K219J583l036l652j994l543r30M277
$$ plain form
1090 -2808 -1140 867 5603 6191 2576 1576 15 -6544 -7034 -2550 -1616 -264 5529 6774 4265 2589
1106 2589 -1029 -4438 -4504 -4374 -4120 1654 6064 4324 4247 5095 46 -5013 -4307 -4453 -4757 58 4341
1123 4341 4337 5276 4827 -199 -3732 -4871 -6585 -5006 378 1527 2458 6200 4989 -1465 -3065 -2781 -6975
1140 -6975 -6713 -1723 1239 3026 5422 4174 1165 -187 -3956 -7320 -4659 -1608 -1184 3587 7075
1155 7075 4030 2007 1679 -2689 -6341 -3877 -1943 -1278 3045 6310 5271 4244 1824 -3095 -3968 -3762
1171 -3762 -5189 -1699 4836 5352 3713 5115 3111 -2717 -4621 -3535 -4561 -2627 2172 3829 4789
1186 4789 5320 1876 -2008 -3181 -5268 -6687 -2516 902 1081 4779 6832 1835 -2383 -1731 -4502 -6762
1202 -6762 -3549 -145 1414 4853 5070 2414 1245 -1218 -6414 -5365 -1904 -1734 -15 5751 6318 2911
$$ packed form
1090b808J668K007M736N88l615j000j561o559m90M484R34J352N793J245k509j676
1106B589l618l409o6J30K54N774M410j740p7Q48n049n059P06j46l04M815M283
1123D341mR39m49n026l533j139j714J579N384J149R31L742j211o454j600K84m194
1140f975K62M990K962J787K396j248l009j352l769l364K661L051M24M771L488
1155G075l045k023l28m368l652K464J934O65M323L265j039j027k420m919q73K06
1171c762j427L490O535N16j639J402k004n828j904J086j026J934M799J657R60
1186D789N31l444l884j173k087j419M171L418J79L698K053m997m218O52k771k260
1202f762L213L404J559L439K17k656j169k463n196J049L461J70J719N766N67l407
$$ plain form
1218 2911 2804 -64 -4851 -5237 -2604 -1953 879 5058 5268 4488 3536 -921 -3844 -3069 -4146 -4558 1010
1235 1010 5031 3306 3861 4766 324 -4309 -4556 -4866 -4377 311 2241 3065 5344 3692 -1036 -2061
1251 -2061 -3496 -6800 -4785 10 457 2224 5747 4126 -548 -1165 -2688 -5931 -5077 -1898 68 3491
1267 3491 5554 3198 1865 1219 -3698 -6050 -2943 -1355 -1668 3193 6608 3978 2429 1721 -2276 -4709
1283 -4709 -3254 -3036 -1230 3046 4682 4661 5017 1438 -3430 -3702 -3328 -5356 -2273 3386 3987 2957 4320
1300 4320 2759 -2543 -4006 -4589 -4909 -1695 890 1423 4077 5075 1429 -1415 -2244 -5218 -6423 -1863
1316 -1863 448 712 4245 5928 2164 -302 -1164 -4361 -5074 -2440 -904 2051 5382 4164 2509 3070
1332 3070 25 -5546 -4366 -1487 -1850 887 5330 5082 2924 2574 -32 -3546 -3722 -3570 -2979 1457
$$ packed form
1218B911j07k868m787l86K633O51K832M179K10p80r52m457k923P75j077m12N568
1235A010M021j725N55R05m442m633k47l10M89M688J930Q24K279j652m728j025
1251b061j435l304K015M795M47J767L523j621m674o17j523l243Q54L179J966L423
1267C491K063k356j333o46m917k352L107J588l13M861L415k630j549p08l997k433
1283d709J455K18J806M276J636k1L56l579m868k72L74k028L083N659O01j030J363
1300D320j561n302j463n83l20L214K585N33K654R98l646k844q29k974j205M560
1316a863K311K64L533J683l764k466q62l197p13K634J536K955L331j218j655N61
1332C070l045n571J180K879l63K737M443k48k158l50k606l514j76J52N91M436
$$ plain form
1348 1457 4316 3800 4219 3526 -1319 -3480 -2781 -4342 -4560 518 3917 2854 3820 3704 -267 -2638 -4098
1365 -4098 -5781 -3504 -154 711 2596 5420 2881 -1024 -821 -2267 -5898 -4316 -869 304 2579
1380 2579 5690 4035 931 -185 -2683 -4429 -3255 -2074 -428 3970 5165 2963 2757 2630 -3232
1395 -3232 -5385 -2250 -1397 -1129 2650 5156 3720 3106 1110 -2417 -3100 -3411 -4320 -1287 2989 3837 3638
1412 3638 4821 1166 -3371 -3016 -3194 -4976 -2480 2430 2610 2557 3676 1684 -836 -2596 -5030 -4964 -1228
1429 -1228 166 878 4582 5272 864 -1255 -1265 -4328 -4644 -1573 -60 1042 3955 4933 2445 914
1445 914 -1168 -4097 -3435 -2085 -1620 1653 5209 3544 2357 3379 -5 -4681 -4000 -1675 -2000 743
1461 743 4197 3823 3205 2239 -1489 -3116 -3143 -4044 -3096 1315 2636 2214 4290 3601 -1463 -3200 -2799 -4565
$$ packed form
1348A457K859n16M19o93m845k161O99j561k18N078L399j063R66j16l971k371j460
1365d098j683K277L350Q65J885K824k539l905K03j446l631J582L447J173K275
1380B579L111j655l104j116k498j746J174J181J646M398J195k202k06j27n862
1395c232k153L135Q53K68L779K506j436o14j996l527o83l11r09L033M276Q48j99
1412C638J183l655m537L55j78j782K496M910J80n3J119j992k520j760k434O6L736
1429a228J394P12L704O90m408k119j0l063l16L071J513J102K913R78k488j531
1445I14k082k929O62J350M65L273L556j665j187J022l384m676O81K325l25K743
1461G43L454l74o18r66l728j627k7r01R48M411J321m22K076o89n064j737M01j766
$$ plain form
1479 -4565 -4028 542 2371 2606 3764 2657 154 -1159 -3579 -5627 -2574 208 301 2913 5820 2492
1495 2492 -35 -75 -1869 -4814 -3130 -721 359 2967 5043 3530 1803 435 -3446 -4065 -2446 -2445
1511 -2445 -345 4359 4192 2018 2697 1774 -2483 -4275 -2729 -2643 -1206 1994 3944 3547 3457 291 -3029
1528 -3029 -2517 -3167 -4554 -1285 2426 1777 2904 4085 1261 -2702 -2703 -3279 -4469 -1727 1104 1904 3731
1545 3731 3426 1039 39 -1531 -4538 -4021 -340 -11 678 4909 4874 1394 187 -854 -3664 -3745 -1628
1562 -1628 -60 1619 4184 3754 2669 2000 -1143 -4022 -3008 -1962 -1967 1764 4627 2857 2020 2717 -1011
1579 -1011 -4105 -3260 -2856 -2410 674 2203 2636 3650 1908 -1944 -2288 -2471 -4259 -3250 867 1987
1595 1987 1952 3667 2928 -1141 -2148 -2643 -4391 -2981 -59 1264 2968 4362 2267 429 -177 -2980
$$ packed form
1479d565N37M570J829K35J158j107k503j313k420k048L053K782R3K612K907l328
1495B492k527m0j794k945J684K409J080K608K076j513j727j368l881o19J619J
1511b445K100M704j67k174O79r23m257j792J546Q6J437L200J950l97r0l166l320
1528c029N12o50j387L269L711o49J127J181k824l963jn76j190K742K831Q00J827
1545C731l05k387j000j570l007N17L681L29O89M231l5l480j207j041k810q1K117
1562a628J568J679K565m30j085o69l143k879J014J046nL731K863j770q37O97l728
1579a011l094Q45M04M46L084J529M33J014j742l852l44j83j788J009M117J120
1595A987l5J715p39m069j007m95j748J410K922J323J704J394k095j838o06k803
$$ plain form
1611 -2980 -4033 -1570 -67 -313 2810 5263 3092 577 -199 -2187 -3795 -2558 -822 203 3201
1626 3201 3919 2698 2142 499 -3150 -3484 -2052 -2475 -799 3223 3359 1828 2507 1214 -2643 -3773
1642 -3773 -3093 -2890 -916 1334 2084 2980 3362 -245 -2594 -2167 -3400 -4063 -591 1678 1507 2952 3837
1659 3837 956 -1245 -1641 -3493 -3366 -1322 251 2039 3990 3128 1446 747 -816 -4069 -3295 -321
1675 -321 17 1062 4314 3898 1606 976 -1157 -3301 -3088 -1834 -1368 1426 3616 2618 2168 1806 -1351
1692 -1351 -3690 -2287 -2659 -2684 1335 3522 2108 2458 2186 -1327 -3115 -3100 -3133 -2038 509 1944 2038 3804
1710 3804 1856 -1395 -1466 -1978 -4204 -2716 578 1349 2420 3924 2666 -37 -691 -2153 -3807 -2101
1726 -2101 285 785 3355 4092 1890 827 506 -2389 -3729 -1056 -452 118 2560 4175 2479 1306
$$ packed form
1611b980j053K463J503k46L123K453k171k515p76j988j608J237J736J025K998
1626C201P18j221n56j643l649l34J432m23J676M022J36j531O79j293l857j130
1642c773O80K03J974K250P50Q96L82l607k349M27j233o63L472K269j71J445Q85
1659C837k881k201l96j852J27K044J573J788J951q62j682o99j563l253P74K974
1675c21L38J045L252m16k292o30k133k144K13J254M66K794K190r98m50l62l157
1692a351k339J403l72k5M019K187j414L50k72l513j788J5l3J095K547J435R4J766
1710C804j948l251p1n12k226J488L294P71J071J504j258k703o54j462j654J706
1726b101K386N00K570P37k202j063l21k895j340K673O04N70K442J615j696j173
$$ plain form
1742 1306 368 -2426 -3058 -2219 -1848 72 2726 2925 1920 2662 256 -2743 -2870 -2339 -2985 -884 2180
1759 2180 2195 1932 2563 425 -2341 -2567 -2914 -2893 -313 1397 1487 3172 3636 -110 -1506 -1408 -3111 -3255
1777 -3255 -565 1137 1528 3256 3452 1113 -327 -1214 -3428 -2869 -728 216 1508 3917 3316 1201
1793 1201 768 -1015 -3535 -2417 -1096 -837 1130 3429 2837 1654 871 -1360 -3129 -2434 -2580 -1745 1434
1810 1434 2882 1501 2075 1563 -1471 -3073 -2407 -2889 -1991 925 2180 2036 2678 1635 -1140 -2166 -2247
1827 -2247 -3379 -1749 480 1350 2390 3697 1899 -980 -769 -2129 -3639 -1930 271 1103 2649 3713
1843 3713 1838 310 16 -2136 -3586 -1490 -342 209 2693 3441 1852 927 18 -2617 -3333 -1762
1859 -1762 -1111 -282 2561 2909 1912 1584 -236 -2691 -2541 -1970 -2501 -588 2282 2312 1731 2328 255 -2508
$$ packed form
1742A306r38k794o32Q39L71J920K654J99j005P42k406k999j27N31o46K101L064
1759B180J5k63O31k138k766k26l47K1K580J710R0J685M64l746j396R8j703j44
1777c255K690J702L91J728J96k339j440q87k214N59K141R44J292K409o01k115
1793A201m33j783k520J118J321K59J967K299n92j183p83k231j769O95j46Q35L179
1810A434J448j381N74n12l034j602O66m82Q98K916J255j44O42j043k775j026q1
1827b247j132J630K229Q70J040J307j798k879K11j360j510J709K201Q32J546J064
1843C713j875j528k94k152j450K096J148N51K484P48j589r25r09k635p16J571
1859a762O51Q29K843L48r97l28j820k455J50N71n31J913K870L0n81N97k073k763
$$ plain form
1877 -2508 -2255 -2566 -2789 -264 1455 1763 2658 2780 244 -1112 -1968 -3007 -2611 -179 910 1614 3386
1894 3386 3243 515 -763 -890 -2720 -2229 -515 487 1676 3259 2571 1204 941 -1390 -3081 -2324
1910 -2324 -616 -602 1626 3249 2431 997 858 -1416 -3058 -2186 -1555 -1051 1034 2625 1925 1812 1281
1927 1281 -1682 -2555 -1837 -2349 -1720 1190 1979 1413 2145 1625 -1162 -1877 -2041 -2545 -1396 1016 1443 1928
1945 1928 2816 1679 -662 -1056 -2139 -2958 -1508 702 1083 2349 3505 1492 41 -115 -1880 -2732
1961 -2732 -1385 -62 796 2615 3082 1541 593 56 -2204 -2952 -1379 -1023 120 2579 2808 1558 848
1978 848 -445 -2813 -2842 -1677 -1567 -8 1886 2141 1760 1440 -505 -1964 -1927 -2199 -2469 -188 1935 1593
1996 1593 2015 2328 210 -1531 -1670 -2337 -2253 -175 1293 1611 2720 2990 258 -406 -1114 -2537 -1847 -39
$$ packed form
1877b508K53l11k23K525J719L08Q95J22k536j356q56j039L96K432J089P04J772
1894C386j43k728j278j27j830M91J714J002J189J583o88j367k63k331j691P57
1910b324J708J4K228J623q18j434j39k274j642Q72O31N04K085J591p00j13n31
1927A281k963q73P18n12O29K910P89n66P32n20k787p15j64n04J149K412M27M85
1945A928Q88j137k341l94j083q19J450K210L81J266J156k013j451j56j765q52
1961b732J347J323Q58J819M67j541r48n37k260p48J573L56J143K459K29j250p10
1978H48j293k368k9J165J10J559J894K55l81l20j945j459L7k72k70K281K123l42
1996A593M22L13k118j741j39o67Q4K078J468L18J109K70k732o64p08j423O90J808
$$ plain form
2014 -39 338 1141 3013 2494 691 155 -1052 -2373 -2168 -620 44 1415 2551 1929 820 767 -1112 -3126
2032 -3126 -2023 -1079 -869 1245 2792 1655 1123 967 -1580 -2758 -2432 -1983 -1335 884 2132 1609 1822
2049 1822 879 -1243 -1933 -1941 -2514 -1161 1219 1711 1893 2213 1461 -662 -1277 -1967 -2748 -909 794 1250
2067 1250 2322 3284 1627 -105 -655 -1963 -2571 -620 157 590 2288 2797 1207 -131 -464 -1841 -2624
2084 -2624 -1542 -789 365 2459 2329 1134 1165 -558 -2616 -2194 -1462 -1468 -111 2053 2020 1368 1222 -370
2102 -370 -2152 -2002 -1836 -1601 111 1576 1864 1801 1639 -42 -1229 -1333 -1976 -2166 12 1516 1765 2440
2120 2440 2381 356 -800 -932 -2260 -1599 299 845 1162 2634 2283 340 1 -1339 -2338 -1922 -375
2137 -375 21 1078 2971 1912 472 67 -1288 -2551 -1984 -1041 -498 1183 2239 1445 1076 512 -1452
$$ packed form
2014c9L77Q03J872n19j803n36j207j321K05J548O64J371J136o22j109n3j879k014
2032c126J103R44K10K114J547j137n32j56k547j178L26M49O48K219J248n23K13
2049A822r43k122o90qn73J353K380M92J82L20p52k123o15o90p81J839J703M56
2067A250J072R62j657j732n50j308o08J951P77M33J698N09j590j338l33j377p83
2084b624J082P53J154K094j30j195L1j723k058M22P32oJ357K164l3o52j46j592
2102c70j782J50J66K35J712J465K88o3j62j681j187j04o43j90K178J504K49O75
2120B440n9k025j156j32j328O61J898N46L17J472l51j943l39j340r99M16J547
2137c75L96J057J893j059j440m05j355j263N67R43N43J681J056p94l69n64j964
$$ plain form
2154 -1452 -2439 -1701 -1655 -1068 906 1781 1577 1742 1341 -1433 -2273 -1684 -1760 -1161 1273 1902 1580 2249 789
2173 789 -869 -1100 -1492 -2275 -910 885 1330 2013 2637 1259 -324 -751 -1938 -2262 -446 258 1037 1781
2191 1781 2355 1010 294 -423 -2168 -2258 -1141 -534 345 2169 2308 846 250 -328 -2280 -2031 -1660 -1263
2209 -1263 -74 1926 1903 1278 1114 -353 -2518 -1630 -1508 -1661 104 1381 1326 1515 1427 -175 -1476 -1518
2227 -1518 -1467 -1859 -240 1458 1752 2343 1932 -53 -688 -968 -1855 -1687 125 903 1486 2341 1673 314
2245 314 -662 -1321 -2451 -1446 -94 46 1265 2000 1680 478 320 -1286 -2485 -1698 -1106 -162 962
2262 962 2229 1451 702 99 -1508 -2444 -1736 -1120 -650 1134 1693 1207 1204 851 -1366 -2297 -1434 -1528 -1040 1398
2282 1398 1507 1293 1899 1018 -1010 -1181 -1229 -1935 -797 878 1237 2069 2254 1006 -448 -1037 -1407 -1905
$$ packed form
2154a452r87P38M6N87J974Q75k04J65m01k774q40N89p6N99K434O29l22O69j460
2173G89j658k31l92p83J365J795M45O83O24j378j583m27j187l24J816P04P79P44
2191A781N74j345p16p17j745r0J117O07Q79J824J39j462n96n78j952K49L71L97
2209a263J189K000k3o25j64j467k165Q88J22j53J765J277n5J89q8j602j301m2
2227a518N1l92J619J698K94N91m11j985o35k80q87J68J812P78N83Q55o68j359
2245C14r76o59j130J005J352J40J219P35l20j202j58j606j199P87N92R44J124
2262I62J267p78p49o03j607r36P08O16M70J784N59m86ll53k217r31Q63r4M88K438
2282A398J09k14O06q81k028j71m8p06J138J675L59Q32J85j248j454n89l70m98
$$ plain form
2300 -1905 -397 493 937 1783 2316 914 -231 -699 -1756 -2239 -567 -243 59 1813 2144 713 408
2317 408 -467 -1856 -1890 -1253 -1051 91 1713 1548 878 925 -431 -1610 -1763 -1276 -1279 277 1746 1357 1304
2336 1304 1406 -200 -1422 -1281 -1477 -1601 474 1214 1485 1805 1465 -183 -715 -839 -1644 -1380 173 922
2354 922 1504 1903 1740 148 -287 -1112 -2273 -1440 9 402 1352 2184 1226 445 -112 -1344 -1992 -1676 -716
2373 -716 -179 875 2402 1323 659 -48 -1420 -2246 -1444 -1141 -656 1153 1681 1094 1188 560 -1013 -1910
2391 -1910 -1298 -1566 -604 1111 1533 1372 1499 711 -751 -1298 -1369 -1676 -173 935 844 1389 1969 626 -958
2410 -958 -841 -1116 -2026 -791 873 1182 1538 1920 778 197 -599 -1807 -1960 -591 156 395 1646 1600
2428 1600 967 299 -446 -1944 -2043 -787 -451 95 1701 1208 834 85 -505 -1522 -1680 -988 -1181 79
$$ packed form
2300a905J508Q90M44Q46N33j402j145m68j057m83J672L24L02J754L31j431l05
2317D08q75j389l4O37K02J142J622j65o70M7j356j179j53M87lJ556J469l89n3
2336A304J02j606j222J41j96j24K075P40K71L20l40j648n32j24q05K64J553P49
2354I22N82L99j63j592m35q25j161Q33J449L93R50Q32r58p81n57j232o48L16R60
2373g16N37J054J527j079o64p07j372q26Q02L03M85J809N28n87R4o28j573q97
2391a910O12k68R62J715M22j61J27p88j462n47p1l07J503J108r1N45N80j343j584
2410i58J17k75r10J235J664L09L56L82j142n81p96j208j53J369P47K39J251m6
2428A600o33o68p45j498r9J256L36N46J606m93l74p49n90j017j58O92j93J260
$$ plain form
2446 79 1723 1402 1055 942 -357 -1753 -1431 -1205 -1107 505 1452 1427 1653 1357 -205 -1033 -1068 -1482 -858 68
2466 68 738 982 1867 1399 -208 -831 -1068 -1829 -1353 210 537 1247 1592 1247 220 -310 -955 -2036 -1187
2485 -1187 -448 -403 1119 2077 927 168 251 -1175 -2193 -1191 -963 -131 977 1616 970 852 186 -1328
2503 -1328 -1614 -929 -1471 -612 1208 1424 1185 1406 877 -955 -1190 -1407 -1141 -341 818 1270 1241 1600 682
2522 682 -745 -1214 -1352 -1653 -628 865 865 1562 1612 413 -232 -701 -1497 -2114 -529 296 588 1507 1801
2541 1801 706 25 -708 -1643 -2017 -581 -401 82 1742 1625 361 548 -473 -1793 -1518 -733 -761 241
2559 241 1560 1225 999 798 -337 -1438 -1264 -1355 -779 544 1514 1148 1294 1361 -4 -1159 -726 -1391 -827
2578 -827 284 1198 953 1675 1385 64 -742 -895 -1695 -986 262 539 1045 1802 1240 224 -247 -941 -1588
$$ packed form
2446G9J644l21l47j13j299j396L22K26R8J612R47k5K26k96j562q28l5m14O24R26
2466F8O70K44Q85m68j607o23k37p61M76J563L27P10L45l45j027n30o45j081Q49
2485a187P39M5J522R58j150p59Q3j426j018J002K28Q32J108O39o46j18o66j514
2503a328k86O85n42Q59J820K16k39K21n29j832k35k17K66Q00J159M52k9L59r18
2522F82j427m69j38l01J025J493%O97N0j199o45m69p96o17J585Q25K92R19K94
2541A801j095o81p33r35l74J436J80M83J660j17j264J87j021j320K75P85k8J002
2559B41J319l35k26k01j135j101J74r1N76J323R70l66J46O7j365j155M33o65N64
2578h27J111R14k45P22k90j321q06j53q00P09J248K77N06P57n62j016m71o94o47
$$ plain form
2597 -1588 -1280 -196 367 1106 1906 893 193 -121 -1401 -2082 -926 -738 -274 1040 1588 1010 438 338
2615 338 -1096 -1619 -1099 -945 -311 935 1312 909 1040 400 -997 -1221 -616 -1275 -318 1226 1073 989 1499
2634 1499 519 -629 -723 -1410 -1297 -103 869 1019 1455 1862 150 -706 -572 -1323 -1530 -579 217 618 1463
2653 1463 1662 525 -313 -701 -1533 -1638 -635 -231 514 1466 1209 458 115 -402 -1667 -1653 -893 -531 448
2672 448 1425 1209 824 611 -341 -1437 -1238 -596 -659 535 1225 1096 1192 985 -445 -1126 -761 -1128 -909 703
2692 703 1095 1218 1442 1002 -374 -937 -1080 -1460 -811 373 821 1143 1725 881 -391 -681 -812 -1480 -1073
2711 -1073 -143 24 1051 1744 772 -122 -611 -1329 -1833 -948 -389 -39 967 1890 641 385 30 -1010
2729 -1010 -1768 -1362 -633 -142 1226 1345 1092 778 327 -1172 -907 -684 -928 -20 1099 1207 837 1355 101
$$ packed form
2597a588L08J084N63P39Q00j013p00l14j280o81J156J88M64J314N48n78n72j00
2615C38j434n23N20J54O34J246L77m03J31o40j397k24O05o59R57J544j53q4N10
2634A499r80j148r4o87J13J194R72J50M36M07j712q56J34p51k07R51P96M01Q45
2653A463J99j137q38l88q32j05J003M04P45R52k57p51l43n17j265J4P60L62R79
2672D48R77k16l85k13r52j096J99O42o3J194O90j29R6k07j430o81L65l67K19J612
2692G03L92J23K24m40j376n63j43l80O49J184M48L22N82q44j272k90j31o68M07
2711a073R30J67J027O93r72q94m89p18n04Q85N59L50J006R23j249k56l55j040
2729a010p58M06P29M91J368J19k53l14m51j499K65K23k44R08J119J08l70N18j254
$$ plain form
2748 101 -794 -898 -964 -1335 -32 889 922 1174 1166 501 -423 -906 -1409 -1431 -251 545 631 1178 1503 13 -557
2769 -557 -259 -1493 -1188 -674 -43 228 1366 875 186 158 -814 -1560 -1369 -614 -419 668 1549 828 355
2788 355 511 -649 -1384 -1051 -651 -358 744 1327 1165 1125 849 -685 -1111 -847 -746 -615 535 1404 960
2807 960 1349 704 -292 -1042 -611 -1474 -1127 333 825 753 1582 910 -27 -422 -1274 -1511 -759 490 608 991
2827 991 1263 631 -489 -333 -1069 -1313 -746 -177 142 907 1236 958 21 -401 -1317 -1491 -773 -636 299 837
2847 837 1252 833 799 566 -721 -1061 -688 -604 -106 1108 1447 991 941 -207 -860 -785 -757 -948 -200 1103
2867 1103 957 1332 1301 317 -822 -804 -1082 -1187 -246 584 651 954 1036 222 -275 -752 -1306 -1359 -265 -153 674
2888 674 1422 1366 230 -132 -893 -1451 -1180 -211 198 361 1054 763 585 268 -492 -1345 -1007 -687 -843 575
$$ packed form
2748A01q95j04o6l71J303R21L3K52qo65r24m83n03k2J180P96Q6N47L25j490n70
2769e57K98j234L05N14O31K71J138m91o89k8r72p46J91P55J95J087Q81p21m73
2788C55J56j160p35L33M00K93J102N83j62m0k76j534m26K64J01J31J150Q69m44
2807I60L89o45r96p50M31q63L47J460M92p2Q29o72r37l95q52k37P52J249J18L83
2827I91K72o32j120J56p36k44N67N69L19P65L29k78r37m22r16j74P18J37R35N38
2847H37M15m19l4k33j287l40L73Q4M98J214L39m56n0j148o53P5K8j91P48J303
2867A103j46L75l1r84j139J8k78j05R41Q30O7L03Q2q14m97m77n54n3J094J12Q27
2888F74P48n6j136l62p61n58K71R69M09J63O93k91j78l17p60q53L38L20j56J418
$$ plain form
2908 575 1442 787 619 569 -392 -1217 -554 -555 -452 725 815 1074 1023 754 -666 -1225 -1157 -1292 -623 824 597
2929 597 916 1252 995 -347 -1047 -996 -1261 -857 343 125 1045 1388 499 -61 -406 -1112 -1742 -823 36 242
2949 242 716 1221 648 75 -340 -1065 -1306 -879 -118 157 1287 1353 547 413 -203 -823 -977 -444 -787 190
2969 190 1196 1020 675 1125 -90 -1029 -777 -594 -576 87 782 966 946 911 187 -892 -820 -995 -1242 98
2989 98 419 599 872 1137 -76 -693 -403 -1181 -1187 -313 570 632 1060 1018 -284 -391 -695 -1158 -1208 -215 -257 559
3011 559 1214 1170 480 81 -570 -1158 -895 -355 -20 530 1389 910 674 439 -648 -1076 -560 -601 -355 590
3031 590 1240 645 1013 570 -425 -1146 -536 -954 -630 436 725 770 1269 489 -873 -1011 -975 -1103 -530 543
3051 543 410 876 1274 451 -380 -593 -1089 -1355 -695 128 301 1046 1014 323 68 -337 -976 -1336 -376 -76
$$ packed form
2908E75Q67o55j68n0r61q25O63jJ03J177R0K59n1k69j420n59O8j35O69J447k27
2929E97L19L36k57j342p00N1k65M04J200k18R20L43q89n60l45p06o30R19Q59K06
2949B42M74N05n73n73m15p25k41M27P61K75J130O6q06j34o16o20j54N33l43R77
2969A90J006j76l45M50j215r39K52J83J8O63O95J84k0l5p24j079P2j75k47J340
2989I8L21J80K73K65j213o17K90p78oQ74Q83O2M28m2j302j07l04m63n0R93m2Q16
3011E59O55m4o90l99o51n88K63N40L35N50Q59m79k36k35j087m28N16m1K46R45
3031E90O50n95L68m43r95p21O10m18L24J066K89M5M99p80j362j38L6j28N73J073
3051E43j33M66L98q23q31k13m96k66O60Q23J73P45l2o91k55m05o39l60R60L00
$$ plain form
3071 -76 167 872 1157 573 307 -164 -965 -918 -434 -468 -81 1127 1182 537 507 223 -1180 -658 -302 -847 336
3092 336 996 715 650 643 113 -1090 -791 -1230 -846 136 875 530 1271 1239 -396 -761 -624 -1123 -1034 -1 476
3113 476 514 1086 606 -281 -184 -750 -1230 -1066 -195 254 633 1407 712 123 322 -848 -1125 -652 -182 54
3133 54 629 998 679 391 191 -609 -844 -490 -393 -180 877 983 680 800 485 -634 -949 -648 -735 -576
3153 -576 637 928 901 583 274 -758 -988 -717 -1233 -146 516 663 738 1012 142 -261 -496 -1005 -1090 -568
3173 -568 545 440 870 988 401 -333 -394 -1055 -1140 -420 -169 395 1216 1143 255 -63 -1 -1121 -981 -498 -388
3194 -388 342 1051 1034 573 613 -145 -809 -618 -501 -616 286 1138 919 991 548 -372 -825 -723 -542 -531 243
3215 243 923 644 889 532 -170 -564 -937 -1109 -835 288 443 537 1141 688 -34 -477 -682 -1139 -869 -19
$$ packed form
3071g6K43P05K85n84k66m71q01M7M84l4L87J208N5o45l0k84j403N22L56n45J183
3092C36O60k81o5pn30j203K99m39L84R82P39l45P41l2j635l65J37m99Q9J033M77
3113D76L8N72m80q87R7n66m80J64Q71M49L79P74o95n89J99j170k77M73M70K36
3133E4N75L69l19k88k00q00k35L54R7K13J057J06l03J20l15j119l15L01q7J59
3153e76J213K91k7l18l09j032k30K71n16J087O62J47P5K74q70m03k35n09q5N22
3173e68J113j05M30J18n87p34o1o61q5P20K51N64Q21p3q88l18O2j120J40M83J10
3194c88P30P09j7m61M0p58o64J91J17j15R02Q52k19P2m43r20m53J02J81J1P74
3215B43O80k79K45l57p02l94l73j72K74J123J55R4O04m53p22m43k05m57K70Q50
$$ plain form
3235 -19 213 825 817 521 -24 2 -575 -1244 -927 -236 202 488 1095 597 118 19 -670 -732 -637 -441 53 829
3257 829 735 359 496 287 -510 -927 -662 -748 -305 732 952 278 687 279 -699 -1013 -684 -1034 -420 593
3277 593 625 669 948 258 -583 -635 -786 -692 -273 167 434 838 939 92 -634 -256 -715 -842 -160 150 312
3298 312 1095 896 178 159 -363 -932 -701 121 -291 110 1101 1077 354 125 -269 -942 -867 -272 -294 292 968
3319 968 636 461 500 -412 -815 -796 -894 -500 236 745 364 598 290 -230 -685 -688 -905 -831 386 185 257 760
3341 760 664 -211 -626 -639 -907 -276 173 406 610 808 817 116 -256 -640 -1207 -456 -134 31 900 848 569 299
3363 299 -283 -804 -610 -386 -362 -358 979 1133 335 153 -54 -338 -669 -448 -320 -141 605 879 511 493 321
3384 321 -738 -1113 -563 -543 -168 730 603 591 627 -127 -751 -842 -983 -1149 -170 604 592 564 985 158 -136 -417
$$ packed form
3235a9K32O12qk96n45K6n77o69L17O91M38K86O07m98m79r9o89o2R5J96M94P76
3257H29r4l76J37k09p97m17K65q6M43J037K20o74M09m08r78l14L29l50O14J013
3277E93L2M4K79o90q41n2j51R4M19M40K67M04J01q47p26L78m59j27O82L10J62
3298C12P83j99p18j9n22n69K31Q22m12M01R91k4p23k29l94o73P5N95k2N86O76
3319I68l32j75L9r12m03J9r8L94P36N09l81K34l08n20m55lk17P4J217k01P2N03
3341G60r6q75m15j3k68O31M49K33K04J98Rp01l72l84n67P51L22J65Q69n2k79k70
3363B99n82n21J94K24K4MJ337J54p98j82k07k84l31K21J28J79P46K74l68j8j72
3384C21j059l75N50K0L75Q98j27j2L6p54o24r1j41j66R79P74j2k8M21q27k94k81
$$ plain form
3406 -417 -826 -708 12 396 447 627 1146 389 -289 -611 -716 -732 -190 84 316 1232 781 362 -57 -282 -632
3427 -632 -729 -139 -143 730 907 453 551 -54 -292 -752 -292 -399 -572 70 853 357 362 304 -280 -689 -355 -633
3449 -633 -561 164 583 724 643 531 -273 -771 -604 -932 -524 232 718 745 944 661 -210 -76 -680 -925 -296
3470 -296 51 218 604 864 575 -11 -269 -821 -607 -528 -97 265 961 1167 592 314 -178 -1175 -858 -781 -250
3491 -250 -124 1072 780 698 349 -166 -758 -971 -459 -363 -161 148 382 594 372 88 -810 -511 -570 -920 183
3512 183 340 609 701 667 -95 -423 -601 -511 -661 -137 574 266 667 753 198 -254 -267 -903 -285 -78 120 167
3534 167 1293 595 329 130 -460 -961 -727 -179 -76 430 841 441 665 214 -494 -647 -626 -159 -411 500
3554 500 692 865 289 48 -232 -786 -596 -437 -578 14 576 553 604 521 -431 -667 -441 -798 -422 168 485
$$ packed form
3406d17m09J18P20L84N1J80N19p57o78l22j05j6N42K74K32R16m51m19m19k25l50
3427f32r7N90mQ73J77m54R8o05k38m60M60j07j73O42P83m96Nn8n84m09L34k78
3449f33P2P25M19J41q1j12q04m98J67l28M08P56M86K7J99k83q71J34o04k45O29
3470b96L47J67L86K60k89n86k58n52K14P9M31L62O96K06n75k78m92r97L17P7N31
3491b50J26J196k92q2l49n15n92k13N12R6K02L09K34K12k22k84q98K99n9l50J103
3512A83J57K69R2l4p62l28j78R0j50N24P11l08M01Q6n55m52j3o36O18K07J98M7
3534A67J126o98k66j99n90n01K34N48J03N06M11m00K24m51p08j53K1M67k52R11
3554E00J92J73n76k41k80n54J90J59j41N92N62k3N1q3r52k36K26l57L76N90L17
$$ plain form
3575 485 655 703 473 62 -432 -611 -722 -383 223 307 559 806 413 191 -356 -549 -562 -85 161 199 968
3596 968 831 381 233 130 -828 -617 -112 -295 177 807 848 312 585 -174 -559 -773 -538 -310 414 364 726
3617 726 612 210 26 -758 -890 -332 -767 -142 640 674 643 612 97 -596 -336 -533 -1098 -24 340 300 649
3638 649 368 4 -203 -193 -771 -613 -178 397 421 656 520 -23 -116 -716 -947 -473 51 297 290 998 205 211
3660 211 125 -542 -1049 -747 -567 -111 778 726 641 348 139 -559 -681 -200 -497 40 355 190 364 518 319
3681 319 -231 -593 -543 -515 -323 129 414 763 677 -22 -354 -401 -537 -677 -18 558 482 717 594 431 84 -179
3703 -179 -796 -436 -351 41 323 788 1029 241 63 -66 -679 -820 -124 -6 207 445 700 555 348 -322
3723 -322 -575 -789 -768 -215 -15 839 330 399 550 -43 -500 -502 -574 -414 -110 465 449 282 416 41 -412 -419 -635
$$ packed form
3575D85J70M8k30m11m94j79j11L39O06Q4K52K47l93k22n47j93j3M77K46L8P69
3596I68j37m50j48j03r58K11N05j83M72O30M1n36K73p59l85k14K35K28P24n0L62
3617G26j14m02j84p84j32N58m35O25P82L4l1l1n15o93K60j97n65J074L64m0L49
3638F49k81l64k07J0n78J58M35N75K4K35j36n43r3o00k31M74N24K46pP08p93O
3660B11q6o67n07L02J80M56Q89n2q5k93k09o98j22M81k97N37L15j65J74J54j99
3681C19n50l62N0K8J92M52K85L49q6o99l32m7j36j40O59N76p6K35j23j63l47k63
3703a79o17L60Q5L92K82M65K41p88j78j29o13j41O96J18K13K38K55j45k07o70
3723c22k53k14K1N53K00Q54n09O9J51n93m57kp2J60L04N75j6j67J34l75m53pk16
$$ plain form
3746 -635 -450 -279 603 392 850 522 -170 -149 -205 -719 -587 -68 156 320 538 626 -290 9 -114 -538 -335
3767 -335 153 75 486 710 617 164 -166 -458 -791 -683 -118 44 341 617 388 408 120 -344 -551 -308 -539
3788 -539 -259 321 412 300 441 -124 -292 -523 -557 -723 -397 569 205 464 601 160 -157 -232 -535 -500 -212
3809 -212 95 244 479 654 205 -68 -343 -471 -618 -144 -19 287 555 839 424 -164 -189 -545 -670 -306
3829 -306 2 179 437 598 401 175 -111 -658 -853 -11 -151 117 612 533 410 216 -342 -502 -705 -371
3849 -371 -340 264 164 578 569 358 145 -548 -333 -362 -532 153 558 720 560 298 -259 -347 -665 -491 -429 -247
3871 -247 232 84 814 512 -96 -302 -354 -299 -484 100 -50 499 782 347 -102 110 -470 -531 -309 13 139
3892 139 669 660 412 349 -66 -651 -530 -158 -450 -224 235 157 224 379 110 -418 -593 -265 -504 -137 550 487
$$ packed form
3746f35J85J71Q82k11M58l28o92K1n6n14J32N19K24J64K18Q8r16K99j23m24K03
3767c35M88p8M11K24r3m53l30k92l33J08N65J62K97K76k29K0k88m64k07K43k31
3788e39K80N80R1j12J41n65j68k31l4j66L26R66l64K59J37m41l17p5l03L5K88
3809b12L07J49K35J75m49k73k75j28j47M74J25L06K68K84m15n88k5l56j25L64
3829c06L08J77K58J61j97k26k86n47j95Q42j40K68M95p9j23j94n58j60k03L34
3849c71L1O04j00M14rk11k13o93K15k9j70O85M05J62j60k62n57q8l18J74O2J82
3871b47M79j48P30l02o08k06n2N5j85N84j50N49K83m35m49K12n80o1K22L22J26
3892A39N30rk48o3m15n85J21L72k92K26M59p8O7J55k69n28j75L28k39L67O87o3
$$ plain form
3914 487 580 553 -148 -494 -510 -269 -488 -371 322 349 584 576 245 -292 -379 -233 -505 -230 57 423 442 933 -133
3937 -133 -492 24 -694 -588 -11 -59 242 576 594 160 -123 -251 -622 -646 -261 152 -5 396 387 213 230 -303
3959 -303 -777 -384 -509 -350 151 739 187 323 404 -48 -642 -275 -188 -312 380 714 476 592 461 21 -441
3980 -441 -166 -519 -404 444 -10 374 357 451 -138 -65 -183 -596 -247 -143 226 545 610 144 129 -132 -471 -306
4002 -306 -339 -161 -59 326 501 102 -5 -17 -383 -671 -560 -216 194 457 338 255 453 20 -459 -389 -192
4023 -192 -338 64 365 559 401 427 162 -457 -141 -446 -376 167 768 386 435 276 178 -167 -475 -74 -605
4044 -605 -46 62 286 530 620 89 -219 -170 -550 -639 -8 -94 417 612 316 171 86 -266 -795 -533 -118 -55
4066 -55 170 643 484 182 227 -368 -944 -386 -164 -279 252 590 335 46 365 -166 -526 -496 -83 47 68
$$ packed form
3914D87R3k7p01l46j6K41k19J17O93K7K35ql31n37q7J46k72K75K87L66J9M91j066
3937a33l59N16p18J06N77m8L01L34J8m34k83j28l71k4L85M13j57M01rj74J7n33
3959c03m74L93j25J59N01N88n52J36Q1m52n94L67Q7j24O92L34k38J16j31m40m62
3980d41K75l53J15Q48m54L84j7R4n89P3j18m13L49J04L69L19O5m66j5k61l39J65
4002c06l3J78J02L85J75l99j07j2l66k88J11L44M10K63j19q3J98m33m79P0J97
4023a92j46M02L01J94j58K6k65o19L16l05P0N43O01l82M9j59r8l45l08M01n31
4044f05N59J08K24K44R0n31l08M9l80q9O31q6N11J95k96j45q5l52n29K62M15O3
4066e5K25M73j59l02M5n95n76N58K22j15N31L38k55k89L19n31l60L0M13J30K1
$$ plain form
4087 68 477 13 303 429 -208 -523 -221 -490 -413 -28 496 419 738 267 -280 201 -236 -751 -259 114 350
4108 350 151 527 118 -167 -82 -276 -767 -335 123 216 210 495 384 -36 180 -420 -708 2 160 -75 456
4129 456 370 274 185 -67 -248 -656 -339 -413 79 515 547 208 119 -26 -49 -431 -631 -208 265 269 290 251 437 137
4153 137 -323 -282 -498 -296 193 239 54 529 650 -133 -508 -362 -191 -283 71 140 93 531 553 -311 -131 -209
4175 -209 -205 -217 -364 -205 631 519 313 160 20 -438 -573 -694 -16 -168 168 578 391 96 29 -231 -628
4196 -628 -319 -351 -64 371 494 276 346 367 -310 -493 -343 -289 -83 109 289 402 274 257 -560 -100 -274 -565
4218 -565 -148 361 357 213 612 76 -233 -362 -573 -581 -119 174 116 461 363 331 -13 -114 -680 -277 -686 -235
4240 -235 255 267 550 19 42 -283 -445 -497 -197 -271 222 272 640 795 21 -61 -471 -330 -445 -128 118 562
$$ packed form
4087F8M09m64K90J26o37l15L02k69P7L85N24p7L19m71n47M81m37n15M92L73K36
4108C50j99L76m09k85Q5j94m91M32M58R3oK85j11m20K16o00k88P10J58k35N31
4129D56q6r6q9k52j81m08L17p4M92M36L2l39q9j45k3l82k00M23M73MK1l9J86l00
4153A37m60M1k16K02M89M6j85M75J21p83l75J46J71r2L54O9m7M38K2q64J80p8
4175b09Mj2j47J59Q36j12k06j53j40m58j35j21O78j52L36M10j87k95o7k60l97
4196f28L09l2K87M35J23k18P0K1o77j83J50N4K06J92J80J13j28j7q17M60j74k91
4218e65M17N09mj44L99n36l09j29k11qM62K93n8L45r8l2l44j01n66M03m09M51
4240b35M90J2K83n31K3l25j62n2L00p4M93N0L68J55p74q2m10J41j15L17K46M44
$$ plain form
4262 562 530 367 487 -151 -254 -231 -232 -341 214 138 358 479 446 -227 -253 -172 -361 -560 -61 150 164 453 334
4285 334 -105 -464 -226 -807 -520 -186 -151 63 422 173 85 -55 -117 -559 -400 -260 -140 101 637 343 92
4306 92 146 -236 -510 -372 -234 62 317 276 275 326 212 -360 -388 -332 -270 -325 197 525 500 518 230 -55 -357 -201
4330 -201 -242 -2 111 269 612 494 111 -30 -447 -546 -531 -4 430 176 316 209 -67 110 -276 -264 -546
4351 -546 -302 159 100 329 527 207 -58 -389 -297 -257 -120 -340 10 667 420 475 160 -133 -381 -508 -18
4372 -18 -286 96 474 342 160 365 -24 -180 -491 -372 -47 103 388 44 545 106 112 -440 -264 -438 -582
4393 -582 67 203 140 563 382 -43 -63 -440 -587 -345 -16 -39 379 411 473 -25 -17 -532 -541 -250 -21 134 404
4416 404 644 497 63 6 -352 -496 -216 -144 92 321 426 227 337 78 -148 -460 -279 -203 -90 243 469
$$ packed form
4262E62l2j63J20o38j03K3jj09N55p6K20J21l3o73k6Q1j89j99M99K11J4K89j19
4285C34m39l59K38n81K87L34L5K14L59k49q8j40o2m42J59J40J20K41N36k94k51
4306I2N4l82k74J38J38K96K55m1jN1j14n72k8N6O2n5N22L28k5J8k88k85l02J56
4330b01m1K40J13J58L43j18l83j41m17r9J5N27M34k54J40j07k76J77l86J2k82
4351e46K44M61n9K29J98l20k65l31R2M0J37k20L50O57k47N5l15k93k48j27M90
4372a8k68L82L78j32j82K05l89j56l11J19L25J50K85l44N01m39On52J76j74j44
4393e82O49J36o3M23j81m25k0l77j47K42L29k3M18L2O2m98Qn15rK91K29J55K70
4416D04K40j47m34n7l58j44K80P2K36K29J05j99J10k59k26l12J81P6J13L33K26
$$ plain form
4437 469 -1 338 97 -107 -353 -193 -422 -480 391 685 204 307 173 4 -514 -501 -240 154 230 144 333
4458 333 571 133 -352 -244 -214 -387 -104 140 -33 113 364 378 121 -8 -547 -291 -226 -110 30 790 252
4479 252 -47 56 11 -407 -261 103 -333 178 524 488 298 125 51 -266 -227 -170 -150 272 578 385 347 344 76
4502 76 -183 -280 -609 48 142 403 88 272 385 163 -327 -446 -378 -286 -145 -12 275 419 170 156 -291 -47
4524 -47 -434 -402 -58 37 116 586 297 168 123 -83 -444 -207 -5 18 172 255 152 149 -13 -565 -353 -398 26
4547 26 -96 203 487 -48 362 8 -149 -614 -188 -489 -170 546 200 570 503 50 -452 -234 -339 -721 -173
4568 -173 724 430 521 369 -24 -112 -109 -77 -352 -406 192 10 355 472 1 -57 143 -469 -255 294 61 418
4590 418 533 439 37 54 -122 -428 -72 144 2 180 335 302 293 36 -67 -399 -314 -159 -292 342 385 360 396
$$ packed form
4437D69m70L39k41k04k46J60k29n8Q71K94m81J03j34j69n18J3K61L94P6q6J89
4458C33K38m38m85J08L0j73K83K44j73J46K51J4k57j29n39K56O5J16J40P60n38
4479B52k99J03m5m18J46L64m36N11L46l6j90j73p4l17L9N7K0M22L06j93l8lk68
4502G6k59r7l29O57R4K61l15J84J13k22m90j19O8R2J41J33K87J44k49j4m47K44
4524d7l87L2L44R5P9M70k89j29m5k06l61K37K02K3J54Q3j03lj62n52K12m5M24
4547B6j22K99K84n35M10l54j57m65M26l01L19P16l46L70o7m53n02K18j05l82N48
4568a73Q97k94R1j52l93q8LL2k75n4N98j82L45J17m71n8K00o12K14N49k33L57
4590D18J15r4m02J7j76l06L56K16j42J78J55l3rk57j03l32Q5J55j33O34M3k5L6
$$ plain form
4613 396 373 37 -301 -417 28 -113 84 404 134 595 446 -26 -60 -87 -69 -120 -50 275 54 497 93 -193
4635 -193 -144 -159 -501 -118 196 96 -84 267 18 -400 -350 -247 -546 -113 343 -61 119 359 421 155 134 -174
4657 -174 -290 -75 -183 -29 171 467 302 374 -46 -529 -193 -94 -49 -96 172 403 31 307 155 -323 -303 -274
4679 -274 -670 54 315 39 192 449 57 -121 -424 -597 -357 -370 74 29 317 512 79 9 -47 -316 -381 76
4701 76 227 417 684 297 92 19 -12 -381 -464 66 -100 420 403 422 221 200 -349 -291 -117 -403 91 81 355
4724 355 638 285 -237 65 -496 -210 -261 -213 173 234 -4 376 159 232 -47 -55 -218 -304 82 77 121 281 442
4747 442 -46 -223 -262 -495 -375 4 -13 351 421 242 -236 -248 -195 -454 -170 221 322 417 616 463 32 -55
4769 -55 -208 -312 36 -171 -48 558 120 473 91 -149 -263 -610 -154 -249 -71 569 287 38 328 112 -271
$$ packed form
4613C96k3l36l38j16M45j41J97L20k70M61j49m72l4k7J8n1P0L25k21M43m04k86
4635a93M9j5l42L83L14j00j80L51k49m18N0J03k99M33M56m04J80K40O2k66k1l08
4657a74j16K15j08J54K00K96j65P2m20m83L36R9M5m7K68K31l72K76j52m78K0K9
4679b74l96P24K61k76J53K57l92j78l03j73K40j3M44m5K88J95m33p0n6k69o5M57
4701G6J51J90K67l87k05p3l1l69q3N30j66N20j7J9k01k1n49N8J74k86M94j0K74
4724C55K83l53n22L02n61K86n1M8L86O1k38L80k17P3k79qj63q6L86nM4J60J61
4747D42m88j77l9k33J20L79j7L64P0j79m78j2N3k59K84L91J01R5J99j53m31q7
4769e5j53j04L48k07J23O06m38L53l82k40j14l47M56r5J78O40k82k49K90k16l83
$$ plain form
4790 -271 -322 -111 25 118 255 136 454 498 22 -256 -6 -441 -387 40 131 116 352 216 -35 -244 -49 -160
4812 -160 -105 100 7 80 368 441 -135 -97 -418 -444 -231 -130 -115 30 441 247 -13 10 -229 -344 102 191 -54
4835 -54 134 300 346 0 220 -274 -480 -458 -88 -285 232 243 242 -13 47 -335 -398 -302 -458 166 121 212 479 438
4859 438 -3 -192 -295 -443 -419 76 63 56 257 489 248 -68 -103 -277 -526 8 -18 44 69 602 -20 -174 -51
4882 -51 -159 -615 29 28 -39 337 254 -2 -42 130 -339 -250 -108 -459 -69 379 340 -75 121 -72 -384 -324 -180
4905 -180 -593 -257 114 585 72 212 71 -235 -423 -190 -331 -167 149 252 410 299 -83 -158 -229 -489 -195
4926 -195 -128 -116 39 279 463 55 -68 -277 -394 -5 -104 -289 275 311 194 225 215 -113 -328 63 -193 -172
4948 -172 139 485 301 180 284 -428 -484 -188 -258 -204 312 98 59 86 146 -109 -214 -336 -123 -266 122 261
$$ packed form
4790b71n1K11J36R3J37j19L18M4m76k78K50m35N4M27R1j5K36j36k51k09J95j11
4812a60N5K05r3P3K88P3n76L8l21k6K13J01J5J45M11j94k60K3k39j15M46Q9k45
4835e4J88J66M6l46K20m94k06K2L70j97N17J1jk55O0l82o3R6j56O24m5R1K67m1
4859D38m41j89j03j48K4M95j3pK01K32k41l16l5j74k49N34k6O2K5N33o22j54J23
4882e1j08m56O44jo7L76q3k56m0J72m69Q9J42l51L90M48l9m15J96j93l12O0J44
4905a80m13L36L71M71n13J40j41l06j88K33j41J64L16J03J58j11l82p5p1k60K94
4926a95O7J2J55K40J84m08j23k09j17L89r9j85N64L6j17L1j0l28k15L91k56K1
4948a72L11L46j84j21J04p12n6K96p0N4N16k14l9K7O0k55j05j22K13j43L88J39
$$ plain form
4970 261 196 74 51 -252 -300 -324 -579 -313 14 233 -85 305 -66 -403 -49 -353 -368 -309 55 115 -54 390
4992 390 58 -79 -45 -446 -469 -132 -55 158 219 249 -1 -63 197 -528 -64 -153 6 -149 261 236 306 321 -51
5015 -51 -227 -394 -205 -300 57 358 192 315 418 -362 -181 -49 -465 -308 4 -73 242 33 -36 46 -111 -199
5037 -199 -424 -131 30 361 295 405 147 -194 159 -313 -358 -220 265 355 297 410 423 -8 -152 -41 -272 -287
5059 -287 8 12 -18 193 327 376 -113 148 -258 -70 -178 -207 264 172 138 -77 90 -318 -171 -227 -310 111 91
5082 91 114 274 145 -73 -123 -84 -96 -93 -19 306 39 147 270 -20 -153 -74 -7 -411 -123 139 -46 488 150
5105 150 -186 -69 -179 -359 -428 -312 -70 68 618 361 11 76 149 -114 -456 29 -224 146 194 530 203
5126 203 -148 219 13 -159 -261 49 142 300 143 384 191 10 -430 -353 -127 -133 -153 97 80 -33 307 51
$$ packed form
4970B61o5j22k3l03m8k4k55K66L27K19l18L90l71l37L54l04j5N9L64O0j69M44
4992C90l32j37L4m01k3L37P7K13O1L0k50o2K60p25M64q9J59j55M10k5P0J5l72
5015e1j76j67J89r5L57L01j66J23J03p80J81J32m16J57L12p7L15k09o9Q2j57q8
5037a99k25K93J61L31o6J10k58l41L53m72m5J38M85R0n8J13J3m31j44J11k31j5
5059b87K95Ml0K11J34M9m89K61m06J88j08k9M71r2l4k15J67m08J47n6q3M21k0
5082I1K3J60j29k18n0L9j2LP4L25k67J08J23k90j33P9O7m04K88K62j85N34l38
5105A50l36J17j10j80o9J16K42J38N50k57l50O5P3k63l42M85k53L70M8L36l27
5126B03l51L67k06j72j02L10R3J58j57K41j93j81m40P7K26ok0K50j7j13L40k56
$$ plain form
5148 51 -341 -359 -86 -542 37 451 156 505 257 -173 -322 59 9 -138 41 203 178 488 377 -20 -92 -390
5170 -390 -259 -225 70 -15 124 391 197 -63 -174 81 -709 -152 -242 -206 85 183 -5 253 286 125 -200 -317
5192 -317 28 -43 -267 67 345 175 -113 -59 -482 -219 -577 132 298 -38 144 368 67 -245 -170 -297 -359
$$ packed form
5148E1l92j8K73m56N79M14k95L49k48m30j49L81n0j47J79J62k5L10j11l97p2k98
5170c90J31L4K95q5J39K67j94k60j11K55p90N57r0L6K91R8j88K58L3j61l25j17
5192c17L45p1k24L34K78j70k88N4m23K63l58P09J66l36J82K24l01l12P5j27o2
$$ [...]
8191i1
##END NTUPLES=NMR FID
##END=
