##TITLE=1H_Pr 5-2
 CDCl3
 8 sc, 
 28.11.2024
##JCAMPDX= 6.0         $$ Bruker NMR JCAMP-DX V2.0
##DATA TYPE= NMR FID
##DATA CLASS= NTUPLES
##ORIGIN= UXNMR, Bruker Analytische Messtechnik GmbH
##OWNER= root
$$ XWIN-NMR		Version 3.5
$$ Thu Nov 28 15:43:32 2024 Russian Standard Time (UT+4h)  she@DPX200
##.OBSERVE FREQUENCY= 200.1315
##.OBSERVE NUCLEUS= ^1H
##.DELAY= (6, 6)
##.ACQUISITION MODE= SIMULTANEOUS
##.ACQUISITION SCHEME= undefined
##.AVERAGES= 8
##.DIGITISER RES= 18
##SPECTROMETER/DATA SYSTEM= spect
##.PULSE SEQUENCE= zg30
##.SOLVENT NAME= CD3CN
##.SHIFT REFERENCE= (INTERNAL, CD3CN, 0, 15.7039)
##AUDIT TRAIL= $$ (NUMBER, WHEN, WHO, WHERE, WHAT)
$$ ##TITLE= Audit trail, XWIN-NMR		Version 3.5
$$ ##JCAMPDX= 5.01
$$ ##ORIGIN= Bruker BioSpin GmbH
$$ ##OWNER= she
$$ F:/spectra/data/she/nmr/H-F/1/audita.txt
$$ ##AUDIT TRAIL=  $$ (NUMBER, WHEN, WHO, WHERE, WHAT)
(   1,<2024-11-28 15:42:10.76 +0400>,<she>,<DPX200>,
      <created by zg, POWCHK disabled, PULCHK disabled
       configuration hash MD5:
       00 E9 B6 7A A2 85 ED C7 34 08 36 98 17 FE 4E 26
       data hash MD5: 16K
       51 DB F9 F4 C3 BE 84 E5 34 BA 81 41 67 88 BA 3F>)
$$ ##END=
$$ 
$$ hash MD5
$$ BE 39 AA 16 99 54 70 01 62 35 31 E6 7F 00 26 1A
##$RELAX= 
##$RELAX= 
##$RELAX= 
##$RELAX= 
##$RELAX= 
##$RELAX= 
$$ Bruker specific parameters
$$ --------------------------
##$DU= <F:/spectra>
##$EXPNO= 1
##$NAME= <H-F>
##$PROCNO= 1
##$TYPE= <nmr>
##$USER= <she>
##$AMP= (0..31)
100 100 100 100 100 100 100 100 100 100 100 100 100 100 100 100 100 100 
100 100 100 100 100 100 100 100 100 100 100 100 100 100 
##$AQSEQ= 0
##$AQ_mod= 1
##$AUNM= <au_zg>
##$AUTOPOS= <>
##$BF1= 200.13
##$BF2= 200.13
##$BF3= 200.13
##$BF4= 200.13
##$BF5= 200.13
##$BF6= 200.13
##$BF7= 200.13
##$BF8= 200.13
##$BYTORDA= 1
##$CFDGTYP= 0
##$CFRGTYP= 5
##$CHEMSTR= <none>
##$CNST= (0..31)
1 1 145 1 1 1 1 1 1 1 1 1 1 1 1 1 1 1 1 1 1 1 1 1 1 1 1 1 1 1 1 1 
##$CPDPRG= <>
##$CPDPRG1= <>
##$CPDPRG2= <>
##$CPDPRG3= <>
##$CPDPRG4= <mlev>
##$CPDPRG5= <mlev>
##$CPDPRG6= <mlev>
##$CPDPRG7= <mlev>
##$CPDPRG8= <mlev>
##$CPDPRGB= <>
##$CPDPRGT= <>
##$D= (0..31)
0 1.2 0 0 0 0 0 0 0 0.06 0 0.03 0 0 0 0 0.0002 0 0 0 0 0 0 0 0 0 0 0 0 
0 0 0 
##$DATE= 1732794130
##$DBL= (0..7)
120 120 120 120 120 120 120 120 
##$DBP= (0..7)
150 150 150 150 150 150 150 150 
##$DBP07= 0
##$DBPNAM0= <>
##$DBPNAM1= <>
##$DBPNAM2= <>
##$DBPNAM3= <>
##$DBPNAM4= <>
##$DBPNAM5= <>
##$DBPNAM6= <>
##$DBPNAM7= <>
##$DBPOAL= (0..7)
0.5 0.5 0.5 0.5 0.5 0.5 0.5 0.5 
##$DBPOFFS= (0..7)
0 0 0 0 0 0 0 0 
##$DE= 6
##$DECBNUC= <off>
##$DECIM= 24
##$DECNUC= <off>
##$DECSTAT= 4
##$DIGMOD= 1
##$DIGTYP= 9
##$DL= (0..7)
0 120 120 120 120 120 120 120 
##$DP= (0..7)
150 150 150 150 150 150 150 150 
##$DP07= 0
##$DPNAME0= <>
##$DPNAME1= <>
##$DPNAME2= <>
##$DPNAME3= <>
##$DPNAME4= <>
##$DPNAME5= <>
##$DPNAME6= <>
##$DPNAME7= <>
##$DPOAL= (0..7)
0.5 0.5 0.5 0.5 0.5 0.5 0.5 0.5 
##$DPOFFS= (0..7)
0 0 0 0 0 0 0 0 
##$DQDMODE= 0
##$DR= 18
##$DS= 0
##$DSLIST= <SSSSSSSSSSSSSSS>
$$ [...]
##$SUBNAM2= <"">
##$SUBNAM3= <"">
##$SUBNAM4= <"">
##$SUBNAM5= <"">
##$SUBNAM6= <"">
##$SUBNAM7= <"">
##$SUBNAM8= <"">
##$SUBNAM9= <"">
##$SW= 24.0689530833862
##$SWIBOX= (0..15)
0 0 2 0 0 0 0 0 0 0 0 0 0 0 0 0 
##$SW_h= 4816.95568400771
##$TD= 16384
##$TD0= 1
##$TE= 0
##$TE2= 300
##$TE3= 300
##$TEG= 300
##$TL= (0..7)
0 120 120 120 120 120 120 120 
##$TP= (0..7)
150 150 150 150 150 150 150 150 
##$TP07= 0
##$TPNAME0= <>
##$TPNAME1= <>
##$TPNAME2= <>
##$TPNAME3= <>
##$TPNAME4= <>
##$TPNAME5= <>
##$TPNAME6= <>
##$TPNAME7= <>
##$TPOAL= (0..7)
0.5 0.5 0.5 0.5 0.5 0.5 0.5 0.5 
##$TPOFFS= (0..7)
0 0 0 0 0 0 0 0 
##$TUNHIN= 0
##$TUNHOUT= 0
##$TUNXOUT= 0
##$USERA1= <user>
##$USERA2= <user>
##$USERA3= <user>
##$USERA4= <user>
##$USERA5= <user>
##$V9= 5
##$VALIST= <valist>
##$VCLIST= <CCCCCCCCCCCCCCC>
##$VD= 0
##$VDLIST= <DDDDDDDDDDDDDDD>
##$VPLIST= <PPPPPPPPPPPPPPP>
##$VTLIST= <TTTTTTTTTTTTTTT>
##$WBST= 1024
##$WBSW= 4
##$XGAIN= (0..3)
0 0 0 0 
##$XL= 0
##$YL= 0
##$YMAX_a= 29788
##$YMIN_a= -26698
##$ZGOPTNS= <>
##$ZL1= 120
##$ZL2= 120
##$ZL3= 120
##$ZL4= 120
##$ABSF1= 10
##$ABSF2= 0
##$ABSG= 5
##$ABSL= 3
##$ALPHA= 0
##$AQORDER= 0
##$ASSFAC= 0
##$ASSFACI= 0
##$ASSFACX= 0
##$ASSWID= 0
##$AUNMP= <proc_1d>
##$AZFE= 0.1
##$AZFW= 0.1
##$BCFW= 1
##$BC_mod= 2
##$BYTORDP= 1
##$COROFFS= 0
##$CY= 11.3945322036743
##$DATMOD= 1
##$DC= 2
##$DFILT= <>
##$DTYPP= 0
##$F1P= 15.6554695791079
##$F2P= 12.8336369535428
##$FCOR= 0.5
##$FTSIZE= 0
##$FT_mod= 4
##$GAMMA= 1
##$GB= 0.15
##$INTBC= 1
##$INTSCL= 1
##$ISEN= 128
##$LB= 0.24
##$LEV0= 0
##$LPBIN= 0
##$MAXI= 10000
##$MC2= 0
##$MEAN= 0
##$ME_mod= 0
##$MI= 1.114404
##$NCOEF= 0
##$NC_proc= 0
##$NLEV= 6
##$NOISF1= 3.799351
##$NOISF2= 2.8
##$NSP= 1
##$NTH_PI= 0
##$NZP= 0
##$OFFSET= 15.70392
##$PC= 1
##$PHC0= -26730.39
##$PHC1= 31.78744
##$PH_mod= 1
##$PKNL= yes
##$PPARMOD= 0
##$PSCAL= 0
##$PSIGN= 0
##$REVERSE= no
##$SF= 200.130013532006
##$SI= 16384
##$SIGF1= 3
##$SIGF2= 2
##$SINO= 400
##$SIOLD= 16384
##$SREGLST= <1H.CDCl3>
##$SSB= 0
##$STSI= 0
##$STSR= 0
##$SW_p= 3612.71676300578
##$SYMM= 0
##$S_DEV= 0
##$TDeff= 0
##$TDoff= 0
##$TI= <>
##$TILT= no
##$TM1= 0
##$TM2= 0
##$TOPLEV= 0
##$USERP1= <user>
##$USERP2= <user>
##$USERP3= <user>
##$USERP4= <user>
##$USERP5= <user>
##$WDW= 1
##$XDIM= 8192
##$YMAX_p= 0
##$YMIN_p= 0
$$ End of Bruker specific parameters
$$ ---------------------------------
##NTUPLES= NMR FID
##VAR_NAME=  TIME,          FID/REAL,        FID/IMAG
##SYMBOL=    X,             R,               I
##VAR_TYPE=  INDEPENDENT,   DEPENDENT,       DEPENDENT
##VAR_FORM=  AFFN,          ASDF,            ASDF
##VAR_DIM=   8192,          8192,            8192
##UNITS=     SECONDS,       ARBITRARY UNITS, ARBITRARY UNITS
##FACTOR=    0.0002076,     1,               1
##FIRST=     0,             0,               0
##LAST=      1.7004516,     0,               0
##MIN=       0,             -26698,          0
##MAX=       1.7004516,     29788,           0
$$ Real data points
##PAGE= N=1
##DATA TABLE= (X++(R..R)), XYDATA
0 0 0 0 0 0 0 0 0 0 0 0 0 0 0 0 0 3 -8 8 -8 8 -8 9 -14 16 -16 19 -23 25 -28 32 -36 42 -46 51 -59 66 -73 80
38 80 -88 99 -111 122 -135 149 -165 182 -203 227 -252 282 -316 358 -408 470 -547 652 -797 1012
58 1012 -1378 2168 -11394 25173 12535 -24743 1751 12914 -5927 -6828 3356 -1154 4258 1143
72 1143 -10725 3619 14469 -7469 -5057 15614 -658 -13208 11547 9528 -12475 2578 14919
85 14919 -5360 -2524 12489 1046 -2156 8954 -1379 -2800 12862 2697 -8720 11629 11656
98 11656 -10358 2114 17566 -2935 -5840 11692 3512 -4825 7210 3905 -1473 9268 2729
111 2729 -7857 9227 10794 -10329 48 15733 -5628 -9308 14644 6477 -11066 3645 8544
124 8544 -5300 -300 5341 -3172 1410 3757 -7677 717 10985 -6621 -8828 11887 778 -14830
138 -14830 4487 8600 -11691 -4250 8580 -5051 -6813 4618 -2657 -5606 3215 -4663 -8652 5760
152 5760 -145 -13708 2204 7212 -11474 -6146 8382 -4636 -9869 3632 -1623 -8764 1562
165 1562 -465 -7985 1830 1031 -10638 67 6420 -10207 -6372 8472 -4088 -10921 5868 3179
179 3179 -9776 -419 4568 -5623 -1755 2647 -5247 -1148 4351 -5867 -2835 8768 -2788 -8724
193 -8724 7931 4250 -10298 1598 8967 -5839 -3210 8212 -221 -3186 5921 245 -3184 6216
207 6216 1394 -5131 6392 5359 -6908 3055 10501 -3627 -3310 9854 1041 -4726 6586 3626
221 3626 -3196 4863 4043 -2999 4871 6002 -4926 2127 9260 -3008 -3387 10020 1991 -6014 6383
236 6383 6046 -4927 2120 6263 -2536 273 5225 -2585 -88 6585 -1894 -2926 7857 614 -7568
251 -7568 4845 5421 -6906 -605 6809 -3633 -3632 5321 -843 -4100 3165 -130 -4449 3230 57
266 57 -6589 2358 2967 -7654 -1169 6646 -5155 -6277 5292 -947 -7497 2015 920 -6613 64
281 64 1558 -5829 -770 2522 -6339 -3177 4457 -4437 -6449 4288 -469 -8370 1350 2093 -6727 -1628
297 -1628 3040 -4767 -2777 2803 -4051 -3613 4078 -2640 -5768 4000 737 -7059 1829 4449 -6364
312 -6364 -2255 5561 -2805 -4120 4543 -152 -3830 3069 679 -3685 3290 2253 -4985 2074 5311
327 5311 -3995 -746 7235 -1409 -4112 5682 2370 -3859 3082 3609 -2826 2393 4197 -2289 1385
342 1385 5480 -2504 -698 7075 -28 -3404 6339 3601 -4491 2928 5609 -2760 372 5300 -1145
357 -1145 -543 4922 60 -1436 5198 762 -3229 4891 3423 -4725 1949 5842 -3587 -1460 5813
372 5813 -1006 -2793 4275 663 -3459 3106 1424 -3913 2308 2797 -4704 425 4660 -3845 -2909 4853
388 4853 -1505 -5366 3036 1099 -5050 768 1754 -4374 -983 2551 -3853 -1731 3068 -3801 -3965 3509
404 3509 -1458 -5964 1938 1365 -6144 -325 2824 -4468 -3106 2493 -3075 -3785 2287 -2032 -4277 2589
420 2589 -619 -5765 1278 1858 -5869 -929 3479 -3989 -3141 3933 -1342 -4145 1810 167 -3555 1443
436 1443 1046 -4050 904 2480 -3986 -296 4305 -2491 -3468 4351 361 -4035 3128 2950 -3743 854
452 854 3051 -2226 504 3909 -1725 -614 4387 -729 -2149 4854 1456 -3634 3494 4463 -2907 713
468 713 5275 -1395 -1427 4729 531 -1352 4312 725 -1707 3993 2680 -2700 2986 4362 -2845 239
484 239 5227 -746 -2080 4872 1018 -2591 3263 2114 -2261 1966 2688 -2997 935 3941 -2505 -787
500 -787 4501 -1050 -3338 3725 1095 -3681 1512 2323 -3322 56 2518 -2561 -1039 2689 -2464 -1974
516 -1974 2692 -1563 -4028 2734 683 -5057 613 2730 -4442 -2098 2448 -2501 -3246 1702 -1294
531 -1294 -3294 1083 -1018 -4191 1042 684 -4588 -283 2276 -4352 -2264 2945 -2210 -3820 2162
546 2162 -194 -4362 932 940 -3587 -40 1494 -3592 -726 2833 -3054 -2450 3334 -930 -3855 2383
562 2383 1271 -3774 912 2650 -3124 -311 2556 -1566 -1090 2925 -1032 -1748 3498 256 -2752 2659
578 2659 2582 -3292 1149 4119 -1688 -739 3952 -173 -1599 3437 1029 -1780 2707 1790 -1818 2484
594 2484 2853 -2094 757 4054 -1043 -637 4810 769 -1946 3381 2346 -2109 1916 3051 -1793 1010
610 1010 3118 -1749 -77 3896 -945 -1574 3891 646 -2794 2735 2601 -2834 613 3106 -1884 -616
626 -616 2809 -1413 -1435 3050 -820 -2447 2618 464 -3376 1090 2129 -3545 -996 3021 -2449 -2538
642 -2538 2185 -531 -2891 992 -618 -3236 563 225 -3385 193 1617 -3677 -1377 2495 -2620
657 -2620 -3268 2232 -703 -4076 835 928 -3832 -389 1359 -2933 -1256 1434 -2526 -1893 2066 -2109
673 -2109 -3198 1887 189 -4014 849 1472 -3257 -617 2064 -2030 -1637 2133 -1220 -2043 2271 -322
689 -322 -2700 2066 1172 -2898 881 2802 -3009 -969 3490 -754 -1859 3045 497 -2229 1986 1392
705 1392 -1760 1743 2152 -1779 1107 3252 -1578 -425 4012 -233 -1826 3365 1590 -1861 1952
720 1952 2649 -1707 1158 2736 -607 409 3256 -637 -254 3433 297 -1650 3074 2314 -2506 1521
736 1521 2853 -1692 -192 3134 -622 -1000 2683 -49 -1288 2451 769 -2374 1741 2056 -2670 517
752 517 2907 -2268 -1438 2803 -725 -2366 2026 370 -2397 802 1039 -2292 -8 1425 -2982 -726
768 -726 2247 -1996 -1890 2203 -978 -3613 1248 682 -2993 -381 1308 -2695 -1380 1432 -1777 -1615
784 -1615 1292 -1655 -2302 1641 -570 -3043 568 493 -3319 -170 1556 -2373 -2066 1680 -1647 -2171
800 -2171 1731 -385 -2657 1009 48 -2969 456 1519 -2726 -568 2110 -1747 -1524 2120 15 -2238
816 -2238 1458 847 -2248 1256 1230 -1764 700 1953 -1539 -495 2857 -314 -1285 2921 1076 -2408
832 -2408 1461 2296 -1639 765 2289 -656 354 2579 -97 -556 2954 241 -1277 2795 1455 -1651
848 -1651 1799 2382 -1287 304 3136 -725 -719 2794 75 -1021 2511 1334 -1360 1659 1374 -1474
864 -1474 835 2517 -1485 -268 2663 -702 -1406 2343 754 -1972 1645 1085 -2099 255 1532 -1547
880 -1547 -461 1873 -1637 -1421 2259 -621 -1969 1350 632 -2771 313 1432 -2225 -597 1050 -1403
896 -1403 -1174 1109 -1043 -1719 1453 -631 -2747 766 280 -3020 -253 1364 -2348 -1475 1736 -1426
912 -1426 -2268 1306 -464 -2360 621 -69 -2754 381 894 -2740 -705 1467 -1969 -1494 1355 -877
928 -877 -1830 1426 34 -2428 630 961 -1681 137 1502 -1877 -702 1964 -1119 -1651 2105 71
944 71 -1849 1549 1267 -1841 397 2147 -991 -350 1695 -504 -645 2539 109 -1127 2066 758
960 758 -1806 1588 2006 -1569 494 2514 -793 -297 2638 258 -839 2259 1027 -826 1574 1483
976 1483 -980 787 2118 -1069 173 2403 -347 -662 2569 69 -1098 1800 1290 -1420 1117 1708
992 1708 -1239 208 1859 -869 -687 2150 -97 -1537 1299 332 -1907 916 1471 -1799 -141 1714
1008 1714 -1234 -719 1397 -861 -1025 1388 -572 -1892 882 704 -2424 420 1287 -2311 -795 1842
1024 1842 -1489 -1668 1103 -746 -2193 518 -145 -2290 231 536 -2187 -658 1326 -2051 -863 1627
1040 1627 -1348 -2121 1394 177 -2628 653 708 -2066 -137 952 -1626 -1129 1233 -1072 -1868 1525
1056 1525 -384 -1754 999 438 -2148 204 1499 -1773 -407 1729 -503 -1203 1742 -365 -1376
1071 -1376 1378 380 -1368 1275 1358 -1350 591 2187 -1041 -341 2189 -170 -785 1727 547 -1393
1087 -1393 1389 1388 -1097 924 1823 -790 498 2043 -509 -585 2481 282 -987 1864 1305 -1103 1083
1104 1083 1704 -735 260 2210 -678 -269 2114 -202 -914 1720 705 -1166 1441 1328 -1470 331
1120 331 1724 -1212 -445 1791 -314 -841 1582 -88 -1655 1428 707 -1913 761 1079 -1836 -267
1136 -267 1880 -1010 -1105 1339 -533 -1651 709 -155 -1772 636 412 -1779 -353 817 -1774 -817
1152 -817 1087 -1049 -1500 1309 -392 -2316 681 273 -2060 -71 1423 -1918 -1297 1161 -1192 -1513
1168 -1513 1222 -580 -2133 794 34 -1956 269 1259 -1929 -675 1418 -1225 -1036 1389 -440 -1171
1184 -1171 1021 340 -1683 890 692 -1575 372 971 -1000 -260 2163 -435 -928 1419 142 -1427
1200 -1427 1122 835 -1020 783 1370 -915 20 2096 -604 -531 1788 164 -890 1625 655 -1321
1216 -1321 1205 1383 -1283 204 1846 -488 -139 1660 -67 -455 2042 552 -1048 1349 969 -987
1232 -987 889 2121 -952 -201 1802 -323 -762 1666 281 -985 1234 702 -1044 759 1453 -1134
1248 -1134 -18 1764 -1023 -373 1715 -559 -1626 1398 193 -1767 900 586 -1566 -182 1043
1263 1043 -1543 -734 1111 -1001 -1376 1197 -599 -2060 1034 129 -1558 35 821 -1475 -649 824
1279 824 -1044 -1485 891 -573 -1764 783 -64 -1788 417 345 -1875 -207 718 -1757 -1156 1320 -1004
1296 -1004 -1434 850 139 -1461 404 474 -1509 245 833 -1673 -408 1399 -998 -1061 1158 -239 -1358
1313 -1358 950 542 -1382 776 896 -1343 -7 1665 -791 -165 1668 -416 -965 1470 447 -1377
1329 -1377 1091 1233 -741 597 1783 -740 34 1711 -199 -624 1674 542 -965 1174 842 -1087
1345 -1087 946 1592 -870 233 1853 -389 -106 1697 492 -830 1363 787 -817 809 979 -844
1361 -844 526 1209 -896 25 1675 -494 -648 1428 204 -1123 1059 1008 -1201 447 1384 -1202 -194
1378 -194 1574 -362 -802 1372 -386 -1030 1451 394 -1231 557 930 -1523 -229 954 -786 -821
1394 -821 1353 -500 -1423 574 -98 -1735 575 436 -1686 -252 697 -1497 -897 1226 -897 -1402 893
1411 893 -243 -1613 636 327 -1799 87 626 -1830 -252 1022 -1518 -1050 1020 -473 -1490 1234
1427 1234 237 -1634 353 787 -1416 -185 1015 -870 -469 1519 -322 -855 1395 17 -1530 1078
1443 1078 552 -1050 535 1449 -988 -94 1350 -232 -731 1184 107 -868 1381 596 -918 676
1459 676 1505 -581 305 1738 -570 -31 1534 -315 -894 1265 672 -655 925 1001 -882 486 1507
1476 1507 -734 -312 1376 -606 -555 1709 433 -643 1066 842 -1164 484 1188 -793 135 1057 -671
1493 -671 -663 1573 -70 -653 1219 336 -1225 856 827 -1502 340 1108 -868 -594 1048 -486 -1030 931
1511 931 0 -1344 668 110 -1338 -30 783 -1306 -496 862 -755 -1041 586 -148 -1271 511 408
1528 408 -1312 -237 384 -1595 -334 667 -1278 -641 923 -593 -1096 859 -10 -1301 324 -115
1544 -115 -1438 -352 551 -1289 -1020 716 -474 -1012 1380 -75 -1179 322 -24 -1488 -234 551
1560 551 -1104 -157 1062 -924 -879 1328 136 -946 1038 469 -971 240 757 -814 543 976 -441
1577 -441 -446 1276 -61 -439 1410 168 -894 889 1295 -852 596 1103 -666 19 1469 -394 -236
1594 -236 1562 -37 -411 870 818 -977 643 1247 -575 343 1309 -535 -163 1529 -219 -575 762
1611 762 437 -928 635 875 -1206 189 946 -960 31 1007 -535 -831 1007 254 -1112 742 467
1628 467 -1094 200 740 -955 -278 689 -849 -938 1185 -340 -856 567 124 -1214 179 167 -1172
1645 -1172 -430 622 -895 -620 679 -654 -1058 508 -300 -1141 253 337 -1518 -307 558 -1021 -581
1662 -581 303 -582 -793 860 -340 -1325 147 -48 -1377 -53 612 -970 -158 977 -725 -925 895
1679 895 -326 -1026 827 493 -1240 551 323 -838 78 747 -809 -17 1097 -490 -582 1173 153
1696 153 -844 815 640 -1210 540 1028 -521 192 1162 -160 -50 1027 195 -369 984 523 -536
1713 -536 496 968 -493 28 1108 -512 -142 1446 197 -500 1043 417 -787 799 475 -703 652
1730 652 1140 -324 -8 1290 -297 -533 1134 263 -379 801 594 -854 469 675 -525 -196 885
1747 885 -548 -571 1182 -44 -623 801 377 -951 374 524 -677 -66 766 -1020 -366 950 -814
1764 -814 -925 566 -67 -1246 375 -3 -1064 -171 531 -1022 -264 632 -881 -943 464 -518 -1201 233
1782 233 -171 -1160 10 -1 -1136 -141 355 -875 -767 770 -680 -1026 712 -58 -817 254 588 -670
1800 -670 -212 450 -1031 -354 845 -374 -524 678 -137 -561 565 325 -1039 172 896 -563 -449
1817 -449 1240 -447 -535 746 -150 -175 1198 356 -622 653 534 -655 205 961 -514 -21 1078 21
1835 21 -100 1003 243 -283 991 649 -476 402 879 -561 91 1342 -431 -290 733 216 -703 491
1853 491 672 -647 660 638 -745 241 787 -181 -202 555 -105 -772 708 389 -641 366 645 -724
1871 -724 368 297 -703 -180 958 -434 -352 579 -177 -766 691 405 -775 117 525 -885 -280 688
1889 688 -680 -254 353 -495 -1184 223 -138 -944 -59 289 -889 44 339 -855 -439 568 -350 -669
1907 -669 294 -381 -593 135 -36 -1000 112 342 -886 -510 598 -603 -424 705 -356 -851 685 177
1925 177 -732 350 479 -770 -196 673 -781 -405 530 -578 -376 406 203 -631 303 377 -694 195 467
1944 467 -607 -146 846 -325 49 920 -39 -262 1024 466 -509 321 963 -385 259 954 -455 -140
1962 -140 1088 -222 -138 551 388 -627 833 1063 -564 109 914 -188 -43 817 -69 -304 947 263
1980 263 -466 710 462 -587 95 705 -428 117 728 -384 283 818 -37 -311 606 245 -523 398 258
1999 258 -607 17 795 -538 -341 436 -459 -553 726 33 -580 344 198 -659 405 549 -620 -185 615
2018 615 -384 -602 500 128 -864 373 23 -1108 3 459 -889 -12 537 -679 -426 198 -532 -587
2036 -587 385 -53 -791 30 98 -989 -37 631 -561 -669 700 -232 -401 611 113 -673 273 163 -858
2055 -858 10 333 -364 74 720 -336 -505 551 -135 -679 792 263 -640 140 518 -125 19 738 -181
2074 -181 -336 677 -46 -421 793 177 -552 637 609 -694 382 901 -377 142 962 -118 -287 597
2092 597 226 -543 748 601 -836 433 471 -264 -58 354 -281 158 1071 -276 -518 575 253 -268 559
2111 559 665 -261 -33 738 -170 -139 772 -221 -429 516 -216 -426 204 310 -722 -124 542 -524 -334 743
2131 743 -688 -457 377 -75 -560 391 19 -704 286 391 -584 -187 313 -893 -446 143 -340 -740 536
2150 536 -139 -541 47 105 -623 -73 667 -879 -280 458 -690 -621 231 -235 -596 66 -97 -618 367 534
2170 534 -909 -277 579 -682 -382 350 -209 -684 469 3 -843 -4 227 -602 -47 559 -614 -187 597
2189 597 -63 -481 434 208 -448 332 469 -294 37 580 -119 -16 712 73 -34 336 238 -354 460 272
2209 272 -615 367 313 -18 1 1028 -249 54 1146 18 -426 674 264 -322 530 368 -461 369 418
2228 418 -349 95 824 -133 164 652 -61 -460 633 218 -533 -5 182 -285 279 547 -189 -265 453 -176
2248 -176 -555 465 -153 -661 313 314 -479 78 301 -765 -447 697 -126 -525 541 -192 -425 309 273 -522
2268 -522 15 297 -622 35 445 -527 -692 343 -237 -713 178 24 -717 -35 42 -731 -154 333 -568 -650
2288 -650 449 -163 -596 175 -325 -458 12 213 -788 -197 192 -368 -198 548 -297 -488 481 -47 -617
2307 -617 134 146 -293 40 541 -397 -79 330 -236 -257 608 127 -253 284 288 -741 484 424 -475 269 363
2328 363 -206 126 577 -272 -62 760 434 -597 374 279 -362 184 350 -238 -52 648 -123 90 379 144
2348 144 -337 466 34 -144 569 78 33 -381 475 -124 -137 476 -25 -523 210 363 -531 343 377 -420 -89
2369 -89 381 -520 -379 784 -275 -713 453 -43 -418 387 35 -698 111 275 -502 -48 214 -371 -115
2388 -115 536 -164 -632 114 -221 -603 368 58 -545 -85 135 -618 -257 56 -505 -401 334 104 -457 129
2408 129 554 -730 -315 321 -396 -418 312 -587 -283 418 -287 -619 190 108 -783 239 182 -761 -78 521
2428 521 -228 -545 347 -301 -451 468 59 -260 504 192 -32 -64 396 -356 -184 735 -410 3 347 134
2448 134 -536 279 432 -623 201 363 -477 98 497 172 -191 471 -300 28 318 304 -583 323 509 -540
2468 -540 62 590 -315 -35 455 -311 103 671 219 -362 634 742 -306 301 549 -39 166 702 -206 58
2488 58 361 31 -207 273 45 -404 319 483 -276 186 288 -277 -290 508 -134 -158 190 23 -621 -10 190
2509 190 -331 120 106 49 -346 669 -448 -294 279 11 -322 -101 -69 -414 75 196 -712 -431 134 -293
2529 -293 -363 503 129 -562 -9 -353 -472 145 383 -437 -19 80 -223 -14 328 -253 -29 506 -195 -469 39
2550 39 348 -756 -303 280 -359 178 400 -108 -288 712 215 -460 357 -181 -462 137 533 -317 -163 364
2570 364 -132 -350 97 176 -67 307 83 -299 308 171 -319 198 827 -137 -22 415 -307 -119 795 107
2590 107 -300 288 176 -47 245 -85 -306 180 703 -193 22 784 15 -219 530 426 -267 410 208 -167
2610 -167 -178 489 33 -17 575 -84 -290 367 -265 -414 40 350 -384 -6 393 8 -5 94 -262 -419 268
2631 268 -179 -404 153 248 -266 -65 202 -163 -150 137 -288 -9 481 -185 -278 290 105 -324 67 344 -294
2652 -294 -231 -46 -423 17 190 -178 -344 217 -146 -346 304 -278 -657 136 51 -402 63 222 -557 -39 -176
2673 -176 179 69 370 165 -340 82 246 -351 -177 343 -292 -129 99 -28 -309 407 218 -412 188 121
2693 121 -205 91 181 65 229 671 -175 -30 586 275 -19 386 72 -181 365 398 -251 469 759 -6 -214
2714 -214 601 3 -152 138 86 -348 192 622 -222 441 464 -168 -326 425 -185 -27 324 -154 -85 235 -67
2735 -67 -128 238 413 -306 -229 516 -152 -175 197 -35 -6 288 157 -315 69 -152 -177 -256 222 25 -60 469 -264
2758 -264 -393 85 -84 -159 455 -87 -200 82 82 -316 -237 266 -118 -283 401 -33 -570 254 339 -503 -27 305
2780 305 -250 -81 104 234 -97 451 222 -210 428 325 -224 359 -244 -245 42 64 -402 -181 305 -236 -191
2801 -191 552 127 -561 97 172 -530 -204 31 -95 237 328 35 -289 193 458 -340 516 -9 -207 246 27
2822 27 -206 115 312 -183 139 492 -22 -286 410 214 -99 191 378 -115 124 454 -139 119 302 279 -49
2843 -49 186 158 -74 474 106 -193 67 350 -378 -105 288 -188 -342 407 -113 -422 186 -247 -328 259 114
2864 114 -226 -37 12 -149 -434 282 -190 -203 44 102 -502 157 339 -400 -88 251 -418 -77 125 -366 -313
2885 -313 347 -12 -256 -273 49 -585 44 114 -271 -203 -259 -265 -257 219 -412 -299 175 -248 -142 148 -245 -237 -293 154
2909 154 -219 -145 296 -98 -188 573 -104 -327 -88 14 -576 311 119 -305 -361 89 38 -564 288 -392 -372 177
2931 177 158 -216 490 156 -469 120 135 76 -189 472 43 -122 236 22 -274 568 178 -385 171 480 24
2952 24 -95 247 -214 -180 477 -96 -418 425 341 -268 43 110 245 68 260 176 -122 233 54 107 298 -229
2974 -229 -212 256 123 -118 222 497 -388 142 471 106 -271 605 196 0 231 129 86 -140 136 -464 83
2995 83 342 -75 -2 373 -209 -227 123 28 -396 -181 380 -457 -4 293 -68 -266 11 31 -311 245 115 -403
3017 -403 95 198 -549 -72 101 -335 -307 203 115 55 -38 -109 -531 84 98 -161 7 28 -162 -291 -1 -460
3039 -460 -344 208 -117 -254 -91 4 -268 306 42 -343 -19 281 -445 -202 438 308 -119 107 -46 -251
3059 -251 137 10 -445 2 252 -372 114 91 -55 175 191 -187 -92 389 442 -182 80 -109 51 -214 198
3080 198 -185 -139 333 3 -153 405 314 -188 665 349 52 -209 355 -183 -60 706 -168 -111 279 169 -187
3101 -187 108 236 -156 142 136 -76 27 -17 60 -58 292 -253 -533 433 142 -132 420 68 -295 24 160
3122 160 -306 20 373 27 49 58 -36 -378 69 12 -279 -4 336 -223 36 -185 -453 -376 342 84 89 161 -143
3145 -143 -57 -122 -13 -235 -18 68 -230 -122 304 139 -14 45 23 -324 -42 39 -489 -209 -25 -360 -142 10
3167 10 1 -545 562 247 -557 116 -102 -484 -72 -12 -177 -5 53 -266 -135 326 106 -259 -125 284 -550
3188 -550 46 -129 -308 -273 279 -392 -158 104 -179 -124 196 116 -125 170 31 -406 -98 208 -144 -73 388
3209 388 -126 -137 312 -115 -84 -205 1 -9 -62 -146 -130 123 156 -49 141 258 -3 -200 353 -30 14 114 240
3232 240 -59 251 61 -260 -158 307 -466 -91 346 30 -193 82 43 50 -2 188 -91 -54 73 -120 -216 299
3254 299 -310 -180 251 -20 -260 -95 232 11 -460 211 -254 98 216 124 -197 158 -233 -461 291 152
3274 152 103 378 281 -185 60 284 164 -366 71 -63 38 279 -75 -543 121 -237 -143 -156 83 -148 -118 11
3296 11 -223 -426 381 206 -371 351 113 -89 355 172 -244 80 20 -388 -192 287 251 -303 202 -110 152
3317 152 -86 127 -362 -36 226 109 206 416 225 206 175 -74 -235 98 262 -140 -191 136 48 203 487 -352
3339 -352 -228 -186 -19 212 -76 89 -40 -253 68 -58 89 66 -161 -35 4 -66 75 313 -269 -254 -26 199
3361 199 -237 117 75 -270 -116 -173 54 27 319 -285 154 399 -55 -25 79 191 -5 136 111 35 -101 391
3383 391 -187 -271 10 451 -202 122 -84 -164 -81 352 29 -324 71 -86 56 -2 55 -105 245 10 66 147
3405 147 218 -22 205 83 -357 -174 58 -161 -176 -216 -103 -190 -133 142 -329 11 46 74 213 76 210 -312
3427 -312 182 14 -30 216 243 109 -114 -38 -380 33 306 84 -396 -65 202 -270 481 -162 -178 227 -65
3448 -65 -43 -266 104 28 -52 91 -14 -131 377 296 -199 367 109 87 104 -58 -21 -276 299 -84 -129 236 -59
3471 -59 -291 217 164 -284 -323 63 76 310 152 158 108 371 -57 -141 83 260 156 373 424 -95 -27 345 0
3494 0 78 113 -43 -186 96 -160 -53 148 31 -23 179 -175 -215 57 198 -21 -224 32 -18 -228 78 -97
3516 -97 -469 36 154 -316 -280 -50 -114 60 -131 -25 -16 122 -184 61 -29 186 -178 -138 44 189 -8 109
3538 109 -138 -231 227 -8 -172 -206 425 -77 237 -6 -296 17 81 4 317 277 124 -128 284 80 -207 556
3560 556 184 -62 498 272 1 12 80 137 116 115 270 181 -215 16 28 -29 167 -39 245 146 -20 61 291 63
3584 63 11 73 282 1 91 320 -304 94 275 -137 26 242 96 -204 283 63 -199 3 79 20 -2 202
3606 202 -41 -277 -178 179 -36 245 83 158 -257 91 -17 10 266 -30 35 -35 -97 -363 168 -22 -387 176
3628 176 51 207 -166 330 -380 -135 -193 -444 -191 280 -181 -168 154 220 -241 107 304 -93 240 83 -94
3649 -94 -60 230 81 128 453 -467 -218 -16 -184 -406 -205 -105 -227 -67 -74 -170 -161 375 -105 -24 123 368 -320
3672 -320 116 5 94 -119 15 15 -197 235 -305 90 73 55 82 113 69 38 50 -234 115 -16 14 -45 61 231
3696 231 -329 57 -82 191 -51 31 33 -81 129 17 -58 191 207 300 -174 409 -161 -299 94 169 113 256 93
3719 93 -63 -189 -57 22 182 -147 226 -63 -60 -60 114 75 -1 -318 311 -464 -129 -502 -253 113 -190 421 153
3742 153 188 95 17 -145 -73 174 -353 -164 55 -76 -144 -257 187 79 112 252 -31 178 391 5 -166 -22
3764 -22 -139 -156 -143 -297 -362 61 221 -294 -44 36 100 -118 279 -126 -161 92 11 -188 -37 -45 -70 360 296 -63
3788 -63 17 -31 -244 -117 70 -274 6 -61 225 -196 -68 -82 -147 124 236 -83 -129 344 -144 -194 -126 -7 80
3811 80 104 -199 59 134 37 -64 236 121 19 -18 178 226 75 92 -189 70 -173 134 -89 -93 109 -107 354
3834 354 376 68 259 -451 100 126 -179 -35 -66 85 -14 31 231 -19 -124 285 176 -177 -122 302 113 -98
3856 -98 -57 207 -97 249 338 -32 150 -91 120 243 -97 -103 32 -366 126 -367 -134 -167 2 -173 1 92
3878 92 -1 -130 -102 18 78 134 -57 65 -334 -59 100 57 -219 -60 312 40 -45 118 88 -20 -73 282 163
3901 163 20 199 -47 42 100 42 -62 117 237 61 91 -234 32 -76 -80 -180 -302 -15 -168 27 -284 73
3923 73 204 -11 -192 -246 76 -58 -129 66 144 -208 -25 -141 -24 133 60 71 288 120 -201 -355 -64 179
3945 179 -366 -50 88 134 177 -82 80 120 158 333 68 197 165 91 165 86 398 -176 -185 166 -81 141 2
3968 2 -384 -157 -234 -225 44 -144 68 -86 157 -246 -74 8 -141 -21 48 -35 24 -253 -120 -81 -202 101 -6
3991 -6 -220 84 57 -231 -162 -283 -48 -39 244 38 -199 -4 341 228 -50 -218 -281 42 -130 -187 -220 -203 185
4014 185 -45 270 -224 -18 -59 -203 294 46 -39 -138 -57 62 137 17 114 -143 363 23 8 271 -43 -166
4036 -166 0 174 158 -33 -221 50 240 -125 227 -191 -327 9 -160 -8 237 243 -102 229 46 -26 335
4057 335 55 204 -72 -128 -186 141 -223 153 178 11 53 -237 -118 -62 174 246 -37 -37 197 251 -224 66 -17
4080 -17 113 -232 44 -14 -55 219 280 -141 381 -133 -137 42 223 141 -40 -42 148 215 -260 -54 -221 105 292
4103 292 64 -63 -91 13 6 158 -32 -105 -100 332 67 -304 135 -243 102 40 -41 209 -109 -150 -189 -83 -181 -94
4127 -94 127 -24 -269 46 308 120 -1 230 161 -123 121 -220 -80 248 -326 58 -82 176 84 28 -118
4148 -118 152 -118 237 -101 42 -91 -213 228 277 249 -53 -467 -172 212 145 363 178 40 -138 15 -51
4169 -51 -284 63 63 173 -192 -110 189 237 411 -201 -270 70 -143 -283 64 -171 -260 254 36 118 77 57 -112
4192 -112 14 -269 -56 164 88 -99 -143 -347 -235 39 -56 186 -77 -65 427 265 -150 -59 -86 306 -34 -198
4214 -198 50 384 -145 -87 -97 190 -152 -113 -104 158 -1 113 330 -57 28 4 16 57 151 87 20 -64 -69 102 191
4239 191 74 23 75 90 26 218 -298 187 80 85 112 -46 17 192 252 -183 157 -126 22 390 -117 79 132
4262 132 -174 -265 -37 224 -418 79 -18 -205 -9 -62 145 -112 -168 50 119 -5 -34 -11 -64 -177 156 52 -297
4285 -297 -109 94 142 -66 204 -93 -299 302 -356 -99 123 18 -7 147 83 -9 -106 167 138 118 -260 -23
4307 -23 0 -15 210 -73 136 -38 157 118 65 78 -215 -40 202 348 -204 199 241 -216 -13 -327 112 64 -122
4330 -122 -150 44 234 205 215 -164 1 40 13 116 -305 -234 6 90 6 -201 2 119 -139 -142 -267 -155 388
4353 388 230 -153 -182 -161 183 205 352 79 -182 104 114 213 -71 240 -170 -141 -138 107 40 -183 -38 -21 108
4376 108 -307 -98 133 79 -268 -54 -205 -101 -90 -111 -141 -275 58 -14 177 -93 -47 45 99 83 115 -256 -135
4399 -135 -12 -117 282 43 -50 111 -12 -115 61 157 -201 64 -255 -222 -66 -62 102 -187 -263 -156 197 132
4421 132 -65 121 62 -518 34 48 -274 215 -179 -94 295 -83 -43 -10 -59 0 11 27 -42 -27 646 9 0 -208
4445 -208 -18 181 365 294 -146 -230 30 -114 71 -191 26 -173 -144 -40 3 -61 133 -303 -190 192 -245 6
4467 6 30 58 -84 199 -98 -82 173 -126 160 -31 -191 52 -181 -97 -12 185 -35 260 -199 -77 -61 -184 25
4490 25 -66 100 -34 -15 83 -145 -104 224 321 156 79 58 -371 223 -281 381 -106 -350 98 -118 -13 334 149
4513 149 15 104 -108 36 -163 -127 93 203 -289 -306 -257 -106 -154 24 -16 295 347 70 260 -27 307 190
4535 190 -16 46 -7 -51 154 -50 -36 26 -69 71 -71 35 210 -117 -166 -89 -16 128 103 -220 -150 179 -126 -46
4559 -46 127 -107 120 68 -77 -62 -46 -46 118 165 178 -84 21 40 -105 250 162 116 104 -349 40 285 -25 -197
4583 -197 62 -30 65 -43 26 166 -298 -18 -6 -108 325 139 329 -222 -177 397 17 -322 509 184 196 -66
4605 -66 -9 10 -116 169 117 159 -59 -137 -160 -7 -86 -16 -192 306 -219 47 -193 -178 126 2 88 244 165 -312
4629 -312 313 277 6 250 97 177 95 -128 189 -307 -4 -159 -271 -74 288 123 -54 -251 79 -47 6
4650 6 196 -125 331 -31 -166 -105 224 -161 185 -332 335 6 232 -98 232 93 210 -147 94 358 -78
4671 -78 187 148 39 61 -36 -71 184 41 20 101 421 -103 173 210 39 -28 173 305 55 256 -9 148 39
4694 39 -108 -234 137 54 145 -319 -95 -300 -156 28 -185 -75 -172 212 58 -148 196 -264 -32 83 221
4715 221 5 65 75 -230 9 171 -121 -165 80 58 295 -171 468 -152 28 105 -31 -24 -110 -46 67 -157 -124
4738 -124 333 65 -39 -18 110 5 -210 -186 100 147 159 60 -108 -186 -257 -412 -44 13 52 94 -48 36 -104 34
4762 34 -161 -57 -164 -93 114 -152 -37 -92 36 71 -101 -185 -88 73 217 84 -153 -199 -120 -111 172 -167 85
4785 85 -358 136 132 239 -121 -114 -139 -171 33 53 104 182 197 9 -33 -7 68 93 -24 93 -112 -18 70 -356 -102 288
4811 288 -189 -88 -184 -86 -184 13 -125 91 -152 -326 -262 -62 -116 -148 142 -185 379 -295 77 130 80 -42 39
4834 39 25 -146 79 -191 -40 -81 -81 78 197 57 86 -242 189 203 54 181 37 -43 57 -107 -69 21 -118
4857 -118 -142 177 -133 -32 -173 -129 -24 -23 -170 203 -60 -77 40 -31 -100 -218 -65 -227 240 -192 72 109 81
4880 81 -179 -8 -227 16 133 -73 53 -143 382 -153 -326 -63 52 42 170 -35 180 -70 -34 18 -285
4901 -285 129 99 -20 206 22 36 242 18 -128 3 236 49 -281 36 -13 -159 101 79 130 168 344 -72
4923 -72 177 -152 -157 178 12 101 -145 97 -173 -284 -355 -59 35 -227 -393 150 79 -33 -263 -302 302 -235 73
4946 73 7 5 4 -153 -35 238 -254 -67 99 -121 -247 59 133 -316 -91 104 -114 -243 212 193 -22 -4 -92
4969 -92 118 -92 -415 15 128 -156 236 141 -244 -33 -194 -325 -124 39 -408 -158 18 -25 -48 91 -190
4990 -190 -88 -29 23 -17 -203 -97 56 199 61 63 210 147 55 -30 78 63 -62 38 122 -163 -151 -75 -188 -56
5014 -56 -71 51 5 216 -67 38 229 -171 -63 -37 58 -19 89 46 -38 -334 219 -43 -232 156 53 421 76
5037 76 -104 -48 3 285 -72 118 -196 117 72 22 112 216 160 -131 -189 163 36 -168 -134 -164 90 -141 1
5060 1 -304 -64 0 -105 5 415 -71 -219 -16 131 -53 159 8 140 438 202 10 -69 -34 -90 -293 291
5082 291 184 -231 26 -258 -66 -344 -363 337 60 126 150 -290 141 -49 -404 -206 9 -50 330 8 -398
5103 -398 127 7 175 23 130 -145 -245 -44 -185 42 88 -32 -119 98 452 -256 -484 56 -144 160 23
5124 23 -50 -144 183 -112 103 -3 -4 362 143 414 129 -30 40 -27 -148 247 -20 -92 140 94 88 -38 155 -3
5148 -3 66 -50 -175 -145 264 73 -64 93 392 -343 208 -169 119 0 -67 -126 154 146 -51 -251 -75 -77 -312
5171 -312 -201 151 58 177 77 119 147 93 114 427 97 -115 -81 104 240 -53 -203 -14 -123 -197 304 -66
5193 -66 54 263 -158 159 118 -130 105 172 175 78 -1 -133 -111 -165 90 54 14 63 104 -226 -248 36 -538 -122 33
5218 33 -51 93 -93 -433 378 122 83 266 -168 -178 -15 -17 -133 60 -365 -121 34 155 -109 176 -115 319
5240 319 118 -57 -65 6 -171 -250 -183 115 30 23 275 61 102 193 -241 65 -47 242 475 -206 37 283 181
5263 181 -169 -128 -234 107 -117 372 131 -44 -175 -4 48 132 -272 -96 127 373 57 -310 -199 -64 -311
5284 -311 199 -262 -98 63 -19 245 184 -342 159 201 -116 103 -13 65 277 -98 94 -136 -16 -130 81
5305 81 32 -59 -92 62 140 256 -178 -41 -120 237 -18 -175 206 82 12 115 -40 -225 -292 -165 -69 104 97 244
5329 244 80 -113 -84 112 -22 -46 23 -203 214 -50 -236 -119 -395 -103 144 -137 -178 184 105 36 -183 201
5351 201 123 -204 -221 199 -274 -101 -163 -145 144 369 115 67 39 -9 43 156 -151 -195 -61 -153 -44 235 502
5374 502 -95 -68 204 223 -147 80 -180 249 -151 68 -236 16 -41 -81 -74 420 85 14 105 -59 251 -54 -486
5397 -486 87 106 316 51 83 -68 -286 326 199 -188 29 199 18 196 174 -55 -61 217 21 -8 7 423
5419 423 -42 -57 304 38 81 299 -71 -40 86 -5 209 -30 -72 25 46 86 14 194 -220 82 109 208 -60 42
5443 42 134 -61 -63 -61 -53 -39 -76 431 -261 -161 259 -111 66 -270 -63 90 271 234 -151 -108 -168 -149 178 73 -36
5468 -36 130 39 -11 -35 -54 -89 -69 58 84 -135 -15 230 62 -192 16 -121 8 -90 -69 -137 100 31 -251 -51
5492 -51 209 372 108 -73 29 169 -180 91 232 30 -53 -142 -232 -32 144 -26 -280 -202 80 39 -44 -244
5514 -244 264 175 -74 -41 62 211 -28 -189 186 -7 -42 66 171 222 155 -182 206 311 -99 1 366 -394
5536 -394 -106 -19 215 182 211 -191 37 -177 -240 293 137 -151 -149 22 -51 -5 -23 140 -90 -29 -256 402 -39
5559 -39 89 227 -202 199 251 -319 77 100 133 -145 -71 57 79 294 -137 297 173 220 -41 -58 -215 -89 236
5582 236 32 -65 140 364 24 109 24 85 -365 -270 -121 79 111 -36 -257 -115 -134 171 -56 119 134 279 134
5605 134 281 395 202 94 -181 180 -64 214 86 249 -10 -121 -38 -107 -4 291 -50 -135 -177 237 121
5626 121 6 -138 158 171 201 7 22 -7 -40 46 -135 12 -142 -248 -225 13 -194 103 52 35 31 -175 -150 190
5650 190 98 -59 25 -31 314 -205 62 306 -10 10 226 -76 -84 131 -42 -240 149 1 190 18 -107 73
5672 73 432 -191 -46 76 -90 -291 -98 -184 71 145 48 -179 204 79 42 -37 -99 310 -228 118 84 -153 44
5695 44 143 134 -119 86 99 -300 354 106 -52 -306 -105 -181 -125 131 -1 43 94 108 -96 -41 170 -1 296 125
5719 125 326 -227 -41 -153 186 169 -200 151 -276 -114 -178 34 83 -51 -60 -140 51 -52 181 -232 241 27
5741 27 23 -67 -138 -167 -129 113 -176 -106 -104 -192 55 -104 169 304 162 2 -90 27 90 -29 -86 -28 194 -41 190
5766 190 71 -141 -118 39 -69 -127 142 333 -184 -215 354 123 -120 113 11 142 98 200 -57 291 290 10
5788 10 -149 -329 -169 -71 -46 -91 -234 245 -77 118 26 21 -195 -176 15 -133 43 211 -91 -3 255 -285 -2
5811 -2 0 -199 -306 124 218 -35 304 79 9 9 430 -29 151 107 138 -162 161 -162 -30 -216 37 -433 -127
5834 -127 -145 -376 -107 -245 -19 -392 320 -468 -217 115 127 -129 66 -282 -99 48 -201 6 -143 14 250
5855 250 -55 -18 0 32 -83 27 -186 -65 97 -222 200 353 -21 -183 138 -196 116 253 66 -147 125
5876 125 23 57 -12 209 -190 38 201 -288 -5 -264 -25 44 135 101 93 89 187 224 -204 101 193 25 -133 223
5900 223 -120 -90 -457 167 4 -241 -141 167 13 228 -265 59 61 85 -272 -26 16 -126 30 -68 348 -67
5922 -67 -112 -12 50 -42 -52 -5 182 107 285 183 -5 118 160 -32 418 169 -184 119 74 17 213 -179 178
5945 178 -502 48 356 -185 -207 -114 -99 -78 133 -106 60 -28 -320 -201 -70 -241 142 38 199 216 -203 -233
5967 -233 -22 -128 -291 221 -122 -14 467 46 -129 17 -80 23 -87 -1 -12 -349 -43 20 254 404 83
5988 83 204 81 -80 -50 -174 93 -195 345 77 60 -236 -118 117 69 -100 11 267 247 21 -158 28 -101
6010 -101 174 69 -62 136 -59 -116 180 -79 -181 -8 -225 13 36 -51 307 197 -248 66 162 -11 -64 113
6032 113 -335 325 9 110 -194 26 -16 -233 284 -87 -70 70 -237 -244 223 96 201 74 141 -30 -48 -7
6054 -7 282 -125 146 -103 -63 358 -153 38 -149 -35 143 -41 -39 -204 206 -59 -82 -330 63 -249 -80 11
6076 11 552 -148 -73 178 -10 -181 73 -93 39 180 -94 165 -37 179 -46 369 63 -375 -108 -234 108
6097 108 192 269 94 -407 -54 -3 25 -259 4 -216 5 155 -10 -254 61 360 46 -96 -44 -75 78 586
6119 586 -260 -167 68 -42 -131 79 -79 60 201 316 233 -77 287 -80 -315 93 64 -42 -279 -172 -206 211
6141 211 -46 -39 -4 346 -266 -118 29 -169 -80 78 -131 91 -212 -50 -35 321 14 -358 -66 104 88 -25
6163 -25 22 209 -154 55 141 -105 201 91 -337 59 -149 -280 171 -132 233 142 -18 -17 -125 -251 109 -128
6185 -128 -171 166 -12 71 175 70 87 248 -183 -215 274 19 -14 355 -48 172 143 18 144 243 76 260
6207 260 -203 -149 229 114 100 -134 135 -139 8 8 60 191 -213 -138 56 60 -115 197 -172 39 347 127 24
6230 24 51 -89 129 52 -71 211 18 242 -5 -110 307 -124 71 162 293 -82 21 225 202 -161 -39 -248
6252 -248 -331 -46 111 92 27 41 -36 272 -64 54 -196 342 62 -85 268 -23 -224 -79 -238 -528 105 68
6274 68 -148 -57 92 0 -195 -14 130 -118 13 -23 -223 -69 100 -95 -63 4 -28 105 -7 -149 -77 352 -246
6297 -246 -104 -26 16 55 -217 240 -85 -111 -164 -52 -97 32 -230 -101 94 59 -78 -145 -579 68 -167 72 121
6320 121 -108 -117 -218 57 -131 -16 -144 -173 370 -71 -282 199 -32 180 104 -235 -17 128 302 -374 -181
6341 -181 -250 -258 -150 -73 -96 -187 -43 -257 2 -103 -44 20 145 -132 -21 136 213 -100 42 -228 -48 135 -138
6364 -138 242 106 -143 -91 194 45 303 -332 89 -43 28 85 114 103 -68 -55 391 -204 515 59 -58 282
6386 282 -223 184 -98 153 115 245 -67 171 -154 -76 115 28 -105 117 -8 14 77 239 35 44 16 78 163
6409 163 57 -176 205 -47 -11 12 172 0 7 -21 48 89 84 -138 -40 213 57 44 234 -173 153 -129 146 84
6433 84 -95 179 27 -4 291 237 41 21 -196 205 -60 -206 52 -44 63 -166 -167 -46 -197 -90 -10 -53 91
6456 91 -203 -23 -134 -385 -230 100 34 -47 -51 -65 -16 -221 -112 244 -202 3 -60 47 29 117 138 130 -46 180
6480 180 -34 -11 138 -45 28 -119 39 -22 -64 -54 201 -184 154 -110 -62 -23 169 56 72 233 -250 17 24
6503 24 -126 94 108 66 -305 -16 242 -237 167 -12 -146 40 112 25 -191 -33 93 -180 27 -311 -99 -54
6525 -54 10 -41 -98 6 -29 -30 -80 61 -80 28 -289 116 186 191 101 42 -74 -72 36 -100 81 -93 -72 123 -271
6550 -271 253 230 -252 292 112 -151 -20 486 110 28 162 -223 -7 -284 -223 -432 -49 184 -121 148 289
6571 289 204 197 386 -114 84 337 259 2 -101 -472 -93 -57 77 19 -194 -238 143 -49 -2 -358 -41 198 -251
6594 -251 181 202 432 303 303 -33 185 29 228 -111 106 33 249 -40 17 -65 -94 -379 -128 -195 383 -25 -16
6617 -16 -210 84 78 -145 126 -90 -31 -272 -117 -462 -19 349 -99 62 -34 340 -31 -168 137 100 298 -170
6639 -170 -172 190 180 -302 137 81 195 -231 162 -218 200 186 94 -6 123 491 -66 -146 317 -54 -13 99 180
6662 180 -26 305 -51 115 -146 279 -67 165 -92 -125 -89 34 170 -27 234 -41 -88 103 132 -134 -184 -75
6684 -75 -181 -176 170 295 -51 45 298 -44 -69 266 191 -78 95 120 313 343 -23 363 -7 26 -112 -39 16 -249
6708 -249 -87 -210 -204 -103 54 221 254 136 82 73 235 15 27 -188 80 101 86 191 -162 -23 -72 263 60
6731 60 271 143 132 -44 -154 99 237 -291 -208 245 -21 -62 468 159 -27 -13 107 -251 -77 -47 -32 219
6753 219 -223 214 -438 110 -130 -83 245 -99 198 -334 -12 260 97 308 249 -249 138 7 -118 -28 -23 -117
6775 -117 272 183 115 -39 -165 55 222 -37 89 101 -114 65 48 -106 154 0 -345 -79 -270 -74 -324
6796 -324 25 105 23 -80 156 -21 163 -226 285 191 155 457 201 259 -27 -27 93 44 96 -238 3 89 -155
6819 -155 -358 -219 119 -10 -83 100 -188 23 115 26 -87 -193 -63 -259 194 150 -41 -197 100 13 91 -36
6841 -36 -2 -397 -170 180 85 2 104 25 -47 327 88 204 134 83 -303 1 116 292 -78 -87 -32 233 -30 115
6865 115 -70 -19 179 211 -146 -178 -103 -71 180 -46 116 141 -182 -231 -68 -1 103 -9 91 253 457 -70 201
6888 201 -223 322 66 -164 -218 149 -17 14 151 41 176 197 -338 -122 354 17 29 -142 84 401 -94
6909 -94 29 26 -224 -95 -209 -98 14 -9 79 62 -163 5 171 86 -398 40 -261 409 141 348 87 -19
6931 -19 499 -191 -129 -289 -128 -249 245 223 -31 -226 30 64 -201 -84 -187 -89 13 37 -183 -139 199 214 339
6954 339 193 -375 64 273 -78 -325 -230 135 -47 -166 215 -140 -43 227 -156 -113 -262 143 -103 80 -303
6975 -303 66 200 -98 -159 109 274 -437 191 335 171 -159 -153 -16 24 229 181 -207 157 145 -325 -245 -75
6997 -75 -137 -31 125 14 307 -411 -35 209 24 97 -122 -15 -301 -13 10 -328 -109 11 -165 -162 -13 360
7019 360 -60 -154 64 -38 -25 -2 14 -169 82 23 -81 91 384 -239 -201 -189 68 101 -30 -184 88 58 59 -28
7043 -28 84 61 -22 -26 -162 -84 -98 -151 146 -136 -41 -87 -91 64 43 139 66 88 117 124 27 121 -230 -84 113 -229 -96
7070 -96 173 -160 134 76 75 -159 173 174 46 -23 -59 126 -65 -328 -324 -113 179 -296 -120 136 352 59 -213
7093 -213 50 -1 -111 159 -2 -1 253 -138 214 165 -115 -89 48 108 -214 -152 109 -168 -123 444 -280 48 242
7116 242 -274 -127 116 109 173 31 -41 98 11 -172 27 -185 -210 141 213 94 -84 -40 -161 70 -186 -183 -380
7139 -380 110 86 20 -178 -158 134 -81 -127 -82 -308 -274 261 -293 85 212 -51 -67 -35 160 38 -89 217 -270
7162 -270 41 84 74 147 -193 75 -240 43 25 -271 152 185 -17 133 104 49 144 14 536 -257 37 69 -305
7185 -305 -68 -275 -89 -5 190 -103 40 200 213 -65 97 222 -114 -52 -150 -184 -441 79 107 13 264 -220
7207 -220 34 -8 -70 -301 21 13 37 165 -7 198 -117 -157 -65 -27 5 17 -129 67 -66 -304 -98 99 -117
7230 -117 -139 273 -148 -84 -56 22 -6 111 59 24 38 247 186 -242 -127 280 -52 -116 -214 -41 148 -151 -267 119
7254 119 -137 -337 168 39 -21 24 128 -7 4 -18 64 -90 -3 -24 33 -180 130 -4 -230 284 -47 -84 -38
7277 -38 307 -1 -26 281 -24 89 -36 1 -165 -22 227 -119 49 17 -211 -233 164 -238 -31 22 41 -225
7299 -225 117 18 77 -130 179 33 52 0 -79 193 -293 69 188 27 -125 28 400 186 -143 -41 124 -26
7321 -26 63 -47 -403 126 -45 -200 -27 56 351 -197 179 124 136 54 337 9 143 -199 -337 153 111 -96
7343 -96 -71 92 -19 62 -360 -115 98 -122 213 7 -161 34 90 385 -166 -18 -85 -50 -257 -118 58 14
7365 14 -256 -54 -180 146 50 104 -171 62 36 -340 32 115 -175 115 2 -328 -428 85 24 -137 -295 -26
7387 -26 -160 61 192 -202 175 265 302 121 105 -42 -69 -87 164 139 -449 -71 -102 -168 211 283 151 -94 -43 197
7411 197 71 85 -39 -98 7 20 181 96 142 17 -146 170 -160 -23 0 -11 94 219 -120 190 317 -174
7433 -174 -107 -52 -58 -19 160 131 -678 -85 147 -149 84 -40 -403 84 -139 -10 353 -144 88 -120 100 251
7455 251 -61 81 213 58 69 101 -21 -178 63 -75 -200 -120 -169 -85 101 3 67 -2 -248 -152 -94 -97 35 157
7479 157 -166 -137 -90 109 137 118 -139 216 84 -180 517 47 -156 -12 250 228 104 12 199 163 279 -97
7501 -97 -25 415 101 -371 266 -31 -78 -203 305 142 -145 170 -51 -13 -17 -72 -233 44 -67 -246 -41 3 249
7524 249 43 97 352 -51 -220 152 148 -147 37 -165 25 46 -135 -285 53 -262 -15 213 308 -149 5 289
7546 289 253 -40 -276 -134 123 48 38 16 371 28 150 2 -22 201 -10 -142 -3 54 -262 -6 -150 175
7568 175 -97 -188 126 3 -100 -231 -54 38 -15 65 -185 221 -65 -136 4 -54 -385 299 23 171 -140 37
7590 37 50 -82 -14 389 227 -66 4 -1 142 -4 -241 -314 105 181 -61 -174 9 42 71 6 6 -74 -127 68 64 37
7616 37 35 96 349 -84 -122 109 -267 87 -138 133 57 145 -52 303 279 24 243 9 155 348 -49 180 16
7639 16 -203 -103 307 -90 243 -10 -181 166 -63 265 85 -82 182 7 40 -43 -226 91 138 94 -85 16
7661 16 22 118 162 -41 -136 35 -74 84 -69 -101 -106 176 38 314 -159 294 258 -154 196 183 88 -104 -50 216
7685 216 -204 113 258 -388 197 116 -37 67 -55 83 -237 -135 53 -94 -129 233 4 129 98 215 24
7706 24 64 -94 106 327 -155 -173 114 170 74 50 209 -188 -89 95 13 129 -71 -96 234 130 128 -191 -36 -127
7730 -127 -3 136 276 -163 -13 97 268 141 378 113 -27 -61 -7 -177 0 215 185 -137 79 -54 -16
7751 -16 181 85 -41 0 -82 -20 51 -5 -70 -221 -122 -109 294 79 237 -297 -50 29 -365 91 -56 -153 -18 173
7775 173 -305 17 61 -214 128 211 216 18 128 -76 -40 79 -43 46 -250 -10 64 -17 84 140 -71 84 -25
7798 -25 -60 135 87 -122 -150 213 -59 -84 131 160 126 -27 128 -321 -215 -95 -220 -276 -63 -401 -94 46 286
7821 286 70 3 263 -107 33 24 -291 223 -170 -317 -84 41 370 -85 151 -28 -240 -127 -80 -22 335 -115
7843 -115 49 46 -78 -149 20 202 122 157 -8 111 -265 234 -165 200 7 48 -48 -29 -19 -50 105 -5 -173
7866 -173 160 54 -13 -15 31 -88 -181 457 96 -185 155 -2 -203 34 34 -191 -176 -110 -92 -172 42 187 -65 320
7890 320 157 188 396 17 91 35 295 -338 319 79 195 -146 -122 -145 -32 -89 86 244 83 176 25 128
7912 128 103 217 -195 26 -117 153 -164 -94 -85 16 -72 -190 114 -95 352 -74 2 141 213 30 259 -103
7934 -103 85 -135 -82 78 -172 189 69 32 84 -63 -171 -168 -151 29 -257 195 34 121 329 -176 -156 234 -106
7957 -106 330 103 11 -102 23 -211 403 9 2 -118 195 427 -193 125 -372 56 33 160 -238 13 235
7978 235 -87 -76 -97 -36 -185 -106 61 22 256 295 319 147 -50 60 -123 130 28 -160 56 -49 197 -84
8000 -84 173 19 -135 -9 -189 359 172 311 -69 -218 218 53 -11 312 -155 246 109 -84 -49 -282 -203
8021 -203 70 -131 64 202 223 -135 -344 13 8 81 -120 45 -242 -271 50 192 252 -112 215 51 -77 -125
8043 -125 -22 87 -103 -173 -95 -135 -203 -225 -20 187 -242 21 170 -173 178 -83 350 183 95 23 -261 134
8065 134 99 -109 30 22 -189 109 36 -240 -56 169 -195 -262 71 -139 -311 435 99 65 290 -251 -56 46
8087 46 -23 61 381 3 -257 1 227 -392 86 73 51 27 78 177 3 -102 330 -10 -99 96 -293 -134 -151
8110 -151 -89 81 128 500 191 -84 8 32 226 79 151 -220 320 184 -8 -79 33 -52 -113 165 -206 -29 258
8133 258 55 168 105 205 247 -133 150 -12 -9 233 197 65 179 -80 200 235 13 13 38 217 63 194 300
8156 300 137 219 103 -84 -10 207 -275 187 110 163 78 -83 -103 60 237 -168 66 -314 358 270 173 -64 -77
8179 -77 231 0 -29 3 70 53 -173 -291 103 63 -55 302
8191C02
$$ Imaginary data points
##PAGE= N=2
##DATA TABLE= (X++(I..I)), XYDATA
0 0 0 0 0 0 0 0 0 0 0 0 0 -1 8 -8 8 -8 8 -12 16 -16 20 -24 25 -32 36 -41 47 -52 60 -68 77 -85 96 -108 120
35 120 -132 149 -165 182 -202 225 -249 276 -305 338 -376 416 -465 519 -582 657 -747 858 -999
54 -999 1183 -1436 1801 -2395 3505 -6301 29788 28848 -26698 1326 20144 -178 -8003 9910
68 9910 4610 4351 4467 -3495 3842 17279 -2487 -6951 14363 4901 -13138 9364 14486 -9692
82 -9692 -683 16673 -2443 -6503 11653 3345 -6353 5401 1671 -5385 8366 4471 -11126 5191
96 5191 11229 -11256 -5181 14352 -2983 -12434 7380 4194 -9350 1575 3922 -5921 1513 1166
110 1166 -10971 1350 8249 -11960 -7611 11698 -4970 -14937 8541 5637 -15877 -3557 8130
123 8130 -7510 -6920 3273 -4758 -4872 1680 -7426 -4387 7348 -6056 -13013 6719 2599 -16287
137 -16287 -356 9924 -10757 -9185 8538 -2578 -10102 3339 243 -7766 1622 -931 -8095
150 -8095 4096 2848 -11066 121 10302 -7860 -7644 9450 -125 -10394 4116 3926 -6762
163 -6762 2377 5028 -5304 1626 5377 -6134 95 9733 -4729 -5874 10746 2295 -8954 7198
177 7198 9178 -6929 -268 9076 -1131 -1525 6312 -52 -65 7270 -558 -1911 9997 2217 -7242
192 -7242 7459 9184 -7360 639 11986 -2153 -4200 9642 3193 -4143 5435 3623 -3295 5052
206 5052 3820 -4319 4409 7193 -5458 1 10380 -2232 -5822 8741 3113 -6813 3878 4973
220 4973 -4888 1090 4347 -4350 303 5186 -5114 -2463 7263 -2994 -7154 6423 2437 -9020
234 -9020 1411 5619 -6940 -3276 4999 -3983 -4380 3138 -3022 -4519 3377 -2213 -6727 3606 836
249 836 -9675 922 5224 -8280 -4799 5874 -3613 -7598 3654 -113 -6810 318 433 -5752
263 -5752 493 783 -7225 -373 4011 -6838 -3588 6124 -3252 -7568 4733 1382 -7589 963 3463
278 3463 -5466 -1016 3717 -3459 -1574 4194 -3018 -3553 5489 -673 -6053 5260 3477 -6180 1683
293 1683 6306 -3623 -1488 6079 -1152 -2057 4830 563 -2247 5771 1910 -4124 4814 4585 -4606 1847
309 1847 8065 -3128 -1951 7696 688 -3160 5474 3341 -2789 3119 3885 -2292 2809 4900 -3042
324 -3042 1418 6974 -1714 -1962 7197 854 -4428 4787 4624 -4252 1532 4940 -2482 105 4595 -1842
340 -1842 -894 4730 -1605 -3083 5309 979 -5436 3574 3827 -5447 -224 5331 -3582 -3211 4186 -1207
356 -1207 -3613 2662 -621 -4317 2299 415 -5495 1380 2595 -6218 -1797 4153 -4462 -5095 3707
371 3707 -1314 -5946 1994 673 -5448 283 1715 -4831 -854 1930 -4981 -2433 3801 -3537 -5509
386 -5509 3428 -683 -6763 1712 2440 -5910 -1259 2799 -3858 -2402 2864 -2716 -2870 2796 -1548 -4272
402 -4272 3368 957 -5433 1448 3673 -4413 -1202 4849 -2129 -3060 4182 -530 -2732 3162 1170
417 1170 -3358 2908 2845 -3435 1792 4668 -3314 -749 5685 -458 -2945 4710 2000 -3209 2816 3014
433 3014 -2281 1758 3727 -1752 890 4690 -1401 -244 5667 147 -2514 4725 3052 -3870 2597
448 2597 5038 -2502 157 4817 -574 -582 4349 -393 -1565 4008 728 -2627 3741 2375 -4070 1276
464 1276 4802 -2727 -1000 4897 -873 -2724 3220 915 -2880 2178 1028 -3530 1448 2178 -3765
479 -3765 365 3429 -3867 -2765 4248 -1107 -4298 2359 658 -4357 519 1770 -3870 -1085 1937
494 1937 -3430 -2123 2775 -2825 -3277 3091 -1196 -5163 1588 1345 -4860 -834 2166 -3559 -2312 2286
510 2286 -2258 -2822 1618 -1718 -3917 1946 -592 -4796 1237 1680 -4856 -822 3365 -3028 -2915 2926
526 2926 -830 -3767 2109 828 -2987 905 1310 -2852 737 2491 -3105 -648 3787 -2359 -2425 3975
542 3975 519 -3685 2527 2319 -2876 1063 3038 -1616 117 3419 -1258 -693 4265 -175 -2133 4178
558 4178 1444 -2752 3158 3669 -2444 816 4366 -1025 -364 4257 283 -736 3387 824 -1968 3356
574 3356 2492 -2355 2286 3767 -2183 -14 4740 -1087 -1686 4054 926 -2093 2690 1811 -2029 1232
590 1232 2274 -1902 796 2967 -2148 -1106 3529 -1059 -2661 3342 830 -3915 1357 2076 -3282
605 -3282 -490 2457 -2295 -1686 2055 -2098 -2254 2153 -1155 -3786 1979 621 -4299 338 1884 -3681
621 -3681 -1515 1949 -2175 -2855 1486 -1460 -3457 1270 -345 -3659 752 951 -4223 -462 1889 -3360
637 -3360 -2114 2485 -1652 -4073 1610 171 -3514 445 875 -3226 -295 1222 -2644 -669 2430
652 2430 -2293 -2026 2920 -933 -3189 2416 1281 -3552 930 2591 -2546 -543 2816 -1178 -1032 2646
668 2646 -730 -1341 2726 570 -2346 2787 2248 -2567 882 3531 -1392 -525 3578 -85 -1401 3070
684 3070 1071 -1117 2890 1595 -1728 1936 2899 -1845 691 3542 -912 -1045 4217 749 -1623 2856
700 2856 2303 -2031 1370 2751 -1218 625 2722 -1253 -98 3344 -1172 -1188 3414 568 -2603 2200
716 2200 2222 -2405 248 2773 -1892 -551 2565 -977 -1429 2457 -550 -2586 2094 410 -2973 1074
732 1074 1697 -3189 -472 2483 -2142 -2177 1902 -744 -2738 1142 91 -2800 554 400 -3337 11
748 11 1681 -2975 -1723 1984 -2114 -3230 1877 -102 -3347 566 641 -3094 -544 986 -2403 -1053
764 -1053 1183 -2503 -1493 2074 -1480 -2858 1909 -106 -3586 677 1705 -2721 -881 2232 -1796
779 -1796 -1686 2233 -428 -1599 1752 32 -2251 2277 998 -2513 1098 2193 -2094 -234 2730
794 2730 -1258 -957 2811 385 -1865 2405 1638 -1508 1521 2392 -1613 477 2976 -743 -453 3149
810 3149 -144 -1775 3025 1618 -1571 1567 2364 -1388 758 2831 -897 33 2624 -651 -664 2970
826 2970 530 -1610 2354 1478 -1969 1019 2649 -1268 -420 2463 -604 -905 2073 184 -1309 1501
842 1501 609 -1736 1317 1495 -2202 251 2482 -1827 -1009 2452 -795 -2309 1540 159 -2351 877
858 877 756 -2510 -141 1161 -1955 -1043 1592 -1784 -1981 1395 -693 -2885 1073 520 -3184 -122
874 -122 1097 -2423 -912 822 -1923 -1595 1181 -1099 -2281 1440 -797 -3440 314 953 -2398 -607
890 -607 1656 -1922 -1560 1464 -579 -1821 1505 -184 -2123 585 223 -2423 743 1404 -2233 -674
906 -674 2167 -1280 -1732 2207 -436 -1980 1459 854 -1772 1120 1615 -1696 -267 1964 -1216 -193
922 -193 2723 -503 -1110 2322 820 -1658 1296 1983 -1521 645 2451 -874 348 2408 -738 -552
938 -552 2244 74 -1098 1991 1401 -1479 1493 2318 -1138 346 2623 -322 -621 2300 281 -687
954 -687 1737 864 -1504 1536 1486 -1726 854 2073 -1441 -304 2570 -493 -1578 2228 375 -1982
970 -1982 1022 991 -1533 372 1481 -1452 -580 1428 -837 -1127 1715 -305 -1796 1384 304 -2549
986 -2549 470 1221 -1883 -514 1345 -1633 -1408 1087 -1108 -1884 986 -155 -2601 163 750 -2495
1002 -2495 -661 1296 -2183 -946 924 -1142 -1601 1445 -675 -1872 1077 146 -2328 404 1145 -2123
1018 -2123 -522 1614 -1675 -1281 1698 -543 -2289 1047 531 -1864 255 1115 -1626 -190 1367 -1035
1034 -1035 -647 1822 -503 -1273 1718 356 -1607 1298 1069 -1823 702 2071 -1010 10 1926 -541
1050 -541 -493 1619 -8 -857 2307 696 -1307 1583 1770 -1079 285 2197 -453 -454 2244 307 -1165
1067 -1165 2220 864 -1011 1400 1410 -856 1064 1913 -869 -174 2148 -335 -747 2087 548 -1341
1083 -1341 1657 994 -1495 855 1446 -1201 -97 2092 -828 -687 1878 -94 -1756 1797 627 -1988
1099 -1988 392 1073 -1695 -37 1595 -1197 -1141 1372 -675 -1531 1107 71 -2058 486 686 -2086
1115 -2086 304 894 -1916 -807 1111 -1421 -1589 1210 -805 -1859 212 -80 -2253 8 763 -2246
1131 -2246 -768 1245 -1815 -1335 923 -1073 -1833 641 6 -2205 560 626 -1656 177 1107 -1428
1147 -1428 -423 1272 -876 -1415 1322 -209 -1587 1057 355 -1950 249 1326 -1091 -159 1805 -644
1163 -644 -989 1684 -441 -1162 1543 624 -1208 1140 1619 -1054 340 1778 -1285 -550 1967 -259
1179 -259 -1003 1941 724 -1163 1232 1400 -1130 910 1889 -805 -42 1847 -515 -257 1972 317
1195 317 -1055 1756 1109 -1357 988 1600 -999 13 1941 -571 -228 2001 -130 -1108 1686 721
1211 721 -1121 1032 998 -1093 382 1492 -832 -371 1605 -632 -986 1612 30 -1762 989 598
1227 598 -1558 665 1094 -1807 -231 1494 -1050 -1224 1512 -567 -1794 544 -40 -1803 343 831
1243 831 -1743 -533 860 -1436 -823 926 -666 -1471 823 -481 -1976 594 5 -2121 -292 595
1259 595 -1654 -1061 1057 -1002 -1420 646 -699 -1832 865 82 -1719 528 703 -1698 -297 1510
1275 1510 -1210 -1004 1143 -415 -1097 1342 260 -1447 685 612 -1257 483 1327 -972 -419 1460
1291 1460 -864 -939 1477 -46 -1160 1087 1206 -1376 576 1416 -787 93 1604 -372 -203 1766
1307 1766 210 -827 1526 827 -1161 1346 1260 -901 198 1831 -175 9 1812 -107 -583 1658
1323 1658 702 -805 1309 1306 -878 886 1288 -1207 -125 1928 -600 -340 1612 449 -788 1124
1339 1124 781 -1324 643 845 -935 217 1509 -1084 -784 1695 -186 -1304 1416 188 -1478 295
1355 295 623 -1292 -51 788 -1201 -569 1021 -1135 -1014 1048 -399 -1318 650 437 -1880 301 798
1372 798 -1697 -670 1010 -882 -1325 740 -511 -1585 679 153 -1304 286 652 -1875 -467 1091
1388 1091 -1496 -761 1000 -851 -1496 962 16 -1475 351 725 -1819 33 678 -863 -609 1364
1404 1364 -687 -1058 1295 -94 -1180 778 480 -1336 491 1039 -1139 152 1290 -846 -285 1339
1420 1339 -253 -772 1573 542 -819 1178 978 -895 653 1683 -364 -235 1195 -112 -710 1613
1436 1613 547 -714 1525 818 -1140 927 1525 -733 126 1638 -317 -557 1680 269 -819 1421
1452 1421 906 -1048 910 933 -940 254 1230 -725 -449 1644 -127 -559 1225 2 -1133 734
1468 734 677 -1110 351 567 -950 -386 915 -712 -1115 824 -439 -1487 791 250 -1493 282 533
1485 533 -1325 -550 1193 -723 -946 524 -586 -1384 502 -16 -1495 64 274 -1499 -210 696 -1288
1502 -1288 -562 686 -978 -1204 847 16 -1331 304 -55 -1501 -89 384 -1167 -526 1067 -998
1518 -998 -1029 744 -167 -844 819 151 -1615 177 759 -1215 -392 1183 -709 -551 1009 -199 -862
1535 -862 1037 -56 -727 839 558 -791 489 1210 -1060 26 1606 -183 -876 1480 36 -668
1551 -668 1045 651 -634 869 1095 -652 141 1229 -616 -226 1529 -144 -839 899 485 -815 786
1568 786 1295 -201 311 1338 -267 -152 1134 28 -514 1531 304 -874 849 374 -878 642
1584 642 1103 -839 1 831 -398 -326 1321 55 -863 765 267 -908 230 724 -1150 -105 854
1601 854 -914 -593 869 -329 -865 654 5 -1138 428 114 -1345 -218 722 -1256 -511 1103 -921
1618 -921 -860 821 -288 -1463 474 65 -1192 190 219 -1108 -99 929 -722 -954 582 -547 -1456
1635 -1456 426 87 -1413 40 47 -1267 -308 701 -1109 -393 864 -725 -675 1029 -70 -876 722
1652 722 353 -1265 59 740 -875 -452 980 -599 -334 1028 99 -722 823 383 -729 589 842
1669 842 -967 -19 1126 -594 -331 886 -105 -582 1287 569 -756 1084 802 -540 504 927 -486
1686 -486 -144 1253 -331 -17 1140 330 -582 1164 769 -910 1132 960 -668 218 1283 -419 -158
1703 -158 1038 -156 -637 859 316 -676 685 566 -540 78 859 -614 -334 896 -142 -455 816
1720 816 3 -735 392 463 -1342 332 581 -606 -510 971 -603 -816 604 -581 -1160 146 297 -1417
1738 -1417 90 554 -1116 -344 403 -794 -825 596 -539 -858 664 -471 -975 429 463 -1129 -115
1755 -115 685 -1052 -376 662 -409 -775 306 -323 -1322 509 255 -1225 178 675 -1128 -244 774
1772 774 -1023 -815 828 -396 -966 399 250 -852 479 513 -1133 30 754 -643 -296 801 -586
1789 -586 -409 933 293 -788 669 619 -678 521 1017 -650 85 1161 -263 -277 1277 6 -404
1806 -404 1079 570 -721 522 865 -523 310 1045 -26 -270 976 -26 -280 907 653 -643 754
1823 754 863 -724 728 743 -564 89 1221 -174 -496 970 227 -510 767 536 -457 302 511 -645
1841 -645 -161 924 -342 -347 786 -367 -569 874 290 -1002 286 209 -1006 -282 594 -684 -222 422
1859 422 -627 -906 594 -512 -858 217 23 -974 -175 365 -1167 -228 847 -756 -649 687 -229
1876 -229 -935 167 -32 -818 115 47 -791 -145 563 -536 -449 559 -802 -542 615 -77 -956 261 537
1895 537 -1241 -81 291 -774 -130 730 -210 -451 400 59 -389 980 192 -653 -113 526 -582 -108
1913 -108 830 -516 -417 682 54 -608 695 -75 -566 767 495 -709 -61 414 -405 -249 794 -101
1931 -101 -277 1058 265 -344 445 699 -356 447 591 -270 -357 1073 -261 -14 978 180 -369 830 322
1950 322 -703 143 605 -167 56 910 -327 -151 639 -238 -190 580 19 -507 510 497 -765 110 645
1969 645 -774 -258 722 -184 -570 570 43 -954 390 40 -875 16 338 -987 -396 359 -866 -579
1987 -579 421 -353 -1005 305 -91 -637 166 282 -908 -271 311 -650 -556 630 -325 -541 -26 -194 -703
2006 -703 365 46 -841 -265 438 -832 -421 360 -482 -678 485 -64 -869 536 126 -467 201 443 -689
2025 -689 -67 872 -458 -437 1073 178 -470 589 317 -396 235 517 -485 -44 349 -353 -130 606 -97
2044 -97 -465 870 296 -634 649 374 -263 491 839 -292 226 981 -108 -305 754 125 -443 654
2062 654 89 -506 413 319 -574 55 633 -203 -296 808 214 -208 880 -77 -458 665 407 -373 527 805
2082 805 -526 -166 783 -233 -218 752 -179 -436 287 20 -424 200 354 -505 -81 728 -528 -496 420 -362
2102 -362 -528 427 -52 -804 335 243 -736 -110 464 -751 -215 538 -346 -678 556 -413 -1032 3 120
2121 120 -960 -61 10 -751 -203 355 -755 -463 327 -311 -792 260 -192 -941 291 308 -506 -80 256
2140 256 -538 -303 487 -177 -716 291 128 -483 121 -239 -880 11 356 -492 -92 703 -461 -156 162
2159 162 -5 -566 637 141 -597 62 516 -720 33 703 -200 -22 785 -117 -85 646 233 -175 662 541
2179 541 -343 163 520 -146 -161 837 -12 -166 357 291 -465 475 462 -454 51 701 -252 230 869 -13 -399
2200 -399 781 72 -299 640 326 -341 434 162 -262 180 213 -219 -477 743 -177 -445 462 -61 -508 -109
2220 -109 284 -735 79 475 -821 -113 209 -279 -63 302 -301 -574 549 312 -849 328 165 -894
2238 -894 -491 573 -429 -170 324 -165 -531 538 -125 -740 -141 136 -999 -64 603 -506 -234 683
2256 683 -290 -435 300 -339 -612 356 332 -671 142 439 -627 -264 283 -637 -562 154 -86 -345 476 22
2276 22 -715 470 106 -371 53 442 -448 -263 638 -186 -310 498 75 -459 432 484 -240 370 550 -264
2296 -264 -71 382 8 -18 662 231 -428 636 185 -365 227 437 -481 396 559 -123 -34 546 231 -170
2316 -170 505 75 -61 276 555 -566 286 717 -239 173 615 -211 -223 554 67 -307 417 335 -611 195
2336 195 404 -661 232 553 -121 -334 163 -35 -485 161 333 -593 270 514 -457 -363 112 -277 -445 514
2356 514 -336 -508 242 -105 -673 501 248 -563 -180 346 -228 -98 614 -816 -433 506 -31 -988 -60
2375 -60 44 -391 140 -110 -412 -64 209 -822 -709 536 -521 -477 169 -153 -455 422 188 -661 -258 589
2395 589 -270 -164 409 -141 -342 553 23 -592 543 307 -629 205 243 -190 116 565 -368 -125 542 54
2415 54 -288 464 281 -302 419 446 -118 206 704 -423 -227 451 299 -48 503 205 -389 -1 223 -94
2435 -94 -81 591 114 209 507 -143 -435 361 123 -316 760 495 -218 269 147 -201 158 494 -207 -190 453
2456 453 114 -405 518 31 -536 434 592 -483 48 545 -502 -174 518 -314 -548 419 -194 -664 542
2475 542 12 -634 276 580 -406 -394 369 -452 -67 343 -217 -701 460 -24 -344 -28 105 -452 -198 257
2495 257 -487 -221 407 -237 -893 201 28 -269 257 440 -608 -212 217 -467 -282 295 -362 -24 18 -197
2515 -197 -696 178 -105 -413 222 211 -324 -416 679 -316 -160 393 -261 -221 219 166 -252 210 198 -335 -234
2536 -234 317 -260 30 352 -180 -226 743 322 -660 274 505 -358 370 268 -550 237 494 -227 -182 398 -4
2557 -4 -297 490 251 -610 384 605 -187 -25 529 -195 -111 575 192 -454 108 206 -210 259 163 -383 -123 296
2579 296 -450 -236 143 -645 -295 550 408 -389 352 128 -486 351 205 -419 -192 373 -278 -227 534 268
2599 268 -166 468 -119 -624 111 408 -517 -110 232 -326 -529 132 -92 -213 -21 -76 -479 -108 63 -623
2619 -623 243 249 -237 -3 233 -429 -619 185 -125 -512 371 -53 -475 -18 397 -448 -124 84 -25 -36 376
2640 376 -271 -158 455 -40 -310 -45 155 -715 100 179 -199 -230 516 -367 -342 239 -34 -168 476 147 -381
2661 -381 71 517 -263 130 449 -146 -89 487 136 321 169 212 -280 -76 563 -343 434 286 -495 -82 799
2682 799 -125 -105 509 381 -177 383 89 -305 -106 365 -108 -61 250 158 -34 269 197 -246 454 29 -306
2703 -306 342 351 -16 82 263 69 146 667 109 -179 513 107 -311 224 190 -230 280 217 -267 79 38 -416
2725 -416 -156 -12 233 -444 176 271 -353 408 153 -236 -100 150 -464 -649 -58 -335 -568 155 106 -712 230
2746 230 141 -592 -24 99 -757 115 335 -7 -370 136 -185 -166 -32 149 -213 124 242 -424 47 -33 -305
2767 -305 -314 578 -111 -418 -68 253 -610 295 362 -236 87 342 -108 -13 588 -196 -390 396 141 -129 453
2788 453 22 -215 10 184 209 -136 362 -85 -315 243 135 -161 339 28 47 279 173 -453 -268 357 118
2809 118 -179 580 -4 -142 455 187 -148 298 605 -386 110 365 -242 79 348 88 -135 195 -307 -280
2829 -280 128 250 202 427 28 -556 10 406 29 11 426 66 -281 296 -147 -433 106 122 -393 -106 445
2850 445 41 -72 14 178 -227 59 219 -101 136 317 -517 120 81 -132 -197 133 -600 -347 117 -7 -327
2871 -327 147 22 -337 110 239 -65 -364 27 -416 -309 236 -45 -80 178 -277 -201 98 207 -341 -276 1
2892 1 -130 -191 628 -27 -111 372 -53 -212 120 343 -251 101 150 -424 -48 54 -76 -36 560 173 143 183 -98
2915 -98 -358 107 346 -21 86 172 -79 -428 147 42 -165 332 127 -335 165 -91 -337 -84 304 -154 -63
2936 -63 685 34 172 318 243 -236 96 372 4 231 475 -15 -405 612 15 -111 110 72 -1 298 -73
2957 -73 -182 -225 371 -147 73 129 -214 52 464 -35 67 354 -222 -284 320 95 -493 86 81 -297 -53 415
2979 415 -156 -106 397 -139 -320 109 44 -320 126 -219 -244 -128 1 -46 -315 -72 -178 -144 128 -282 -244 261
3001 261 -68 -391 260 216 -153 -266 73 -49 -192 260 -255 -406 289 -153 -218 391 37 -97 -90 129 -112
3022 -112 -192 55 -168 25 113 -68 -247 79 -67 83 -125 408 -26 167 91 -162 133 367 136 28 460
3043 460 60 -203 264 382 -272 -133 241 179 -140 374 213 -192 7 -233 -434 66 303 -23 322 379 11
3064 11 10 259 405 -295 18 -143 -272 -13 -81 -53 84 214 -294 -127 135 -55 167 368 152 -222 156 79
3086 79 -70 214 367 138 -400 419 -367 -202 402 -138 -331 117 -79 -387 -62 200 -237 -104 5 -271
3106 -271 -256 333 227 -500 101 -129 -336 17 242 -411 -126 -191 -249 4 -216 -365 -304 175 213 -276 -67 157
3128 157 -444 33 16 -573 -307 205 -393 -298 160 -188 14 363 205 -456 -112 28 -355 -83 -24 80 -12
3149 -12 433 -200 -117 30 -25 18 -140 99 -350 -85 353 -327 -188 118 -577 60 345 183 -278 130 106 -160
3171 -160 233 -188 62 -41 -93 115 -199 187 10 -250 450 -252 129 -53 214 -302 -226 331 -240 -169 126
3192 126 -35 -128 350 196 -92 248 190 -183 -47 174 -262 -144 482 -241 -258 277 30 129 -31 -45 -101 -13
3214 -13 0 -251 209 37 -215 80 -18 -107 -163 133 -131 24 197 138 -192 -235 226 -226 -12 272 -173 71
3236 71 203 -124 -29 -60 33 -341 311 334 -246 -145 74 -277 -77 301 -233 -284 156 73 -285 402 -106 -433
3258 -433 148 224 118 -10 200 117 31 38 -180 -179 240 -171 -345 159 -117 -267 -122 -19 -140 -3 568 -78
3280 -78 -117 206 135 -36 12 262 51 193 115 27 -1 341 -124 23 -161 -98 -212 44 -160 -317 398 341 -129
3303 -129 97 416 -78 148 -73 40 28 273 -20 -149 398 284 -47 42 39 57 175 341 -127 -214 121 -45
3325 -45 -195 31 231 -406 -18 127 -67 -196 201 70 -110 47 -153 -253 -47 -255 -253 -26 154 -83 14
3346 14 31 -257 -44 140 -166 128 180 -22 -41 89 42 -108 -251 -26 -279 -133 125 -196 -260 142 -33 -314
3368 -314 -2 -97 -247 115 234 -514 137 -11 222 -227 218 -172 -240 184 89 -69 106 -262 -272 63 376
3389 376 -524 -214 296 108 15 175 -93 -69 -183 197 110 24 -269 -182 19 99 -96 -137 16 -29 384 386 115
3412 115 -107 159 -94 12 -51 21 -206 283 100 -167 26 133 27 65 98 61 -103 -26 146 444 -34 12
3434 12 145 3 171 188 -120 291 191 -13 143 210 -170 -130 119 -82 117 51 102 79 -214 309 -339 153
3456 153 -18 -167 -131 124 29 -326 43 -47 -74 -73 -47 -262 288 211 -337 108 87 -193 -148 278 -138 -209 -53 -32
3480 -32 -136 -83 414 -92 198 44 128 -93 317 -311 -183 17 13 23 57 -212 -26 -116 -19 -147 -52 166 21
3503 21 -36 -44 -13 -229 -43 231 -133 -94 -188 -190 -5 87 92 -290 317 -388 -180 -181 -65 -412 97 37 -316 -331 112
3528 112 109 22 174 -101 -130 -187 280 50 151 -222 24 250 325 -345 106 167 -108 -13 338 76 -37 128 -113
3551 -113 -25 306 -69 101 120 79 -141 249 521 -74 269 141 -52 -199 33 -137 193 108 310 -178 -173 -165 -187
3574 -187 71 -125 -103 78 112 -72 -111 27 -140 -195 393 -43 -125 -16 54 10 18 151 22 -340 55 122 -322
3597 -322 272 282 -134 -100 72 -178 115 -104 -78 -215 -61 -124 -22 181 168 -297 31 -29 -100 -13 193 -2 -96
3620 -96 -45 -313 62 -334 -9 -110 107 -223 94 346 -136 50 62 79 -76 -104 -70 181 -103 458 43 41 100
3643 100 172 -118 -93 -284 -168 -170 181 -152 -325 12 9 -94 336 -69 296 -278 201 62 -366 105 -113 17
3665 17 112 139 47 361 99 158 1 551 215 -256 309 212 -51 52 207 23 143 268 -262 210 68 -248
3687 -248 202 -22 72 221 -52 132 -52 33 18 -68 -56 -162 -215 -187 -26 -43 50 285 0 -90 -4 -35 -338 75
3711 75 -77 45 229 156 -67 -17 198 -151 -117 70 -150 -20 199 -540 174 -340 -113 87 157 262 -195 -154
3733 -154 -22 320 58 -39 13 -142 -241 -30 -58 26 -237 139 213 -74 -307 -132 311 -108 -467 -68 53 -331
3755 -331 -126 -262 5 30 -100 194 220 174 -3 -83 201 399 -204 -177 43 58 129 440 -226 -65 -12 141 202
3778 202 208 -169 -15 195 -101 169 -164 383 -225 269 -6 103 228 46 100 -126 154 133 14 51 -153 -326
3800 -326 71 25 283 -340 167 -64 196 90 -265 -235 36 -511 -110 100 120 136 -272 61 -88 70 340
3821 340 23 -196 228 69 -448 -171 163 125 -50 -172 177 4 109 -40 85 332 135 -4 -51 -77 29
3842 29 -200 242 -61 88 -97 33 53 5 31 -42 261 -150 -35 89 -87 169 -223 162 229 -8 -93 -155 -244
3865 -244 14 26 27 152 129 131 -27 -56 -159 -191 -143 -150 -30 -319 -17 40 -70 -186 -117 195 -30 -190 -151 105 164
3890 164 -1 183 202 105 -72 -85 104 -16 -80 -262 -81 -160 -1 -30 -204 -64 299 -213 -225 -8 -69 -188 -111
3913 -111 169 28 -18 -296 123 -74 50 137 11 118 -5 -63 -354 261 -27 116 -132 45 133 -131 150
3934 150 -233 -163 16 176 191 337 43 -179 -92 173 -57 -94 41 -160 -153 50 63 159 161 -32 -178 -33 484
3957 484 -48 -178 32 -61 -227 25 14 126 -49 -42 -172 275 -8 115 340 -70 -191 -44 177 -106 165
3978 165 7 -18 -350 -96 235 -243 -239 103 191 -25 -224 -231 87 -196 271 -215 -384 194 -48 10 69 174 -161
4001 -161 -59 -195 15 -186 66 145 126 92 97 142 -285 -238 122 113 -13 -17 45 89 108 -269 -155 116 33 123 110 34
4027 34 94 -63 -47 357 -94 21 149 23 -154 -12 87 -330 -8 -86 215 153 15 -50 121 41 -17 41 93 139
4051 139 -105 306 -12 58 88 389 -70 -10 -82 226 -198 -214 253 -308 -41 122 138 -137 123 54 110 -164 -22
4074 -22 -147 311 38 -217 -100 27 -283 11 -332 -124 159 -171 122 36 309 123 -181 -123 -75 52 -12 54
4096 54 -288 -51 -58 74 224 -315 -200 136 99 -26 -169 -29 -24 -137 -132 13 93 -14 48 -7 -223 118 269 56
4120 56 -25 289 -161 109 -40 153 -3 391 54 -124 -39 -175 102 -34 201 167 87 -97 153 181 -70 17
4142 17 -230 296 -238 -203 -137 -15 30 -99 128 -187 107 6 13 83 218 101 -172 66 323 -32 249 233 -125
4165 -125 228 235 -15 288 10 -116 101 25 -135 -53 206 -79 -200 101 167 120 -145 -133 218 79 3 7 -377
4188 -377 -76 -117 -331 -35 87 -145 225 128 -290 -99 217 12 197 -100 184 208 -36 -474 100 -56 -197
4209 -197 -91 50 271 -43 362 350 -94 -78 239 96 -31 46 115 -157 -255 109 -89 -242 -196 240 -273 10
4231 10 -409 -189 122 285 36 -62 -5 114 83 -21 -22 -97 131 -5 100 -199 118 -199 -14 130 220 60 -9
4254 -9 -88 -165 -102 179 118 -107 65 -161 -230 -49 189 -122 -165 40 -83 -298 38 35 -72 -23 -20 -88 -155 -203 124
4279 124 -8 33 -75 291 -53 -236 134 108 2 -202 182 324 -15 12 43 -101 304 -201 118 -51 14 -58
4301 -58 -11 125 -365 28 -55 25 38 -226 -100 -120 -218 240 150 -62 14 318 -146 -176 -155 1 -54 -115 158 145 190
4326 190 209 134 11 99 64 261 -151 146 -392 39 164 -230 -229 115 214 155 78 -20 -131 286 -437 -203 -62
4349 -62 -159 -141 -109 118 -225 -142 -47 -20 -251 -353 -39 -29 -51 20 44 27 -185 5 331 -295 125 -161 87 5
4373 5 67 -39 90 41 -33 -31 397 -5 129 -149 -66 192 -190 -183 -221 56 -336 28 -233 -2 -50 439 -151 -244
4397 -244 -200 159 -182 36 78 176 -103 144 -294 96 118 29 -429 -55 105 -190 -114 161 -95 -201 -16 -7 -55
4420 -55 136 16 76 297 162 140 -30 -46 209 148 -185 133 -99 -4 -44 34 177 -239 -49 338 128 196 -128
4443 -128 -2 -82 -89 -289 -118 -88 -4 203 74 -253 -64 336 203 -52 170 319 227 238 -49 -177 18 19 -270
4466 -270 128 -34 42 19 -246 191 169 69 25 499 58 -111 -6 123 105 -269 216 -344 107 92 96 -79 -77
4489 -77 265 229 -127 -273 -407 222 131 -5 -159 48 56 -4 -189 27 -13 96 -13 -618 44 -22 -54 -4 171
4512 171 -89 307 -285 135 98 -298 -42 -2 -329 -35 125 -77 -4 -17 -10 -50 -43 90 -416 152 183 -172 -262 73
4536 73 319 168 -226 227 -114 204 242 32 131 239 -139 -18 158 51 -120 42 122 10 175 237 -115 -53
4558 -53 -155 18 272 -135 125 -20 -239 -60 -289 127 -478 -223 -104 10 -95 -47 355 -162 -141 -33 -146
4579 -146 143 -132 71 217 -100 -227 625 -137 45 -303 -39 -47 -1 84 32 237 31 371 195 -132 -420 286
4601 286 -56 -133 -285 -27 297 82 20 380 168 -23 -84 128 97 -401 93 118 -23 -79 -293 120 107 -18
4623 -18 -219 123 126 142 -141 -183 20 -177 -19 -196 2 -45 -87 79 -172 20 46 -44 -331 -95 -152 -73 -89 -118
4647 -118 46 139 109 16 273 -104 -70 -123 65 -173 25 112 -7 -416 227 -87 20 67 91 228 25 -184 153
4670 153 -50 39 -79 248 -88 108 211 324 -260 -21 287 -164 -94 -35 217 17 5 -59 -194 -247 -2 -116
4692 -116 -141 -214 78 -166 -221 240 -56 126 433 -312 -4 43 -126 -246 -105 196 -77 80 91 -46 109 13
4714 13 -89 61 56 -12 210 62 105 -50 -345 -264 15 -154 3 -62 62 -51 0 -177 -14 -150 -141 -53 113 -105
4738 -105 -20 406 -253 -225 -96 -473 -146 -154 -104 -170 195 127 95 222 50 172 -53 -128 28 354 48 -15 -9 -128
4762 -128 98 -85 -1 -47 -115 204 45 -32 47 116 -103 -20 395 -72 -90 28 115 -235 -211 73 307 -70 -203
4785 -203 -150 172 -42 -293 -207 -343 153 -70 147 -247 -23 101 -144 98 15 -171 -183 456 -69 202 -30
4806 -30 -200 -60 -224 164 106 4 222 7 -283 246 0 -153 106 -131 108 1 -103 -113 -259 -43 -287
4827 -287 78 -22 236 57 104 121 -208 -34 229 -54 23 -53 284 -106 250 88 -122 4 115 73 -52 15
4849 15 -27 110 -163 68 -32 4 266 19 -22 -107 -81 -275 114 -204 -32 41 19 -100 -236 23 134 34 141
4872 141 -18 -235 67 23 84 115 -209 -206 -187 117 -186 -8 -3 8 26 -255 -207 -149 308 274 -51 218 11 -53 100
4897 100 1 232 10 122 -149 25 317 -205 140 -121 -23 240 -6 114 -141 83 -210 287 128 -130 158
4918 158 311 217 -301 -76 -50 -112 -242 -124 314 -127 -27 68 -181 -162 9 -263 -16 246 -79 -137 60 329
4940 329 -53 160 -24 -156 -271 -20 -388 186 -3 -258 -124 169 223 -129 -399 -35 -120 -95 -151 338 -273
4961 -273 118 -63 237 27 -39 200 -4 308 -1 -91 -17 -39 -28 99 -39 142 110 -93 -225 172 -65 77
4983 77 -93 -302 -154 -278 -193 -54 -348 5 -208 -27 -147 -24 -57 78 294 35 -277 -90 -104 -125 -24 -76
5005 -76 -152 -353 -224 -5 -108 52 -335 221 138 -36 -50 100 200 14 -191 128 -91 199 252 122 3 -58
5027 -58 -95 -51 8 40 206 86 5 -122 141 6 -292 -44 171 -266 276 -156 -40 -286 128 84 -20 167
5049 167 -8 27 191 -162 -146 -66 401 48 -154 -91 5 168 112 165 69 111 -126 6 28 70 -58 -53 -26 -103 58
5074 58 -24 -116 -174 -193 77 -36 121 -5 261 -166 -6 -110 109 -68 -126 -65 93 -69 -164 -173 59 -88 105
5097 105 76 28 -214 -134 -106 -158 22 82 111 -154 187 -142 -55 -61 88 169 -338 82 219 -82 120 218 -100 61
5121 61 -202 290 141 -101 345 229 221 82 172 69 133 -260 444 -134 126 -280 -236 47 214 -175 157 -56
5143 -56 -10 -19 -101 71 -212 105 153 -132 -298 -203 36 165 253 65 -9 226 -101 -307 -15 138 -156 14 -20
5166 -20 -85 222 41 -180 70 169 -8 187 168 -117 -208 146 77 -166 64 -10 -98 -109 188 63 -3 -15 190 -124
5190 -124 563 -171 134 -229 -285 -87 -200 47 -169 99 -92 169 106 -143 -323 -40 284 -23 139 68 -176
5211 -176 -373 -289 45 34 163 -62 361 186 -113 335 -227 -173 125 104 -134 0 67 213 -72 250 -35 -371
5233 -371 -13 -58 255 216 -69 -290 -236 -200 24 186 -254 -258 -141 202 -207 194 126 -144 -26 -237 -57 -249
5255 -249 60 60 -121 17 -298 -167 29 110 -12 -199 279 -119 -15 -74 218 9 -114 120 2 39 -277 -44
5277 -44 248 13 -104 -32 24 47 -221 -38 11 8 160 16 -108 141 140 -203 14 67 -64 233 -212 -96 -177 62
5301 62 287 -89 93 141 44 320 135 -392 -34 -293 -326 64 267 -179 -160 48 196 -129 11 -106 170 87
5323 87 -74 -289 138 229 29 -34 61 123 14 -92 -110 53 5 -122 -184 82 197 29 66 75 -84 95 75 -142
5347 -142 120 95 67 127 129 296 183 -7 -31 -197 93 170 415 60 156 72 297 52 -4 -156 24 93 -67 -182
5371 -182 189 202 220 95 210 141 5 216 51 -44 -428 303 -258 308 -378 -271 -35 -77 -150 -189 -291 101
5393 101 -96 -59 -82 19 -4 141 25 -19 158 -147 130 -68 -87 197 216 -252 15 314 146 -185 358 171
5415 171 263 321 59 -38 127 -342 -93 -86 4 -287 -6 -202 -8 62 67 -446 -29 -60 -57 -98 -226 -198 -42 -15 25
5440 25 -236 -184 -9 -138 -77 -79 192 -278 89 93 -267 345 219 49 162 -6 -200 125 97 -225 222 28 3
5463 3 70 136 -313 48 218 289 -168 206 162 110 -83 -305 41 91 13 87 -49 40 -118 73 -190 27 -151 -25
5487 -25 -197 -32 100 169 -150 -12 61 -88 -195 -215 -119 87 -152 -209 -146 61 7 -168 94 -134 14 280 -156
5510 -156 70 305 30 81 72 53 -18 152 118 115 190 -24 -169 35 36 77 -16 -28 -45 76 35 20 14 -102 88 -149
5536 -149 39 -116 -203 12 83 6 45 50 -139 -33 95 -207 27 -18 -10 159 -90 -436 297 178 -26 -61 214
5559 214 44 -89 -133 23 -227 40 55 -117 -140 168 231 -48 293 174 -88 -141 256 -2 113 -43 -123 62
5581 62 -12 -231 -2 325 -440 -85 47 -191 248 -352 68 69 -8 287 244 48 52 -75 -21 -30 -238 118 15 46
5605 46 88 50 152 -23 231 -347 -12 -120 -182 -17 -94 297 424 -184 19 87 169 -172 293 65 170 13
5627 13 87 188 140 -64 2 150 106 -257 12 125 43 30 293 183 146 116 282 -228 11 -136 11 -280 17
5650 17 -5 -62 32 -126 -181 255 166 -249 -8 367 70 -136 141 -444 306 376 176 -348 -260 -31 17 246 264
5673 264 -311 -97 101 -182 66 -229 -106 -103 -47 3 -19 52 54 -212 -93 321 -339 -159 297 -127 -91 69 299
5696 299 146 -201 118 83 -106 11 -22 -164 322 312 255 -126 -88 -12 69 -274 88 -48 -119 -150 84 149 61 -103
5720 -103 147 -24 -195 -59 17 -118 -98 197 -429 -94 -20 83 88 -86 -332 257 -376 179 -32 12 9 -21 115
5743 115 -116 -155 -150 -235 -73 375 127 -135 -19 582 -286 -96 154 -127 -90 -137 -22 143 64 433 92 -114
5765 -114 362 -133 -207 141 252 -269 363 111 -106 -142 52 63 5 -16 -69 -153 38 151 -146 312 -163 -27
5787 -27 20 -94 -245 -71 -125 138 -61 213 268 48 -225 94 39 73 102 -58 -191 -231 53 -262 -336 98 13
5810 13 13 297 -272 80 46 -126 63 -194 -91 -18 -202 3 9 -113 -402 -106 173 47 -96 169 113 166 226
5833 226 63 65 165 209 -75 -115 -219 273 -62 -21 198 -223 -1 302 64 154 197 373 -325 228 248 -164 80
5856 80 179 202 -353 -25 100 77 -123 -35 -176 287 -16 -56 52 93 -102 -46 82 -31 -22 -197 -315 -45 -140 437
5880 437 -46 194 -307 13 277 247 -33 92 24 18 -35 44 -107 -84 128 -83 113 -46 -124 -154 196 -226 -3
5903 -3 44 -9 -19 -32 78 -180 79 220 101 -215 43 343 101 -458 -137 4 50 205 71 -50 7 40 -173
5926 -173 331 9 -301 -184 203 -170 113 159 -63 -97 -1 -278 130 230 21 -79 -49 -95 -214 -128 62 57 186
5949 186 123 377 4 -100 80 -567 142 28 72 -207 82 40 -116 -215 -34 -479 114 -17 94 122 229 -103
5971 -103 173 686 29 -16 -97 -26 224 189 -226 72 -4 186 164 3 290 -110 -65 73 -255 245 310 -122 -74
5994 -74 211 -13 80 -17 -101 -193 81 -293 -204 -136 -137 270 -437 -167 -152 54 -345 54 -7 -75 -213 -138 8 -5 45
6019 45 -110 325 -111 -293 -137 189 -54 86 128 -241 280 271 249 -61 385 -97 61 124 171 -133 -240 -144 -60
6042 -60 73 397 -42 -60 -76 -323 32 269 103 -34 -201 221 11 -262 -2 141 -273 100 -164 -322 -113
6063 -113 20 127 -10 214 -61 22 -27 42 89 -280 -169 125 -179 109 264 -106 1 33 -275 101 -166 -14
6085 -14 170 -53 147 69 108 286 232 -33 -59 179 -16 -382 318 -160 -180 -8 207 382 -57 269 29 23 -102
6108 -102 114 86 -242 -46 23 133 8 -140 -42 113 134 147 -46 47 -4 459 -98 -112 104 59 28 -17 19 111
6132 111 54 -24 24 -104 269 175 -281 86 -5 -75 -92 3 -3 -179 -112 -244 -234 205 -44 -374 -84 -87 -322 -125 45
6157 45 -80 4 49 -351 36 -53 -187 -312 -185 91 -9 -90 21 -7 66 306 -24 326 102 -316 16 -38 18
6180 18 248 -13 -151 -176 243 -7 112 -24 104 -252 174 154 -95 -212 -137 -244 -202 -32 356 -123 -223 -47
6202 -47 17 199 -28 242 22 92 63 -55 -85 16 17 -273 -553 131 -95 210 -183 87 107 -256 -28 117 44
6225 44 -30 -235 91 -52 -32 57 -142 -172 57 -170 -80 65 -82 -164 -44 187 -35 -37 125 -239 277 41 31
6248 31 23 -142 263 10 408 -257 -136 -128 94 2 -172 -11 -10 111 -186 478 -329 -302 -116 -145 -298 -39 23 -140
6272 -140 -17 -9 -303 -56 -189 -115 480 -89 -27 199 -108 -208 -132 -131 -377 -53 4 80 44 54 -276 23 263 142
6296 142 -89 23 109 -190 111 12 -298 -275 76 152 40 -264 31 -265 -37 -70 145 -194 322 114 81 117
6318 117 -22 -285 86 -142 104 -191 77 -117 -108 -248 1 -125 -166 56 138 -37 149 -19 -143 321 70
6339 70 48 29 2 85 191 347 -285 72 209 146 -30 -174 -60 -222 25 -130 157 -124 -9 443 50 -95
6361 -95 168 66 67 -6 4 -419 -96 -45 -132 21 57 121 -352 69 115 37 269 146 84 -8 -45 454 -163 94 206
6386 206 -322 63 93 26 -133 143 76 -55 -107 65 -89 87 53 273 -241 147 -267 -56 -64 19 -186 -35 7
6409 7 -203 142 125 114 -104 -174 -143 -188 237 242 -228 279 -90 -131 119 328 148 181 164 -201 73 32 46 -173 -137
6434 -137 49 138 1 -144 -64 4 96 110 125 88 -290 -175 94 -375 -72 189 -23 -34 -157 96 203 -214 -132
6457 -132 -146 -22 187 -133 75 -292 15 -87 31 291 274 -5 2 64 -121 4 392 220 190 -157 -119 249
6479 249 82 47 191 125 -481 -110 119 -109 23 -21 116 -188 -96 234 0 42 -35 -453 -93 -151 -232 -344 27
6502 27 83 -26 103 -26 12 -155 -173 -177 -151 237 -79 70 -26 -66 -54 43 82 -326 142 -102 -137 -88 146 -16 376
6527 376 -75 -87 -259 -144 -128 189 -24 302 265 -189 -93 64 196 228 -71 -113 -17 -38 124 94 119 8 99 79
6551 79 -22 -53 -59 270 -156 20 -146 -283 -32 -68 -25 222 -101 -153 148 -52 -14 337 166 -37 119 -19 -24
6574 -24 -223 30 249 34 89 254 -300 86 -175 35 -99 196 -100 -126 249 -72 -135 188 127 -3 29 -193
6596 -193 -22 207 -74 232 156 287 111 113 -164 81 22 34 -201 -351 58 -37 -270 88 -27 -54 -19 27 -155
6619 -155 -111 -8 292 -48 257 270 -308 -112 -120 -197 26 -69 91 -46 258 8 -70 -3 -101 185 -430 -154 73
6642 73 -265 216 116 64 109 23 341 57 182 -45 301 -96 272 13 -72 50 220 152 -4 -47 -150 -254
6664 -254 -270 -108 -134 -33 -181 -123 -90 -281 -141 -412 -5 -3 -176 -76 205 -192 -190 155 100 71 10 -3 -262 -167
6688 -167 46 364 182 -303 41 -258 -88 255 -134 -269 138 -430 -10 264 -136 68 -49 11 19 206 276
6709 276 60 -286 -28 -57 -164 -55 -324 6 216 43 43 54 -205 25 -8 16 137 -348 -35 289 235 159 146
6732 146 -178 -49 61 -99 242 307 232 54 197 -166 305 464 107 -242 9 142 -25 180 39 -151 -7
6753 -7 -39 -140 130 136 -120 49 123 -155 169 -24 297 -61 -53 -12 -13 -139 -57 -307 146 215 -269 22 435 236
6777 236 -101 220 24 -485 -65 256 -100 47 173 94 95 -372 -157 55 -107 67 -59 271 117 -204 159
6798 159 74 -195 54 263 23 -273 -176 -54 24 10 190 29 -6 -198 202 165 18 14 7 147 14 -200 -84
6821 -84 -130 -181 87 -26 -29 152 230 -29 -89 94 95 -301 -169 124 257 134 107 -51 246 -114 47 -102 128
6844 128 -15 156 -78 43 148 347 6 -279 -435 -164 41 248 94 193 -56 -144 -13 6 283 63 151
6865 151 320 124 -281 -59 13 60 -23 92 107 -75 18 301 -217 201 307 86 -193 14 28 -65 301 198
6887 198 -102 53 23 -212 -36 134 81 -120 163 199 76 -98 48 13 22 -16 297 44 -129 -243 -116 -59 38
6910 38 -244 24 153 116 -74 138 -53 -231 483 -213 -242 -75 31 220 163 -168 -36 -28 -218 29 -177 -96
6932 -96 -221 419 89 -209 -53 -12 -114 -124 37 -129 237 238 155 -103 54 -31 83 97 -128 83 -101 152 453
6955 453 -60 41 78 81 -58 103 -228 39 -32 -135 -277 -33 160 279 -123 -162 -13 74 -79 77 138 -372
6977 -372 -244 -123 -131 -210 -131 273 69 137 184 179 -15 -93 -22 -136 414 -85 -96 40 -76 -67 -60 -42 41 36 221 -178
7003 -178 -112 122 138 267 149 267 127 -56 121 110 -372 -12 174 12 -94 333 -137 337 455 -358 -43
7024 -43 -324 -96 -27 133 103 -139 157 -177 -50 -362 193 -75 249 125 -217 8 -122 38 -284 101 80
7045 80 -54 137 165 -39 -5 -158 80 40 73 105 108 143 135 -87 -149 -229 -568 201 -163 -93 -113 233 -58 250 -220
7070 -220 13 -89 10 173 201 -147 -63 -67 272 69 -20 120 91 277 190 -161 -234 -59 256 -108 -43 282 70
7093 70 -139 -204 -109 -69 183 -219 -136 90 77 213 -58 -74 315 -64 367 279 44 235 191 222 -3 60 312 -29
7117 -29 16 -337 -185 -277 -104 -266 -34 10 65 -34 302 38 127 17 60 -4 19 -17 -199 362 -146 -336 -116 216
7141 216 12 -131 267 -175 156 132 78 -112 -112 133 -144 58 -155 -289 -378 11 97 -251 -63 51 -226 -326
7163 -326 31 -228 29 182 250 264 -35 106 -179 -254 -72 -155 -299 -138 30 272 57 -153 -128 -131 -55 24 92
7186 92 106 151 58 21 -354 -175 261 34 2 -104 238 -55 -2 39 -173 288 101 -404 -64 -48 -58 13 292 -189
7210 -189 -46 96 -84 104 121 74 -188 -204 15 -247 -26 264 -55 2 154 -108 61 203 9 241 176 180
7232 180 -179 -56 4 98 -220 -217 -228 -152 144 233 194 73 -153 -108 -157 99 142 131 230 225 -87 -265 116 -19 -24 81
7258 81 -111 97 342 -140 153 69 -382 66 -89 -269 72 124 -21 25 480 -170 -62 174 55 185 -133
7279 -133 -39 -303 159 -56 221 -17 15 -122 -213 148 18 -102 -149 122 -88 -92 179 -213 -283 93 -350 -168
7301 -168 -23 56 31 -52 29 132 -147 202 125 -330 84 80 249 170 68 227 203 285 62 -287 -179 90 -14
7324 -14 -22 242 115 361 265 -77 262 -6 400 164 -118 -117 42 -39 -59 -48 88 -223 10 -101 53 -7 309
7347 309 68 127 105 -201 -181 81 -197 -27 -265 106 -172 -41 51 39 -2 4 66 -99 31 58 -209 -111 -8 -155
7371 -155 258 82 -94 48 -2 -100 94 68 385 36 321 22 184 29 204 278 -221 140 203 -132 -96 -35
7393 -35 -458 185 -158 -500 -273 -97 -402 -40 151 -53 287 125 -141 -92 -91 205 -85 -62 12 -228 -260 -151
7415 -151 -30 130 170 -190 -312 119 -156 -115 -138 -76 -169 -255 110 -197 72 -211 -141 -207 -188 -113 -117 8 147 184
7439 184 34 49 -395 37 79 -112 -103 -156 189 -244 -131 102 -230 -10 -33 -85 184 6 124 200 124 129 -103 -15
7463 -15 -139 -432 157 81 -104 -94 375 106 -99 134 203 -316 207 -123 -81 -34 -257 86 -115 172 185 170 -129
7486 -129 -151 -191 187 228 24 -161 89 430 -75 -197 -126 -42 -241 99 -284 -54 104 146 -13 -181 -8 90
7508 90 -56 69 -96 255 180 215 149 130 53 232 268 222 -268 -92 188 69 111 97 118 147 353 123 -66 -21
7532 -21 -80 -42 207 48 -292 120 238 -25 114 339 -224 58 269 117 -168 101 5 136 296 148 58 35
7554 35 -216 -172 -153 -12 -13 132 -145 -51 -160 -81 -227 12 164 133 -178 -286 -185 -40 287 3 62 -170 147
7577 147 -109 80 32 156 112 41 124 -160 7 219 46 70 41 -174 -159 -260 -222 -57 319 336 -334 14 -133
7600 -133 170 186 113 -53 305 -87 339 63 120 32 309 12 26 -41 -150 32 -317 239 -52 3 31 208 -155
7623 -155 -363 -146 -85 -31 -118 -220 -20 -21 -191 -83 -108 -208 -117 -381 91 154 -225 -35 15 -44 -121 -164 167 22
7647 22 -58 -129 53 151 79 -111 -225 255 120 231 144 3 6 81 -49 144 29 -80 -376 -84 -233 85 -84
7670 -84 36 -5 108 -73 -27 -72 112 61 205 -348 176 -223 -130 -140 -93 74 107 29 -254 -212 -330 -122 -176 -96
7694 -96 -176 453 113 -123 81 -152 -96 64 -238 -34 -55 -147 -345 -100 199 -60 8 124 -61 239 -188 -61
7716 -61 -224 -33 234 50 39 244 82 -71 135 -43 -101 -373 57 2 -29 -254 171 97 197 144 -156 66
7738 66 416 -161 -22 -141 48 -195 64 -317 91 71 -260 -78 -23 50 -271 -221 47 -244 25 285 -22 -234
7760 -234 39 -209 -44 -328 -136 119 334 127 61 -27 -130 -2 129 13 241 222 389 -65 -57 24 22 -85 -132
7783 -132 -5 84 84 522 -133 -147 161 -16 106 -30 -37 16 -98 207 76 -309 150 -196 1 -28 -126 97 178
7806 178 -285 -95 102 289 9 249 69 -151 114 368 -111 -242 36 -236 102 3 158 157 -34 71 100
7827 100 41 223 -95 -46 111 50 63 77 -154 107 -89 -66 -110 18 -491 -319 -149 -174 30 22 252 -150 63
7850 63 138 -103 -250 165 -84 -140 -300 57 -142 -176 -208 -132 -238 -74 27 -39 -123 0 -100 64 -266 -207 -23
7873 -23 102 -38 -100 -218 118 125 124 -123 199 641 -271 -332 -142 -165 -46 6 -80 -103 114 324 -62 305 258 39
7897 39 120 -169 -128 -350 157 -5 124 -61 -243 -25 -240 -40 190 -79 26 299 -183 -85 -17 -507 -279 123
7919 123 126 -223 341 -219 96 -14 -72 -95 52 46 -27 -178 86 62 119 136 61 60 -88 111 -170 320 78 149 -16
7944 -16 24 -79 -84 109 -124 65 225 149 -132 189 -108 4 -58 -68 -121 -49 356 63 17 -37 -77 -11 -39 55 -28
7969 -28 160 -17 172 204 206 151 199 -6 57 -154 41 204 -347 40 85 -243 -33 -188 117 218 103 -475 39
7992 39 333 -241 44 216 22 -270 166 -81 232 105 362 75 -97 111 -93 -380 -318 -144 97 14 94
8013 94 -178 -66 262 -148 -53 314 144 285 134 52 -41 213 -182 -103 134 -69 229 -113 -154 -293 237 -155
8035 -155 -164 45 -265 -213 -293 54 129 -97 195 161 113 -178 -116 -94 -104 231 -10 -113 69 216 -326 45 89 -43
8059 -43 249 -19 348 162 103 -48 29 185 38 -12 -602 183 24 -118 -102 31 131 64 -138 -114 181 -58
8081 -58 -113 -134 -446 -274 51 259 -45 -12 -177 -65 159 -19 280 -13 -130 145 356 -31 -213 39 66 45
8103 45 294 6 70 -226 26 -190 47 122 -65 312 -57 75 -12 43 -36 38 169 24 157 5 -159 -30
8125 -30 -190 77 191 121 -406 -122 -16 180 -399 -117 115 -114 -67 120 -24 149 77 -148 -57 228 -15 -548
8147 -548 91 -129 -173 11 190 -262 145 -10 46 -22 -260 131 16 59 165 53 42 -470 -169 -72 -197 -69
8169 -69 -75 55 179 -61 4 -184 130 134 195 -86 345 108 -108 153 -223 -262 -87 -25 82 -498 11 -163
8191a63
##END NTUPLES=NMR FID
##END=
