##TITLE=1H_Pr 5-2-ion
 CDCl3, 8 sc, 
 5.6.2020
##JCAMPDX= 6.0         $$ Bruker NMR JCAMP-DX V2.0
##DATA TYPE= NMR FID
##DATA CLASS= NTUPLES
##ORIGIN= UXNMR, Bruker Analytische Messtechnik GmbH
##OWNER= root
$$ XWIN-NMR		Version 3.5
$$ Fri Jun  5 11:38:51 2020 Russian Standard Time (UT+4h)  she@DPX200
##.OBSERVE FREQUENCY= 200.1315
##.OBSERVE NUCLEUS= ^1H
##.DELAY= (6, 6)
##.ACQUISITION MODE= SIMULTANEOUS
##.ACQUISITION SCHEME= undefined
##.AVERAGES= 8
##.DIGITISER RES= 18
##SPECTROMETER/DATA SYSTEM= spect
##.PULSE SEQUENCE= zg30
##.SOLVENT NAME= D2O
##.SHIFT REFERENCE= (INTERNAL, D2O, 0, 15.7039)
##AUDIT TRAIL= $$ (NUMBER, WHEN, WHO, WHERE, WHAT)
$$ ##TITLE= Audit trail, XWIN-NMR		Version 3.5
$$ ##JCAMPDX= 5.01
$$ ##ORIGIN= Bruker BioSpin GmbH
$$ ##OWNER= she
$$ F:/spectra/data/she/nmr/H-F/1/audita.txt
$$ ##AUDIT TRAIL=  $$ (NUMBER, WHEN, WHO, WHERE, WHAT)
(   1,<2020-06-05 11:37:52.79 +0400>,<she>,<DPX200>,
      <created by zg, POWCHK disabled, PULCHK disabled
       configuration hash MD5:
       00 E9 B6 7A A2 85 ED C7 34 08 36 98 17 FE 4E 26
       data hash MD5: 16K
       CF 14 17 02 2A 6B C3 83 2C AD 34 BB B9 3E 22 D1>)
$$ ##END=
$$ 
$$ hash MD5
$$ CE 57 F3 64 05 62 A7 08 56 84 83 4F 89 DF C8 57
##$RELAX= 
##$RELAX= 
##$RELAX= 
##$RELAX= 
##$RELAX= 
##$RELAX= 
$$ Bruker specific parameters
$$ --------------------------
##$DU= <F:/spectra>
##$EXPNO= 1
##$NAME= <H-F>
##$PROCNO= 1
##$TYPE= <nmr>
##$USER= <she>
##$AMP= (0..31)
100 100 100 100 100 100 100 100 100 100 100 100 100 100 100 100 100 100 
100 100 100 100 100 100 100 100 100 100 100 100 100 100 
##$AQSEQ= 0
##$AQ_mod= 1
##$AUNM= <au_zg>
##$AUTOPOS= <>
##$BF1= 200.13
##$BF2= 200.13
##$BF3= 200.13
##$BF4= 200.13
##$BF5= 200.13
##$BF6= 200.13
##$BF7= 200.13
##$BF8= 200.13
##$BYTORDA= 1
##$CFDGTYP= 0
##$CFRGTYP= 5
##$CHEMSTR= <none>
##$CNST= (0..31)
1 1 145 1 1 1 1 1 1 1 1 1 1 1 1 1 1 1 1 1 1 1 1 1 1 1 1 1 1 1 1 1 
##$CPDPRG= <>
##$CPDPRG1= <>
##$CPDPRG2= <>
##$CPDPRG3= <>
##$CPDPRG4= <mlev>
##$CPDPRG5= <mlev>
##$CPDPRG6= <mlev>
##$CPDPRG7= <mlev>
##$CPDPRG8= <mlev>
##$CPDPRGB= <>
##$CPDPRGT= <>
##$D= (0..31)
0 1.2 0 0 0 0 0 0 0 0.06 0 0.03 0 0 0 0 0.0002 0 0 0 0 0 0 0 0 0 0 0 0 
0 0 0 
##$DATE= 1591342672
##$DBL= (0..7)
120 120 120 120 120 120 120 120 
##$DBP= (0..7)
150 150 150 150 150 150 150 150 
##$DBP07= 0
##$DBPNAM0= <>
##$DBPNAM1= <>
##$DBPNAM2= <>
##$DBPNAM3= <>
##$DBPNAM4= <>
##$DBPNAM5= <>
##$DBPNAM6= <>
##$DBPNAM7= <>
##$DBPOAL= (0..7)
0.5 0.5 0.5 0.5 0.5 0.5 0.5 0.5 
##$DBPOFFS= (0..7)
0 0 0 0 0 0 0 0 
##$DE= 6
##$DECBNUC= <off>
##$DECIM= 24
##$DECNUC= <off>
##$DECSTAT= 4
##$DIGMOD= 1
##$DIGTYP= 9
##$DL= (0..7)
0 120 120 120 120 120 120 120 
##$DP= (0..7)
150 150 150 150 150 150 150 150 
##$DP07= 0
##$DPNAME0= <>
##$DPNAME1= <>
##$DPNAME2= <>
##$DPNAME3= <>
##$DPNAME4= <>
##$DPNAME5= <>
##$DPNAME6= <>
##$DPNAME7= <>
##$DPOAL= (0..7)
0.5 0.5 0.5 0.5 0.5 0.5 0.5 0.5 
##$DPOFFS= (0..7)
0 0 0 0 0 0 0 0 
##$DQDMODE= 0
##$DR= 18
##$DS= 0
##$DSLIST= <SSSSSSSSSSSSSSS>
$$ [...]
##$SUBNAM2= <"">
##$SUBNAM3= <"">
##$SUBNAM4= <"">
##$SUBNAM5= <"">
##$SUBNAM6= <"">
##$SUBNAM7= <"">
##$SUBNAM8= <"">
##$SUBNAM9= <"">
##$SW= 24.9337058887773
##$SWIBOX= (0..15)
0 0 2 0 0 0 0 0 0 0 0 0 0 0 0 0 
##$SW_h= 4990.01996007984
##$TD= 16384
##$TD0= 1
##$TE= 0
##$TE2= 300
##$TE3= 300
##$TEG= 300
##$TL= (0..7)
0 120 120 120 120 120 120 120 
##$TP= (0..7)
150 150 150 150 150 150 150 150 
##$TP07= 0
##$TPNAME0= <>
##$TPNAME1= <>
##$TPNAME2= <>
##$TPNAME3= <>
##$TPNAME4= <>
##$TPNAME5= <>
##$TPNAME6= <>
##$TPNAME7= <>
##$TPOAL= (0..7)
0.5 0.5 0.5 0.5 0.5 0.5 0.5 0.5 
##$TPOFFS= (0..7)
0 0 0 0 0 0 0 0 
##$TUNHIN= 0
##$TUNHOUT= 0
##$TUNXOUT= 0
##$USERA1= <user>
##$USERA2= <user>
##$USERA3= <user>
##$USERA4= <user>
##$USERA5= <user>
##$V9= 5
##$VALIST= <valist>
##$VCLIST= <CCCCCCCCCCCCCCC>
##$VD= 0
##$VDLIST= <DDDDDDDDDDDDDDD>
##$VPLIST= <PPPPPPPPPPPPPPP>
##$VTLIST= <TTTTTTTTTTTTTTT>
##$WBST= 1024
##$WBSW= 4
##$XGAIN= (0..3)
0 0 0 0 
##$XL= 0
##$YL= 0
##$YMAX_a= 252016
##$YMIN_a= -192832
##$ZGOPTNS= <>
##$ZL1= 120
##$ZL2= 120
##$ZL3= 120
##$ZL4= 120
##$ABSF1= 10
##$ABSF2= 0
##$ABSG= 5
##$ABSL= 3
##$ALPHA= 0
##$AQORDER= 0
##$ASSFAC= 0
##$ASSFACI= 0
##$ASSFACX= 0
##$ASSWID= 0
##$AUNMP= <proc_1d>
##$AZFE= 0.1
##$AZFW= 0.1
##$BCFW= 1
##$BC_mod= 2
##$BYTORDP= 1
##$COROFFS= 0
##$CY= 11.3945322036743
##$DATMOD= 1
##$DC= 2
##$DFILT= <>
##$DTYPP= 0
##$F1P= 16.9975609425685
##$F2P= -3.02152046262296
##$FCOR= 0.5
##$FTSIZE= 0
##$FT_mod= 4
##$GAMMA= 1
##$GB= 0.15
##$INTBC= 1
##$INTSCL= 1
##$ISEN= 128
##$LB= 0.24
##$LEV0= 0
##$LPBIN= 0
##$MAXI= 10000
##$MC2= 0
##$MEAN= 0
##$ME_mod= 0
##$MI= 1.114404
##$NCOEF= 0
##$NC_proc= 0
##$NLEV= 6
##$NOISF1= 3.799351
##$NOISF2= 2.8
##$NSP= 1
##$NTH_PI= 0
##$NZP= 0
##$OFFSET= 15.70392
##$PC= 1
##$PHC0= -9802.961
##$PHC1= 28.40082
##$PH_mod= 1
##$PKNL= yes
##$PPARMOD= 0
##$PSCAL= 0
##$PSIGN= 0
##$REVERSE= no
##$SF= 200.130013532006
##$SI= 16384
##$SIGF1= 3
##$SIGF2= 2
##$SINO= 400
##$SIOLD= 16384
##$SREGLST= <1H.CDCl3>
##$SSB= 0
##$STSI= 0
##$STSR= 0
##$SW_p= 3612.71676300578
##$SYMM= 0
##$S_DEV= 0
##$TDeff= 0
##$TDoff= 0
##$TI= <>
##$TILT= no
##$TM1= 0
##$TM2= 0
##$TOPLEV= 0
##$USERP1= <user>
##$USERP2= <user>
##$USERP3= <user>
##$USERP4= <user>
##$USERP5= <user>
##$WDW= 1
##$XDIM= 8192
##$YMAX_p= 0
##$YMIN_p= 0
$$ End of Bruker specific parameters
$$ ---------------------------------
##NTUPLES= NMR FID
##VAR_NAME=  TIME,          FID/REAL,        FID/IMAG
##SYMBOL=    X,             R,               I
##VAR_TYPE=  INDEPENDENT,   DEPENDENT,       DEPENDENT
##VAR_FORM=  AFFN,          ASDF,            ASDF
##VAR_DIM=   8192,          8192,            8192
##UNITS=     SECONDS,       ARBITRARY UNITS, ARBITRARY UNITS
##FACTOR=    0.0002004,     1,               1
##FIRST=     0,             0,               0
##LAST=      1.6414764,     0,               0
##MIN=       0,             -192832,         0
##MAX=       1.6414764,     252016,          0
$$ Real data points
##PAGE= N=1
##DATA TABLE= (X++(R..R)), XYDATA
$$ [...]
2757dj466K78K688n85k529l57K949M87l219l78K519J399k781o73J754J394j972
2774d96j880J729K282q61k702J059K079p28k059l9L249r99j817N8K297K49k381
2791i60n44K022O23j469j631J849J244j025k178J833J865j668k025J448K181j182
2807C83j960R23J892q8k499M16J768M40j901j133K284P67j674j366J300K294j946
2824a00j211P82K139j323k050J402K177r22k166L33K346J35k650k7J996O14k344
2841h69k49J988O72j957r24J622J059j203j599J355J656j089j997J534J490q69
2857F20k139J083J623p9k023L34J589P20k982LJ510P26j251j742K555K38j241
2874d56j213J823J602k112j345J254J376r15j535O21J059N8j339l33K361r20j313
$$ y = [-4, -1470, -1192, 1496, 911, -1618, -1975, 974, 1461, -1758, -2136, 383, 1782, -999, -1672, 82, 1476, -496, -2376, -647, 1635, 774, -1928, -869, 1210, 482, -1577, -1616, 1633, 634, -1183, -1125, 1172, 1421, -960, -1504, 518, 1141, -328, -1959, -110, 1134, 109, -2069, -236, 1629, -39, -2064, -616, 1565, 383, -1577, -654, 1238, 1150, -1349, -933, 835, 1275, -626, -1759, 525, 1292, -382, -1748, -448, 1846, -100, -1311, -529, 1610, 287, -1763, -361, 1816, 894, -1272, -939, 1407, 1542, -1108, -1135, 861, 1475, -869, -1118, 870, 1542, -415, -1339, 283, 1342, 139, -1460, -105, 1551, 462, -1535, -1, 1489, 620, -1519, -436, 1187, 1108, -915, -581, 1008, 1728, -1254, -1251, 259, 985, -266, -2008, 547, 785, -456, -1669, 154, 1756, -356, -1701, -447, 929, 14, -1521, -900, 159, 217, -1122, -1455, 906, -14, -1327]
2891a327m65J934L1j005n74R34J278j848p61J600J016j421j015P64J566o68j908
2908a869Q10J348J78j733LJ656K20j616R7J142N61j464r35J559P71j202l25M61
2926c38J229j231r27J019J026j63j839R67J305o73j099M20J145J6j232k70J981
2943A336N8j476q39J405R03j161q15Q59J296j465q74Q47J504j181j327R54J476
2960A500j86j841O76Q79k85q43PJ217L08j201n35J341J51j203l9M47J342j172
2978E63j041O39Q17k23j363N85J142o81j117L7J962l77j988K20J374L2j248j75
2996h42P39J032j391p18J201J027j287p00Q41J066j001p86O70P19l87q96M25O27
3014C39j97j479N66R84J88j196J00J421j75j133o24J709J04j027q90J160J307
$$ y = [-1327, -1792, 142, 173, -832, -1406, -472, 806, -1042, -1803, -203, 813, -608, -1623, -859, 707, 39, -1869, -1059, 289, 467, -1266, -1263, 393, 613, -1003, -906, 236, 797, -667, -1602, -43, 728, -474, -799, -338, 891, -340, -1267, -248, 778, 615, -1224, -257, 1048, 375, -724, -304, 841, 857, -375, -645, 1336, 1394, -82, -921, 484, 1387, 226, -589, 270, 1566, 101, -773, 74, 1578, 397, -930, 24, 1500, 1314, -527, 149, 1028, 743, -100, -93, 1124, 1432, 231, -304, 1037, 1188, -15, -54, 393, 1735, 563, -478, 161, 978, 755, -608, -23, 1119, 438, -679, -642, 1320, 943, -1045, -825, 549, 581, -667, -842, -103, 929, -462, -1180, 21, 1048, -239, -939, -98, 968, -33, -819, -149, 570, 183, -713, -288, 339, 142, -1337, -771, 213, 401, -795, -695, 726, 551, -582, -1206, 503, 607, -420, -1310, -150, 1157]
3031A157j203p06L23J371q17j066O26J277m1j733m3J789k11q34n97P87O54o71
3049F2o76P30O89q70p76Q59Q23q26k77L16P36k53p77N89Q92n68r29J51J325n04
3069G16j290L89Q96M21j443L54Q68q3q28q10J376P28j010q54J059R99r9j592N34
3088C31Q07p39j025J041K46M52j434n9J065L75j220k95P99N30j036l93P45N04
3106F94n80m16O59L78r66m49N64P53k38r45N91Q49m91p31o94K396r32j314O04
3125b68J119n24l45n77P22Q32o47p98N85J058q99j278Q96P55l12n49J40N42J30
3144E82o29j94P30j89q24m72J350j26q89n95J570M33l61j677J417M72r12o50P81
3163a83L71o39p38K10J275j88r45n5J448m30r30k61J215M95r13n09J398m42k44
$$ y = [1157, -46, -752, -429, 942, 125, -941, -315, 962, 921, -812, -855, 934, 723, -111, -708, 79, 733, 62, -614, 116, 805, -65, -841, 18, 841, 15, -262, 54, 790, 537, -240, 349, 1241, 673, -256, -105, 1220, 716, -574, -185, 711, 1132, -311, 43, 911, 828, 0, -810, 566, 1294, 284, -570, 489, 1488, 1389, -203, 331, 1138, 399, -626, 415, 661, 1113, -321, -380, 685, 1060, -160, -455, 344, 874, -162, -555, 190, 694, 114, -302, 357, 735, -231, -680, -116, 637, 399, -546, 45, 894, 403, -328, -1022, 1374, 442, -872, -268, 851, 327, -18, -595, 127, 959, 312, -486, 99, 1157, 258, -1020, -124, 631, 319, -230, -90, 452, 582, -47, -241, 489, 300, -524, -996, 354, 228, -661, -1256, 314, 747, 386, -1291, 126, 598, -314, -964, -183, 188, -451, -1189, -979, 296, 108, -837, -892, 556, 126, -804, -1065, 150, 645, -268, -777, 621, 179, -65]
3182f5j179J244L34j63j020K77J323j70q57J43O78j155j92P87J373q11j510K43
3200g20J280o82M24q38P53N73n81m47P01Nq14K1K68K65J54l13K98J41K02r61m22
3221f93J247m20m48N58J086r18n65N9K98P04p13j74O28J76j232j73J862l54o86
3240B42n62P07Q16l72j236M61Q97p50p42K83Q34k68n09j05K24M64o13k56N30O14
3260F59j138p0R92Jn22q14M44N71l01l45M31O79m57q32N03M60L21j148k60R95
3280A69m13o65l88J473M31j220j99R01L53j051l41M70O64m92j039Q19P08n35p03
3299a058J033R46j140m34N1Q45K26j227p9R48M63q02l79N89J62j55p62N87N18
3318C32n09n30M92J086o87m74J92P26l21r16J57J191q7j352N76R30l59j004L32
$$ y = [-65, -1244, 0, 334, 171, -849, -572, 751, 581, -276, -133, 545, -610, -802, -15, 1358, 547, -963, -720, 560, -122, 302, -536, 217, 790, 209, -238, 463, 468, -346, -325, -57, 208, 362, 49, 347, 488, 690, -271, -693, 554, 134, -314, 244, 1330, 412, -153, -94, 204, 908, 195, 21, 649, 825, -407, -580, 1282, 928, 242, -320, 387, 1203, 831, -405, 56, 953, 203, -539, -256, 578, 310, -199, -304, -80, 384, -229, -485, 45, 659, -479, -549, 443, 444, -78, -892, -448, 123, -178, -523, -92, 587, 130, -702, -199, 261, 582, -566, -826, 169, -244, -909, -1297, 176, 607, -613, -812, 89, 442, -609, -950, -480, 184, -308, -1347, -528, 180, -355, -1058, -25, 921, -219, -653, -602, 243, 469, -758, -837, 111, 574, -228, -607, -18, 144, -11, -773, -186, 332, -177, -707, -215, 871, 184, -290, -98, 628, 307, -609, -452, 739, 652, -700, -124, 806, 447, -557, -225]
3337b25O72M03o70n78N51N02k76o94N98J16Ko82K78P67l59p87L11M20M06m66m30
3358a41R22n25n79P3M25K21p89j09J72O59n14J52j42N37o99l52P09O98m19n54
3378b55J19O87j82j208Q01N23j25o73l33O73K16n40l4L65K3l08m93P99P85j232
3398c92j47M71L78l77p59J83R05K4m23j24O75j41q52R1N30L90n08m78L43Q01m95
3419I5n13M13J010j351j60N66Q8Q7r06l5J156l01o47N59j22J73n22j50N97J175
3439A212j693k46R14O4n86j7M14P95j204P9N46M64p53r2Q4J53M65q78p1N94J179
3460A423j594K80R4M13j025L7Q04L79j003n09O42Q51m05r32N67R89j297l14O18
3479A8Q42o61n90N82M92J62j500L90Q45j93n52j53Q99M53j121o18J025Q28j308
$$ y = [-225, 447, 850, 180, -398, 153, 655, 379, -315, 283, 399, 401, -281, -3, 764, 405, -382, -71, 349, 755, 289, -141, 781, 256, -323, -250, 175, 396, -393, -502, -330, 329, -185, -33, -175, 362, -337, -689, 20, 718, 299, -255, -136, 551, 369, -839, -38, 485, 360, -313, -646, 27, 243, -297, -331, 34, 57, -251, -744, 55, 840, -392, -539, -68, 310, -67, -826, -643, 262, 286, -137, -261, 414, 273, -579, -488, 42, 432, -76, -554, -211, 590, 95, -418, -5, 1005, -346, -506, 60, 148, 235, -671, -706, 450, 149, -498, 61, -61, 112, -410, -560, 37, 1212, -481, -727, 187, 251, -335, -352, 62, 857, -347, -268, 278, 742, -11, -103, -19, 134, 599, -279, -350, 244, 1423, -171, 109, 203, 616, -409, -372, 432, 811, -192, -701, -59, 792, 387, -545, 22, 1011, -286, -600, 18, 860, 199, -391, 191, 683, 845, -655, -265, 580, 387, -165, -318, 581, 1034, -87, -705, 320, 1148, -160]
3498a60j70P31Q1m97J95k15R45o09j208N32N81N82m90o30P65L87j261J04P33K78
3518F74j044J95N10L24p96O3L67m53n02L94R8M82M62j568N85P54nj190P62N98
3538G10%j072R0L62K41o92l45J029M0k86j107J357l2j85l54jJ037j107p89Q92
3558b12Q57r3j025k47J065k18o41J12P91M69j055l09O02N10nr27q6Q56q38m78
3578h72Q26O69l65o42N19m4L08l51k67J76L32p93J78M66Km54K8O25K85n82m01
3599c57N34R80p12q13O98N79j20m08j05M48J45o79k97O33M16r89N0O33L07j134
3619a91j91J213m31K8j233J316L75q94q2J77Q93k03j181N45O88l60p22K26j42
3638a69L88o1j002J309N26r47r94J332j87K26q47K51M21N79j184Q2J387q05q03
$$ y = [-160, -330, 401, 482, -15, 180, -35, 910, 301, -907, -375, 206, 788, 298, -332, 433, 820, -441, -337, 396, 674, -370, -175, 335, 659, -137, -74, 293, -160, -662, -268, -170, 312, 774, -794, -209, 545, 540, -650, 112, 710, 710, -362, -272, 90, 331, -361, -706, 323, 363, 77, -1030, 327, 295, 110, -244, -245, 792, -315, -1104, -212, 645, 552, -473, -720, 345, 127, -514, -402, 389, 858, -197, -506, 96, 606, 601, -326, -412, 444, -394, -872, -46, 623, 258, -384, 135, 91, 399, 48, -219, -43, 289, -504, -326, 140, 142, -312, -284, 341, 626, 44, -357, 177, 1157, 445, -368, 330, 909, 789, 381, 276, 724, 869, 190, -107, 526, 942, -47, 3, 636, 943, -191, -382, 831, 400, 428, -805, 511, 886, -8, -90, 87, 980, 777, -404, 141, 829, 469, -253, -27, -169, 219, 158, -844, 465, 991, 44, -950, 382, 195, 421, -426, -175, 246, 825, -359, -277, 1110, 305, -498]
3657d98L17L87l17o49M81K80k17j90p78J957j62j142r0R68k37n31M50O4J31o17
3677c93m15P64N01k27q68k51J742k55j190L45L63r4q46R13K50j36j046j47J431
3696D41k77L3m39j44L09K50j119P60N36p70J90k24O40l27p58n2J834r1r28P1Q29
3717G64J87j074m19O02R18j269j16L19P08l37o82O05P42l38p77K64O09j20q64
3736b78l73J357nj230K96P58j20J7n79L19J20Ll63j47R71r26Q3P35j24m42o52
3757e80k13J258l29j22m52J263j12p28P8M19m00n85k13P45K82q91K34K96P73q68
3777a45l85j9P73k3l59K5P7L02n07k83J122l69o62l64R00k31m53N35K14m23L91
3798A16n75J9L72k07j016Q51P89n77m79P58M71l08o33q3N95l4p11L96O53m33P2
$$ y = [-498, -181, 206, -111, -760, -279, 1, -216, -406, -1184, 773, 611, -531, -621, 347, 110, -421, 29, 93, 224, -393, -808, -44, 457, 230, -638, -889, 853, 598, -592, -247, 116, 22, -824, 89, 339, 203, -843, -990, 441, 164, 197, -242, -386, -77, 173, -946, -186, 350, -420, -230, -454, 186, -141, -899, -951, 883, 792, -136, -65, 764, 951, -123, -542, 60, 978, -291, -407, -88, 620, 283, -399, 206, 948, 610, -167, 97, 706, 586, -278, -651, 706, 701, -529, -233, 525, 405, 422, -157, 162, 282, 285, -78, -225, 746, -180, -97, 638, 514, 72, -580, -793, 465, 136, 14, -438, 825, 713, -15, 63, 482, 82, -503, -716, 29, 311, -580, -346, -50, 723, -145, -530, -549, 224, 201, -158, -133, -56, 246, -261, -544, 578, 209, -453, -817, 83, -148, -601, -66, 148, -275, 116, -459, -440, -68, -275, -1291, -440, 349, -228, -707, 51, 522, 214, -419, -502, 93, 59, -652, -256, 397, -36, 36]
3819C6j108J540k15j135N09O5J020r92j91M84j0j60o81N48J090j024m58J202M7
3838E67j54r36R3R42m54j77j057J322P95j241m26O18P70r91j01R3J143q16o53
3857f63K57R61m46m91JJ061q47R8m45J057K83j217l24Q18P38j099o33P41L24l88
3877b14J51O67J41o22o74M13R95q33Q6L22L27R5q26m29J171Q6r61o1L55K79n33
3898f5k78O98N80k91j250O84L05q65J58J87J410j170J49m39O31M47q57j12K45
3917A67n5p7j25P97p58k26j67L92M07n48q78P56J328j246M05O0k82k28o52M53
3937d77J150o35n98l23J083m2n97M48m94P80m94n13j29J065p14n98J090P81j452
3956f69j15P45M63k77m05o7R2m7l14O6K88O49j051O16j81R66j153M13l49K06L87
$$ y = [36, -1072, 468, 253, -882, -373, -308, 712, -280, -471, 13, 3, -157, -838, -290, 800, -224, -682, 520, 567, 413, -523, -430, 512, 58, -119, -1176, 146, 941, -300, -726, -108, 662, -329, -430, -337, 806, -10, -663, -406, 555, 109, -382, -381, 680, -167, -69, -514, 543, 826, -391, -715, 103, 841, -258, -891, -150, 174, -214, -63, 604, 745, 123, -551, -138, 857, 24, 110, 432, 759, 854, 28, -401, 770, 856, -105, -166, 189, 468, -65, -343, 355, 935, 644, -606, 78, 383, -482, -324, -137, 1273, 103, 252, -187, 444, 891, 34, -78, 167, 112, 35, -90, 707, -51, -277, -444, -52, 355, -193, -1071, -315, 1013, -233, 172, 232, -50, -278, -930, -477, 673, 38, -560, -883, 200, 158, -439, 9, -485, 295, -199, -712, -841, 224, -490, -1088, 2, 783, -669, -784, -39, 424, 147, -258, -325, -233, -280, -594, -528, -240, 409, -642, -26, -207, 759, -394, 19, -330, -124, 263]
3977B63j183J406M13p24n64j72Q27k53r38P70P41n37L34j23K8L70j324N99P61
3996F94R8j704N92N61L85l30m53J186q6p46q85O71R82n2k126J139M82N20j646
4015g18N54J102l78o36J41K68M82q19K0K61k65r5j245J398L85j18k96l28J073
4034G86l23o03q9J47M11r56j1J331Q7q61M38k29R49j358J38j22P78p75O6L21K53
4055C78j7n03p8J80J95k15J9O86l61l49k79M04J2m09m45R11L46n95l13N02N03
4076E72q15R0l24O24o25p17J546J44o28l50M91P70j23j830J068K68M0N2o73J361
4096I41o40o85Q78o44J053j502N14j33O94n89K23K07K29n20k38n20J292r91KN04
4116G5j6O15j318l9J394k81o66Q6P91L49r78k09M89Q87r70J26p50N50M37q29N27
$$ y = [263, -920, 486, 899, 175, -389, -561, 266, 13, -925, -155, 586, 49, 383, 260, 288, 658, -666, -67, 694, 792, -912, -320, 241, 626, 296, -157, 1029, 943, 197, -688, -17, 965, 913, -1213, -74, 408, 928, -718, -164, 938, 560, -76, 65, 333, 815, -4, 16, 277, 12, -83, -1328, 70, 455, 337, 41, -287, 786, 463, -140, -229, -82, 329, -627, -638, 693, 780, -81, 357, 128, 1077, -281, -143, -265, 513, -262, -196, 125, 378, 361, -142, -220, -40, 155, -60, -41, 645, 284, -65, -344, 60, 72, -337, -782, 129, 475, -120, -433, 69, 572, -243, -153, -477, 147, -478, -1195, 351, 495, -133, -483, 8, 778, 655, -1175, -107, 161, 201, 253, -420, 941, 301, -384, 494, -150, 903, -599, -85, -218, 476, -113, 110, 317, 546, 26, -212, -732, 560, -431, -429, 75, 59, 674, -644, -683, 711, 430, -236, -150, 641, 990, 12, -197, 292, 1179, 209, 335, -415, 135, 572, -257, 270]
4137B70M9R0m70L51m26J28m42J68K79Q39m91j373J141J225j290k22L43J55p67
4156d43J77N41k39J95n33r55O99Q29q91K98l28L74J145j339J353k23j159P62o3
4175B00j28o03N18M14O35r51J5L02l36L96r32K25J430p65o97J42L40O7p94j47
4195f69O03k5j77q81O60O31j045m3K07O90L78n55r90J082q77J137O05j234M00
4214a03n36Q5R84m80L01O34j74k20r79n59Q28Q44q17k26N04LP00j943R91L34n46
4235c75L56n2O07q7K5l16j39k86L7K75o7K7m67n3J022o9p4k78j012J273R41j995
4257g07P79L61o01k91M18M00m70j95N63j33N60j648M95O66M76n29r5r8L29J57
4277D37M2m75M40QJ20j090J351l53o44K4R69m79o64O40K43m28j17m99JJ822j237
$$ y = [270, 319, 409, -61, 290, -136, -8, -450, -282, -3, 836, 345, -1028, 113, 1338, 48, -174, 169, 324, -443, -266, 275, 36, 231, -302, -1257, -558, 271, -620, -322, -650, -276, 869, -470, 883, 660, -499, 263, 200, 72, -531, -13, 401, 1036, 85, 100, 402, 66, 462, -470, -245, 1185, 420, -277, -135, 205, 272, -522, -669, -66, -91, -268, -1149, -489, 142, -903, -946, -739, -49, 329, -226, -1216, -134, -1011, 126, 731, -503, -103, -639, -554, 430, -50, 251, 885, 711, 491, -488, -1047, -219, 625, -192, -418, 86, 89, 789, -1154, -163, 171, -375, -19, -71, 536, 449, 474, 158, 19, -267, -230, 45, -22, 5, -462, -515, 507, 438, 364, 86, -926, 347, 1288, -707, 72, 433, -168, -459, -41, 359, -111, -306, 257, 124, 684, -964, -469, 197, 673, 144, 49, -49, 280, 437, 479, 4, 444, 452, 572, -518, 833, 480, -164, -140, 829, 350, -314, 326, 569, 141, 24, -475, -474, 1348, 111]
4298A11l79n74L78p00J400l31Q01q59j215K077M54j300j380N61Q61l39j51J139
4316E54m48J26q74L15Q60K88j505Q72p64J357j293M54n78K54R52q49k70R66L36
4335G53j698J106LP85n48Q3j66q17N67J00J246p70j098O6Q95j13n73o37O00O09
4355C93k56p47N37M45n22r15O37J711j264K50n60R31K01j068J263n10o80l19L57
4374a16M97j17K62o64J53J85l06L59o69L35L99j09L33p41M61l95M4J151m58k56
4394C48O2o25q44R47q7J084m77M6m01l1J242j261j253J670K01o79K72o27O67K73
4414E27l67J70O38j394K10M74Q33p49l55N04M9m58J58L55j22q05J036j195O94
4433B03p65L69o13O24P05q96n73J068n68Q12j234J988j324R08r1j685R13J235
$$ y = [111, -268, -842, -464, -1164, 236, -95, 706, -153, -1368, 709, 1163, -137, -1517, -956, -95, -434, -585, 554, 106, 232, -642, -327, 533, 821, -684, 188, -576, 781, -512, -58, -636, -382, 570, -279, -549, 417, 753, -945, 161, 164, 949, 401, 484, 318, -499, 68, 168, 1414, 644, -454, -388, 507, 394, -179, -816, -216, 393, 137, -610, -73, 372, -150, -1065, -428, 1283, 19, 269, -291, 640, 841, -227, 1036, 526, -154, -473, -116, 381, 264, 526, -138, 15, 200, -106, 253, -416, -81, 318, 209, 542, -199, 262, -133, -89, 1062, 604, 348, 410, -215, -1059, -112, -199, 885, 408, 454, 53, 22, 1264, 3, -1250, 420, 621, -58, 214, -413, 254, 527, 160, 330, 968, -426, -216, 258, 1091, 342, -13, 491, 540, 82, 240, 595, 473, -332, 704, -491, 203, -562, -193, -806, -182, 523, -373, -946, 122, -446, 366, -868, 1120, -204, 704, 613, -1072, -159, 1076]
4451A076j248k81R04O06q96Q5o58J113n29q20n5N19L17m46M40J47L03o86N47k14
4471B24Q1q94M9P65L16K63q77j31k14J780j617p2N85o22R28j381J380m37l22j55
4491c51J83n7J50k50P42m61j016J774j07j235O0K60K24J64p39rm27J729j313R42
4511B63J89N94j589Q33K21m91J20p48j91J074K32m17j261J035Q77r15p29R78R11
4530I86l38o02O01m03o93q0j66K196j611k8M80m73J384j022j087J076n30M53p94
4549f51M62k0Q44j387J094L32p2n11l30K80M51K63J67L3j193L57K73p75O7m2N60
4570B02Q76k35j695j026J932O84k26j607J16Q51q1r23J779p82K87j062L12N65
4588c3r71M89P20J25p67O05k17J204j0j352p85J221j53q23n34P32J667j081q95
$$ y = [1076, -172, -453, 451, 1057, 161, 246, -412, 701, 172, -648, -703, -184, 133, -313, 127, 274, 577, -109, 438, 224, 305, -589, -540, 225, 541, 804, -73, -204, -418, 1362, -255, -327, 258, -364, 564, -817, 563, 126, -196, -351, -168, -225, -75, -325, 417, -44, -1060, 714, 607, -628, -568, -308, -84, 80, -659, -668, -1095, 634, -679, 263, 452, 1046, -543, 290, 511, 20, 140, -608, -799, 275, 507, 90, -1171, -136, 741, -174, -903, 75, 986, 648, 46, 647, 244, -449, -529, -695, 1501, -110, -138, 342, -131, 1253, 231, -856, 220, -310, 143, -651, -189, -209, 635, -752, 342, 674, 602, 91, -239, 41, 492, 755, 922, 955, -238, 119, 392, -383, -316, -358, 202, 1078, 843, -852, -1878, 54, 738, 512, -1095, -979, -128, -209, -1132, 647, -135, 152, -910, -598, -33, -1004, -515, 205, 330, -437, 168, -49, 1155, 1145, -207, -992, 229, 76, -747, -1281, -549, 1118, 37, -858]
4607h58J057p7p05P38q45Q69j0n68r3J087k36k22n52j46N74l91K46O27l28M30
4627E97N57j372P32l89LK71p82N35L02n17L42m50j80p68J909R0o22k33k77J40
4647a12k00L98pL32q89J183k56l93m2r3J037j02Jj389N13M71p45K5m11J700r6
4668I25j998O32J121l03k52L34k64K58M00p9j480J759j058Q7n55K104k405J46
4686f28J804j776O15m26K02N38K39j332K46j34L5P00j326Q10K33O8L69j23q54
4705g40Q75j024Q30m67p8Q80J84o4o13O4m23J597m03j574R88O26j192N73k87M15
4725A67J86J23j220J011j331J455p05J434j907K07J00O27J131j613N2J13l33L54
4743a49R5P86j081R57p55O97K19J40j380M52P99j37r56M17m13M1J164m86M29r30
$$ y = [-858, 199, 122, -583, 155, -690, 179, 169, -399, -492, 595, 359, 137, -415, -561, 13, -378, -132, 495, 167, 597, 1154, -218, 514, 125, 128, 399, -383, 152, 454, -63, 279, -171, -351, -1119, 790, 880, 258, 25, -252, -112, -312, 86, 79, 411, -478, 705, 449, 56, 14, -79, 958, 856, 857, -532, -19, 452, -293, -268, -679, 1021, 925, -1073, -441, 680, 377, 125, 459, 195, 453, 853, 774, -706, 1053, -5, 82, -473, 1631, -774, -628, 1176, -600, 15, -411, -209, 329, 568, -764, -518, -652, -617, 83, -1243, -433, -200, -132, 237, 114, -740, 135, -889, -59, -526, -604, 276, 460, 396, -217, -153, -576, 1021, 618, -956, 32, 658, -534, 39, -248, 167, 353, 476, -744, 267, -1064, 391, -314, 1120, -787, -580, -480, 147, 1278, -335, -283, -170, -503, -149, -54, 732, -349, 608, -147, 550, 769, 909, -471, -19, 780, 643, -313, 104, -309, -268, 896, 410, 839, -91]
4763i1J33j242Q30M72o32p2N18LJ494o90n35j29K12q39N19J187j198R59j347O54
4783B06L55j95l77l12R10m70p20o3J353o14L88O7l97o53J39K02j96J137n59q46
4803f45k18N21K56j48j014K317o32l53K65k19m10lN65j094P80L37m73M80n11P52
4823E53j071m13K754j330o8Q90o54j631J368o56K1p00R44j17K75l1k163J121Q50
4842e8O45q45L40P29k60j77n52N56n13R55m35n04r92J631l59J17j025K56k1L95
4862a17J124j65j273M14lo45P65J41l91k65M5m26Q73K42n01N59Q22o50n36k87
4882b74N50K11q21J129L6j421P68j32J221j158j132P72j74J316j703Q44j31k56
4900c55O4J496K06j223O48r25l86J101p39J203r75o6k65r45R83o02J144J52j524
$$ y = [-91, 42, -1200, -370, 102, -530, -602, -84, -81, 1413, 723, 188, 59, 271, -568, -49, 1138, -60, 899, -448, 206, 561, 366, -11, -323, 587, 117, -603, -666, 687, 73, 461, 528, 131, -522, -383, -181, -377, 760, 201, -645, -863, -342, -86, -234, -1248, 1069, 437, 84, 349, 130, -280, -283, 282, -812, -32, 305, -168, 312, -199, 553, -518, -931, 1823, 493, 425, 1315, 661, -970, 398, -258, -237, -937, 7, -110, 165, 134, -2029, -908, -58, 587, -258, 82, 811, 551, 374, -178, 378, -135, 820, 385, -119, -1111, 520, 161, 278, -747, -491, -512, -117, 1007, 842, -431, -17, -20, -665, 100, 241, -150, -415, -370, -796, 77, 319, -182, 377, 1199, 549, 13, -274, 276, 487, -334, 795, 831, -590, 178, 46, 1267, 109, -1023, -251, -425, 891, -812, 32, -99, -355, -291, 1205, 1411, 188, 836, -89, -475, 626, -113, 1090, 115, 49, -216, -1161, -178, -780, 364, 516, -1008]
4919a008J619n83q3J121j816P92R88j036P6P11j033J246j495J580M65k959J435
4936B0J072n86q59J158j228P07J134p34q75m30jJ334r06j90J507j774K91J149
4954G89l6J271j913N12o95j019P77P18j659K044r37J003q95j611Q48J123j013
4971f93R57P30j254J938j420k8m36Q85q5o1j368Q04p64R02O56n3l61k75O04k46
4991D32n69Q05P12j286O59L12m86o87O57j185J027j973J922N50r26j81j46K39
5009a24J00L24J421k516J141P75j284J121j026P09o52k02j014J513j096O09k96
5026d97M44N39r00O30q21K23J77P61M32k086J878j843N44R87k6n64J49O39j122
5045d56M02k74R96P9m82J193k370M87L37j085K037q26n71O41r7Q83j075O15m57
$$ y = [-1008, 611, 28, -55, 1066, -750, 42, 1030, -6, 70, 781, -252, 994, -501, 1079, 1544, -1415, 20, 1092, 506, -353, 805, -423, 284, 1418, 684, -191, -621, -622, 712, -194, -384, 1123, -651, -360, 789, 753, 2024, 111, 623, -72, -1091, -314, 404, -1255, 789, -148, 855, -40, -1651, -803, 320, -693, 264, 994, -260, 1678, 258, 230, -206, 679, 594, 533, -835, -31, -795, 107, 763, 710, 349, 74, 678, 432, -137, 668, 1380, 94, 753, 1065, 579, -108, 549, -636, 391, -1582, 340, 890, -36, -217, -363, -124, -24, 300, 1721, -795, 346, 1121, -163, 958, -68, 641, -11, -213, -1227, 286, -810, -201, -497, -53, 486, -414, 216, -605, -382, -205, 556, 988, -1098, 780, -1063, -519, 468, 442, -122, 27, 666, -456, -54, -328, 668, 747, 265, 1458, -912, -425, -88, -1173, 864, 38, -533, 108, 11, 894, -181, 434, -23]
5064b3o52J774j384M13P42J06J601k632j00j32M83j121J233K10j688R28J237k900
5082a905K593n16m16P28rK7l38m81Q38k11K69n21j673J177K02J85R56j187o97
5101i79L87P77k317J543N80rK47Lm06r55l00K013j52k083L044j032P85j164J187
5120A169j527J60J633j339j01LN87p8r9J64l98o1Q76k67j023M13r13n24P86K75
5140b64J34O47J93p37j65r76N74m18J734j34l31j331O97m46N7J907J15j092J489
5159A653k419N36J357j168l39P26j335M81n02J0R93M78n01k38k1k92M17n29L78
5178c15j6l57j33J324j306J447M55J03r51j013m84J106J49L66L71Q7n56L18j144
5197e49J642j516P40L12m98o36m11J143m26J046N8m76r05q7J509j289M59j202
$$ y = [-23, -675, 1099, -285, 128, 870, 976, 2577, -55, -155, -287, 196, -925, 308, 518, -1170, -242, 995, -1905, 688, 172, -244, 484, 475, 502, 164, -317, 521, 310, 579, 58, -1615, -438, -236, -51, 905, -282, -979, -592, 185, -2132, -589, -9, -18, 229, 232, -174, -1129, -1429, 584, 432, -1651, 1393, 361, 1146, -18, 1169, -358, -198, 1435, 96, -5, -2, 585, 507, 408, 572, 174, 113, 989, 722, -301, 112, -801, -1325, -539, -264, -130, 517, 710, -27, -192, -1168, -594, -1012, 722, 588, 257, -1074, -377, -823, -766, 1141, 1256, 164, 1653, -766, -230, 1127, -41, -380, 346, -989, -508, -1010, -1000, -7, 471, -30, -268, -289, -581, -164, -693, -315, -331, -688, -821, 503, -803, 644, 1099, 1202, 251, -762, -1246, -140, 9, 375, 746, 833, 277, 595, -549, 1093, -423, 317, 629, 131, -505, -916, 227, -199, 847, 905, 429, -476, -563, 946, -343, 116, -1086]
5215a086J275M52j127k27j74J052J262j488J7O16m6M02l64j314M44J244r65N46
5233E19J08Q78p01j33p34r93K124M46o27o3K52j231K134l82j294J7K69j1m49m0
5253H9j70J22j49M8p34n1J677j447P60O85j318J024J027j015n78q97N82J281r51
5272a5p99R17N16Qm31j043K503l553P93J430l43p24J776L4j308k06P94R06L58
5291A613q64j293N47n99R05O27r90O16n36K98M68r95J38j27jN21j19P90o80q84
5311e65j58O5j95J673j571J958r26j108J688r54M62q65k1L75q01P0K573k405Q23
5330A18j89J371k343J391j013O82J428p84j334K107r16n86j261J610K41n16m64
5347d58K78J974j174L62n85k19J389q74j441J634j350q43P92K20P71n2m92r28
$$ y = [-1086, 189, 641, -486, -713, -887, 165, 1427, -61, -44, 572, 526, 928, 564, -750, -306, 938, -27, 519, 627, 1505, 804, 671, -63, -1056, 1068, 1514, 887, 824, 1076, -155, 1979, 1597, 303, 320, 589, 578, 129, 89, -81, 41, -108, -60, -794, -845, 832, -615, 145, 830, -488, 536, 1563, 548, -30, -927, -345, 936, -15, -814, 103, 619, 627, 196, -847, 1656, -1897, -1104, 326, -17, -741, 1035, 1069, -239, -445, 349, 1255, 1613, 749, -544, 3, -596, 309, 936, -54, 562, 26, 324, 792, -203, -65, -192, -193, 328, 209, 999, 319, -565, -723, -658, -853, 820, -751, 1207, 281, -827, 861, -93, 369, -496, -517, -142, -943, -873, 1700, -705, 118, -71, 1300, -1043, 348, -665, 17, 1445, 661, -673, 1434, 518, -68, -1329, 281, 522, 6, -458, -180, 1794, 620, 982, 397, 178, 1567, 693, -748, 886, -464, -1307, -515, -295, 476, 424, -68, -996]
5365i96M93O12R97O8k180J303O10r59K73R0k46J505j430J255j977j38J01k32l43
5384a194J531p41J122O71j385N87j102o96J836j964J340o75j38Q94l58l35J446
5401H39m89K30j515J022j559N60L07P74P79j725J472o9k32l35j80k09q21R72l0
5420b09q15J544Q28k216Q91q27R51L00L67k49q72O77j155J256k58K19m89Q21L30
5439A094O3O04j628j420R83N67R77o10M05r66O33j348O94J70q18N9J472J78q91
5458B18j012J109L79j296n87JO49K62l15L37n39R73N19K46k89m68J12l65m19P85
5478C00L07o12n23JN74M04j134j87R25N95j201l22J531j532J983j392J105K70
5496A092p88m54O01n61J408j588N81M05n77j451J185R4m56M18N89q00J158l14
$$ y = [-996, -503, 109, 1106, 1174, -1006, 297, 907, -52, 221, 311, 65, 1570, 140, 1395, -582, -720, -619, -851, -1194, 337, -404, 718, 1389, 4, 591, -511, -1207, 629, -1335, 5, -670, -808, 86, -272, -607, 839, 350, 580, -935, 87, -1472, -912, -605, 169, 948, -777, 695, 626, 394, 59, -121, -330, -1151, -179, -209, -1024, 520, 1348, -868, 23, -804, 147, 447, 814, 565, -307, 370, -785, 471, 213, 432, -57, 764, 1094, 1157, 1761, 133, -1287, -304, 263, 1240, 630, 1035, 69, 702, -646, 48, 218, -600, -541, 931, 1109, 218, -794, 315, 694, -602, -1189, -1188, -539, -277, -592, -255, -794, 179, 698, 944, 655, 187, 299, -66, -485, 300, 607, -5, -528, -527, 47, 451, -683, -870, 55, 650, -551, -873, 658, -874, 1109, -283, 822, 1092, 304, -150, 451, -110, 1298, -290, 291, 696, 119, -1332, -147, -53, -509, -91, 498, -302, 856, 542]
5514E42j968J705N05L30J37j574M39Pq85O18L42l75N71n07l73l77P95j082J876
5533G26k592K073j28J026q69Q0j09k57J215n04j731J181j41L4j82r14J078N7M5
5552H8j09J760j720M8M71r36L24J462j412l87J291k093m97Q29J129P68q51P84
5570I49n67L98o0J80p71m57J147j331J70P23p2K74j559J596o10k61m90Q55r25
5589h11J133p51K15R48k56N86j413n48N91n79L68k96P14O55j396k82P41Q0J075
5608G74j111N5N57o68m85Q3P03M79r07N41L38K0j336J464n30n99J158k29N88n39
5628C56P67j916%J410K91j054N23j48n59k78k65J172L06J98j776P04K39L7j242
5647a235M55K020p71l04o40J563j047n2j400O55J117r7L42Ol21q47J10K69J96
$$ y = [542, -1426, 279, 784, 1114, 1251, -323, 116, 123, -762, -144, 198, -177, 394, -113, -486, -863, -68, -1150, 726, -1866, 207, 79, 1105, 236, 316, 207, -50, 1165, 661, -1070, 111, -30, 4, -178, -1092, -14, 43, 88, -21, 1739, 19, 67, 538, -398, -74, 1388, -24, -411, 880, -1213, -1710, -881, 248, 1016, 165, 949, 382, 780, 720, 900, 129, -328, 819, -512, -342, 381, 309, 583, -976, 620, 10, -251, -741, 114, -811, 322, -429, -214, 734, 478, 1064, -349, -897, -306, -885, -517, -813, -99, 556, -840, -1122, -381, -301, 774, -337, -282, 275, -393, -878, -795, -92, 387, -520, 21, 359, 379, -957, 507, -23, -622, 536, 307, 895, 356, 1123, -793, -793, 617, 908, -146, 377, 229, -330, -608, -873, 299, 605, 803, -973, -269, -30, 7, -1235, -780, 1240, 469, 165, -475, 1088, 41, -11, -1411, -756, 361, 264, 606, 612, 291, -556, -446, -177, 19]
5666A9l0J33k53O41q8j12K79m09j182K122j116K60l00M40j074m1J176j166K024
5685A323j156M69j937Q87J733j136k11Q72m22o39J299j468J119j828J740j099
5701d54o34N57o13R88K156j307K13l81q71m37J268m6M99m79j369Q51O67m02P7
5720B83k55P24l89O27L68k271O71K05q12J003k80j80J023j825R39L93M96N05j304
5739g9Q54j443M08J897j458l94p86L076k078m56J274r80q54J385r66N41k30M37
5757A48M45J83k335J567L3R9J5j93LL43q92J122j98J55L88j646N61O43j434O55
5777c38J233n92q76M72O31J84J15o45o77Q41J86l8j105J90k74O9Q86J155j134
5796B83m9K70J86K75j772J512o65l16j03L04R4p88Q13j085J724l5j548J393n94
$$ y = [19, -11, 122, -131, 510, 422, 310, 589, 180, -1002, 1120, 4, 264, -36, 404, -670, -711, 465, -701, 1323, 167, 636, -1301, -414, 1319, 183, -28, 844, 422, -217, 1082, -386, 733, -1095, 645, -454, -1088, -531, -1144, -156, 2000, 693, 906, 525, -346, -783, 485, 439, 938, 459, -910, -59, 608, 206, 283, 28, 752, 363, 990, 1358, -913, -242, -37, -849, 154, -126, -306, 717, -1108, -169, 224, 720, 1225, -79, 775, -668, -260, 1637, 179, -215, -1001, 2075, -3, -459, 815, -165, -1019, 366, -600, -59, -289, 148, 593, 776, -1559, 8, 41, 140, 155, -38, -35, 308, -584, 538, 340, 495, 883, -763, -202, 441, -993, -338, 895, 303, -573, -101, 530, 714, 829, 184, -493, 348, 534, 496, -609, -419, -693, -624, 262, 1417, 283, 234, 504, 690, 965, -807, 705, 40, -276, -379, -75, 19, -769, 44, -1041, 683, 648, -900, 493, -101]
5815a01k65j23n92J409m47M50J50O0m33K02M99m02m11L97k49k018J925P41j093
5834c01J308r56q75N86o25P49R57k134J11K332jq28n87M39L86m27Q30j023m50
5853e09J394m74j045J081Q42k879K167j77l95K33k23o6J392o24m79o78J571r35
5871A96j498K232r25Q68j462J094l40M09j517J587k41J115k183J80R96l03N54
5888G62j537J975j588Q10m27J877p33j317J634j804M68M91j289J398j696K048
5904A072r19J90q08J734p64j430R9N12J171j348J129o31j407L78Q80j738J931
5921E1jK21k59l36Q81J058j165P0j160J208K75K0o78r67J493l47j413Q39J194
5940I84o25j373J025p23K394o61l096K032o99R20K8L45j024j083J105jO65j90
$$ y = [-101, -366, -489, -1081, 328, -119, 331, 481, 541, 108, 310, 809, 407, -4, 393, 144, -1874, 51, 792, -301, 1007, 51, -824, -238, -863, -114, 843, -1291, -1180, 1152, 1151, 323, -264, 175, 561, 134, 964, -59, -509, 885, 411, -634, 447, 1289, -1590, 577, 400, 5, 238, 15, -51, 1341, 717, 238, -440, 1131, 196, -1302, 930, 5, 873, -589, 505, 165, 574, -943, 644, 403, 1518, -665, -485, 511, 208, 762, -775, 1200, -388, 422, -5, 1872, 1139, -178, 1456, -348, 120, 611, -678, 720, -976, 1072, 153, 343, -465, 1269, 505, -925, -826, -314, 857, -491, 638, 7, -1400, -1022, -142, -1880, 51, 50, 271, 12, -324, 557, 1615, 450, 520, -640, 568, 843, 863, 185, -782, 711, 364, -1049, -210, 984, 359, -1014, 11, -712, 1682, 1021, -2075, -43, -742, 178, 206, 551, -473, -1556, -451, -452, 213, 23]
5958B3K95j984J014J448q86J04K07N2r08J342j720J435l64J066j214J032k089
5975a147J64J072Q25r53j321K178j030j163K683Q32l060J205L20j291P28P55q69
5992g2j060J683j115j31O43J969l217J467k12r17J991o45n27L00j757K671j052
6009A9k57J48J36j084N15m66J724k26r45N66n37J741k832K334o61J140j282p23
6027f90L53J70N80M38j015J835j003k203K115K32o21l87L71R34j592K77R35p51
6045b2O83n23k93J1p31J688n38J75l06L5N38M16m85o04J016k94k83k10n56q4J93
6066a74M17q30N18J82P02j150K29Q66l01M76j699L06Q31q62K303k285N83J526
6084A638k084j76n21K16K345j02l35j376P74Q32j984J002K62K03J297j739P30
$$ y = [23, 318, -1666, -652, 796, -90, 14, 221, 273, -635, 707, -1013, 422, 58, 1124, -90, 942, -1147, -983, 89, 914, -39, -1360, 818, -212, -1375, 1308, 2140, -920, 285, 605, -686, 42, 797, -72, -1132, 551, -564, -695, -52, 1917, -1300, 167, -45, -962, 1029, 384, -143, 157, -1600, 1071, 19, -238, -90, 46, -1038, -523, -989, 735, 509, -436, 130, -407, 1334, -1498, 836, 175, 1315, 33, -690, -337, -167, 413, 851, -164, 1671, 668, -1535, 580, 812, 191, -196, 175, 1109, -483, -206, 729, -22, 661, 138, -155, -144, -875, 813, 275, 450, 144, 179, 717, 1133, 648, 44, 1060, 766, 483, 273, -283, -367, -174, 243, -587, -69, 113, 815, -335, -106, 760, 459, 935, -764, -458, 373, -489, 1814, -471, 112, 1638, -446, -622, -1143, -927, 1418, 1316, 981, -395, 379, 1211, -773, 229, 491, 694, 1991, 252, 982]
6101I82o83k51L82k03q8l80K71p04J493j843J488j652O12l15M04k59K031k129
6119h44J397Q00j064k44M90M47j916R41n82K64O59J602k626R68j647K71K253n62
6137F07K37j184P99N87j346n4j90R02m27p63P39R5m98J411j556R28o29J99l1j492
6157a666K301n5q76P44m99n22j82J466q80P25o62J344q47j96k92M82j128J667
6175I24l67o34R00n39L64m60O95M55p50n98O0l08l27J023k31j10q18O76k85j408
6195a738J983j080J409M13j087M42o67L219k284q86K517r46k232J294k62L58J480
6212A933k249m67k07M86J122k130R00R03M37l45O70n33j474J772j71p3Q29j349
6230E4l71l50J359n06O08k37J341r12m23j048Q04j86m74m23K54k92j76r09Q17
$$ y = [982, 299, 48, 430, 227, 139, -241, 30, -674, 819, -1024, 464, -1188, -576, -891, -487, -746, 1285, -844, 553, 1353, 289, 45, 535, 982, -934, 7, -575, -311, 348, 1950, -676, 292, -1355, -1084, 1169, 607, 844, -340, 459, 1046, -300, -354, -544, 358, -69, -832, -93, 2, -496, 915, -641, 287, -342, -143, -174, -1666, 635, 580, -296, 448, -51, -573, -755, 711, -169, 556, -106, 1238, 391, 195, -97, 385, -743, 924, 557, -77, 823, 284, 648, 188, 883, 1338, 588, -10, 50, -258, -585, 438, 207, 97, -721, -45, -330, -1738, 245, -835, 574, 987, -100, 342, -325, 2894, 610, -276, 2241, 1295, -937, 357, 95, 453, 1933, -316, -783, -990, -504, 618, -1512, -612, 291, 728, 383, 1053, 520, -954, 818, 647, 574, 1403, 54, -317, -667, 692, 186, 794, 557, 1898, 986, 563, -485, 319, 133, -341, -764, -510, -802, -978, -1887, -1070]
6249a070J815p36j312J986k32L5k81l6O29k250J704m45R11j98j519J899k77n26
6267I7M73n96J357j262L35p10Q07J095k806Q48j83r57J392L63r87J171j319J173
6285B91j057o0O28j904K069n8M49Q6M33L59k400J256O4p8m20L04Q70r83o1m57
6305f69J042j153m4n3P38N18o97P19l75J03n4q74J631r96R11l56L6j94N79n14
6325B98r68K27k50O11m00R59O92j355j93J457o82l43l23N66K06j81jj057P93n67
6345e11J718j087K28l48Q69j172L62J319p91r47M28r87K443n09k045J126r16J069
6363B49p95N05M2l71N22J256j047j561J649k11j117K96R41o41J095k072J626l71
6381ep23J480p35j627J397l39O9p45J132K41j164Q06m29R4P48l28O4M18m88l14
$$ y = [-1070, 745, 9, -1303, 683, 451, 486, 205, 169, 798, -1452, 252, -193, 718, 520, -999, 900, 623, 97, 570, -26, 1331, 69, 404, -306, 501, 1596, -1210, -362, -545, -1502, -110, 253, -734, 437, -882, 291, -766, -826, -198, -2102, -33, -91, 358, 444, 877, 1236, -1164, 92, 156, 78, -342, -38, 832, -151, -212, -669, 373, -780, -824, -877, -139, 379, -318, 401, 26, 129, 75, -799, 832, -164, 747, 391, 427, 233, 812, 298, -670, -443, -693, -82, -482, 477, 1169, -186, -379, 1078, 396, 53, -270, 296, 502, 321, 320, -737, 56, -511, 1207, 120, 348, 0, 869, -303, 59, 1378, 587, -360, 68, -919, 1524, 1015, -1030, 96, -820, 249, -546, -41, 1, -370, 152, 1408, 361, -1200, 449, 238, -879, -583, 358, -283, 812, -1260, 366, -5, -728, 752, 17, -1610, -213, -552, -483, -1228, -96, 145, -1019, -213, -642, -548, 200, -128, -64, 354, -134, -448]
6401d48L96k036K460j37n69N67N42k14j736K225o44K42m99J216j125j80N98K65
6419I23J1j314Qj71k05J314k087J195N74n19j91R02p67N77P62j194J83L63L55
6438G19j80j419Q50O9O41o50M31j09j813K307j340J63O94l02J3K18o34j031K197
6457H24n99j3l06J308j38m92k85m65K55p2L55K38M03j006M48n84J146m93m60k42
6477a78J003k002K320o16p78P36j181K87J074r89K01L88m57m34M81O59J19p44
6495a11n7J55O87j033R98j126Q39O23q12m54k71Q77P49j574N51P22j48Q3j384
6514f86O68k24Q13p12Q1L06l91r64J062P79k096M97J378M0j085K92J38K12M70
6533E78m09j451J307j452K59M62K04P92P60o71p83O43k32R80k033J077k71N55
$$ y = [-448, -52, -2088, 372, 235, -334, 233, 775, 561, -1175, 1050, 406, 648, 149, 1365, 240, 60, 658, 923, 934, -380, -372, -543, -748, 566, -1521, -326, 248, -271, -462, 440, -327, 250, 1012, -182, 1, 364, 719, 539, -880, -30, 39, 680, 30, 461, 352, -1461, 846, -494, -331, 363, 61, 74, 292, -342, -1373, 824, 225, 212, -94, 1214, 1076, 584, 299, -166, 89, 17, 372, 610, 1013, 7, 455, -129, 1017, 524, 64, -178, 825, -1177, 1143, 527, -251, 485, -696, -409, 665, -324, -123, 265, -192, -626, -145, 514, 633, -111, -168, -13, 674, -359, 639, -487, 352, 975, 163, -291, -562, 315, 1064, -510, 41, 763, 615, 698, -686, -18, -242, 571, -141, -60, 246, -145, -1109, -47, 732, -1364, -867, 511, 551, -534, -242, -104, 108, 578, 169, -1282, 25, -1427, -1168, -706, -502, 290, 1050, 379, -404, 239, 7, 987, -1046, 31, -240, 315]
6551C15j424J127l61j108K209q08J801j867o93n4J582m48N36N11M10j480j733
6568a485J437o3J024j790J54J525r36J58q7q91K308j325k17n4Q74L82n00l34m3
6587A37j13p13P87Q42o90j77j88r52L53J320L40m69m23l40j015K218J23m6k81
6606G13j637N58J031l37M30m97j125L75Q9M02K31m5p72N52p07R35p07P90o87J91
6626b17j15L21Q44r15J513k06j962R1J191J23r84q83J192L79j000R64r11J132
6644E57j35p81K176j390n67j1o05Q50n5J40l93j176J417O86j548J388n23q18m30
6663a218J095m19J094j831R58p29N68J0r2N28o73M43M30r3O5M73o22J76l73J9
6683a91j149J798O58j054K83o27P14r15M62n48k06J052l97j547K286j37k47q84
$$ y = [315, -1109, 18, -343, -1451, 758, -50, 1751, -116, -809, -863, 719, 271, 807, 1318, 1728, 248, -1485, -48, -111, 913, -877, -723, 802, -134, 24, -63, -954, 1354, 29, -188, -242, 632, 1014, 514, 180, 137, 24, -689, 98, 940, 250, 73, -115, -1067, -714, 606, 946, 477, 54, -286, -1301, 917, 1040, 994, 713, -924, -366, 665, 328, 758, 261, -864, -489, -400, 2, 233, 188, -584, -32, -739, 196, -511, 279, -408, -217, -332, -11, 833, -82, 1431, 1225, -737, -646, 545, 668, -316, -1199, -7, 372, -628, 336, -575, 557, 422, -359, 1817, 427, -140, -151, -756, 94, 39, 179, -214, -1390, 27, 713, -835, 553, 30, -788, -1218, -123, -542, 552, -1279, -321, -1050, -482, -472, -564, -36, -709, -266, 164, 71, 136, 609, -13, 163, -210, -191, -1340, 458, 1116, 62, 345, -282, 432, -483, -21, -569, -775, 277, -120, -1667, 619, 482, 235, -649]
6701f49J691q43O74n38m13J26N73n06l45J988j338j29p84k1q89J400K18l1l59
6720a75l20R40n56K53N34o47M20p77Q93j888Q19r28J145ol41M85M5o76k12N37
6740d55R75j121J588M24k655J25K046l74j464P03n54Q76q72J332J97r31j97n02
6758h59J310k61p3q40L93J46j455K717r93J86J338n61j439P16L88n22k37O01j483
6777i28K227j264j474K106L78l75j009J838j742J238j119j82L68K30j52Q39j510
6794e31N65o98O49L3o23j36J254l81k50n88R1K90K61j723J901L06J616k072K46
6813B10m38q9O19J057j222J051j180j93O52r8j75n26J264k66n68n86P74n32q06
6832a052J968r09l40q68J861Q02k317J573m29L21n09n48J423m7j464J867j242
$$ y = [-649, 1042, 199, 873, 335, -78, 48, 621, 115, -230, 1758, 420, 291, -493, -514, -1403, -3, 215, 184, -175, -495, 445, -111, 142, 676, 29, 449, -328, 565, -1323, -504, -1432, -287, -293, -634, -149, -104, -780, -992, -455, 520, -601, 987, 1411, -1244, -1119, 927, 553, -911, -208, -762, 114, -758, 574, 771, -160, -357, -859, 451, 190, 117, -723, -330, -184, -1639, 1078, 85, 271, 1609, 1048, -391, 325, 713, 191, -46, 555, -928, 1299, 35, -1439, 667, 1045, 670, -339, 1499, -243, 995, -124, -306, 62, 292, 140, 979, -531, 34, -664, -15, 18, -605, -741, 513, 132, -118, -706, -615, -325, -64, -1787, 114, 420, 2036, -36, 210, -228, -317, 302, 1359, 137, 1188, 8, -185, 467, 369, 194, -332, 932, 666, 98, -488, 286, -246, -1052, 916, 7, -333, -1201, 660, 1462, -855, 718, 289, 610, 101, -447, 976, 929, -535, 1332, 90]
6849I0m36P06P99j274M63l43J785m03p12r70P31p2o87p2P17k63j76q26J808j862
6869i97J159r20J063j374J663k62j306K092R5j763PN87p2k60p00K091j712O29
6887B0p39J206j93L50m22J224j098P8j892N61R47J316o80j795M31N44J291j354
6905b05J172j785J177q90P65q33O18o76j6L29K43q55J871p01k95M91O72l44o44
6924I4j3l21M31o6P43o70Q7o41O8j3N29n96o48J096q06K100m97n42m82J75O01
6945F29N3m98j056J374o2L09r16J10o9R33n57l95j22n69Q54p21j18K185j913J061
6965E12k5O2j372K91J292K9q76l93j82J252k93N01J80j635L67K08Q28L89j059
6984G6N81p39m74O33k32N39K30r79o0L05n33O25N27l18l8j37j82k87L99L35q10
$$ y = [90, -346, 360, 1159, -115, 348, 5, 1790, 1387, 675, -295, 436, 364, -323, -395, 322, 59, -117, -943, 865, -997, 162, -758, 305, -1069, 594, 332, -974, 1118, 1213, -550, -543, 44, -28, -288, -988, 1103, -609, 20, -719, 487, 294, 644, 222, 1446, 348, 426, -1466, -905, 42, 1358, 678, -1117, -686, -142, 1149, -205, 967, -818, 359, -531, 234, -599, 19, -657, -673, -344, -101, -956, 915, 214, -81, 410, 1082, 738, 94, 81, -240, 191, 125, 868, 198, 285, -356, -288, -301, 228, -368, -1016, 80, -726, 1374, 877, 335, -147, 28, 629, 682, 184, -872, 502, 440, 749, -167, -57, -126, 807, 250, -145, -267, -836, 18, -703, -821, 1364, -549, 512, 487, 549, -823, -532, 760, 789, -87, -480, -662, 590, 297, 798, 978, -657, -290, -82, 746, 1135, 76, 657, -82, -556, 77, -155, 384, 614, -365, -425, -120, -653, -28, 499, 181, 143, 6, -176, -463, -64, 271, -539]
7005e39J070j100N33l09j8P67p02P12l54o08J001n62K18j827J380Q96n91L65q17
7024d85J65l28J313k12n50M20k72j317J989o72n34P45l50K37p46N69L11M30n64
7043A49k8K60J73q90p81J067q96N41l63M1N65j63J905n38j339Q63p08j31m28P28
7063B7p43J111Kq01q5J192q33J00M97K20j007M83O74m82K14p37P44P7K5j012M52
7084A18L48j286J896j409K62P76M39j615K03L8P8m7M0M46p1N09p53n15K17j67
7104d93J238l75P32m41l48L7J54j96p1L48M19m43r96J028p62M49J5K73J36m70
7124B34P55r90l32J176o63j9L45j156M61N32l41l06L5Q1J39Q23j289K77J079j172
7144c31o6N52N4j16J149j566K18P83p4m37J10o44L36M86Q8k76j142K30k36O12
$$ y = [-539, 531, -569, -36, -345, -363, 404, -298, 414, 60, -548, 453, -109, 109, -1718, -338, 558, -33, 332, -485, -320, -648, 665, 453, -97, 323, 51, -1266, 723, 51, -483, 262, -88, 149, -597, -28, 283, 713, 149, 121, 381, 554, -336, -1117, -50, -946, -405, -768, -727, -162, -325, 1580, 1042, -297, 566, -142, -273, -701, 27, -716, 395, 397, -404, -489, 703, -130, -30, 467, 687, -320, 163, 837, 355, 569, -168, 576, 653, 678, -334, 118, 466, -820, 1076, -333, -71, 705, 1144, -471, -268, -230, -152, -199, -159, 287, 216, 725, -28, -543, -326, -493, 745, 370, 1102, 661, 313, 350, 504, 308, 237, 585, 1004, 561, -435, 593, -169, 280, 295, 568, 704, 234, 989, -1, -333, 843, 180, 161, 506, -650, -189, 343, 2, -304, -269, -188, -49, 774, -515, -238, 841, -331, -397, 155, 209, 93, 1242, -324, -106, 677, 603, 166, 276, -368, -32, 454, 542, 266, -876, -646, -882, -270]
7164b70M11J08L17K98k00p81l69Q84p25m4M7j56R77J20p28K64r22Q65n46K9M64
7185D3q27J465l65j11K97j125L27N10J81p84P95j041L28P02K6p47j06J193k50
7204E11M24j489L87n91J137O59k106Q17P34j79n58J25j3p7M52Q0r56M57Q93p61
7224e4J24n48Q08P32j177L68n14J55J95m45r1K40J95K04n02N34Q91j595P16PM49
7245F92j001J75J84K80n43R56p67O34N83j196j45n03P55j94m48j99J083m92l92
7264e38K5P70J80L46m12j07m27P4L47K34o50N48m86P18m00r18K28K273j878P3
7284@P98j35J95j612J063q74J366j760J115l89J460j328p5J08o78J558n35m88
7302b11K73p9l01M27P93r06k0N8K54k3n89P08j050R29p65N63P1j89JJ82M58J142
$$ y = [-270, 141, 249, 566, 864, 664, -117, -486, 398, -327, -371, -324, -480, 497, 617, -111, 153, -769, 96, -450, -421, 43, -784, 681, 316, 205, 502, -623, -296, 214, 395, -389, 406, -635, -307, 395, 421, -326, -432, 761, 511, 935, -554, -167, -758, 379, 1038, -1068, -251, 483, 304, -254, -129, -142, -219, 233, 313, -643, -186, 707, -54, 70, -478, 330, 1062, -115, 253, -261, -106, 89, -356, -447, -207, -12, 192, -310, 224, 1115, -480, 236, 243, 692, -309, -134, 50, 330, -213, 743, -24, 610, 1193, -3, -148, -651, 104, -90, -538, -737, 346, -146, -538, -513, 257, 437, 783, 371, 264, -163, -89, 258, 492, -158, 390, -96, 622, 222, -696, -468, 1805, -73, 0, 798, 663, 858, -754, 309, -565, 801, -959, 156, -233, 1227, -101, -176, -68, -746, 812, 277, -211, 62, -17, -318, 109, 902, -4, -24, 34, 288, 265, -324, 384, -666, 263, -502, 61, 132, -57, -56, 126, 584, 1726]
7324A726j404P7j82k66J091j59l12m16Q49j284R06m36l03J80L2M08n74O38n42
7343B9n09J214o80o50N88M66k72J47q15L99N88K9j209J050l24J14m07L73k0N35
7363F46M88o21j6L63r87j55J26k24O40J88k91r15M23J098j261J703j637N87p13
7382e58k12O56P89j270O18N04J47j98l78p87N49N34j79p23J098o81j11L27M16
7401E41n16j61l24R27j214l64J649m26L48n39l7n10J087j55o22N70L46n47k63
7420b10Q50j299P93J49j107J099M70l27k27j090J174n48N33Q27j386N67q8j45
7438C5j75J63K29M60p67k93O66Q4R41q76o84N7n5k7k09Q23m18k62O74M63o25o93
7460d89J322l27o45R97j051r4K9m75J10J196l49O66P65j329o95K68m65M24o85
$$ y = [1726, 322, 399, 217, -49, 1042, 883, 571, 155, 1004, -280, 626, 190, -113, 67, 99, 507, -67, 571, 29, -480, 734, 54, -596, -8, 458, 186, 333, -482, -83, 505, 534, -675, 375, 51, 165, -242, 131, 111, 646, 1134, 513, 497, 860, -127, -282, -156, -380, 260, 448, 157, -758, -335, 763, -498, 1205, -432, 155, -558, -770, -114, 675, -595, 23, 527, 674, 476, 98, -689, -140, 394, 215, -508, 590, -91, -202, 125, 541, 25, -136, -460, 467, -747, -1111, 538, 112, 460, -79, -116, -626, 461, 306, -316, 254, 600, 53, -210, 640, -659, 134, 283, -824, 275, 745, 418, 191, -899, 275, -273, 260, 1087, -299, 268, 180, 35, -140, 23, 252, 712, -55, -348, 318, 402, 1343, 467, -217, -160, -215, -242, -451, 372, -46, -308, 366, 829, 204, -489, 833, 506, -139, 858, -193, -287, -258, -733, -623, 573, 224, 890, 1655, 326, -369, -101, -566, -142, -827]
7479h27N61P5L36N63r13L38o48M8L33P80l44N39j043J487j516M93l85M9m29N65
7499F2o50J005J32J03J23r54R2k05J444J58j550l27O61L40M05j010l33l77J257
7518C76p70m06M76o76J608j75k92k5M53j28j208J094o3O2m8ON02m02j30ml91M99
7540C58J185j783J005n17k66k6k31L08J26j153J257k81L50k09k22N90m97k67J214
7559I41j082n8J263j338m88J407j85L38j05r40P17o11Q68l97M05n06j128K23J696
7578A020j170P82j033k54P77l83R21Jj002L53L38J4q16K06O73k62M41p45P32j832
7598a239J163q1j30J085n38P65j486N99K28m41j66J044j016Q64j133O98P56o64
7616C08k75o08J18J335N7n82q21O55L77L50r36r33R17M40j149R48j81j38R08k019
$$ y = [-827, -266, -191, 145, 708, -205, 133, -515, -467, -134, 646, 302, 841, -202, 1285, -231, 262, -123, -74, -503, 62, -588, 417, 549, 652, 775, -179, -87, -292, 1152, 1310, -240, -567, 94, 434, 839, -171, -504, -881, 376, -394, -800, -324, -1000, 608, 433, 141, 116, 569, 441, -767, 327, 264, 326, 278, 284, 786, 384, 254, 250, -141, 358, 1543, -240, 765, 248, -18, -44, -275, 33, 159, -994, 263, -18, 332, 123, -99, 491, -6, -273, 941, -141, -199, 1064, -274, -762, 645, 460, 798, 693, -247, 470, -141, 727, 330, 735, 229, -899, -676, 1020, -150, 632, -401, -655, 122, -261, 660, 661, -341, 12, 350, 364, -452, -246, 427, 165, 606, -139, 593, -1239, -76, -157, -287, 798, 260, 1025, -461, 138, 366, -75, -241, 803, -213, 651, -482, 216, 972, 308, 33, -575, -457, 878, 935, 353, -468, 187, 564, 914, -22, -955, -38, 402, -747, 201, 20, -118, 790, -1229]
7636a229J482M47r28M13q48J267o93k93M35k2j797J680m89M78N06K17m55K96J32
7655E99o49r6O7o7O88q73J282o03j044P52N36M31j215O51n78oQ17q28Q31m91k40
7676c6M0L18o83O47q06R90k00q09Q05j721K673j155l53k50M17p25P00N35r65O96
7696A18k31Q93j466J019k52l08n83K55J325q93o36J272O4o66R08j281RN52j7k84
7716b02Q24l00m42R14l75l21q00O55M63L87q89J32l59L72N4o65N15k76K72J59
7736A18l53O9J18P13p64m18O81p20N12p52J003q01M18P64j295J030Mn30j73J070
7756F94L59o25p79L30J26k30N60m10l2n96J004r02O34O11k09K14j069n84R05m90
7776d89M01J260j208L96j35M58l30K9K6j384J051n57M89O59qr40P79n22n41P6
$$ y = [-1229, 253, 700, -228, 185, -663, 604, -89, -382, 53, 31, -1766, -86, -575, -97, 409, 626, 171, 467, 599, -50, -146, -79, -146, 542, -331, 951, 348, -696, 56, 592, 1023, -192, 459, -119, -125, 692, -136, 695, 204, -36, 4, 322, -361, 286, -520, 470, 270, -539, 266, -1455, 1218, 63, -290, -540, -123, -848, -148, 387, -578, 118, -113, 780, -686, 333, 81, -227, -810, -555, 770, -123, -759, 513, 577, -89, 819, -462, -453, 99, 82, -202, 622, 322, -120, 794, 419, 98, -702, -47, 416, 803, -86, 46, -313, 59, 113, -552, -37, -313, -41, 118, -235, -166, -48, 665, -99, -517, 164, -556, -44, -796, 207, -594, -176, 588, -707, 323, 327, -203, -376, 694, 1053, 428, -351, -21, 105, -125, 435, 25, -7, -603, 401, -501, 133, 744, 535, 749, -320, -904, 1, -489, -88, 1172, -36, 360, 225, 683, 353, 382, 408, -976, 75, -482, 7, 666, 658, -282, 497, -25, -566, -490]
7796d90O51k63J52n85J629j322J69O08j09r58J165m1j445J116j73k24J662j297
7814B45K0m28q2l45L13K47O41q23j38L29r50M56L85O26k05k37N48m10J63J297
7834A652j896K58m60Q61M25o55j71r83J117J55m70J90M94j454P82N78m65m84l04
7853h30p51K000J54l09j81N52n17m42N73j55Q3j39RJ1r5K04N44j177J144k034
7873a356J282L88n16N97j386P85N15o18o09R53K41n4m07k57J09M53R6N6m60O38
7893D50o78M67N13q06O49p09J062p18l65J31K5J117j400M65n26N50k25K83Q1j223
7913h57J115j17l14n4l0J130p81m33M78m06k74J30J116p60k31L92R6k78k53k4
7933c55mj55M10L71M42o74r84Q4J565q13K61k80O79j172Q6J105j93m07n04K78
$$ y = [-490, 161, -102, 50, -535, 1094, -228, -59, 549, 440, -518, 647, 606, -839, 277, 104, -120, 1542, 245, 265, -163, -245, -590, -277, -30, 611, -212, -350, -21, -971, -515, -130, 496, 291, 54, 602, 192, 355, 1652, -244, 14, -446, 415, 840, 185, 14, -969, 148, 303, -167, 23, 517, -937, -155, 423, -42, -526, -830, -1581, 419, 573, 264, 83, 635, 118, -324, 249, 94, 177, 38, 47, 58, -37, 167, 711, -466, 678, -1356, -74, 314, -202, 395, -991, -206, 309, -309, -918, 35, 276, 222, -185, -442, -333, 120, 216, 272, -188, 450, -228, 239, 752, -54, 595, -114, 948, 230, -135, -4, 21, 1138, -262, 203, -323, 227, 2, 285, 366, -857, 258, 141, -173, -227, -257, 873, 92, -341, 137, -269, -543, -413, 703, -57, -288, 104, 200, -78, -331, -355, -359, -514, -104, 267, 709, 35, -949, -865, 700, -113, 148, -132, 547, -625, -539, 566, 373, -34, -538, -260]
7953b60P53pj283J445m46j65n88Q41r37j60O25k72P31q95J486k35k15n27N2k55
7973c12K50J04j13J11n4L97k27K14l51m09n43P5J193q0p28N25k4L06m69m07M99
7994d3L11Or56J100n29J07l6M26n33L94m64J176j330N19m16O5J1M82K30o58M06
8015B68r90J581j171N07o28J12P75q21j7K05j72M53q9o34J237l41n11K41P2O6
8035A43m98L7J30o17O74M31r25J436j010K57K2n8k91P9J05O54k77p33J057n13
8055A03j94l14K98R22q84L82j47n16N92l97n18O43l49K65l33K65M46o25L03n12
8075e70J201M7q05Q3J3k29N94j057J113j474J209R0r10M98k63J99m3K50m50O72
8095A68j52P44p82N6j98L70l3j05p37R90l58r8N19m82n25J67L2L47N29r10J027
$$ y = [-260, 493, 486, -797, 648, 202, 37, -551, 290, -647, -807, -182, -454, 277, -618, 868, 633, 418, -109, -57, -312, -62, 42, -71, 40, -14, 383, 156, 370, 19, -390, -933, -858, 335, 255, -473, 52, 28, 334, -135, -542, -43, 268, 274, -682, 418, -111, -4, -40, 386, -147, 247, -217, 959, -371, 148, -268, -203, -192, 290, 520, -138, 268, -722, 859, -312, 195, -433, -321, 454, -367, -384, -179, -351, 102, 13, -621, 616, 275, -236, 5, 77, 143, -355, -318, -188, -805, -131, 300, -625, 811, -199, 58, 80, 22, -269, -190, -85, 569, 292, -441, 616, 103, -91, -405, -107, 815, -69, 313, 166, -350, 242, -155, -673, -30, -379, -114, -447, -182, 264, -361, -58, -570, 631, 678, -127, -44, -31, -260, 334, -723, 390, -1084, 125, 215, -695, -197, -460, -261, -304, -54, -504, 168, 16, 760, -22, 34, -164, 206, 173, 68, -669, 321, -37, -135, 384, -98, -623, -456, -424, -77, 452, -458, 569]
8116E69o46k45J57l2M00l88P36o77l21N89K68n41n3M19J39j74o01J400r38K46
8136C07m72P74l03j67J8N40m09l47J20M52n27k95r8N37o14J39P87j47n86l88J066
8157C87k50j11k7j00Q7L56o11R0m0J93M79o65L69n12O17j76n66N46K1M7m43K89
8179b0O8K05q55J98O97k93p12J96j84J58O40J45
$$ y = [569, -77, -322, -165, -197, 203, -185, 551, -126, -447, 142, 410, -131, -184, 235, 374, 200, -401, 999, 61, 307, -165, 609, 306, 139, 157, 697, 288, -59, 61, 513, -14, -309, -407, 130, -484, -345, 442, 295, -291, -679, 387, 137, 26, -1, -101, -14, 342, -269, -179, -219, -26, 453, -212, 157, -355, 262, 86, -480, 66, 87, 134, -309, -20, 48, 253, -602, -404, 293, 0, -712, -516, -700, -542, 98, 243]
8191B43
$$ Imaginary data points
##PAGE= N=2
##DATA TABLE= (X++(I..I)), XYDATA
0@%%%%%%Nj3J6j6K2l0L7m5N4o7Q2r8J16j40J66j91K22k58K96l38L85m39M98n62
30b98O34p16Q04q98J004j121J244j381J536j704J887k088K312k561K838l147L497
47A842l891M340m865N482o215P105q221R665j1610J4393j8744K6551m4849J62811
61A33794J18222l20632l8270J90765P9743j79125m6010J49873N3400j84459p0082
72a12781J73015J21909j50992j29814J07308J21678j12961j34126R1341J47016
82A21593p1636j37192N6703J36615o0375j44085O5177J79575l6467k19455k9086
93a38633K00177P6778j53711p7967J34933O9256j40075p9525J47972J18367j37147
104B0425j61862Q2749J62682m6752j42742L7435J41909k8146j51057J0179J44844
$$ y = [0, 0, 0, 0, 0, 0, 0, 5, -8, 8, -8, 14, -16, 21, -24, 30, -37, 45, -53, 63, -77, 89, -102, 120, -138, 158, -180, 205, -234, 264, -298, 336, -380, 424, -474, 530, -591, 653, -728, 808, -896, 991, -1097, 1215, -1346, 1492, -1655, 1842, -2049, 2291, -2574, 2908, -3307, 3798, -4423, 5242, -6368, 8025, -10719, 15832, -29017, 133794, 252016, -68616, -106886, 83879, 163622, -15503, -61513, 88360, 141760, -42699, -112781, 60234, 182143, 31151, -98663, 8645, 130323, 17362, -116764, -25423, 121593, 49957, -87235, -30532, 106083, 45708, -98377, -33200, 146375, 109908, -109547, -138633, 61544, 138322, -15389, -93356, 41577, 110833, -29242, -108767, 39205, 157572, 20425, -141437, -58688, 103994, 57242, -85500, -48065, 93844, 65698, -85359, -75180, 69664]
115F9664P424j38778k2935J30204K4945j36290l5007J50332P1987j38722j01077
126a18253J09144J04208r8219j04456R6393J22984r2079j47788O8786J66056k7625
137G9151j64605p87J48908N478j52508k0541J56662N3218j51506p9445J26529
148E54Q7662j03932q6085J00329Q5342j04325j04928R5318J30440p1814j35376
159a06815M7829J36821l0805j35604K1443J42305j0377j44078r933J47880K8571
170H7237j41115m4655J38495P1108j33000r6017J10406J07181q6335j09851P0993
181b5553J04117o6071j10384O6055J24732n1215j45599K0761J43431J705j31152
192f9173j8884J22787K6017j17039k8203J21099M2793j27649o3520J20341Q8743
$$ y = [69664, 77088, -61690, -84625, 45579, 70524, -65766, -100773, 49559, 121546, -17176, -118253, -9109, 95099, -3120, -107576, -11183, 111801, 19722, -128066, -59280, 106776, 79151, -85454, -86241, 62667, 68145, -84363, -104904, 51758, 104976, -46530, -125975, 554, 88216, -15716, -101801, -1472, 83870, -20455, -125383, -30065, 100375, 28561, -106815, -58986, 77835, 47030, -88574, -67131, 75174, 64797, -79281, -89214, 58666, 87237, -53878, -98533, 39962, 111070, -21930, -117947, -7541, 99640, 13305, -96546, -25553, 78564, 12493, -97891, -31836, 92896, 41681, -103918, -83157, 60274, 61979, -69173, -88057, 34730, 60747, -56292, -84495, 36604, 79397, -48252, -111772, 8569, 97312]
203I7312j01396j03822Q3091J15690n8926j12673M7359J14108l8326j19268K9317
214d7534J26001j3708j32095k710J29127K8316j23677m6593J08047N5733r7897
225a6990o4536R1533O6970r3472p8600Q6895R8716p6601j12313N4787J16841l1266
237D1964j18284J7171J08739r650j11157p09J16208K0593j17940l8188J11367
248B0114N3101j00012o6054Q7603P1951p9695q1637O9878R0143n5170r7618M6489
260d0907R7369l9682j05741K3428J11626q015j12752p606J11731K0103j06084
271e6530k7621J03469L7468j02555n6485R7923P7288q3999q2514P1404R0306o2122
283F032r4251N4636J03685l8759j09215K2508J07343m968j04987k292J05284J2352
$$ y = [97312, -4084, -107906, -24815, 90875, 31949, -80724, -33365, 80743, 42417, -76851, -47534, 78467, 64759, -67336, -70046, 59081, 87397, -36280, -82873, 25174, 80907, -16990, -81526, 10007, 76977, -16495, -95095, -8200, 90516, 13915, -98398, -43611, 73230, 41964, -76320, -59149, 49590, 39940, -71217, -71926, 44282, 64875, -53065, -91253, 20114, 73215, -26797, -92851, -5248, 66703, -12992, -94629, -24751, 65392, 10222, -87396, -40907, 56462, 16780, -88961, -65533, 46093, 38078, -74674, -82280, 29451, 49554, -56530, -84151, 19318, 56786, -45769, -102254, -4331, 72957, -11042, -93556, -22152, 68154, 6032, -88219, -33583, 70102, 31343, -77872, -55364, 51979, 47011, -57976, -60268, 45016, 57368]
295E7368j06022k7178J05338M2665r8854n2843Q5758O1180q1959o6929P5174P8354
307G2052o3917q7705N1634R2328l8355r6645L0910R8316k0281j02076P399J07956
319E1616J1080r9778k3696R3457L2915q7987m1662Q6840N3607p9171o6531P1197
331A887P5876n7180p9801M5537Q1067m0058q6033K7756R3233j5985r3449K703
343d4447Q9390P670r0952j7548Q9131K9298q7518m1954Q2375M9932p1181n6837
355f2641O2604O3341n8886p0569N1287Q0270l7590q7881K6356Q8772j6295q8719
367d9951N372R0176O467r0481j8942Q7271L0382q3348m0261P2885M8523p0965
379a2872n6779O6155O2772n4122p2276M3185P4649l5052p8789K6215Q2992j8018
$$ y = [57368, -48654, -75832, 29506, 72171, -26683, -79526, 6232, 67412, -14547, -81476, -6302, 72052, 8135, -79570, -27936, 64392, 26037, -70608, -39698, 58618, 38337, -63739, -56340, 51616, 62696, -37082, -60778, 32679, 65594, -22393, -64055, 22785, 76392, -2779, -69310, 1887, 77763, 20583, -59218, -13681, 67386, 27328, -58705, -30949, 62284, 46299, -47150, -44447, 44943, 52613, -38339, -55887, 33244, 62542, -24976, -66930, 15445, 65377, -5804, -62641, -37, 63304, 4418, -66151, -14864, 65406, 27816, -60065, -33709, 55063, 38768, -49951, -44579, 45597, 52064, -38417, -57359, 29912, 60294, -23054, -63315, 9570, 58093, -12872, -69651, -3496, 59276, 5154, -67122, -23937, 50712, 15660, -63129, -36914, 46078, 28060]
391B8060q4607R237Q5796M188q3000j3247P9793K2999p9972k9490P6692M4968
403F1417p0940n0275O3239N8674n3941o4735M7249O9114l7282p3838K7420P9311
415E5413j5076q0325M840Q0896k78p9192r543P9313J9874p5127l0536P0415L8947
428E9621o3652m6342N9527N2395n2492n9114M8265O6177l8702o8965K7304P2276
440E6298j9401p4379J2114P6528j796p6552p913P5157J7119p2238k7080O9098
452B6955L3621o4007m4585N9503N1753n1741n6309L8910O0943l4848o3467K7712
464a5560O7299j8270p0251J0362O8750J287p1255q904P0266J4364o3282k4210
476c9404O3457L1904n7739l9466N4087M2173m8679n0434M4514N7725l6249o1208
$$ y = [28060, -56547, -47310, 38486, 42674, -40326, -53573, 26220, 49219, -30753, -60243, 16449, 61417, -9523, -59798, 3441, 62115, 8174, -56561, -9312, 59802, 22520, -51318, -23898, 55413, 40337, -39988, -35148, 45748, 45470, -33722, -43265, 36048, 55922, -19205, -49741, 20674, 59621, -4031, -50373, 9154, 61549, 9057, -50057, -1792, 64385, 25683, -43282, -15978, 56298, 36897, -37482, -25368, 51160, 49364, -27188, -35101, 40056, 57175, -15063, -42143, 26955, 60576, -3431, -48016, 11487, 63240, 11499, -44810, -5900, 55043, 20195, -43272, -15560, 51739, 33469, -36782, -26420, 42330, 43617, -27638, -36542, 33724, 48088, -15194, -39404, 24053, 55957, -1782, -41248, 12839, 55012, 6333, -44101, 413, 58138, 21889, -39319]
488c9319K4091O4154j8742o4670J1244O2234l056o6688l345O7000J2899o7402
500b1600k2551O1297K9518n5971l8310N0790M4218m5220m8753M2538N0422l4272
512A2106n5817K7629N9523j8352o4278J2969O4218J108o2939q965O0057J0763
524C8022n7399j5190N9421K1734n9672l1162N5907M0238m9551m8688L9046N1354
536D4060l3309n2567K8850N4988k5228n7843J6288O1060r422o2983k083O4343
548B6154Q958n7922j9060N3773K5844n1804k8671M8784L1802m5986l6924M3843
560a209M2980l4772m9579K6683N3453k0840n0909J4273N2360q595n4885O999N4597
573C0556K310n5673j1814N5520J8241n1352k5733M9756L3328m2634l8511L6715
$$ y = [-39319, -15228, 48926, 30184, -34486, -23242, 38992, 35936, -30752, -34097, 32903, 45802, -21600, -44151, 17146, 46664, -9307, -47617, 3173, 47391, 2171, -46582, -4044, 46378, 12106, -43711, -16082, 43441, 25089, -39189, -26220, 37998, 39106, -23833, -32798, 27259, 38022, -19377, -34567, 24854, 46588, -13084, -44246, 11661, 51899, 2348, -46340, -7294, 44060, 10751, -41816, -12966, 42022, 16794, -41049, -24761, 36299, 26877, -36106, -38189, 26154, 35112, -22810, -41870, 11903, 37747, -14057, -42728, 6056, 37858, -8128, -45052, -1209, 41771, 6999, -42580, -15897, 37556, 16716, -34193, -19920, 32440, 23845, -31040, -24041, 30556, 32866, -22807, -34621, 20899, 39140, -12212, -37945, 11811, 45139, 2505, -36006, 709]
585G09M1660k8631m5159K6844M6365j8684n0957J5030N3104o581n2663o95N0533
598C0875N217m7349j2314M6946J6238m5213k1280M2576K3957m1745l0579L9812
610G141L6072l7287m3927K8455M9258k2240n1387J0447N0158p927m7746L753M8259
623B3029K110n4087p958N2370J9079m9936k6888M2135L1466l3586l2780K9007
635f039L2082k7186l4804L0001L8410k8242m4825K3035M9858j1865n2052L61M9595
648A8329M396m4639p573M2553R080m7471j2485M9006K2678m7861l5609L8168M1220
661B9792k7448l9496J9989L5893j6670l4218J6635L7899j5844m3879J1409M7936
673B1998q10m8873o489M5170J3762l9194j5167L5969J4325l8532j4883M1788K5117
$$ y = [709, 42369, 13738, -31421, -4577, 41788, 23104, -27853, -12823, 40281, 33700, -18963, -19658, 30875, 36092, -11257, -23571, 23375, 39613, -5600, -26880, 15696, 39653, -2092, -32671, 7141, 43213, 5926, -38001, -9546, 39712, 17472, -33915, -23468, 26690, 18763, -28983, -25230, 23029, 25139, -28948, -36906, 15464, 34543, -15393, -42281, -146, 31320, -2266, -35046, -6039, 26043, -1143, -35947, -5946, 32464, 4222, -40603, -17568, 32290, 20425, -31627, -31266, 18329, 22725, -21914, -29487, 13066, 22146, -25325, -37810, 11196, 33874, -13987, -49596, -11428, 29792, 2344, -37152, -17163, 18730, 2060, -32158, -15523, 22376, 6532, -37347, -25938, 21998, 21188, -27685, -34174, 10996, 24758, -14436, -29603, 6366, 20691, -17841, -32724, 9064, 34181]
686C4181l9844l6237L4208M2422k1291m4949J2608M2728p768l8276P137L8385
698B3304m729m0473j882M3712Q528m1341j5123L6547K1365l1018k3022K9278K0661
711B5807k6629k3640K8169K6656k5421l2958K1224L9240j5852m2252P574M2067
723B3985l014l9778k421L9181O681l8350j3147L7749J6616l4303k4737L0979K5524
736B4965k3463k9372K1335L1563j7394l2713J2998L2695j0004l2434P990L3736
748A9902o053l3924K910L7983J124l9499p726L8952J4369l6917j8854L3437K3414
761B9118k8439k8790K7192K7349k3576l2256J9387L5077j3085m0136O085L8407
773A6333j165l4370l922K9529M900k8182n069L0268O597l4227j2493L5502J7861
$$ y = [34181, -5663, -41900, -7692, 34730, 13439, -31510, -18902, 23826, 16058, -22218, -15081, 23304, 18575, -21898, -23780, 19932, 28460, -12881, -28004, 8543, 29908, -1110, -24132, 5146, 25807, -822, -24462, 3707, 30363, 4942, -28016, -6792, 32448, 16596, -25656, -18082, 23985, 20971, -18807, -21228, 17953, 24634, -13716, -26863, 10886, 27502, -6801, -31538, -559, 24965, 1502, -27870, -6535, 25028, 7634, -25079, -12081, 20614, 10610, -21824, -13834, 19902, 13849, -20075, -17165, 20818, 21942, -17557, -25283, 13669, 28038, -8879, -27733, 5704, 29118, 679, -28111, -919, 26430, 2854, -29402, -10015, 25062, 11977, -28159, -22074, 16333, 15168, -19202, -23124, 6405, 11305, -16877, -21946, 8322, 14919, -19308, -31801, 3701, 21562]
786B1562k9853k2937K2902K6781k0164k5642J9089K5969k0023k9174J7588L6201
798B2299j0066l9127J841L9218N818l4728j1223K8971J3441k5578j2690K6172
810D348J3795k6028j6926K5382K3650k1891k7811J4448K8465p534k4880Q104K2055
823A5177r316k5108J0059L1181n062l4104j376L2387R777k9756j3571K7279J5195
836B2762k4784j7441K2759K0038k1037k2364J8995K6795j5990l1537J0967L0223
848A9386l807k8728J551K4273J496k4669j362K6533L103k9062q631K7466J5082
861B2631k3867j4027J9376J7904k1072j9231J8774K3655j7031k5355J3042K8429
873B3228q574k8928N075K7885m06l0486l630K7553Q289k5921r192K5311R460k3883
$$ y = [21562, -8291, -31228, -8326, 18455, -1709, -27351, -8262, 17707, -2316, -31490, -13902, 22299, 12233, -26894, -25053, 14165, 19983, -14745, -25968, 3003, 16444, -9134, -21824, 4348, 18143, -7885, -24811, 571, 24221, 2330, -25481, -11033, 17432, 9898, -14982, -6878, 15177, 5861, -19247, -9188, 21993, 16931, -17173, -18549, 13838, 23615, -6141, -19712, 7567, 22762, -2022, -19463, 3296, 23334, 2297, -20067, -1072, 25723, 9733, -21804, -10837, 19386, 15579, -13149, -11598, 12675, 14171, -10498, -11860, 14673, 17776, -11286, -19917, 7549, 22631, -1236, -15263, 4113, 22017, 945, -18286, 488, 24143, 7112, -18243, -5201, 23228, 14654, -14274, -9199, 18686, 18280, -12206, -15836, 11717, 20006, -5915, -15107, 10204, 19664, -4219]
887d219j3308K1507J6008j9461j9938J7078J9749j3154k1269J2302K4688j2147
899G836k6053Q422K5209q00k7130J87K4389K411k5030m126K6048Q336k4865j3917
913a9083K1841J6907j8896j7458J7343J7750j6636j8954J2652K3183j0826k2549
925a4726O649K4245m380k5092J282K5575J496k4577n099K3171O767k1757o947
938a3393K0597J1541k1353j4921J8542J8731j4614j7922J0564K0179j0370j9979
950a2398R546K1051o118k2864J471K4199K036k2219m832K2506N679k1154r761
963a2858K1016J1199j9039j2311J6761J4123j4756j7019J3553J8979r899k1229
975a1480O146K2636m195k0753J646K1682k036k0397k989K2583N994k1274q157
$$ y = [-4219, -17527, 3980, 19988, 527, -19411, -2333, 17416, 4262, -17007, -4705, 19983, 7836, -18217, -9795, 15414, 14614, -12516, -12329, 12060, 14471, -10559, -14685, 11363, 19699, -5166, -19083, 2758, 19665, 769, -16689, 654, 18404, 1768, -17186, -4534, 18649, 7823, -14726, -8077, 16168, 11788, -13304, -12022, 13553, 15049, -9528, -14627, 8544, 15311, -6446, -13393, 7204, 18745, -2608, -17529, 1013, 19744, 5130, -12792, -2228, 17951, 7581, -12398, -2852, 18199, 12081, -10783, -9312, 14887, 16923, -5296, -10128, 12378, 18057, -3097, -12858, 8158, 19357, 318, -11993, 4768, 18891, 4135, -12884, 669, 19648, 9749, -11480, -5334, 17302, 13107, -7646, -6000, 15682, 13646, -6751, -9740, 12843, 18837, -2437, -10594]
988a0594J9923R489j7371j2620J6313J4653j6297j6829J5136J7972j1508j9413
1000a1146Q747J9004p576j9964K875K1235j451k0008j644K0007M778k1508o075
1013a2726J9608P979j8748j1873J8188J3113j5374j4171J3447J5000j2902j6649
1025a5108R847J8023p178j9874O415J8730l147j9763L15J9951N39j8921m145J8806
1039D490N856j7581q902J7939R176j5354j2669J3264J5626j2145j5842R895J7087
1052A0840p839j7455N329J6942j969j7659M65J8484J703j6608l599J7308M816
1065A0758j6915p555J6700R585j5096j0084J3668J2859j3456j3441R513J5641
1077A2177q580j6725O927J8933m670j8974K771J7123K96j8591j732J8525L428
$$ y = [-10594, 9329, 18818, 1447, -11173, 5140, 19793, 3496, -13333, 1803, 19775, 8267, -11146, -2399, 16605, 9029, -10935, -8060, 13175, 11724, -8284, -9928, 10079, 14857, -6651, -12726, 6882, 14861, -3887, -15760, 2428, 15541, 167, -14004, -557, 14443, 1541, -15108, -5261, 12762, 5584, -14290, -7875, 10855, 7708, -12055, -11740, 8211, 8750, -10171, -14316, 4490, 10346, -7235, -16137, 1802, 10978, -4376, -17045, -3781, 11845, -300, -16142, -6247, 10840, 3001, -14454, -9125, 7817, 5848, -11811, -11346, 7138, 8841, -7767, -11366, 5942, 10758, -6157, -13712, 2988, 12573, -2523, -12607, 1061, 13920, 464, -12977, -3464, 12177, 3597, -13128, -6201, 12732, 8062, -10912, -8141, 8982, 9278, -9313, -11045, 7480, 10908]
1090A0908j7072o194J5688J0548j5583j1558J3327J2734j1026j5485J0499J6582
1102A3368q857j5450O390J7054n493j6925K828J7524j378j6623j594J7534L815
1115A2193j7154n534J6153N861j4323r247J4488J0078j3738j1446J2033J4271
1127A3635j0147j6203Q359J4973n089j6919M326J7119k839j8510Q68J6932O55
1140G160j5280m688J6277O773j6332q024J2913J0497j1904j2239J0807J1796j0563
1153b807j2316Q760J3810o423j5675N404J5011k453j6230J23J5964K338j6508
1166a1002k076J5389L355j4648n546J4824Q115j5058q221J2033J2049j0401j3147
1179a4334P761J4045n575j5240N636J5418m502j4560J186J6374R90j6255l276
$$ y = [10908, -6164, -12358, 3330, 13878, -1705, -13263, 64, 12798, 1772, -13713, -3214, 13368, 4511, -10939, -4549, 12505, 7012, -9913, -7085, 10439, 9061, -7562, -9156, 8378, 12193, -4961, -10495, 5658, 11519, -2804, -12051, 2437, 12515, -1223, -12669, -636, 13635, 3488, -12715, -4356, 10617, 5528, -11391, -7065, 10054, 7215, -11295, -10427, 6505, 7160, -8120, -12808, 3469, 10242, -6090, -14114, -1201, 9296, -2608, -14847, -4040, 7756, -2807, -15123, -6363, 7447, 1024, -14651, -9247, 5764, 3311, -12919, -12796, 3168, 5506, -11002, -13078, 2311, 5666, -8982, -14528, 296, 8411, -6647, -14868, -2835, 9214, -1187, -14334, -6573, 7472, 1897, -13343, -7707, 7711, 3209, -11351, -10165, 6209, 7199, -9056, -12332]
1192a2332J6113L936j4519o131J3172P692j0825r131J1100R565j0616j1157R192
1205c941J4286q581j4329N351J4790k611j5446J807J4022J189j5431q4J5583K789
1219I394j5627n540J5108Q374j3273j0546J1977J1780r438j1837Q084J1811p678
1232B589j2294P499J3290n404j6849N075J5951j062j6177r57J4614L135j3225
1245c815n316J3537M919j2812o593J3652Q303j3310j1375J1446J3598r025j3025
1258i816N109J3687n057j3237M576J3806m489j5255J002J7358J258j5590m058
1271a0706J4456P171j3954p722J1895O883r390r122J1392J0390j0729j2899R743
1284b592J3984o235j4302K601J2967K41j2546J700J0893n98j2858p59J4062K763
$$ y = [-12332, 3781, 7717, -6802, -12933, 239, 7931, -2894, -12025, -925, 8640, -1976, -13133, -3941, 10345, 1764, -12565, -7214, 7576, 4965, -10481, -8674, 5348, 6537, -8894, -8978, 6605, 9394, -6233, -11773, 3335, 11709, -1564, -12110, -133, 11647, 2209, -9628, -1544, 10267, 2589, -9705, -2206, 11084, 5680, -11169, -6094, 9857, 8795, -7382, -8339, 6275, 9410, -3815, -9131, 4406, 9325, -3487, -10080, 3572, 11875, -1435, -12810, -1364, 12234, 3209, -9816, -4707, 8980, 3923, -9314, -4738, 9068, 4579, -10676, -9674, 7684, 8942, -6648, -10706, 3750, 10921, -3033, -10755, 1140, 8023, -1367, -10489, 903, 11293, 564, -12335, -2592, 11392, 5157, -9145, -6544, 6423, 6664, -5882, -4182, 6711, 6113, -6745, -7504, 6558, 9321]
1298I321j4846m530J3669P280j1999q857R904R330r075j0113Q530J1676q403j4072
1312a2185O772J5946n009j5168o1J5224K812j4755k715J2506M316j2097m437J1362
1326B511O639j2592p061J1420Q205p775j1175Q299R975o015j0912N247J2522l827
1340E461j3586N007J3230j930j5136j09J5065L738j5568n954J4661P428j1503
1353H04q576R700J1396j0027j0546P574J1412o218j2647O265J2954l720j3465
1366e094J350J3141O41j2283j893J1352K093j1916j462J2858M237j4765o359J3415
1380E315R618j2577j0820J0273J1116p171j2366N320J3699o264j3547M396J4549
1393A1541j754j6052j249J6387K897j3043o292J1453N703j0078n426R859O350
$$ y = [9321, -5525, -10055, 3614, 10894, -1105, -9962, -58, 9272, 197, -9916, -1386, 10290, 1887, -12185, -5413, 10533, 5524, -9644, -9705, 5519, 8331, -6424, -9139, 3367, 7683, -4414, -8851, 2511, 9150, -3442, -10503, 917, 9122, 1347, -9828, -1529, 8446, 2431, -8481, -3234, 9288, 5461, -8125, -3118, 10112, 8182, -6954, -7063, 8002, 11740, -3828, -9782, 4879, 12307, 804, -7772, 1928, 13324, 3297, -7249, 325, 11737, 5519, -7128, -863, 12091, 8371, -5094, -3744, 9397, 10038, -2245, -4138, 7214, 9307, -2609, -4071, 8787, 13024, -1741, -8100, 5315, 14933, 2356, -8464, 1809, 12925, 5754, -6612, -1292, 12407, 6143, -7404, -3008, 11541, 9787, -6265, -7514, 8873, 11770, -1273, -7565, 3888, 9591, -487, -5913, 3946, 10296]
1406A0296j0926q773J1756R712r835j2490P614J3080n816j1559J973J3252l949
1419D335j1919J898J4364j588j6120j538J5139O017j3602p986J0824Q874r464
1432g66q483P258J0465r007r804P892J2295o749j3645L612J4083j721j2186K95
1446f461J1023J806j1971n61J2342K481j3357n843J3840P926j1807q866R650J0071
1460A0273q886r674P037R758m945j1393N123J2423l464j3646J523J3186J042j2329
1474c972k920J1923L765j1642m043J2830M347r631r517J0398J0435j0052j0238
1487h317P338J1693o346j2527M167J3635m142j2710K358J2702J276j3823k318
1500g014J2880L117j2106m561J1383O067j1102q586J1088Q830p530j1184Q354
$$ y = [10296, -630, -9403, 2353, 12065, 2230, -10260, -2646, 10434, 4618, -6941, -4968, 8284, 4335, -7584, -5686, 8678, 7090, -9030, -10568, 4571, 10588, -3014, -11000, -176, 8698, -766, -9249, -1991, 8474, -533, -10337, -2445, 9850, 3101, -10544, -6932, 7151, 5430, -6756, -6461, 4562, 6368, -5603, -6164, 6178, 8659, -4698, -10541, 3299, 11225, -582, -9448, 202, 10273, 1387, -8287, -1250, 8508, 3563, -7830, -2707, 9716, 6252, -7394, -5871, 7315, 8357, -3972, -6892, 5031, 8796, -2846, -6889, 5941, 10288, 657, -8860, 1538, 11973, 1921, -8317, -979, 10714, 4368, -8159, -3992, 9643, 5501, -7209, -4851, 7851, 9127, -4696, -7014, 5866, 8983, -3123, -7684, 3699, 9766, -1336, -9922, 1166, 9996, 2466, -8718, -364]
1513c64R544n970j1426N578J1466l978j4366L472J4814j770j4334k254J5331K830
1527H573j3185m744J1157O492j0137p385J0337Q967j1419r891Q965J0952n336
1540C346j2444M445J1636l479j2039L105J0945j272j3199L31J3608K556j3312
1553e773m198J2345M546j0703o594R259R599j1167q974J1355Q827q753j0832N580
1567e483J3299m455j3619L287J2296J33j1128k928J1831L249j3516k676J0870
1580A160N882r836p541J0301P589q836q582P463R587o176j0844N237J2340m701
1594C043j1259K753J2340k093j3537J455J2538J533j2449k738J2464M523j2587
1607d014m860J1238O404j0124q605Q852J0175o189j1204N256J0118l019j3064
$$ y = [-364, 9180, 3210, -8216, -2638, 8828, 4850, -9516, -6044, 8770, 7000, -7334, -9588, 5743, 8573, -4612, -9356, 1801, 8293, -1844, -9229, 1108, 10075, -1344, -11235, -2270, 8682, 3346, -9098, -4653, 6983, 3504, -8535, -5430, 5515, 4243, -8956, -8625, 4983, 7539, -5773, -9971, 2374, 6920, -3783, -10377, -1118, 8481, -2686, -11660, -305, 8522, -231, -11063, -5483, 7816, 3361, -10258, -6971, 5325, 5458, -5670, -8598, 3233, 6482, -7034, -9710, 1160, 7042, -2794, -10335, -34, 7555, -1281, -9863, -2400, 7187, 1011, -9833, -4596, 7744, 3043, -8216, -5463, 6877, 4784, -8753, -7298, 5240, 6773, -5676, -8414, 4050, 8573, -4014, -8874, 2364, 8768, -1356, -9961, -1109, 9066, 2877, -8327, -3071, 7047, 4028, -9036]
1620i036L709J2101j021j1511j549J1999K635j1963m307J1753M486r789o676J0816
1634A647P044r211p216O660J0924q336j1368Q509R571m849j1397L814J3158l924
1648E026j2111M74J2304J604j2689k670J2327N988j2414o313J0427O380r314q539
1662i520R202R504p738j0519O033J0612m185j0602K423J0664k323j0877P92J1608
1676E074J172j2572k223J1691L624j1287n934J1231O576j0032q896J0207Q495
1689G126o709j0535O177R839m173j2882M584J3988k822j2969N48J3162P0j2559
1703g155k582J2910M258j1918n518J1267P082j0800p249R152P878p595r730O640
1717c360J0917n474j0304L531J1498k223j1182Q12J2707m48j2234j161J2225K915
$$ y = [-9036, -5327, 6774, 5753, -5758, -7307, 4692, 7327, -4636, -8943, 2810, 7296, -2493, -9169, 1647, 8691, -520, -7736, -1076, 9848, 1512, -9856, -1347, 8224, 3375, -8022, -4208, 8950, 5026, -7085, -6611, 5693, 7297, -5392, -8062, 4265, 10253, -2161, -8474, 1953, 8333, -981, -9520, -318, 9186, 1448, -9071, -3038, 7574, 3389, -7213, -4790, 5874, 3551, -7326, -6534, 5074, 6246, -6326, -8549, 3142, 6766, -4521, -10455, 776, 7352, -2680, -11576, -1369, 7126, 417, -10118, -3941, 5898, 1725, -11157, -6573, 7415, 4593, -8376, -7828, 5334, 5404, -7155, -9737, 3173, 7431, -4487, -10005, 1262, 8344, -2456, -9705, -553, 7325, -270, -10000, -3360, 7557, 2083, -8221, -4690, 6808, 4585, -6597, -5785, 6922, 6474, -5760, -6921, 5304, 8219]
1731H219j1091n527J1447N766r909o532Q497R625q564r372O663J0195o015j0177
1745f775M391J1017k575j1082L20J2727j39j1793j869J1140L602j1329m092R915
1759C458N724p826o705P463P434p057r799P484R380n051j0835M249J0568k656
1773E831j1492K309J0311J57j1845q76J0452K942r899m232R504O157r835p624
1787h140Q825Q185p627r847P102R799m960r739K403J1455l904r934P36J1781J165
1802G300j2481j204J0702L640j1049m482J0899M158j0415n514R519O201q391p402
1816h519O921J0252o816j0035M420J0995l980r064J78J1929j303j1210M4J0119
1830C931M141j1828m185J0336N850r046o780P473P229o687q167O675Q682n483
$$ y = [8219, -2872, -8399, 3048, 8814, -1095, -7627, 870, 10495, 1931, -7441, -778, 9417, 3402, -6775, -2384, 8633, 6058, -5024, -4704, 8023, 7884, -3909, -5778, 5362, 8964, -2365, -6457, 3458, 9182, 1356, -5349, 2114, 9548, 2491, -7308, 176, 9556, 4505, -6330, -2081, 8487, 5831, -5661, -3352, 6959, 7116, -4729, -5605, 4847, 7789, -2110, -6342, 3162, 9319, -516, -8140, 685, 8870, 1243, -8604, -1502, 8297, 3337, -6402, -3999, 7456, 3552, -6382, -5646, 6135, 7300, -5181, -6385, 4317, 7957, -3092, -7574, 3325, 7483, -2932, -8446, 1073, 7274, -1117, -8519, -1598, 8654, 1838, -8197, -3777, 7218, 3238, -5826, -5648, 6281, 4978, -6232, -6188, 3931, 8072, -3756, -7941, 2395, 8245, -801, -7581, -108, 7121, 434, -7733, -1058, 7624, 2141]
1844B141q871M937J0391l685j1171K505J1200j399j1420M57R894K679j0646m092
1858g080J0554M203r553n253Q589P858q719p761O461J0914p378r368M614J0184
1872H265k850j0705K365J0603q13j0290j048J0733K315j1179n653J1759N533q613
1886D22o837Q667N419p056o767N737Q759o116q290M803R018k341j0735J263J0871
1901F817m63j0542q42R528J513r563k718J0225L700q794n500Q748O894p691q562
1916g250N613R018m614r980O008P814l375r134K448R602J10j0385j031R339L269
1931G452j0820l681J0113L126q473m390Q445N635p743p396P169P354o047r138
1945h394M688J0298l346r973K358R505n09j0158O26Q477K305r201m779J0538M864
$$ y = [2141, -6730, -1793, 8598, 4913, -6258, -3753, 7447, 6048, -5372, -4915, 4979, 7658, -2988, -7080, 3474, 7677, -1876, -7129, 1460, 9318, 599, -7162, -701, 10213, 2835, -6533, -1919, 8265, 5415, -5290, -2925, 7678, 6865, -3425, -4473, 6260, 8575, -2604, -8257, 3502, 9035, 422, -6415, 2252, 7671, 615, -6152, -415, 8344, 2228, -6062, -1259, 7759, 5418, -5317, -4054, 6817, 6354, -4188, -5030, 4498, 6011, -3552, -6270, 3955, 7655, -1139, -6639, 2109, 9003, 1312, -7250, -1637, 7381, 2767, -7213, -1205, 6609, 3234, -5900, -3452, 6150, 6260, -4125, -5156, 4183, 7452, -3368, -7049, 3064, 6190, -2283, -6673, 1772, 7407, -336, -7732, -563, 6791, 744, -8394, -3706, 6592, 3246, -6727, -4369, 5136, 4627, -5531, -4905, 3572, 5877, -3324, -8103, 2435, 7299]
1960G299r936m309P880O194p660o639O067O805m448r733O707P989m120r291J994
1975e201J1603j424j0885k1J0122J229q909k453P938M021q360n229Q704N945q084
1990a004p142P303P292n464p993M791P627j946r302J848J0519k407r323MJ0504
2005E307P41j1332j367R867L963r040m749Q069N050p000m511N313P648n883r022
2020f946N456J0158n824q700K522Q825q34r474K41R010Q29p940k983J0786J188
2035F314q765m120Q912N121q736n375O010P000m717p789N141P386m644q154J785
2050d631J0900j954r880m8R175J236q652k854Q652K401o035n236Q811L292n962
2065g85o434O656O184m897p928M317P641k968q089J606J0030l350p119m99Q835
$$ y = [7299, -2637, -6946, 934, 7128, -532, -7171, -1104, 5701, 1253, -8480, -1773, 6216, 2096, -7195, -5201, 6402, 4978, -5907, -5928, 4194, 5423, -3486, -5939, 1999, 6020, -2340, -7569, 1135, 7080, -1004, -8146, -843, 6449, 985, -7008, -2217, 5410, 3464, -5838, -3990, 6529, 4122, -5201, -5197, 5307, 6048, -5284, -6651, 3216, 7179, -1861, -6610, 1459, 6509, -491, -5002, 311, 7959, 2076, -6946, -1490, 8668, 2844, -5856, -3334, 5491, 4657, -4817, -4576, 4434, 5263, -2677, -5660, 5126, 6314, -2451, -6571, 2341, 7462, -1274, -6649, -639, 6361, 1644, -6145, -1004, 6382, 1738, -6416, -4631, 6269, 4315, -5565, -5613, 3562, 4798, -3854, -6708, 1944, 4345, -1690, -6926, 1885, 5177, -785, -7219, -563, 5621, 724, -7204, -2887, 4754, 1786, -6303, -4697, 5333, 1983, -5136, -5635, 3200]
2080C200m64p234k856R307K950r090m454Q748M980o975n932O699O966n220q104
2095g479M499Q171m091p714J494Q575l89q273J41Q270J040q916j451P374L094
2110D345p093m522Q365M392o746n082N716P022o189p335N301Q788m681p999K573
2125c145R159k296q716N40Q360J514q900j337Q173K335p156l306O461N683p344
2140B5m780M906N647m400o827M541Q340m041q018K648P521j385q599J347P675
2155D600N91r108Q7P117L028q249l374P530M385p199m574N840M988n100n428L810
2171a056N779l648o441K922P319j900q182J986P370P02q702j535P239L412p429
2186b164k723O727K770o027m414N927N319p373l923M182O463l359p144K860P098
$$ y = [3200, 2736, -4498, -7354, 1953, 4903, -4187, -8641, 107, 5087, -1888, -7820, -1121, 5845, 625, -7479, -2980, 5191, 1100, -6614, -5120, 3455, 3066, -5207, -5066, 3204, 4244, -4672, -6123, 1251, 4345, -2748, -7270, 1095, 5487, -1259, -6341, -625, 6397, 208, -7127, -1826, 6962, 2281, -5718, -3145, 6014, 3718, -4998, -4458, 3902, 5416, -3484, -4821, 3352, 5687, -1469, -4775, 1686, 7369, 25, -4755, 151, 5798, 1398, -5429, -888, 7452, 3411, -4607, -1959, 5562, 4177, -4422, -3075, 4600, 5191, -3917, -3830, 3287, 6315, -1934, -5308, 2222, 6607, -592, -5166, 674, 5662, 562, -4866, -1056, 4723, 1075, -5366, -2444, 4875, 2975, -5207, -3221, 4149, 4851, -3851, -5386, 1853, 5265, -2164, -4887, 1840, 4610, -1417, -5831, 96, 5415, -1958, -5881, -1699, 4764, 1405, -5739, -2879, 4219]
2201D219j570p299P71P688j49p977n11P041K797p344k161N284L746n407n324O029
2217a67N776m734o124L467P177m107o441K131P262j006o835o85Q168l94p251j143
2233d906P239K058n798k919N772M272o472l395M599M467m879n520M907O120m387
2248A158n015K001P204j942o685nP020N75p105j091Q008J693p380k682O370L502
2264E626o032m899O224M365m016n060L867N690l292o333K193P454j896p490J232
2279b367O732j83o954m74O881J078o134k920O839K993n520l794N626L760m921
2294F42n302M443N757l390o026K376O167j322o358Q30O740j004o146n37O269J824
2310D963o088k606N317L602n051m659N017M705m700m627L735N127l368n341K335
$$ y = [4219, 2649, -4650, -3879, 3809, 3660, -4317, -4828, 2213, 5010, -2334, -4495, 789, 4535, -872, -6196, -167, 5609, 875, -5249, -1782, 5395, 1288, -5153, -3022, 4240, 3234, -3601, -4286, 3882, 3488, -3763, -4906, 2333, 4391, -1407, -4326, 1446, 5718, -754, -4149, 450, 4917, 38, -5482, -575, 5545, 1158, -3857, -1856, 5348, 3406, -3279, -3284, 3736, 4311, -2794, -3885, 4123, 5816, -1564, -4246, 2124, 5626, -406, -5305, 919, 5284, 1268, -3792, 75, 5765, 2473, -3860, -1667, 5787, 3891, -3599, -2367, 4365, 4182, -2772, -3246, 3635, 4713, -1421, -4341, 2498, 5491, -29, -3823, 1803, 5563, 642, -4660, -217, 5540, 2150, -3876, -1500, 4667, 3345, -3013, -2183, 4557, 3553, -2593, -3130, 3139, 4963, -1125, -3731, 1586, 5188, 137, -4522, 495, 5200, 500, -4127, -392, 4735, 1367, -3974, -1639]
2325a639O217k491n585Q83N796m75n621l00N246J568n513k137N466K851n596l446
2341d776N837L733m548m843L733N299l480n393K163O588k307o125J395N890k45
2356B921n687q11O237R33o081j570N507K122n122k966N007L573m482m149L558
2371a010N586l790n094K843N309j450o000J075O154p30n595m22O185O50n480j915
2387c684N925K328m876l258M531L803m298m001L933M402l419m691K194M915j535
2402B269m898R68N446J6o009K17N289P13n305j258M957J856n175k396M594K849
2418D133l599l497K958M328l616m113K749N044k266n405J463M998j20n772j88
2433b903N630R30o085j196M977K311m362l019M377K909l669m430L896L693k278
$$ y = [-1639, 4578, 2087, -3498, -2615, 3181, 2706, -2915, -3215, 2031, 3599, -1914, -4051, 1415, 4266, -1330, -4776, 1061, 4794, 246, -4597, -864, 4435, 955, -4438, -2275, 4313, 2006, -4119, -2724, 3166, 2921, -2766, -3577, 2660, 3593, -2488, -4058, 1449, 3571, -1551, -4517, 490, 4063, -419, -4568, -1010, 4576, 786, -4308, -1465, 3844, 2394, -3606, -2531, 3623, 2893, -2702, -3124, 3061, 3711, -1769, -3684, 2241, 4569, -307, -3565, 966, 4769, 471, -3530, 403, 4805, 1386, -3305, -1111, 3804, 2269, -2629, -1661, 3785, 3801, -2208, -1991, 3298, 4011, -1294, -2552, 2405, 4261, -914, -3310, 1284, 4133, 534, -2963, -5, 4323, 707, -3406, -657, 4387, 2121, -3284, -1821, 3177, 3057, -2715, -2903, 2727, 3657, -2428, -3624, 1353, 3664, -698, -3717, 660, 3569, -100, -4530, -634, 3059, 781]
2448G81m783L017L647j689m005M29N325n72n296k85M814J185n105j493M750K289
2464C009n456k205M369K925l541l237L394K714k072m577K627M246q78n257J440
2479b499M666k97n699N78M967J60m476r87M355J788m202k331L765L521l887l098
2495c676L423K844k430l859K283M106j481m327J686M566q35n162K96M787N01m705
2511a983o92M311J778m117k491L599K865l888k320K483L735k527m229L097L414
2526C035j505m904J525M511n57m254K58M013J21m137n41M181J091m216j465L751
2542I07K580l368l474L219L181k491l768K577L672j949m148J590M112n18n078
2557b956L49M749J95m055j159L739J532l813j107L521J566l065k584K757K822
$$ y = [781, -4002, -985, 2662, 973, -3032, -2603, 2722, 2150, -3146, -3431, 1383, 2568, -2537, -4030, 720, 3009, -2447, -4652, -283, 2642, -899, -4136, -742, 1972, -100, -4677, -2050, 2196, 1318, -3939, -2499, 2167, 1870, -3829, -3251, 1716, 1876, -2600, -3587, 768, 2556, -1646, -3977, -212, 3309, -578, -3676, -253, 2591, 161, -3698, -1415, 2691, 1210, -3117, -1431, 3135, 2300, -2862, -2566, 2221, 2722, -1983, -2675, 1636, 3414, -703, -3194, 405, 3270, -618, -2938, -455, 3280, 753, -3476, -379, 3035, 1530, -3374, -1849, 2662, 2105, -2149, -1891, 2122, 2243, -1894, -2435, 1746, 2837, -1379, -2844, 907, 3487, 119, -3355, -136, 3045, 554, -3214, -637, 3035, 1086, -3062, -1472, 2640, 2122, -2956, -2607, 2142, 2337, -1718, -2877, 862, 2394, -1419, -2526, 995, 2561, -504, -3088, -331, 2491]
2572B491j909l727K040L141j220l779J215L521p74m286R02L730K24l549n32M083
2588A571N82l609k069L699K239k948k369K520K268j847l143K526L312j978l824
2603c070J183M153j098l954J072L292L64l817n62L238J104l127j908L765J922
2618B557l140k393K609K517k071k717J757K784j281l252Q71M033j071l788O85
2633a900L677m52l176o19L997O79l335j386K758J951k894j813K700K438k400k451
2649b226K113K282j156l271J148L391n55l673J228K782m59k803m08L013P52l364
2665a206o28L288J188k830j377J885K216j759k239J273K683j849k388J332L258
2680B847j092l134K99L294M49l604j42K732J51k128o44K220Q80k270j937K844
$$ y = [2491, 582, -3145, -1105, 2036, 816, -2963, -1748, 1773, 999, -3287, -2385, 1345, 1569, -1980, -2512, 1571, 2153, -1456, -3525, 174, 2413, -535, -2904, -384, 1884, 37, -3106, -580, 2732, 754, -3070, -1887, 2266, 1168, -2786, -1714, 1578, 1942, -1875, -2437, 801, 1905, -1222, -3130, 635, 2557, -583, -2976, -367, 2150, 79, -2638, -881, 1903, 622, -2630, -1759, 2274, 1203, -2585, -1900, 1777, 1325, -1851, -2470, 1527, 2206, -1129, -2515, 243, 2194, -700, -2513, 187, 2625, 225, -2226, -113, 2169, 1013, -2258, -1110, 2281, 1726, -1947, -719, 2063, 1604, -1199, -1607, 1406, 2158, -1206, -1834, 1454, 2642, -188, -1565, 320, 2536, 777, -1462, -189, 2494, 645, -1743, -411, 2847, 1755, -1379, -1080, 2214, 2663, -941, -1083, 1649, 1800, -328, -972, 1248, 2128, -142, -2079, 765]
2696G65K082k070k136J254K220j016k546J140J907L24l170N17K047j04k395q8
2712a269K767M60l350n74K649J628k486j490J629J494j065k715J643K683k049
2727d5k522K069K181j137k570M28K913j01k480l64K680L21k513k89K132Q75k539
2744i61j427L046J200k406j548J749K395j552k448J542K238j183j980L54K609
2759A628l02k997N01K866Mk426p23K447N75k303k96J860J087j975j410R28K538
2776B002j715j801J067K109J8k806J069K291j464j216n05K665j47k640K48K172
2792A347L32j457j091J508J974k063j467J097J773j288j578J164K423j165k670
2807a161O66K308p80j859L39J799L71k032n58K102O00k215r36J246J920j560j514
$$ y = [765, 2847, 777, -1359, -105, 2115, 1099, -1447, -307, 1600, 1924, -1246, -729, 1318, 1214, -1181, -1269, 1498, 1958, -1392, -1966, 683, 2311, -175, -1665, -36, 1458, 393, -2322, -679, 2004, -45, -2567, -498, 1683, 546, -2024, -1596, 1317, 1216, -1264, -1628, 1052, 1373, -1140, -1429, 703, 1578, -961, -2388, 658, 1858, -548, -2096, -347, 2048, 496, -1952, -410, 1828, 645, -1335, -981, 1628, 1326, -1671, -1170, 1696, 1700, -726, -1449, 998, 1573, -730, -1026, 834, 1921, -54, -1464, -536, 2002, 287, -1514, -447, 1662, 1680, -1126, -57, 2234, 770, -446, -951, 1714, 1567, -1073, -825, 1347, 1679, 222, -869, 639, 2613, 550, -917, 180, 1953, 665, -913, 251, 2674, 1509, -1161, -495, 1813, 1033, -826, -487, 1312, 1683, -349, -907, 1195, 1795, -420, -1356, -110, 1810, 250, -1264]
2824a264J374K041j483k114J104K200j159k343R52K248p77j779N08J512Lk364
2840a341l42J921Q52j761j255K413P93j714j212J244J369j348j713J441J595q29
2856A13k095Q27K225m67k426Q45J560K33k367J97J725P98j856n65J458R61j743
2873e77j270J771J014j179j728J638J568r35j679K14J914p93q76Q6J702m62j443
2890a035L60J403l55j345l19J542P66j750p40J588J380j513j113Q12J197n95j085
2907h02K77J675l21j803M85J979p33j675j81J814K13r36q85J415Q94j156p81M89
2925c2J274j054r31O53J233q93j296N74J424j25j844L36J796m31j861L13J823
2942I59j33j466l66J252J087j732r72J339J415j472j139P97J252p64j330J033
$$ y = [-1264, 110, 2151, 668, -1446, -342, 1858, 699, -1644, -692, 1556, 779, -1000, -492, 1020, 1023, -1341, -1683, 238, 1090, -671, -1926, 487, 1280, -434, -1646, -402, 967, -381, -2094, -653, 942, 113, -1982, -1155, 1070, 603, -1823, -978, 582, 815, -1552, -1355, 370, 1168, -688, -1253, 205, 1166, -577, -1847, -76, 938, -241, -1969, -331, 1237, 302, -1377, -1163, 751, -42, -918, -832, 870, 408, -1035, -675, 728, 373, -972, -1291, 251, 1017, -733, -1473, 115, 1495, -18, -1131, -319, 878, 283, -802, -525, 1150, 829, -974, -489, 1490, 757, -918, -1099, 715, 928, -8, -893, 522, 1416, 260, -521, -32, 1242, 188, -743, -90, 1143, 250, -1046, -472, 952, 827, -1017, -681, 1115, 684, -1177, -864, 959, 826, -640, -1006, 246, 1333, -399, -1371, -32, 1383, -89, -1228, -431, 821, 57, -1273, -240]
2958b40L47j12j026kJ495N86j602n03J655J70j482l71J367O60j528l23J095M92
2976F78r42p48J253N54j299l73J58J504r56j087O38J274n47j130K49J345n00p58
2994f87m36J427K3j422j93R76J296j359r24J141P56n77j479J054J196o41j521
3011a370O05J267o63j028M95J041N44j752J5J474K42j080r25J274N04j180k75
3028h12J361K64q70n33P26R95p27r42M17J029p73n61j6J472j61q47m71J724m49
3047H26q85j89R24N21j211l99J203P19q13q94l3J240n04o80P00M67m30j109O12
3066F5Q40k17j067L2R78p2o10p36J344J78o26r47J159Q04j001j094J274J017r93
3085C28p88O43R54p05n07M8P94N2j212j35J028j19q26j30Q50R3r08R7L15R45q35
$$ y = [-240, 107, -5, -1031, -1033, 462, 1048, -554, -1057, 598, 768, -714, -1085, 282, 942, -586, -909, 186, 678, -264, -1012, 241, 795, -504, -877, -719, 785, -171, -1258, -620, 654, 107, -1023, -774, 571, 71, -687, -1123, 304, 327, -1095, -1288, -312, 984, -375, -1299, -158, 598, 21, -1458, -404, 792, 151, -1370, -765, 502, -161, -1189, -694, 347, 891, -861, -846, 628, 870, -210, -1135, 139, 643, -537, -812, 549, 813, -57, -590, 136, 1131, 404, -538, -121, 908, 135, -426, -442, 1030, 869, 22, -449, 1275, 826, -59, -248, 676, 1197, -14, -413, 790, 1509, 696, -198, -231, 1009, 505, -175, 525, 992, 562, -547, 65, 905, 688, -379, -347, 631, 559, -51, -787, 557, 735, 109, -838, 321, 1125, 124, -970, 304, 1321, 328, -460, 183, 1137, 432, -75, -27, 767, 819, -393, -528, 500, 381, -445, -575, 275, 368, -540, -443, -128, 817, -18]
3106a8n48P29K39j040m37P86J022p59j292R72Q23j00j575L76J061j03p81l65J571
3125E61K17j264k83Q88q5k84o49J245r6j13j005R01P85j446j47M48J112o55j066
3144i36P66O57l01r04M90M06J87l50o15J332k18p58n20P30P11p81n31J141O19
3163A125q25n85L62J190j288n67R51K90J1q77L19K06O26n85n86P97N01p52o08
3182b95J005M35q92k78M29N13o18k67P94L68q02m39O06kj06m87n79P17N11r48
3202c35N70M93R17j670k28K56Q58j151L7N15P69r65o18O50J458j240o41O80j46
3221B09j05j171R89L11J78q13J06R16m51o08O0K28P98o81n23R48N3j017j12N65
3241a20O44l36r07J32R75n51k90O86M42n00q75L14R41k28p46j31Q66m3q00K80
$$ y = [-18, -566, 163, 402, -638, -1075, -289, 733, -26, -1318, -346, 477, 377, -1198, -822, 239, 136, -645, -1010, 561, 778, -486, -769, 119, 34, -250, -899, 346, 250, 137, -868, 33, 818, -628, -775, -327, 785, 130, -936, -170, 487, 186, -718, -228, 178, 365, 15, -600, 732, 514, -244, -764, -34, 677, -104, -635, 506, 1125, 300, -285, 77, 1267, -21, -588, 363, 653, 664, -213, 106, 312, 938, 353, -233, 564, 1065, 313, -295, 710, 1145, 253, -25, 404, 917, 299, 32, 826, 1194, 392, -47, 559, 557, 451, -36, -615, 102, 613, -335, 235, 728, 1645, -25, -253, 3, 861, -290, -253, 262, 1031, 66, -552, 98, 1556, 316, -325, 355, 209, 104, -1067, -78, 233, 411, -402, -296, 620, 169, -439, -379, -151, 647, -34, -557, 391, 444, -573, -685, -120, 524, 188, -719, -587, 388, -163, -453, 233, 675, 175, -700, -386, 555, 327, -419, -550, 316, 273, -527, -247]
3261b47L72L77k90j001L93J101n6j331M75O60j60r03O87N56l41p52J87P61m47
3280D1n46J45K34J23m27Q3M02O70q26n84N05N89r6j258O08Q11k01q73O10M71n72
3301i1n95O03P40l27l60k40O91l71k97L47K15J59p46n09J341Q3o79l73K07J201
3321I99q09m67J92N01l96l93L80P14n08m14L10L50K38j336L23M51Q70j210L2K75
3341A02R75j089p96M61O96Qj078N02J171m60j636J007N89m0p83J53N51j90m82
3360c39k37P39Q4m38k84P73N1l73p77Q99L77j197N39K07N64n34p52K23R21J32
3380E78j230m33J066r6k47l77Q57M43j057j83M29O11q86m75J011L12j168L19m3
3399e69J312k40j592M54J332m44r64j31J194k52n00l37O86P30j133j31J59P70
$$ y = [-247, 125, 502, 212, -789, -396, 705, 649, -682, -207, 453, 293, -610, 77, 633, 292, -460, -273, 488, 41, -505, -360, -126, -3, -430, -347, 55, 725, -101, -685, -180, 409, 313, -945, -337, 474, 273, -600, 10, 481, -91, -686, -83, 657, 330, -30, -270, 421, 50, -247, 100, 315, 474, -272, -781, 560, 643, -36, -409, -202, 999, 190, -277, -85, 416, 20, -373, 7, 721, 213, -201, 109, 459, 697, -639, -316, 135, 1005, -205, -173, 102, 1077, -12, -808, -347, 349, 357, -721, -219, 952, 492, -1144, -137, 452, 412, -371, -218, 333, 143, -339, -576, 163, 247, -191, -475, 298, 349, -24, -801, 98, 475, -722, -183, 24, 588, 54, -698, -475, 446, 578, -652, -1085, -19, -115, -362, -739, 118, 561, -496, -679, -250, 361, -525, -1000, 11, 323, -845, -526, -569, 743, 503, -1089, -635, 697, 253, -711, -842, 352, 100, -400, -737, -51, 679, -454, -585, -426, 344]
3417C44o89nM35M22o77n10Q01K08n1o32k3J091p5j562N07R07l45j60M03rL48o35
3439I3n41J127l34p49PO78Q52j247o06L81J375k56q69L67P84j590k86K08J519
3458I13J50j215l09J114N91j400J95L84O85j771L71L66O20p34q24J024K75j47
3476B88o77N6P42l03n34O94L86m65n10k13Q56J08o58k0K32M70j163l41J159L86
3496D93r40mK82M23l09j072P25R06j068j21K38M03L57l90m11Q20k24j97p13J138
3516C36l40o26J28N49M03j285L76M89N06o49j97M65N29q24j101R97N88j71q17
3535f44K66M75j03O2n76M66K26p62P7L93L50k93o63O8N11J13l98P83R83r51p78
3556c95J23N72M51j329N76O78q6r64L45M8N96j079J75J237n54n17J69k09J589
$$ y = [344, -345, -350, 85, 507, -170, -680, 121, 329, 278, -354, -377, 714, 639, -923, -416, 491, 146, -14, 389, 380, 728, 93, -448, 679, 345, -404, -397, 281, 1133, -114, -720, -339, 1036, 780, -89, 278, 1062, -528, -814, -606, 913, 1063, -152, -461, 653, 1244, -156, 39, 423, 1108, -663, -292, 74, 694, -40, -864, 160, 435, 288, -389, -333, 409, 106, -428, 266, 652, 187, -323, -536, 320, 428, -230, -250, -18, 452, -711, -1052, 107, 493, -447, -451, -169, 254, -55, -1127, -402, 504, -564, -685, -447, -44, 313, -77, -488, 332, 108, -89, -802, 336, -4, -630, -502, 47, 450, -835, -459, 30, 536, -113, -310, 155, 684, -140, -1241, -244, 344, 173, -644, -378, 97, -6, 56, -520, -54, 172, -590, -513, -120, 230, -63, -726, -658, -147, -34, -432, 351, 1334, 383, -395, -272, 300, 751, -578, -2, 676, 590, -374, -29, 19, 615, -464, -289, 948, 394, -123, 46, -163, 1426]
3575A426q50q70L76J063j122m33l9J233k05n84j63Q46o05l39J52O09l36j13k39
3594a93Q67O32j187p12N19R13j17j071J20O14P1l83l26K55K05n97R5N27j38k23
3614a29K76L06o88K32p20J195o58P4n16L12N98j066j08J079L50q90J11j38J073
3633F93K35j199J82K91N5l7p45l72J004p8p66J063m35m42k04Q65R47j504m81J004
3653G6l1j88l01k89N82N61q48r6R61J76r30J56O24l69l91m11J255n20n45n8J75
3674d11J86k47L43M75N50j17q18J21J039j302o91P43O28L7r95Q23K94J69o20q83
3694f76Q11O31r38n38J398l64K19j625J431K85m96r29N79N07N14j309N73J119
3712A192Pj376m67J494j55j336j86J782N3j209l85J767n54J43j440R68J029j184
$$ y = [1426, 576, -294, 82, 1145, 23, -410, -449, 784, 579, -5, -168, 678, 73, -266, -114, 495, 159, 46, -193, 674, 1306, 119, -593, -74, 839, 722, -349, -229, 385, 456, 73, -253, 2, 207, -390, -295, 232, 94, -129, 147, 453, -235, -3, -723, 472, -186, -112, -628, -316, 282, -784, -892, 187, 537, -353, -242, -380, 693, 928, -271, -89, 202, 257, 220, -525, -897, 107, 29, -737, 326, -109, -551, -755, 110, 1057, -447, -928, 76, 45, -143, -444, -733, -151, 410, -438, -534, 427, 603, -327, -171, 453, 84, -307, -718, 537, 17, -528, -586, -411, -225, -472, -129, 346, 896, 779, -39, 82, 1121, -181, -872, -129, 499, 536, -459, 364, 658, 827, 207, -676, 135, 766, -172, -710, 688, 324, 543, -1082, 349, 634, 138, -791, -212, 295, 809, -500, 73, 1192, 1199, -177, -644, 850, 695, -641, -827, 955, 1008, -201, -586, 1181, 627, 770, -670, 298, 1327, 143]
3730A43j05j23P37m86j36n04J123J00n61m80O83O04j043o08R84N69j072r02J655
3749E78M01j060m31M66R02p56m48M33P60n80r96R29r7O61j411J84P52l06m69l47
3769h35Q76R21r86k80O20n49M63j264Q82O01j9q06l53R79j16r49L08O24j24o16
3789f23m49J232J25o80n44Q69j55J52q00P65O17o75j060O20J157l58j271J206
3807A28L93l14p98N62R71k78j003J97J89P52m75o46M18J10n0m30M76L53p28l5
3827b08N50J89N2j475Q14O55j61j161K19J127l48q4l86J46O51j150K10L93K20
3846B53j01o47J181j49j027L48O5N26Q1n32j00P85p14o01J34P80o9n47l41R40
3866B65K63j309j16J001M19j051l63J08J059j49n84L48O02J67q33K32N8O2l90
$$ y = [143, 38, -85, 652, 166, 30, -474, 649, 749, 188, -292, 391, 995, -48, -656, 328, 897, -175, -1077, 578, 979, -81, -512, -46, 856, 100, -348, 85, 845, 265, -731, 198, 101, 762, -649, -465, 287, -19, -488, -835, 41, 962, -24, -304, 316, -233, 230, -1034, -152, 449, 430, -376, -729, 250, 134, -815, -507, 117, -7, -623, -1072, 160, 285, -395, -939, -70, -225, -73, -873, -108, 509, -166, -1226, -606, 551, 193, -1078, 128, 521, 207, -591, -29, 942, 664, -339, -142, 47, 799, 324, -322, 96, 206, 156, -274, 202, 555, -173, -208, 342, 531, 583, -892, -78, 577, 416, -745, -526, 601, 253, 169, -217, -71, 580, -570, -360, 33, 253, 152, -495, 686, 537, -490, -142, -77, 449, 530, -2, -102, 683, -31, -632, -498, 282, 213, -334, -675, 265, 528, -781, -897, 104, 523, -528, -891, -783, 276, 127, -457, -109, 493, 660, -173, 59, 117, 179, -211]
3885b11K45K27m66p97N25L26J73k06n46P70K05o4r46P41L46J40j603J329L10P
3905E05j467L52J000pj101N95N5K89q30L8J216l75r92L23K70N18p9j209J12J335
3925E48n99j46o35J428n81r20M68J407k08r13l34N06O34p38m38Q75p9o28J020
3944F67k72n9n75N05J62m10j11m17L89R17q87r10J91J456o73j38k85J057n1j009
3964d53N75l70M66l34j20N13P41j454k05M95J136L4j459R1N74J62j132O57P81
3983F98l36j083L59R76j87q27NJ223o61m00m53J171J8l73r02K26Q06J34n87O38
4003D45j20k05m49o0O77o29J84j50M04j08l82l49J207j79q21m5M01J362j303q42
4023i62J949j093n72M11P38j00p32l18J77N75o09J36k12J060p59l72R2J297m27
$$ y = [-211, 34, 261, -205, -1002, -477, -151, 22, -184, -730, 40, 245, 181, -765, -24, 322, 462, -1141, 188, 498, 505, -962, -610, 390, 383, -718, -123, -68, 221, -609, -571, 645, 270, -722, -399, -129, 389, 310, -899, -787, 548, -51, -197, -832, 596, 15, -905, -437, 970, 762, -151, -485, 21, 655, -83, -521, 354, 275, -353, 667, 395, 336, -239, 266, 428, 18, -93, -510, -121, 796, -91, -1001, -810, 646, -27, -165, -450, 607, 556, -453, 122, -248, 218, -116, -236, 277, 1018, -436, -641, -146, 990, 1024, -435, -344, 230, 392, -740, -83, 698, 362, -721, -362, 614, 427, -400, -395, 828, 167, -233, -686, 485, 503, 130, -772, -546, 260, 394, -193, 445, 325, 120, -329, -389, 288, -341, -157, -307, 97, -11, -393, -742, 465, 286, -535, -580, -179, 1183, -120, -962, 987, -106, -678, -267, 471, 371, -361, -679, -502, 73, -536, -400, -612, 448, -311, -683, -591, 706, 279]
4042B79m84p54J390K54j323%R09M15j184P4N24Q15l76j490J397L57o33n46q2J500
4062A042n07j130L29K38m38m25P46L27r7l76L03N17j70k38l73K61O14r3m99Q2
4082A13L31l51m70R18j34j45r10Q53j42J040j445l19L93J072q77l97J812p84o28
4101g0j5J90O06J82j284M71L02L6o8m02P05J185k690R82K22N46q86J92J27J84
4121E15r84M72L71N2q07o22N59P98J44o72N27q0N76j753J338m16K23r89R97L93
4141F42J7n98n22L03M90o32K69r6M62m78r09R23J82m91j06M5J590r27n20MO17
4162B65K81j681N18J521j199j35k80P27m23L79O22p43N32o72l39l1J184o74n90
4181g38J221q32M37M02j033J026N49j724M06M95m75k87m57N60J250j274O37j007
$$ y = [279, -205, -959, 431, 685, -638, -638, 271, 686, -498, -424, 100, 915, 539, -951, 446, 803, 170, -376, -458, 1042, 535, -595, -266, -28, -466, -891, -145, 182, 85, -291, 12, 529, 359, 121, -252, 9, 623, 530, 31, 113, 444, 93, -377, 541, 407, 262, -648, 205, 63, 1103, -342, -661, -268, 804, -73, -470, 1342, 558, -70, -85, 105, 711, 893, -391, 80, 382, 418, 350, -52, 653, 1838, -852, 130, 352, 898, 12, 204, 331, 515, -469, 3, 374, 426, -381, -1003, -444, 354, 498, -174, 353, 273, 849, -904, 434, 18, 241, -748, 249, 642, 659, 61, -461, -158, 332, -300, -31, -127, 335, -143, -1052, -129, 53, -438, -544, -499, 1091, 164, -356, -352, 265, 546, -1135, -617, 904, -295, -430, -710, 17, -406, -27, 595, -148, 384, -288, -627, -658, 526, -148, -738, 483, -349, 88, 490, -543, 483, 1032, -692, -286, 209, -266, -553, -1010, -450, 800, -474, 163, -844]
4199h44P07K97j111J555l12k09l41K30J271j075j31j52P09r92Q13p99J161j11
4217F66p15N07r10J287m55p75O54N12j106N54j28j20l97m26N54J393j029K62j394
4236a066J931l09j414P23J05R48j359R74k44L40m14j077R75j18n62O73M45k33
4254C18m43J37K90Q13j368j99N0M08r74M74k33J072K91q48J17N11O50j406M1R76
4274F77M06n74j236J68J053o76m82P17J100j685m40J163j390R74K06j72l5O63
4292D37j30j163J208j21r62k70J119K35j457J074k19J78J90m1L02k97n08J0M24
4311Il17N27l86k32K77J94p30J40P20R78j254n57P70P88o72j304J866r98Q44j573
4331i10J294k61k09L51p26J467q95p70K66M28M10r57j78J238p5K97p63N08P30
$$ y = [-844, -137, 160, -951, 604, 292, 83, -258, -28, 1243, 168, 37, -115, 594, -398, 415, -384, 777, 666, -49, 458, -452, 835, 380, -395, 259, 771, -335, 219, 91, -29, -426, -852, -298, 1095, 66, 328, -1066, 865, 556, -858, -135, -30, 918, -441, 533, 289, 629, 215, -862, 113, -5, -567, 106, 551, 318, -125, 12, 302, 1115, -253, -452, -402, 6, -968, -494, -727, 345, 636, -212, -95, 416, 1066, -340, -299, 677, 1083, 509, -727, -559, 494, -182, -664, 53, 1153, -532, -972, 191, -1199, -225, -19, -191, -226, 437, 307, -856, 352, 231, -731, -1001, 118, 353, -1104, -30, -249, -71, 119, 78, 380, 83, -425, -415, 9, -308, 219, -167, -399, -122, 72, -658, -518, 202, 1180, -74, -631, 139, 927, 255, -1049, 817, -181, 663, -910, 384, 123, -86, 265, -461, 1006, 111, -659, -393, 35, 445, -512, -690, 548, 473, 770, 7, 515, 1245]
4350A245j031O8L41p57k0K25j7L99k25m47j34L55l1k95K97P79n59j59p47R84l26
4371e5O11n44Q07L31j634P23p84Q20M36p01Q8M73k67l32L90l65m17J37r0O05p62
4392e30L91L85k23l95J195p60Q29n49K33j487J495Q54j484J01j04R01r62r31J253
4411B12P96l3n16j253O59k80J129j715K158j612J31J15J121l03p95p0m9M45n06
4430c66K07K2k67L29m05Q58n39J87q75K47P62P0j419M44J657l43k3j892J561O33
4450H48r14j198J132N1j58O78r53O80M50r32R37p27m27N05m88J499j593K66m74
4469h18O16l4M64m49P94k51n87j87L43J94M13j252O66J57L61m89j47J130m67l95
4489F2J5J009k20j41q54J43R4J70m67o9N0J94n90J70J297p03m18P60j70M0Nq29
$$ y = [1245, 214, 282, 623, -134, -154, 71, 54, 453, 228, -219, -353, 2, -29, -324, -27, 752, 193, 34, -713, 271, -55, 556, 12, 819, 1150, -484, 239, -545, 275, 711, 10, 98, 571, 304, -28, 362, -3, -420, -283, -373, 232, -530, -139, 246, 23, -372, 823, 63, 892, 343, 576, -911, 584, 1438, -46, 55, -49, 852, -110, -1041, 212, 1008, 975, 459, -794, -135, -415, 714, -1001, 1157, -455, -324, -209, 912, 609, -186, -256, -305, 140, -366, -159, -137, -404, -75, -480, 378, -161, 26, -849, -602, 160, 230, -1189, -745, 912, 569, 546, -1346, 215, 848, -66, -1264, -132, -81, -239, 439, -514, 166, 616, -316, 621, -106, -533, -28, -516, 983, -610, -344, -818, -202, -236, 228, -221, 573, 322, -265, -452, -109, 85, 498, -754, -88, 69, 430, -59, -206, 924, 457, 62, 77, 1086, 866, 725, -129, 14, 108, 278, -189, -258, -208, -14, -604, -434, 863, 160, -258, 502, 332, 372, 377, -452]
4511d52K06q39L47R54k27j015J826j262O46l81K49m65K68k7j60o71O11J244q84
4530c2l27M82q1j40J095p08o05K07L58o99R52N87j360J56M08j083J150o67l47
4549f54J376j653K99R59j16p00M07m20O80n23j34j45P36J52k05O66L27k064j9
4568a031O89R00q76J30L07L52Jp30l58J36K91N05r33O58j62J89r07Q15n14O69
4588A31q39M68L81O37n36m35L7L44j11j0k13N21m82pk28M94j190J226J71j11n98
4609c50M8J87O47l30n86M07L55K15q09n6R52m30Q99p90o15l88M3k68M63O42k71
$$ y = [-452, -246, -1085, -738, 216, -11, -1026, 800, -462, 184, -197, 52, -413, -145, -172, -332, -1003, -392, 852, -32, -359, 123, 42, -98, 997, 289, -316, -109, 249, -450, 502, 1089, -271, -115, 293, -790, 360, -307, -654, 722, -931, -632, 327, 211, -489, -82, -502, 178, -345, -479, -624, 112, 264, 59, 725, 1052, -1012, -1031, -342, 558, -318, -188, 119, 471, 472, -258, -616, -480, -189, 316, -617, 41, -121, 68, -839, -24, -538, 131, -708, -240, 141, 778, 242, -193, -156, 188, 77, 67, -146, 375, -107, -114, -342, 152, -1038, 188, 359, 248, -350, -302, -115, 532, 202, -384, 23, 378, 593, -216, -272, 680, 250, 1149, 359, -256, -644, -601, -869, -406, 236, -35]
$$ [...]
8191F20
##END NTUPLES=NMR FID
##END=
