##TITLE=1H_Pr 5-2-H
 D2O, 8 sc, 
 7.6.2019
##JCAMPDX= 6.0         $$ Bruker NMR JCAMP-DX V2.0
##DATA TYPE= NMR FID
##DATA CLASS= NTUPLES
##ORIGIN= UXNMR, Bruker Analytische Messtechnik GmbH
##OWNER= root
$$ XWIN-NMR		Version 3.5
$$ Fri Jun  7 15:35:55 2019 Russian Standard Time (UT+4h)  she@DPX200
##.OBSERVE FREQUENCY= 200.13155
##.OBSERVE NUCLEUS= ^1H
##.DELAY= (6, 6)
##.ACQUISITION MODE= SIMULTANEOUS
##.ACQUISITION SCHEME= undefined
##.AVERAGES= 8
##.DIGITISER RES= 18
##SPECTROMETER/DATA SYSTEM= spect
##.PULSE SEQUENCE= zg30
##.SOLVENT NAME= CDCl3
##.SHIFT REFERENCE= (INTERNAL, CDCl3, 0, 15.7039)
##AUDIT TRAIL= $$ (NUMBER, WHEN, WHO, WHERE, WHAT)
$$ ##TITLE= Audit trail, XWIN-NMR		Version 3.5
$$ ##JCAMPDX= 5.01
$$ ##ORIGIN= Bruker BioSpin GmbH
$$ ##OWNER= she
$$ F:/spectra/data/she/nmr/H-F/1/audita.txt
$$ ##AUDIT TRAIL=  $$ (NUMBER, WHEN, WHO, WHERE, WHAT)
(   1,<2019-06-07 15:34:45.23 +0400>,<she>,<DPX200>,
      <created by zg, POWCHK disabled, PULCHK disabled
       configuration hash MD5:
       00 E9 B6 7A A2 85 ED C7 34 08 36 98 17 FE 4E 26
       data hash MD5: 16K
       55 CA 6A 9B B7 91 DC AD A1 5C CB 66 8F 32 BF 5E>)
$$ ##END=
$$ 
$$ hash MD5
$$ 53 92 70 F0 4C EC 4F 4F 5F 5D E3 7D C5 4D 58 D8
##$RELAX= 
##$RELAX= 
##$RELAX= 
##$RELAX= 
##$RELAX= 
##$RELAX= 
$$ Bruker specific parameters
$$ --------------------------
##$DU= <F:/spectra>
##$EXPNO= 1
##$NAME= <H-F>
##$PROCNO= 1
##$TYPE= <nmr>
##$USER= <she>
##$AMP= (0..31)
100 100 100 100 100 100 100 100 100 100 100 100 100 100 100 100 100 100 
100 100 100 100 100 100 100 100 100 100 100 100 100 100 
##$AQSEQ= 0
##$AQ_mod= 1
##$AUNM= <au_zg>
##$AUTOPOS= <>
##$BF1= 200.13
##$BF2= 200.13
##$BF3= 200.13
##$BF4= 200.13
##$BF5= 200.13
##$BF6= 200.13
##$BF7= 200.13
##$BF8= 200.13
##$BYTORDA= 1
##$CFDGTYP= 0
##$CFRGTYP= 5
##$CHEMSTR= <none>
##$CNST= (0..31)
1 1 145 1 1 1 1 1 1 1 1 1 1 1 1 1 1 1 1 1 1 1 1 1 1 1 1 1 1 1 1 1 
##$CPDPRG= <>
##$CPDPRG1= <>
##$CPDPRG2= <>
##$CPDPRG3= <>
##$CPDPRG4= <mlev>
##$CPDPRG5= <mlev>
##$CPDPRG6= <mlev>
##$CPDPRG7= <mlev>
##$CPDPRG8= <mlev>
##$CPDPRGB= <>
##$CPDPRGT= <>
##$D= (0..31)
0 1.2 0 0 0 0 0 0 0 0 0 0.03 0 0 0 0 0 0 0 0 0 0 0 0 0 0 0 0 0 0 0 0 
##$DATE= 1559907284
##$DBL= (0..7)
120 120 120 120 120 120 120 120 
##$DBP= (0..7)
150 150 150 150 150 150 150 150 
##$DBP07= 0
##$DBPNAM0= <>
##$DBPNAM1= <>
##$DBPNAM2= <>
##$DBPNAM3= <>
##$DBPNAM4= <>
##$DBPNAM5= <>
##$DBPNAM6= <>
##$DBPNAM7= <>
##$DBPOAL= (0..7)
0.5 0.5 0.5 0.5 0.5 0.5 0.5 0.5 
##$DBPOFFS= (0..7)
0 0 0 0 0 0 0 0 
##$DE= 6
##$DECBNUC= <off>
##$DECIM= 24
##$DECNUC= <off>
##$DECSTAT= 4
##$DIGMOD= 1
##$DIGTYP= 9
##$DL= (0..7)
0 120 120 120 120 120 120 120 
##$DP= (0..7)
150 150 150 150 150 150 150 150 
##$DP07= 0
##$DPNAME0= <>
##$DPNAME1= <>
##$DPNAME2= <>
##$DPNAME3= <>
##$DPNAME4= <>
##$DPNAME5= <>
##$DPNAME6= <>
##$DPNAME7= <>
##$DPOAL= (0..7)
0.5 0.5 0.5 0.5 0.5 0.5 0.5 0.5 
##$DPOFFS= (0..7)
0 0 0 0 0 0 0 0 
##$DQDMODE= 0
##$DR= 18
##$DS= 0
##$DSLIST= <SSSSSSSSSSSSSSS>
##$DSPFIRM= 0
$$ [...]
##$SUBNAM2= <"">
##$SUBNAM3= <"">
##$SUBNAM4= <"">
##$SUBNAM5= <"">
##$SUBNAM6= <"">
##$SUBNAM7= <"">
##$SUBNAM8= <"">
##$SUBNAM9= <"">
##$SW= 24.9336996594482
##$SWIBOX= (0..15)
0 0 2 0 0 0 0 0 0 0 0 0 0 0 0 0 
##$SW_h= 4990.01996007984
##$TD= 16384
##$TD0= 1
##$TE= 0
##$TE2= 300
##$TE3= 300
##$TEG= 300
##$TL= (0..7)
0 120 120 120 120 120 120 120 
##$TP= (0..7)
150 150 150 150 150 150 150 150 
##$TP07= 0
##$TPNAME0= <>
##$TPNAME1= <>
##$TPNAME2= <>
##$TPNAME3= <>
##$TPNAME4= <>
##$TPNAME5= <>
##$TPNAME6= <>
##$TPNAME7= <>
##$TPOAL= (0..7)
0.5 0.5 0.5 0.5 0.5 0.5 0.5 0.5 
##$TPOFFS= (0..7)
0 0 0 0 0 0 0 0 
##$TUNHIN= 0
##$TUNHOUT= 0
##$TUNXOUT= 0
##$USERA1= <user>
##$USERA2= <user>
##$USERA3= <user>
##$USERA4= <user>
##$USERA5= <user>
##$V9= 5
##$VALIST= <valist>
##$VCLIST= <CCCCCCCCCCCCCCC>
##$VD= 0
##$VDLIST= <DDDDDDDDDDDDDDD>
##$VPLIST= <PPPPPPPPPPPPPPP>
##$VTLIST= <TTTTTTTTTTTTTTT>
##$WBST= 1024
##$WBSW= 4
##$XGAIN= (0..3)
0 0 0 0 
##$XL= 0
##$YL= 0
##$YMAX_a= 141998
##$YMIN_a= -171462
##$ZGOPTNS= <>
##$ZL1= 120
##$ZL2= 120
##$ZL3= 120
##$ZL4= 120
##$ABSF1= 10
##$ABSF2= 0
##$ABSG= 5
##$ABSL= 3
##$ALPHA= 0
##$AQORDER= 0
##$ASSFAC= 0
##$ASSFACI= 0
##$ASSFACX= 0
##$ASSWID= 0
##$AUNMP= <proc_1d>
##$AZFE= 0.1
##$AZFW= 0.1
##$BCFW= 1
##$BC_mod= 2
##$BYTORDP= 1
##$COROFFS= 0
##$CY= 11.3945322036743
##$DATMOD= 1
##$DC= 2
##$DFILT= <>
##$DTYPP= 0
##$F1P= 18.9103706918063
##$F2P= -1.10871071338519
##$FCOR= 0.5
##$FTSIZE= 0
##$FT_mod= 4
##$GAMMA= 1
##$GB= 0.15
##$INTBC= 1
##$INTSCL= 1
##$ISEN= 128
##$LB= 0.24
##$LEV0= 0
##$LPBIN= 0
##$MAXI= 10000
##$MC2= 0
##$MEAN= 0
##$ME_mod= 0
##$MI= 1.114404
##$NCOEF= 0
##$NC_proc= 0
##$NLEV= 6
##$NOISF1= 3.799351
##$NOISF2= 2.8
##$NSP= 1
##$NTH_PI= 0
##$NZP= 0
##$OFFSET= 15.70392
##$PC= 1
##$PHC0= -8501.278
##$PHC1= 17.20019
##$PH_mod= 1
##$PKNL= yes
##$PPARMOD= 0
##$PSCAL= 0
##$PSIGN= 0
##$REVERSE= no
##$SF= 200.130013532006
##$SI= 16384
##$SIGF1= 3
##$SIGF2= 2
##$SINO= 400
##$SIOLD= 16384
##$SREGLST= <1H.CDCl3>
##$SSB= 0
##$STSI= 0
##$STSR= 0
##$SW_p= 3612.71676300578
##$SYMM= 0
##$S_DEV= 0
##$TDeff= 0
##$TDoff= 0
##$TI= <>
##$TILT= no
##$TM1= 0
##$TM2= 0
##$TOPLEV= 0
##$USERP1= <user>
##$USERP2= <user>
##$USERP3= <user>
##$USERP4= <user>
##$USERP5= <user>
##$WDW= 1
##$XDIM= 8192
##$YMAX_p= 0
##$YMIN_p= 0
$$ End of Bruker specific parameters
$$ ---------------------------------
##NTUPLES= NMR FID
##VAR_NAME=  TIME,          FID/REAL,        FID/IMAG
##SYMBOL=    X,             R,               I
##VAR_TYPE=  INDEPENDENT,   DEPENDENT,       DEPENDENT
##VAR_FORM=  AFFN,          ASDF,            ASDF
##VAR_DIM=   8192,          8192,            8192
##UNITS=     SECONDS,       ARBITRARY UNITS, ARBITRARY UNITS
##FACTOR=    0.0002004,     1,               1
##FIRST=     0,             0,               0
##LAST=      1.6414764,     0,               0
##MIN=       0,             -171462,         0
##MAX=       1.6414764,     141998,          0
$$ Real data points
##PAGE= N=1
##DATA TABLE= (X++(R..R)), XYDATA
$$ [...]
3561f329J0265o40r112O947L229r793L730P691q774j477R197o030m261J0353l115
3576A881q565Q580K185r738N655N870j0116P76R299o682l952R394l520p225R234
3591C076R85r396O361M242j0267L206Q629q635k363R410n155n123R421q19r406
3606e834O752L850r093L896O671r673o87R870o182m296R455k871q356Q779J906
3621D187r312M841N478r165J233Q663p046l934R599m100o747R994K75j0071O364
3636B59M282r259L123P920q656k221R347m472n307R025j601q902P929L455r102
3651d180L149P021r207k98R449o103m601Q929k348p529Q356J983r692N071N456
3666E456r044J469Q723p824m008R328k775o357Q669k45r360O389M609r134K527
$$ plain form
3561 -6329 3936 3296 -5816 1131 4360 -5433 -1703 5988 -2786 -4263 4934 -1096 -5357 4996 1881
3576 1881 -6684 1896 4081 -5657 -2 5868 -4248 -3472 5827 -855 -4807 4587 1067 -6158 3076
3591 3076 4061 -5335 1026 5268 -4999 -1793 6836 -1799 -4162 5248 93 -5030 4391 3572 -5834
3606 -5834 918 4768 -4325 -429 6242 -3431 -4118 5752 -430 -4726 4729 1858 -6498 2281 4187
3621 4187 -5125 -284 5194 -3971 -2738 5925 -1121 -5055 4544 444 -6303 3691 3966 -6105 259
3636 259 4541 -4718 -1595 6325 -2331 -4552 4795 323 -4984 4041 2440 -6462 1467 4922 -4180
3651 -4180 -1031 5990 -3217 -3515 5934 -169 -4770 4159 1811 -5718 2638 4621 -5071 0 5456
3666 5456 -3588 -2119 6604 -1220 -5228 4100 1325 -5032 3637 3392 -5968 421 5030 -4104 -1577
3681a577P030q622j445R960n110n582Q865j636p766P542L056r502L880N717q247
3696c437N09Q830o704m425R483k674o805Q159J065r428M574O098q495R82P934
3711E666p802k401R480l713n932Q075n91q457O878M155r389K522O902p608j412
3726c627R488n350n620Q534j296p393P082L080r652L552O491q436K35Q203o464
3741a173m172R259k099p176P674P56q786N438N364r131J597P533p212k377R483
3756D978l915o629Q026M51q282O513L858r374K781P092p900r19Q865n498n502
3771e455R222j178p774P401K256r161L895O522p989l65Q079o358l473Q933k774
3786A781p024P754J095q725N118N066q725J215P506p009k277Q850l923o404Q301
$$ plain form
3681 -1577 5453 -3169 -4614 5346 236 -5346 3519 1883 -5883 1659 4715 -4787 -907 4810 -3437
3696 -3437 -2928 5902 -802 -5227 4256 1582 -5223 2936 4001 -5427 -853 5245 -3250 -2268 5666
3711 5666 -2136 -4537 4943 1230 -4702 3373 2782 -5675 1203 5358 -4031 -1509 5393 -2215 -3627
3726 -3627 5861 511 -5109 3425 2129 -5264 1818 4898 -4754 -1202 5289 -3147 -2912 5291 -1173
3741 -1173 -5345 3914 1815 -5361 2313 3069 -5717 -279 5085 -4046 -2449 5084 -2128 -4505 4978
3756 4978 1063 -5566 2460 2911 -5371 1142 5000 -4374 -1593 5499 -2401 -3320 5545 47 -5455
3771 -5455 3767 2589 -5185 2216 4472 -4689 -794 5728 -2261 -2626 5453 -905 -4378 4555 1781
3786 1781 -5243 2511 3606 -5119 -1 5065 -3660 -2445 5061 -1948 -4225 4625 702 -5702 2599
3801B599J51q474O697L560r099K504P099p631j051Q434n574m637Q958j162p739
3816e365O835K389q593L856O192q308J07Q155o148l249Q769k836p019P658J092
3831C535q326N213M285q034J280P364o685j929Q284m317o063Q930k69q000N825
3846A093L325q610K945O732p602j350Q257m902n117R011j647p432O804K062q551
3861d982M191N525q210L30Q350o037l790Q851k777o998P895R35q231M897M897
3876D846q373J580P347o713k494Q455l983n742Q377p3q167O244L399q609K969
3891i37N875p222n18Q002n344m500Q591j579p580P054K223q173L756N728q552
3906c176K74P808n810l493Q535k997o906Q055J029q413M973M574q272J358P224
$$ plain form
3801 2599 2750 -5724 973 4533 -4566 -2062 5037 -2594 -3645 4789 -785 -5422 3536 2374 -5365
3816 -5365 1470 3859 -4734 -878 5314 -2994 -2887 5268 -880 -4129 4640 1804 -5215 2443 3535
3831 3535 -4791 422 4707 -3327 -2047 5317 -1368 -3297 4987 670 -5393 3537 3268 -4732 1093
3846 1093 4418 -4192 -1247 5485 -2117 -3467 4790 -112 -5229 3782 2135 -5297 1507 3569 -4982
3861 -4982 -791 4734 -3476 -3146 5204 -833 -4623 4228 1451 -5547 2348 3283 -4948 -51 4846
3876 4846 -3527 -1947 5400 -1313 -3807 4648 665 -5077 3300 3227 -4940 1304 4703 -3906 -937
3891 -937 4938 -2284 -2802 5200 -144 -4644 3947 2368 -5212 1842 4065 -4108 -352 5376 -3176
3906 -3176 -2902 4906 -904 -4397 4138 1141 -5765 2290 3319 -5094 -121 4453 -3819 -2461 4763
3921D763o909j908Q510m218n084P670k73p554O010L119q432L232O386p629r28
3936c245Q645n597l959Q003j390p458O818K431q749M659M914q175R89P548o345
3951i11l126Q480k898o471P576N37p921N177M014p837J639O537o721j831Q178
3966D422m078n197P650m89p796O301L075q515L215O196p582q08Q213n151m100
3981d644Q393k235p099P403J712q189M228N356q145O42P909n902l526Q402l149
3996A156n668P171P84p750M938M297q481K213O803p002j976Q116m049m814P629
4011C367q71p416N836K972q051K926O196p655p1P420n466l708P855j361p463O522
4027A032K128p827M318M884q118R70P309o011k672Q279l656n585P396O22p763
$$ plain form
3921 4763 -2146 -4054 4456 238 -4846 2824 2551 -5003 1007 4126 -4306 -1074 5312 -2317 -3245
3936 -3245 5400 -197 -4156 3847 2457 -5001 1817 4248 -4501 158 5072 -3103 -2114 5434 -911
3951 -911 -4037 4443 1545 -4926 2650 3187 -4734 443 4457 -3380 -1741 4796 -1925 -3756 4422
3966 4422 344 -4853 2797 2308 -5488 813 3888 -4627 -1412 4784 -2798 -3606 4607 -544 -4644
3981 -4644 3749 1514 -5585 1818 3530 -4659 -431 4925 -3220 -2578 5331 -571 -4097 4305 1156
3996 1156 -4512 2659 3443 -4307 631 4928 -3553 -1340 5463 -1539 -3515 4601 552 -4262 3367
4011 3367 2496 -4920 916 3888 -4163 -1237 4959 -2696 -2767 4653 -813 -4521 3334 1973 -5490 1032
4027 1032 3160 -4667 -349 4535 -3583 -2613 4696 -1315 -3987 4292 636 -4949 2447 3069 -4694
4042d694N252L807p929J921O450o555j731P771l849m863Q190j078p623O510K780
4057D359q273L267N870p450n36P527m558m179P538j830o562O992J152p444L763
4072c64M866q179J515O882o255l188Q473k727o084P030P89p721N231L717p818
4087c833K115O354o850j725Q345m020n391Q032n93p728O233L092q035L166N309
4102D471p133k90P968n285l712P598j992o517P246J473q265M231N097p653R69
4117a794P118o583k514P979l415n364P577p6p967N609M112q256J751O717p379
4132b485j240Q319m454m970P500j001o709O466K239p843L022N493p197J56P299
4147D595n513l857Q189k064o185O787J404p793M491M301p624J669O781o726k250
$$ plain form
4042 -4694 558 4365 -3564 -1643 4807 -1748 -3479 4292 443 -4420 3770 2692 -4931 1579 4359
4057 4359 -3914 -647 5223 -2227 -2763 4764 206 -3973 3565 1735 -4827 2165 3317 -4127 -364
4072 -364 4502 -3677 -2162 4720 -1535 -4723 3750 1023 -5061 1969 2758 -4963 268 3985 -3833
4087 -3833 -1718 4636 -2214 -3939 4406 386 -5005 3027 2434 -5294 939 4031 -4004 -838 4471
4102 4471 -2662 -2952 5016 -269 -3981 3617 1625 -4892 2354 3827 -4438 -207 4890 -2763 -1794
4117 -1794 5324 -1259 -3773 4206 791 -4573 3004 2928 -5039 570 4682 -3574 -1823 4894 -2485
4132 -2485 -3725 4594 140 -4830 2670 1669 -5040 1426 3665 -4178 -1156 4337 -2860 -2704 4595
4147 4595 -918 -4775 3414 1350 -4835 1952 3356 -4437 54 4355 -3269 -1600 5181 -1545 -3795
4162c795Q303l476n608P402k9p188N487L719p873J481O416o957o15P570m304m779
4178d246P748j642o816O575K292q381L220N874p670N01P164n375l782P854k006
4193A310n993O615Q23p721M656N016p996R93P081o642k319Q461l434n514O927
4208B263L15p082N403L499q045K447O049o603j390Q147m531n020P850r35o790
4223d423O108K458q182L463N543p431K4P258n862l121Q670k478o549O482J213
4238C173p413M332M518p737Q71O590n814k222Q065l929n510P523j85p329N907
4253H40L270q559K811O332o636j056P082m534m506Q249j312o551N754K062p626
4268d380L479N829p388o68P467n038l081Q255k846o240O472J423p108M523L768
$$ plain form
4162 -3795 4508 1032 -4576 2826 2797 -4391 1096 4815 -3058 -1577 4839 -2118 -2733 4837 533 -4246
4178 -4246 3502 1860 -4956 1619 3911 -4470 -1250 4624 -3046 -2545 4619 -756 -4538 3316 1310
4193 1310 -4683 1932 2755 -4966 -310 4706 -3290 -2297 4784 -1858 -4177 4284 850 -4664 2263
4208 2263 2578 -4504 899 4398 -3647 -1200 4849 -1754 -3144 5003 472 -4548 3302 2367 -4423
4223 -4423 1685 4143 -4039 -576 4967 -2464 -2440 4818 -1044 -4165 4505 2027 -4522 1960 3173
4238 3173 -4240 92 4610 -3127 -2256 4334 -1480 -3702 4363 434 -5076 2447 2262 -5067 840
4253 840 4110 -4449 -1638 4694 -1942 -2998 4084 -450 -4956 3293 1981 -4570 1184 3246 -4380
4268 -4380 -901 4928 -2460 -3128 4339 -699 -3780 4475 1629 -4611 1861 3284 -3824 699 4467
4283D467p973J625O793o286j576P483l926n305P230L22p272N280L067p657K618
4298a110O025p199p20P079m691l660Q158j822o940N890K401p667L514N289p510
4313b963J43P154m909l373P608k623o275P314J311p574M135M631p997J351O753
4328D686n525k705P375l387m870P454j73p023M811L006p082K487N867o977j159
4343c215P449m249m047P650j506o999O001K745p911L669M735p369N12P100n283
4358g18l191P073k477n595O657J357p602M218L676o908J752O627o619k288P475
4373C437l036m804P378n38p472N343L979p617K637N417p149p50P671m065l971
4388c540O947j567o145O088J985p397L223M890p324P71O657m878l565P438k580
$$ plain form
4283 4467 -3506 -1881 4912 -1374 -2950 4533 607 -4698 2532 2854 -4418 862 3929 -3728 -1110
4298 -1110 4915 -2284 -3004 4075 -616 -4276 3882 2060 -4880 1010 3411 -4256 -742 4547 -2963
4313 -2963 -2820 4334 -575 -3948 3660 1037 -5238 2076 3387 -4187 -52 4579 -3418 -2067 4686
4328 4686 -839 -3544 3831 444 -4426 3028 2855 -4168 643 3649 -3433 -946 4921 -2056 -3215
4343 -3215 4234 -15 -4062 3588 2082 -4917 1084 3829 -4082 -413 4322 -3047 -2535 4565 -718
4358 -718 -3909 3164 687 -4908 1749 3106 -4496 -278 3398 -3510 -1758 4869 -1750 -4038 3437
4373 3437 401 -4403 2975 2437 -5035 308 4287 -3330 -693 4724 -2425 -3175 4496 431 -3540
4388 -3540 3407 1840 -4305 1783 3768 -3629 -406 4484 -2840 -2069 4588 -290 -3855 3583 1003
4403A003n159O692Q32p471M262L986o979J061O837o773k043P654l103n086O790
4418B503p97o707N676L238p541K501M993o429o13P567m734l648O978j886n708
4433d607O155J906p546L384M571o589R86O599o200k828P925k462n065O470j07
4448B592p046M909M033p243J417N940o368j190P575m025m550O712o01o478N608
4463A285K494p267K225N568o514n66P502m934m239P508j600n826N957J238p413
4478d582M040M725o513L90N930n581k437P626k561n657O475M56o782M867L793
4493D189p324J413N626n427j677P655l871m826O898l9o589N182K558p224K598
4508h58N561o385p49O713m761l862P915j849n644N515J417p126M062M630p098
$$ plain form
4403 1003 -4156 2536 3368 -4103 159 4145 -2834 -1773 5064 -1709 -3752 3902 799 -4287 2503
4418 2503 1706 -5001 675 3913 -3628 -1127 3866 -2563 -3176 4391 -343 -3991 2987 1101 -4607
4433 -4607 1548 3454 -4092 -708 3863 -2726 -1740 4859 -1341 -4169 3756 1294 -3771 2699 2592
4448 2592 -4454 455 4488 -2755 -1338 4602 -1766 -2956 4619 594 -3956 2756 2155 -4323 1285
4463 1285 3779 -3488 -1263 4305 -2209 -2775 4727 -207 -4446 3062 1462 -4364 1593 2831 -4582
4478 -4582 -542 4183 -2330 -1940 3990 -1591 -4028 3598 1037 -4620 1855 2311 -4471 396 4189
4493 4189 -3135 -1722 3904 -1523 -3200 4455 584 -4242 2656 2617 -3972 1210 3768 -3456 -858
4508 -858 4703 -1682 -2431 4282 -479 -4341 3574 1725 -3919 1596 3013 -4113 -51 4579 -2519
4523b519M03O118n115k341P326k714n738O283P00o683M542L730p758J895N989
4538D118n974j134O673l857m379P213j46o737N272K254p558L220N287n980r71
4553b699O706m700l127P087j686n743N760J323o593L948M237p267N37O457m985
4568g45k360P010k784n366O842J17o489M517L092p428K190N826o034j414O801
4583C775l971l902O800m73o634M861K822o884K598N255o664n39O613m335k890
4598c568O813j694o053O027J335o607L850M103p290Q28O532m825k630O710l110
4613D21m329O121M41o126M049L004o763K229N599o242j131O801l762l923O515
4628B904q65o227N135K319o575K551N006o818J87O097m307l022O754j935n715
$$ plain form
4523 -2519 -2116 4002 -1113 -3454 3872 1158 -4580 1703 2403 -4280 262 3992 -3766 -1871 4118
4538 4118 -1856 -2990 3683 -174 -4553 2660 2514 -4223 1049 3303 -4255 -1035 4252 -1728 -2699
4553 -2699 4007 -693 -3820 3267 1581 -4162 1598 2921 -3672 276 4513 -2754 -2217 4240 -745
4568 -745 -3105 3905 1121 -4245 2597 2714 -3775 742 3834 -3594 -1404 4422 -1612 -3026 3775
4583 3775 -196 -4098 2702 2229 -4405 456 3278 -3606 -1008 4247 -2417 -2956 3657 -678 -3568
4598 -3568 3245 1551 -4502 1525 2860 -3747 103 4206 -3084 -2256 4276 -549 -3179 3531 421
4613 421 -3908 2213 2654 -3472 577 3581 -3182 -953 4646 -1596 -2727 4074 312 -3611 2904
4628 2904 2039 -4188 947 3266 -3309 -758 4248 -2570 -2383 3714 -593 -3615 3139 1204 -4511
4643d511O192J181o778L584L642o544J233N988m975k393O716l019m517O490K02
4658B491o761M825K863o529J725N932o217j181O506l568l481O420j070n910N454
4673A499K033o773K683M428o023m9O350m134l536O572j665n194O055O66o725L327
4689d86L937o270J093N645n008k742O930k311n105O445j18o168M218L175o582
4704c347K060N040o069p55O713l671l805O275r05n833N704J661o586K741M341
4719C564n885j5O401m650k723O496j829n006N615P24o338L508M129o221N72N941
4735D283m837k503O511k583m242N573k43n652M667K766o829J829N074n459j248
4750b893O539l618l750N810n20n288M576J929o675K854M713n798n35O386m573
$$ plain form
4643 -4511 1681 2862 -3916 -332 3310 -3234 -2001 3987 -988 -3381 3335 316 -4201 2289 2491
4658 2491 -4270 555 3418 -3111 -1386 4546 -1671 -2852 3654 86 -3395 3025 1955 -3955 1499
4673 1499 3532 -3241 -558 3870 -2153 -2202 4148 14 -3522 3050 1385 -3809 2246 2912 -3813 -486
4689 -486 3451 -2819 -1726 3919 -1089 -3831 3099 788 -4317 2128 2010 -4158 60 3235 -3347
4704 -3347 -1287 3753 -2316 -3071 3642 -29 -3834 2441 1536 -4297 1407 3068 -3518 -777 3564
4719 3564 -2321 -2336 4065 -585 -3308 3188 1359 -3647 1968 2692 -3646 -138 3991 -2230 -1658 4283
4735 4283 -554 -3057 3454 871 -3371 2202 1959 -3693 974 3740 -3089 -1260 3814 -1645 -2893
4750 -2893 3646 28 -3722 2088 1568 -3720 856 2785 -3890 -1036 3677 -2121 -2656 3730 -843
4765h43k445O238j998m866N315J095o167L231M009o087J228M979n098j301O344
4780C634k967m639O464m78n854M613K752o244J809M928n359q78O085l800l498
4795c432O012r56n342N112J639o271K613M388n974N5N642m144k577O163j692m977
4811c741N338N29n725L399L596o212J134N417m888k216O599k775m543N928p6n160
4827c396L848K516n905J585M596m825r65O078l713k814N988j141n516M798J776
4842B910n941K850L942n867J57N703m228k664O346k119m671O000J12o050L648
4857A28L413o034J136M882m595j924O126k823l660N615n98n452M312K403o071
4872c142J654M847n032j002N906l393l156N631r80m802M773J265o149L382L619
$$ plain form
4765 -843 -3288 2950 952 -3914 1401 2496 -3671 -440 3569 -2518 -1290 3689 -1409 -2710 3634
4780 3634 667 -3972 2492 2014 -3840 773 3525 -2719 -910 4018 -1341 -2219 3866 66 -3432
4795 -3432 2580 1624 -3718 1394 3033 -3238 -625 3763 -2211 -2156 3486 -658 -3235 2928 1236 -3741
4811 -3741 1597 2126 -3599 -200 3396 -2816 -1682 3735 -1153 -3369 3230 455 -4088 1840 1764 -3396
4827 -3396 452 2968 -2937 -1352 3244 -1581 -2546 3532 -181 -2995 2993 1852 -3664 1134 2910
4842 2910 -3031 -181 3761 -2106 -1949 3754 -474 -3138 3208 1089 -3582 2418 2530 -3520 128
4857 128 3541 -2493 -1357 3525 -1070 -2994 3132 309 -3351 2264 1666 -3786 526 2929 -3142
4872 -3142 -1488 3359 -1673 -2675 3231 -162 -3318 2313 1333 -3469 1304 2569 -3580 -198 3421
4887C421n597J63N447l759k914N951j715m400M996Q26n779L652L526o279J416
4902a045M932n096j553N835k106m350N612j66n532M038K672n709J672M342n163
4917a617m62N493l457l222N959j228m904M402J874o173K832L769n469K67N215
4932C279m114j903N214j875m371N379L98n284L474L075n819J106M787m206j434
4947b294N245k734l623N575k06n205L784K322n193J772M094n109m38N150l277
4962a37l062N602p73m757M424J324n521K662L542n404J38N330m071j810N228j639
4978A076m346N020J32n240L437K741n224Q21M791m513j586N905k920l488M952
4993A558M9n022L970J998n281J642M378m524o43N120l282k875N278j140m563M434
$$ plain form
4887 3421 -2176 -2013 3434 -325 -3239 2712 997 -3403 1593 2419 -3360 292 3818 -2461 -1045
4902 -1045 3887 -1209 -2762 3073 967 -3383 2229 2063 -3469 569 3241 -2468 -796 3546 -1617
4917 -1617 -2079 3414 -43 -3265 2694 1466 -3438 964 2838 -3335 -503 3266 -2203 -1936 3279
4932 3279 -835 -2738 2476 601 -3770 1609 2007 -3277 197 3272 -2547 -1441 3346 -860 -2294
4947 -2294 2951 217 -3406 2169 1963 -3242 542 2864 -2329 -557 3537 -1572 -2010 3140 -137
4962 -137 -3199 2403 1630 -3127 1297 2621 -2900 -238 3304 -2100 -1962 3368 -703 -2513 2715 1076
4978 1076 -3270 1750 1882 -3358 79 2820 -2404 -1583 3208 -1305 -2891 3014 94 -3394 1558
4993 1558 1607 -3415 555 2553 -2728 -1086 3292 -1232 -1875 3245 -37 -2912 2366 1226 -3337 1097
5009A097J650n701K779L763n473L55N036l907k397N711k035l945M976M10n569
5024c250L553K778n232O92M824m401j567N560k680l303M981k39n001L518K044
5039B277n013J901L933m540r12N291l327k450N285j392m718M666J360n193K473
5054c59L155m857N26M575l527j806M950j811m108N315P8m764K857K944m999J024
5070h07M442m442j396M952k112l218M768q20m576M088J772n067J784L869n081
5085a844R8M882l220k825N106r63m733M238J323m770K469K494m697R45M584l897
5101h10k107N338k222l522M815M56n188L070K808m831J242M344m595r67M700k376
5117A55l026N136q90m410M266J626n473K338L616m982J5M806l124k613M938j292
$$ plain form
5009 1097 2747 -2954 -175 3588 -1885 -1530 3506 -401 -2798 2913 878 -3067 1909 2319 -3250
5024 -3250 303 3081 -2151 -1459 3365 -1036 -2603 2957 277 -3026 1955 1716 -3285 233 2277
5039 2277 -2736 -835 3098 -1442 -2354 2937 -390 -2840 2445 1053 -3665 1001 2361 -2832 -359
5054 -359 2796 -2061 -1535 3040 -487 -2293 2657 846 -3262 2053 2131 -2633 224 3168 -1831 -807
5070 -807 3635 -807 -2203 2749 637 -2581 2187 1367 -3209 879 2651 -2416 -632 3237 -1844
5085 -1844 -1746 3136 -84 -2909 2197 1234 -3499 739 2062 -2708 -239 2255 -2442 -1497 3087 -810
5101 -810 -2917 2421 199 -3323 1492 1948 -3240 -170 2638 -2193 -951 3393 -1202 -2169 2531 155
5117 155 -2871 2265 1375 -3035 1231 2857 -2616 -278 3338 -1644 -1629 3177 53 -2560 2378 1086
5133A086m166M408J122n434K732L155m760O03M317l689k061N182j748l750M599
5148A596J76m757L024K401m749J112L914l838j608N436k842k612M633o17m586
5163c317L925K002n098J632L566m600J30M734l336k148M721j283l509L930J216
5178B565n339K733L032m381L78L802l537j356M891k092l253M050M99n039L423
5193C76K382m450P83L875m301p33M799k805k769M626l74m299L652J641m730J545
5209g82L431m328k20M588l047k696M899q53m142L975J156m745K799K933m838M14
5225a456M353l665j425M629j768l248M178j53m157L352K307m654P75L942m212
5240a202n17M578k633l052M738j85m147L274J408m592J964L206m583j14M401l157
$$ plain form
5133 1086 -3080 1328 2450 -2984 -252 2903 -1857 -1254 3063 -626 -2687 2495 747 -3003 1596
5148 1596 1772 -2985 39 2440 -2309 -1197 2717 -1121 -2729 2707 -135 -2747 1886 1269 -3317
5163 -3317 608 2610 -2488 -856 2710 -1890 -1760 2974 -362 -2510 2211 928 -2581 1349 2565
5178 2565 -2774 -41 2991 -1390 -1012 2790 -747 -2103 2788 696 -2557 1493 1992 -3047 376
5193 376 2758 -1692 -909 2966 -1335 -2068 2731 -74 -2843 1783 1409 -2890 762 2403 -2327 -782
5209 -782 2649 -1679 -1899 2689 -358 -3054 1845 992 -3150 825 1981 -2764 35 2968 -1870 -1456
5225 -1456 2897 -768 -2193 2436 668 -2580 1598 1445 -2712 640 2947 -1707 -932 3010 -1202
5240 -1202 -1719 2859 226 -2826 1912 1727 -2420 854 2262 -2330 -366 2840 -1743 -1857 2544 -613
5256f13j861M710j479l620L891O78m469K358K956m651M72M011l296j436M698j916
5272D33l359M189N31m569L182K217m775J075L952m151p03M686l274k090M817m09
5288A752m365L327J325m241K104L157m513m6L999k778k162M812j343l968M293
5303A353Q50m731K653K840m804O84M128l676j305M742k417l272M337K35m224L032
5319D25J650m282J121L576l942p89M730k825k387M633p89l861L425J225m279K329
5335d0K705m685M34M425l216j916M520j405l334L876N95m410K553K425m431O47
5351a257M137l460j530M311j935k772M366q2m210K978K017m594J663L212m099
5366a255n61M466k670k452M161n99l704L143J481m374K134K625m310P0M669l391
$$ plain form
5256 -613 -2474 2236 757 -2863 1028 1706 -2763 -405 2551 -2100 -1628 2383 -913 -2349 2349 433
5272 433 -2926 1263 1794 -2775 407 2624 -2151 -1076 2876 -1275 -1978 2708 -566 -2656 2161 1752
5288 1752 -2613 714 2039 -2202 -98 3059 -1454 -1500 2499 -279 -2441 2371 1028 -2940 1353
5303 1353 2203 -2528 125 2965 -1839 -1155 2973 -703 -2008 2734 317 -2955 1382 1617 -2607 425
5319 425 2075 -2207 -1086 2490 -1452 -2241 2489 -336 -2723 1910 1121 -2740 685 1910 -2369 -40
5335 -40 2665 -2020 -1586 2839 -377 -2293 2227 822 -2512 1364 1959 -2451 102 2527 -1904 -1257
5351 -1257 2880 -580 -2110 2201 266 -2506 1860 1778 -2432 546 2563 -2031 -368 2844 -1255
5366 -1255 -1816 2650 -20 -2472 1689 1090 -2614 529 2010 -2364 -230 2395 -1915 -1845 2824 -567
5382e67j760M283j659l108M151L68m523K921K402m438J015L467l455q30M000j818
5398D49k970M385k87m505L471J914m425J147L762l938m47M017k485k143M028q54
5414A119l640L580J002m295J926K869m098J77M157l180j893M198j460l147L972
5429A287N46m717K943K361m333J068L610l702j254M575k171l069M538k58m133
5444b709L014J974m430J556K846l813Q4M114k876k172M207q83l589L733J051m619
5460b512K115K848l792QM001k970k001M457j197l601M144J76m055K453K260m282
5476a948P74L731l554r50M280j715l460M331m27l745L457J345m318J351L259l737
5492a326m04L962k289k482M196n99l481L252P09m134K419K512m015K98L909l332
$$ plain form
5382 -567 -2327 1956 297 -2811 1340 1708 -2815 106 2508 -1930 -915 2552 -903 -1733 2267 449
5398 449 -2521 1864 1577 -2928 543 2457 -1968 -821 2941 -997 -1444 2573 88 -2055 1973 1119
5414 1119 -2521 1059 2061 -2234 -308 2561 -1537 -1360 2797 -383 -2276 1922 462 -2685 1287
5429 1287 1833 -2884 59 2420 -1913 -845 2765 -937 -2191 2384 213 -2856 1682 1424 -2709
5444 -2709 305 2279 -2151 -595 2251 -1562 -1478 2636 -240 -2412 1795 912 -2677 1056 2107 -2512
5460 -2512 -397 2451 -1341 -1333 2668 -302 -2303 2154 957 -2644 1500 1676 -2379 74 2334 -1948
5476 -1948 -1174 2557 -997 -1947 2333 618 -2842 1489 1062 -2683 774 2119 -2199 -848 2411 -1326
5492 -1326 -1730 2232 -57 -2539 1657 1058 -2423 829 1538 -2596 -177 2335 -1680 -1382 2527 -805
5508h05j435M400j534l177L489L80l600K571K310m456J145L438l319j161M356
5523B602k262l006M338k45l753K957J534l998J054L618l975n22L933k862j790
5538b377M215p55l706L313J120m043K166K411m035K14L691l056j278M283j870
5553B93k784L411L97l746K370K421m267O37L865l270j246M144k169k531M100j86
5569A439l584K975J062l692J416K765l832k56M362k856j964M550j355l436L402
5584I96J177m214K126K397m245O48L872l399j305M002j668k879L976r6m034K773
5600A27K041m184O65L835l809n59M268k543k711M250j75l898L188J732m610J649
5616g34K971l735k17L828k235j976L874q17l363L405R56m131K065K846m447M81
$$ plain form
5508 -805 -2240 2160 626 -2551 938 1318 -2282 289 2599 -1857 -712 2726 -593 -1754 2602
5523 2602 340 -2666 1672 1427 -2326 631 2165 -1833 -779 2839 -1136 -1658 2275 -587 -2377
5538 -2377 1838 1083 -2623 690 1810 -2233 -67 2344 -1691 -1477 2214 -842 -2120 2163 293
5553 293 -2491 920 1317 -2429 -59 2362 -1905 -1268 2597 -673 -1919 2225 56 -2475 1625 1439
5569 1439 -2145 830 1892 -1800 -384 2381 -1451 -1707 2655 -201 -2165 2385 1030 -2406 996
5584 996 2173 -2041 85 2482 -1763 -1115 2757 -642 -1947 2055 387 -2492 1484 1388 -2646 127
5600 127 2168 -2016 -1351 2484 -1325 -1884 2384 -159 -2870 1380 1205 -2693 495 2227 -2383 -734
5616 -734 2237 -1498 -1715 2113 -122 -2098 1776 959 -2404 1001 1957 -2174 -109 2737 -1710 -1229
5632a229L858l025j747M528j755l124L893J35l903K693K053m296J020L533l739
5647a105n06L909k375k105L815l57l766K974J501l960J349L118m111j41M135k692
5663c17k234M478r88l675L520P99m039K367K336l889J18L978l215j182M540k392
5679B05k504L825j02l893K694K173m271J242L099l432q11M358k470k379M160n28
5695A366l967L428J521m427J804K853l575m21L681k512k011L893j095l031L548
5710A055M72l801K103K214l841N04L683l278j119M123j953k750M059j24l956K991
5726C82J672m180J070L490l554n33L767k298k203M119o48l417L237Q17l679J729
5742b29K528l396l11L764k287k074M101j353l243L881N16m183K552K020l790L22
$$ plain form
5632 -1229 2629 -396 -2143 2385 630 -2494 1399 1534 -2369 324 2377 -1919 -899 2634 -1105
5647 -1105 -1611 2298 -77 -2182 1633 1276 -2490 484 1985 -1975 -626 2492 -1619 -1760 2375 -317
5663 -317 -2551 1927 939 -2736 784 1583 -2456 -89 2247 -1642 -1524 2454 -761 -1943 2597 205
5679 205 -2299 1526 1424 -2469 225 2398 -1873 -631 2468 -964 -1775 2583 113 -2266 1894 1366
5695 1366 -2601 827 2348 -2079 -275 2578 -997 -1418 2263 -249 -2260 1633 538 -2493 1055
5710 1055 1527 -2274 -171 2043 -1798 -1294 2389 -889 -2008 2115 162 -2588 1471 1347 -2609 382
5726 382 2054 -2126 -1056 2434 -1120 -1653 2114 -184 -2387 1732 1084 -2333 904 1721 -1958 -229
5742 -229 2299 -1097 -1408 2356 69 -2005 2096 743 -2500 1381 1897 -2286 266 2286 -1504 -1182
5758a182L639l203r25L531j800k482L882j99l547K489J881m084J175L077l208
5773i56p94M096k417k315M134q04l409L219J174m155J658K694l693L89L377k703
5789e05j204L650j031l235L530M18l795K057K426m246J390L143l278j016L996
5804B300j737k752L853k5l927K715J602l698J393K690l455n95L610k096j851L633
5820A660n76l712L344J039m226J986K652l818L14L767k657j787L904j227l273
5835b610L669K48l941K613K204l788N18L731l483j173M072j607k973L956l33l499
5851b396L105J256l800J341K625l175n52M066k568j808L526p08l108L198Q38l924
5867b084J892K229l473L96L556k951j642M183j555k912L660K8l609K462K025l988
$$ plain form
5758 -1182 2457 -746 -1671 1860 60 -2422 1460 1261 -2286 203 2084 -2000 -825 2252 -956
5773 -956 -1750 2346 -71 -2386 1748 944 -2465 754 1928 -2227 -569 2125 -1568 -1179 2198 -505
5789 -505 -1709 1941 910 -2325 1205 1623 -2172 -115 2311 -1935 -545 2598 -680 -1696 2300
5804 2300 563 -2189 1664 1639 -2288 427 2029 -1669 -276 2414 -1041 -1636 1974 -122 -1973 1660
5820 1660 1084 -2628 716 1755 -2471 -485 2167 -1651 -1337 2430 -227 -2014 1890 663 -2610
5835 -2610 1059 1307 -2634 -21 2183 -1605 -1087 2644 -839 -2012 2060 453 -2520 1436 1103 -2396
5851 -2396 709 1965 -1835 -494 2131 -1044 -1596 2470 -98 -1906 1620 912 -2196 1002 1840 -2084
5867 -2084 -192 2037 -1436 -1040 2516 -435 -2077 2106 551 -2361 1299 1327 -2282 180 2205 -1783
5883a783O66L135k930r48M090k309k320L877k91l734K916J781m016J390K799l770
5899a447j47L467j966j968L890j117k932L082R09l810J689K714l644K27L537k771
5915b87j852M465j523k952L294P66m021K334J989l754Q47K953l009j094L880j944
5931I2k297L575j87l468K809J156l546R82L018l706j42L409k096j755L851q43
5947H52l196K855J154l801J926K096l514N86L437k668j656L985j405k981L687
5962A357L32m119K819J685l688J218K814l072p83L482j570k395L377j29l570K803
5978E61J470l710J240L034l957J0L844k752j727L536o37l027K921O06l427K104
5994H9K176l708J98L421k687j379L755j469k735L519r1l344K766J415l810J103
$$ plain form
5883 -1783 -1117 2018 -912 -1860 2230 -79 -2399 1478 1187 -2547 369 2150 -1866 -476 2323 -1447
5899 -1447 -1594 1873 -93 -2061 1829 712 -2220 862 1771 -2039 -350 2364 -1280 -1053 2484 -287
5915 -287 -2139 2326 803 -2149 1145 1911 -2110 224 2213 -1541 -694 2259 -750 -1844 2036 92
5931 92 -2205 1370 1183 -2285 524 1680 -1866 -884 2134 -1572 -1714 1695 -401 -2156 1695 852
5947 852 -2344 511 1665 -2136 -210 1886 -1628 -1042 2395 -273 -1929 2056 651 -2330 1357
5962 1357 1689 -2430 389 2074 -1614 -396 2418 -654 -1437 2045 475 -1920 1457 1328 -2242 561
5978 561 2031 -1679 -439 2595 -1362 -1352 2492 -260 -1987 1549 912 -2115 806 1412 -2015 89
5994 89 2265 -1443 -1245 2176 -511 -1890 1865 396 -2339 1180 1089 -2255 511 1926 -1884 -781
6010g81K842k853p18L485j919k113L591j19l717K964J326l887J493K659l401m32
6026a580M018k757j655L747j039k899L051P15l555K028K498l866K59L149k567
6041d53j154L298r98k947L211M91l183J512J862l407R59L027k874q69L578j837
6057B16k673L847m61l162K922R22l639J699K538l542j24L456k412j243L547j170
6073G21l169L460O28l586K064K066l586L34L165k731q71L545j550k542L249j49
6089A048l069K145J945l609J068K778l230n02L338j398k251L249p54l223K824
6104C59J281l436J296K760l749j7L644k184j755L333r00l069L102R20l732K100
6120d7J947l535M26L703l029j177L526j272k543L117J87l397K453J661l697J209
$$ plain form
6010 -781 2061 -792 -1510 1975 56 -2057 1534 1415 -2302 662 1988 -1899 -406 2253 -1148 -1580
6026 -1580 2438 -319 -1974 1773 734 -2165 886 1601 -1954 74 2572 -1294 -1035 2114 -453
6041 -453 -1607 1691 693 -2254 957 1448 -1735 -223 1639 -1768 -809 2218 -656 -1525 2053 216
6057 216 -2457 1390 929 -2233 689 1611 -2028 -329 2209 -1333 -1457 1999 -413 -1656 1891 721
6073 721 -2448 1012 1640 -1946 118 2184 -1402 -1068 2097 -634 -1505 2040 490 -2052 1197 1048
6089 1048 -2021 124 2069 -1540 -472 2306 -924 -1426 1912 514 -1737 1512 758 -2465 359
6104 359 1640 -1796 -500 2260 -1489 -1506 2138 -46 -1801 1532 632 -2437 665 1585 -2147 -47
6120 -47 1900 -1635 -1209 2494 -535 -1712 1814 542 -2001 1116 1303 -2094 359 2020 -1677 -468
6136d68K526l064l51L144j562j575L054r39l211L150R22l553J759J840k864M35
6152g57K931k635j348L216r69k770L279J30l174J932K195l570O30L002k541j371
6168a820L426j232k265K829O7k923K025J605l292Q06K848l189l76L349j886j963
6184a991L277n12k888K787J066l494J618K273l146k04L245k350j530L466r46k530
6200a859K864L99l243J858J745k999M45K732k877q12L417j289k045K630k93k857
6216b184K689J099l251Q19K714k937k89L264j819k034L424p55k922L115O14l459
6232a912J684K401l457M8K854j883j801L631q11k403K435M64l252J934J943l396
6248a521Q40K763k665p22L231j471k176K756l34k615K566J101l214R46K406k663
$$ plain form
6136 -468 2058 -1006 -1357 1787 225 -1350 1704 765 -2446 704 1626 -1927 -168 1672 -1192 -757
6152 -757 2174 -461 -1809 1407 438 -2332 947 1077 -2097 -165 2030 -1540 -910 2092 -449 -1820
6168 -1820 1606 374 -1891 938 1005 -1918 107 1712 -1580 -774 2074 -1115 -1491 1858 -28 -1991
6184 -1991 1286 774 -2114 673 1739 -1755 -137 2136 -1010 -1214 2031 -319 -1849 1617 671 -1859
6200 -1859 1005 1404 -1839 19 1764 -1235 -790 1942 -935 -1747 1670 381 -1664 966 673 -2184
6216 -2184 505 1604 -1647 -828 1886 -1051 -1340 1924 105 -1929 1495 740 -2182 933 1547 -1912
6232 -1912 -228 2173 -1284 -1236 1618 -265 -2066 1565 754 -1649 786 1250 -2002 -68 1875 -1521
6248 -1521 -681 2082 -583 -1305 1926 455 -1721 1035 701 -1914 652 1753 -1461 -515 1891 -772
6264g72o01L546k460j539K925j32k756K464L91k691J161K448l110j30K824j744
6280a76j520L335j291k334K614M07k825J971J449l176O36K537k345p41L262j642
6296A61k024L026j21l036K385J170l390J316K430k685k40K952k100j279L205j008
6312G62k386K532M77k609J257K128l126j03L063k104j215K883q47k634K902N00
6328A480l047J608J879l500P55K813k478r90L079j466j914K901k36k842K215J062
6344A319l024J254K351k804l48K833j643j834L518q75k787K592R87l053J597J654
6360A737l193N63K599j747j227K899j375k242L155K31l033J896J188k583M41K607
6376A916k520q74K907j370j683L166n59k978K287J135k832Q87K538l084k79K790
$$ plain form
6264 -772 -1373 2173 -287 -1826 1099 967 -1789 675 1066 -1625 -464 1984 -1126 -1256 1568 -176
6280 -176 -1696 1639 348 -1986 628 1035 -1790 181 1630 -1546 -910 1627 -718 -1459 1803 161
6296 161 -1863 1163 1042 -1994 391 1561 -1829 -513 1917 -768 -1008 1944 -156 -1435 1770 762
6312 762 -1624 908 1385 -1224 33 2161 -965 -1068 1995 -109 -1324 1559 712 -1922 980 1480
6328 1480 -1567 41 1920 -1580 -825 1988 -490 -1480 1599 133 -1781 1120 884 -1958 257 1319
6344 1319 -1705 -451 1900 -904 -1252 1581 -62 -1896 1622 747 -2040 552 1539 -1514 83 1737
6360 1737 -1456 -893 1706 -41 -1268 1631 256 -1986 1169 1400 -1633 263 1451 -1132 -691 1916
6376 1916 -604 -1478 1429 59 -1624 1542 983 -1995 292 1427 -1405 -518 2020 -1064 -1343 1447
6392A447j461j823K816m39k636K449P53k760J353K012k743J14K704j903j309K966
6408A540j244k151K914J33k906J854J637l052Q46K156k389n26K643j258j680K517
6424A034Pk806K168R76k694J110K107k704r4K820j998j382K866n64k548K480O04
6441A382k887J347J989l048K95K902k562q94K678r87j703K450J13k980J928J345
6457A368k847O75K559k354q19K764j108k030K854K7k664K037J016k776P57K344
6473A803k664p4K747j821j377K613o21k126K581N76k716J099J741k780Q5K720
6489A786k201q29K740j185j804K083L57k690J791J426k472M36K267k496m80K817
6505A546j602j406K428Kk737K264P41k549R49J919k443k33K895j990j191K539
$$ plain form
6392 1447 -14 -1837 979 540 -2096 353 1106 -1654 -301 1711 -1032 -918 1786 -117 -1426 1540
6408 1540 296 -1855 1059 1192 -1714 140 1777 -1275 -429 1727 -662 -1188 1455 197 -1483 1034
6424 1034 1041 -1765 403 1379 -1315 -205 1902 -802 -896 1924 -74 -1456 1410 846 -1702 778 1382
6441 1382 -1505 -158 1831 -1217 -922 1980 -582 -1476 1202 215 -1488 962 1075 -1905 23 1368
6457 1368 -1479 -804 1755 -599 -1418 1346 238 -1792 1062 1089 -1575 462 1478 -1298 -541 1803
6473 1803 -861 -935 1812 -9 -1386 1227 606 -1520 1061 1637 -1079 20 1761 -1019 -934 1786
6489 1786 -415 -1244 1496 311 -1493 590 947 -1743 48 1474 -998 -562 1705 -791 -1271 1546
6505 1546 -56 -1462 966 968 -1769 495 1236 -1313 -364 1555 -888 -1121 1774 -216 -1407 1132
6521A132p33k080K264O11k629J351J690k516J60K221j884r45K698q29k276K649
6537H84J24k830K082J381k701Q20J991k303m81K724j357k062K810k77k514K137
6553D28R06k539Q45J761k142j23K437k176j208K798n69k092K319O15l038J792
6569A4J556k379r0K757k539p91K575m90k198K795j88k609J643J602k857O08K429
6586A838k450o61K846j367j561K585l41k088J637J100k963J371J840k436n55K839
6602A634j990j178K875o55k149J836N54k482J459J677k541R1K438k242p65K729
6618A291j073j707K289o0k276J919Q74k510P59K102k407o2K278j476j553K537
6634I25k51k131J848P11k517J049J870k151k31K427j525j212K348n50k183K295
$$ plain form
6521 1132 399 -1681 583 1194 -1435 -84 1606 -910 -750 1471 -413 -1358 1340 511 -1765 884
6537 884 1008 -1822 260 1641 -1060 -240 1751 -552 -1033 1691 334 -1728 1082 805 -1709 428
6553 428 1334 -1205 -360 1401 -741 -864 1573 -603 -1811 987 418 -1674 645 1260 -1778 14
6569 14 1570 -809 -899 1858 -681 -1472 1103 613 -1585 1210 1022 -1587 56 1658 -1199 -591 1838
6586 1838 -612 -1273 1573 206 -1355 1230 889 -1199 438 1538 -1425 -54 1786 -650 -1205 1634
6602 1634 -356 -1534 1341 686 -1463 373 927 -1555 -96 1581 -960 -869 1569 -673 -1438 1291
6618 1291 218 -1489 800 740 -1536 383 1257 -1253 -494 1608 -799 -861 1417 -59 -1612 925
6634 925 674 -1457 391 1102 -1415 -366 1504 -647 -878 1549 24 -1188 1160 610 -1573 722
6650G22N05k341J260J361k303L76K110k253o93K583j173j956K789P8k621J804
6666B48R22k435O94J922k025q34K941j696j270K414J5k277J669P24k369J235J457
6683A335k052j70K408j559j224K612j172j977K474J53j950R38J542k460L80K243
6699A521j635q00K150p90j755K381j28k462K073O79k576J050K003k394K7J932
6715A276j068j731K574m08j947J708Q81k426Q64J673k199m3K114j523j021K228
6731I52p23j839K100L37k162J479J231k364M69K117j886p84K455j307j661K227
6747F41J86k419J968Q77k480Q21J949k210j73K402j354j634K858o63k069J640
6763C40N17j828Q60J804k452J00J865j343j167K389n78j939K254Q5k412J809J174
$$ plain form
6650 722 1227 -1114 146 1507 -796 -420 1690 -563 -1256 1327 154 -1802 987 1065 -1556 248
6666 248 1170 -1265 -571 1351 -674 -1508 1433 -263 -1533 881 896 -1381 288 1012 -1357 -122 1335
6683 1335 -717 -887 1521 -38 -1262 1350 178 -1799 675 828 -1122 -184 1358 -1102 -722 1521
6699 1521 -114 -914 1236 446 -1309 1072 944 -1518 555 1234 -1342 -292 1711 -683 -656 1276
6715 1276 208 -1523 1051 643 -1304 404 1285 -1141 -277 1396 -803 -846 1268 -255 -1276 952
6731 952 229 -1610 490 827 -1335 144 1375 -989 -520 1597 -289 -1073 1382 75 -1586 641
6747 641 827 -1592 376 1253 -1227 -406 1543 -667 -840 1562 208 -1426 1432 769 -1300 340
6763 340 857 -971 -111 1693 -759 -659 1206 -137 -1304 1085 507 -1432 822 907 -1505 304 1478
6780A478k851N65K126j512r40K342j117j557K439k39j944J412J122k450O34J748
6796A256j834k97K137j330j220K106k3k350J742R05k356J087J338k258L33K152
6812A388j529j031K484o51k121K174J39k231J587J189k441P32J789j842q15K401
6828A222j127j360K143j70k426J759J028k407P96K268k144p43K720j598j268K379
6844A072p30k085K438J69k203R51J596j810n05K430j245j305K097p62j585K359
6860H82P6k392J591J013j988Q6K373k337m28K411q95j578K218k55j701J170J087
6877A333k064L74J974k546K33J981j259j565K583m71k088K118M40k161R94J454
6893A330k174J68J823j555j009K407l97k016K106L0k333J659J171k132L47J765
$$ plain form
6780 1478 -1373 -808 1318 -194 -1134 1208 91 -1466 973 734 -1210 202 1324 -1126 -492 1256
6796 1256 -578 -875 1262 -68 -1288 818 795 -1555 187 1092 -1264 -177 1161 -1097 -764 1388
6812 1388 -141 -1172 1312 661 -1460 714 853 -1378 209 1398 -1043 -311 1478 -364 -1179 1222
6828 1222 95 -1265 878 708 -1718 41 1069 -1338 -542 1726 -418 -1161 1559 -39 -1307 1072
6844 1072 342 -1743 695 864 -1339 -388 1208 -602 -1107 1323 78 -1227 870 108 -1477 882
6860 882 958 -1434 157 1170 -818 -732 1641 -696 -1124 1287 392 -1186 1032 777 -924 246 1333
6877 1333 -731 -357 1617 -929 -696 1285 26 -1539 1044 573 -1515 603 1043 -1118 -124 1330
6893 1330 -844 -676 1147 -408 -1417 990 593 -1423 683 713 -1620 39 1210 -922 -575 1190
6909A190j846p00K555j042j423K054J11k142J591P09k227Q86J689j854m11K214
6925A354j390j200K211l10k075K044N42k093R65J264j838k25K339j993o56K221
6941A160r29j574K046P3k221J341J194j924K22J793j897m50K804j693j249K187
6957H83m29j934J599P87k007P37J840k147J32J909j631j061K305p60j434J621
6973D10N57k320J234J481k036K78J753j250j153J970n97j718K123J73k008J749
6989F46N09j837M30J659j815o98K171n62j861K103l19j422J636N89k378J056J533
7006A440k097l8K185j895p54K242o64j453J436O75k302J133J129j936M59J811
7022A371j434o53J802q17j541K097J0j826J201J213k216N71J304j657l62K153
$$ plain form
6909 1190 -656 -1356 1199 157 -1266 788 899 -1243 348 1057 -1170 -284 1405 -449 -860 1354
6925 1354 -36 -1236 975 665 -1410 634 1176 -917 48 1312 -526 -751 1588 -405 -1061 1160
6941 1160 231 -1343 703 776 -1445 -104 1090 -834 -612 1181 -716 -1166 1638 -55 -1304 883
6957 883 454 -1480 119 906 -1101 -364 1476 -671 -539 1370 -261 -1322 983 223 -1211 410
6973 410 967 -1353 -119 1362 -674 -396 1357 107 -1046 924 327 -1391 732 905 -1103 646
6989 646 1155 -682 -252 1407 -408 -1106 1065 503 -1358 745 426 -996 640 1229 -1149 -93 1440
7006 1440 -657 -695 1490 -405 -1159 1083 419 -1034 402 1077 -1225 -92 1037 -899 -440 1371
7022 1371 -63 -716 1086 269 -1272 825 835 -991 210 1423 -793 -222 1082 -575 -937 1216
7038A216j141j065J675J06j905J404J283k679Q17J707j941l97K445j587q11K048
7054A175o04j587J586K53j869J081J055j859P5J834j218r65K365r73j727K075
7070F97m0j996J429R17k057P53J517j533o43J624p25j070K007m50j733J846P85
7087A328k312J019J537k447M45J475q42j043J713k93j981K180L08j799P42J224
7103A254k253M03J943j795m62K065j092j374K107N0j935J289O86j919P41J564
7119A272j874j50J852j119j182K113k08k148K294J83k368J140J359j931nJ911
7135A139j298r90K101p24j348J851j76j836J295J046k117M89J787j532o16K162
7151A233j057j325K075k30k146K037M46j825K99J651j603k32J992j439r87J882
$$ plain form
7038 1216 75 -990 685 791 -1114 290 1573 -1106 -289 1418 -523 -920 1525 -62 -873 1175
7054 1175 571 -1016 570 823 -1046 35 1090 -769 -694 1140 -78 -1043 1322 349 -1378 697
7070 697 657 -1339 90 1007 -1050 -297 1220 -313 -956 668 -57 -1127 880 430 -1303 543 1328
7087 1328 -984 35 1572 -875 -430 1045 203 -840 873 580 -1401 779 1087 -712 30 1254
7103 1254 -999 -596 1347 -448 -910 1155 63 -1311 796 846 -1089 200 886 -1033 -292 1272
7119 1272 -602 -752 1100 -19 -1201 912 704 -1444 850 1033 -1335 -195 1164 -767 -772 1139
7135 1139 -159 -1149 952 228 -1120 731 555 -1281 14 1060 -1057 -568 1219 -313 -929 1233
7151 1233 176 -1149 926 696 -1450 587 1033 -792 -493 1158 -445 -677 1315 -124 -1111 771
7167G71k55j911J969N04k279Q40J519k283K22K002j385r76K441q24j661J853L07
7184H54k106J214J254k194L31J965k025j62J973q60j449J913l59j487J387N54
7200H03j711N88J825k385l07K344r26j746K489n75j530J504M09j723P74J600k187
7217g54K62J962j956m58J858l31j592J833qk078J183J142k021L65J995j750n84
7234i32K058j055j285J495L80j643J278M33j622L58J737j761l22J954j299q70
7250a096J834k25j882J863M95k345J146J483k027J57J778j285q97J770m44j560
7266a235J772L47k066J433Q20k053N99J828j956k47J825p26j470J810O0k154J791
7283C78N75j817M49J485j455m17K121j316j267K032l86j785J552N72j943J110
$$ plain form
7167 771 516 -1395 574 1078 -1201 -361 1158 -1125 -903 1099 -286 -1262 1179 355 -1306 547 854
7184 854 -1252 -38 1216 -978 -647 1318 -707 -869 1104 244 -1205 708 349 -1138 249 803
7200 803 -908 -320 1505 -880 -1187 1157 231 -1515 974 399 -1131 373 782 -941 -167 1433 -754
7217 -754 -492 1470 -486 -944 914 583 -1009 824 816 -1262 -79 1063 -958 -593 1402 -348 -932
7234 -932 1126 71 -1214 281 661 -982 296 729 -893 -535 1202 -559 -881 1073 -226 -1096
7250 -1096 738 513 -1369 494 989 -1356 -210 1273 -754 -597 1181 -104 -1001 769 325 -1235
7266 -1235 537 884 -1182 251 1071 -982 -383 1445 -511 -758 1067 341 -1129 681 741 -1413 378
7283 378 953 -864 -415 1070 -385 -802 1319 3 -1264 768 382 -1403 149 721 -1222 -112
7299a12J353k045J54J816j641o43K120q98j184J370N59j980J275J088k243N75
7315d36J713j825n60K456j147j482K109j53j716J421N12j777Q28J194j858k50
7331i71K068j229j073J844j87j615J708L13j855J012J243j808K32J534j576p07
7347a067K056p14j713K288j15j871J276J080k277O20J613j588m43J861r29j318
7363a241J851j34j835J907O42k092O41J465j682n3J705j511p39K130m69j953J857
7380D89K27j797J192R04j640k8K075j853m71J943q72j367J802J00j956J491R48
7397A187k171P21J339j576l68J764r45q88J828n16j596J574L20j889J156J448
7413A388j973l13J958j327j029J922k01j626J900K80j999J175R49k024N91J598
$$ plain form
7299 -112 1241 -804 -650 1166 -475 -1118 1002 104 -1080 290 849 -1131 144 1232 -1011 -436
7315 -436 1277 -548 -1108 1348 201 -1281 828 675 -1041 380 892 -885 -57 1137 -721 -971
7331 -971 1097 -132 -1205 639 452 -1163 545 858 -997 15 1258 -550 -318 1216 -360 -1067
7347 -1067 989 275 -1438 850 735 -1136 140 1220 -1057 -437 1176 -412 -855 1006 77 -1241
7363 -1241 610 476 -1359 548 1190 -902 -261 1204 -478 -531 1174 -337 -1076 1054 585 -1368 489
7380 489 716 -1081 111 1015 -625 -653 1422 -431 -902 1041 169 -1198 604 704 -1252 239 1187
7397 1187 -984 -263 1076 -500 -868 896 -49 -937 891 375 -1221 353 673 -1216 -60 1388
7413 1388 -585 -898 1060 -267 -1296 626 425 -1201 699 979 -1020 155 1104 -920 -329 1269
7429A269j693k46J766j144j259K111j40j572J056J054k133O87J461j707l81J826
7445I55q12j305K094j57k084J923O37k177Q35J266j717k04J981j114j222J565
7461D64l83j279J979j20k139J754R01j790KJ818j734k06J669j040j168J867k07
7478C88j485J492Q20k198P11J579j751l31K248j547j059K010k90j887K130L3j976
7495a113Q82J373j644m75K299j824k04J466l23j627J822L23k233J399J137j990
7511g32L91J575j475o93J980j188q38J821m63j578J320R94j905K73J760k097J91
7528f64J684j170j209K191j77k126J409O18j708Q52J540k039K33J958j618q96
7544a122K057o80j174J352O45k294R49J357j670o2J859j687k01J725q42j430J994
$$ plain form
7429 1269 -424 -670 1096 -48 -1307 804 664 -908 148 1202 -931 -244 1217 -490 -871 955
7445 955 143 -1162 932 775 -1309 614 1251 -926 -91 1175 -542 -746 1235 121 -1101 464
7461 464 81 -1198 781 661 -1478 276 1177 -613 -611 1207 -527 -733 936 -104 -1272 595 388
7478 388 -1097 395 1215 -983 -272 1307 -444 -775 1473 -74 -1133 877 587 -1300 830 863 -1113
7495 -1113 -231 1142 -502 -977 1322 -502 -706 760 437 -1190 632 955 -1278 121 1258 -732
7511 -732 -341 1234 -241 -934 1046 -142 -980 841 378 -1200 120 1114 -791 -518 1242 -855 -664
7528 -664 1020 -150 -1359 832 655 -1471 -62 556 -1152 -300 1240 -799 -566 1392 -226 -1122
7544 -1122 935 255 -919 433 1078 -1216 -267 1090 -580 -642 1217 -470 -671 1054 212 -1218 776
7561G76J38k073J526L60j407J53J432j191n11J737r64j202J994k02j683J453N45
7578H81k054Q81J347j873K98J461j133n71J619m84j367J665m5j846J524N87j673
7595g83K62J331j055p29J958o64j321J722j60j381Q92O03j617N91J732j811j35
7612e65J601p95j102J492l54j327J326M57j772R59J132j651J67J339j354m92J715
7629G76o75j016J291oj303Q14J202k103R35J472j859m76J947r37r94J538p2j480
7647i46J237N76j824Q71J023j452j05J863j474r88J936j5j964J927J07j333J32
7664d29J211j422m0J960j559q39K096j019j126J827K55j751Q62R52j827L55J864
7681A370j684o65J907q13r26J273p6j451J308P16k032J084J047j903K93J364r57
$$ plain form
7561 776 914 -1159 367 727 -680 -527 905 -286 -797 940 -24 -1226 768 566 -1117 336 881
7578 881 -1173 -292 1055 -818 -520 941 -192 -763 856 372 -995 670 625 -1221 303 890 -783
7595 -783 -521 810 -245 -974 984 320 -1001 721 561 -820 72 675 -942 -351 1381 -430 -565
7612 -565 1036 241 -861 631 277 -1050 276 733 -1039 -80 1052 -599 -432 907 -447 -939 776
7629 776 101 -915 376 370 -933 -119 1083 -1020 -85 1387 -472 -948 999 62 -932 606 534 -946
7647 -946 291 867 -957 -86 937 -515 -620 1243 -231 -1219 717 702 -1262 665 772 -561 -429
7664 -429 782 -640 -680 1280 -279 -1118 978 -41 -1167 660 915 -836 26 978 -849 -494 1370
7681 1370 -314 -979 928 115 -811 462 386 -1065 243 959 -1073 11 1058 -845 -552 812 -145
7698a45r64K217o26j376J454J27j287N77O85j116M70R47j260p09J800o20j152
7715i78J645J4j458J396N49j830M19J743j813j92J532r05j122J643k11j567J503
7732C68O23j802L59J231j326k00J705p85j414K277r28j010J240K35j612J018R05
7749H84j681J92J659j259o20J550o02j111J310L35j777J473O28j934O97J057j338
7766e37K35J264j031j020J589K66j724J453L81j480M04J108j293O8J261j197o50
7783i03J731m57j478J513K74j736J227O65j625N06J500j397o99J689p28j031J504
7800E55l16j360J284N73j212K5J557j499n04J861q44j045J579m11j238J317O68
7817I90j632M57J213j495k1J575j159j004J621m85r75J539J93j648R53P95j704
$$ plain form
7698 -145 -1109 1108 482 -894 560 687 -600 -23 662 -454 16 963 -297 -1006 794 174 -978
7715 -978 667 681 -777 619 1168 -662 -243 1500 -313 -505 1027 122 -1000 643 432 -1135 368
7732 368 991 -811 -452 779 -547 -747 958 173 -1241 1036 108 -902 338 573 -1039 -21 884
7749 884 -797 -605 1054 -205 -825 725 123 -988 322 657 -1120 353 981 -953 -256 801 -537
7766 -537 -302 962 -69 -1089 500 766 -958 495 876 -604 -200 908 -385 -317 944 -253 -903
7783 -903 828 371 -1107 406 680 -1056 171 836 -789 -283 1217 -180 -879 810 82 -949 555
7800 555 239 -1121 163 736 -476 -451 1106 -393 -897 964 120 -925 654 243 -995 322 990
7817 990 -642 -185 1028 -467 -488 1087 -72 -1076 545 60 -915 624 817 -831 122 917 -787
7834g87L23J635j205m38J102n38r12J543j38j526R36R56j752N59J287j461n18
7851i34J812j077p65J626l71j402J253Q13j938R66R27j456j56J761j220o50J367
7868E56m54j371J512N48j763R71P35j400M96J188j356j93J405p05r23J615l42
7885E19j393J257J15j183P17J188j777k03J782q68j365J788k05j623J600L60j433
7902g24J090P00j831L56J414j212p32J709o21j143J366M6j228Q13P17j342K44
7919c78J299j145r10J850o56r33J402j47j361J200N68j662N36J329j463j10J334
7936G53n30j093J639o38j004R77N40j430Q28R30j394j01J454j101m98J558o28
7953B62j328J267K12j262Q76P74j233J17J284j374k21J462p35q21J072K13j476
$$ plain form
7834 -787 -464 1171 -34 -472 630 92 -820 723 585 -941 -5 951 -801 -242 1045 -416 -934
7851 -934 878 -199 -964 662 291 -1111 142 955 -983 -17 910 -546 -702 1059 -161 -811 556
7868 556 102 -1269 243 791 -972 -1 734 -666 -170 1018 -338 -531 874 169 -754 861 519
7885 519 -874 383 498 -685 32 1220 -557 -760 1022 154 -1211 577 372 -1251 349 709 -724
7902 -724 366 1066 -765 -409 1005 -207 -939 770 149 -994 372 418 -810 3 720 -622 -378
7919 -378 921 -224 -1134 716 60 -873 529 382 -979 221 789 -873 -337 992 -471 -581 753
7936 753 223 -870 769 131 -873 104 644 -786 42 972 -422 -523 931 -170 -668 890 262
7953 262 -1066 201 413 -849 27 801 -432 -315 969 -405 -626 836 101 -720 352 565 -911
7970i11J084N94j716R22R27j547J61J213j006k86J078r7j486J277L13j317J036
7987B39N49j058j93J155q19m80J474l94j201J291L53j618R91O06j073j79J297
8004I40j258k93J528q80r88J664o5j451J163K90j239M00J075j447j6J247q62m27
8022f19J514r28j073J379L65j744P00J030j257K59J210j371nJ168k83j282J341
8039D04N6j316Q74O68j273L58Q73q85m7J186q28j080J575p8j125J103n7j173N87
8058a78J048j402k88K117j211q68J484n61r95J170L17j464P56Q99j492L66J156
8075H54r69o17J490j026p08J495j32j106J002J95j314P26J042j432k22J500l69
8092D09j294J678o31q22Q04O38j645O40J021j159L87O42j097j00J403m26j209
$$ plain form
7970 -911 173 767 -949 -27 900 -647 -486 727 -279 -565 513 416 -1070 207 520 -797 239
7987 239 788 -270 -463 692 -127 -607 867 473 -728 563 916 -702 289 895 -178 -357 940
8004 940 -318 -611 917 37 -951 713 648 -803 360 650 -589 -189 886 -561 -577 670 -192 -619
8022 -619 895 -33 -1106 273 638 -1106 -406 624 -633 -374 836 -535 -540 628 345 -937 404
8039 404 460 -856 18 686 -587 -229 644 -241 -288 898 70 -1010 565 487 -638 465 408 -765 -178
8058 -178 870 -532 -820 1297 86 -782 702 141 -854 316 633 -831 -75 824 -668 -302 854
8075 854 -115 -732 758 -268 -976 519 387 -719 283 478 -836 -110 932 -500 -722 778 409
8092 409 -885 793 162 -660 144 782 -863 -223 798 -361 26 668 -429 -529 874 448 -761
8109g61P40P67j408Q88O01j342J22J024p86n64J430m56r10J189k7j467J021O63
8127G24j224L63O47p78k98J302p43n95J315m28j023J160M02j547L48J267j662
8144g70K44J314j019l26J240n32q81J101p0j043P00J059j553K11J469j630j3J280
8162G81q00q81J597l39j068R24N74j330O64P63j151j35J175p66n93J187k98j205
8180i01R68P43j352M51J075j528mJ413o54p11J230
$$ plain form
8109 -761 -21 746 -662 226 827 -515 -393 631 -155 -719 711 255 -655 534 507 -960 61 724
8127 724 -500 -137 510 -268 -566 736 -7 -602 713 285 -738 422 824 -723 -375 892 -770
8144 -770 -526 788 -231 -557 683 151 -730 371 301 -742 -42 1017 -536 -325 1144 -486 -499 781
8162 781 -19 -900 697 358 -710 214 788 -542 122 885 -266 -401 774 8 -585 602 304 -901
8180 -901 67 810 -542 -91 984 -544 -548 865 211 -500 730
8191G30
$$ Imaginary data points
##PAGE= N=2
##DATA TABLE= (X++(I..I)), XYDATA
0@%%%%%%%%%Qj6J6j6J7k5L2l3M1m9N7o7P6r0J06j22J39j57J76k00K30k60K90l25
33a72L61m03M52n02N56o16O82p55Q35r24J024j135J259j402J563j745J960k213
51a175K518k894L366l985M835o077Q064j1736K0697p9943j05132J77239J3636
64A9413m7834O2825n3266j17837J24081R9259q3071J1263L4275j12733M3160J62463
76A41998o5855r6182P5415l2634o2521J34381L1004j61687L170P0688o2049L6441
88A2169Q3056j24531p0687J14695p051m7803R5612l5960j42110Q5125J07025q2773
100a3233M93N0941j06497r111J42509l0039q4975N8140l1087p2208J21503N0582
112G7018j34581M969O9788p4271K7904J21262q5794r4076R4344J4323m1689R2945
$$ plain form
0 0 0 0 0 0 0 0 0 0 0 8 -8 8 -8 9 -16 16 -17 24 -25 32 -35 41 -49 57 -65 74 -83 93 -107 123 -137 153 -172
33 -172 189 -214 238 -264 292 -324 358 -397 438 -486 538 -597 662 -740 823 -922 1038 -1175
51 -1175 1343 -1551 1815 -2170 2665 -3412 4652 -7084 13613 -66330 -171462 5777 19413
64 19413 -28421 34404 -18862 -136699 -12618 86641 3570 14833 49108 -63625 -20465 141998
76 141998 76143 -20039 55376 22742 -39779 94602 125606 -36081 -32911 37777 -24272 12169
88 12169 95225 -29306 -99993 14702 7651 -40152 55460 19500 -122610 -37485 69540 -13233
100 -13233 -12740 38201 -68296 -77407 65102 35063 -49912 8228 -22859 -95067 26436 77018
112 77018 -57563 -52594 17194 -57077 -29173 92089 6295 -87781 6563 20886 -20803 72142
124G2142r911j37404N4126R9819o6511R453N7924j16120l5868J46178p604r3855
136b7631M9579j6727q5369R7143P0479j15584j3249O0254o9920J8169J20170p5883
148A1431j00474Q8478J4754o2269Q4550J9396j33837K2567R5190n4404J685O4954
160E2021r5504m9727J26114L252p9422N9375m714r7849Q0022R1577r4927k1254
172c1036O7355n9320o090J14103l9654r0032O7523Q453o3787Q2621L7410j25075
184c7529K992Q8426n4058q120Q1273p3170p7128R5798K0965o6089N1162j776j03683
197h0937N5087R2607p8146k3908O2517o7105k7047J18396j5982r9139M9588K0485
209F416o5541O5971N2250j05302q341Q0187m7153q464R0979n8047q2913R0650
$$ plain form
124 72142 62231 -75173 -21047 78772 12261 21714 79638 -36482 -72350 73828 66224 -27631
136 -27631 21948 5221 -80148 16995 87474 -28110 -41359 18895 -51025 -32856 87314 11431
148 11431 -89043 -565 14189 -48080 36470 55866 -77971 -55404 39786 -14618 -12933 52021
160 52021 -43483 -93210 32904 36156 -43266 16109 11395 -86454 -6432 85145 -9782 -31036
172 -31036 36319 -23001 -29091 85012 45358 -44674 22849 31302 -32485 50136 87546 -37529
184 -37529 -34537 53889 -169 -8289 72984 -186 -77314 18484 39449 -26640 24522 22746 -80937
197 -80937 -25850 66757 -11389 -35297 27220 -39885 -66932 51464 35482 -63657 -14069 6416
209 6416 -59125 6846 59096 -46206 -54547 25640 -21513 -29977 61002 2955 -79958 10692
221A0692L0452o8983N2336K4392j02754K8427R5472n5772k5015N9987n9864l7937
233d8567J09154k997r2255M5661K1242p7023N3146O8707r3940k6594P5800m0667
245h333k4036Q4511l6014q3124O7488K5645o7948M8978L5778r9179O743Q9403
257C9912m8087k7536O8137m7719n8848R0794K0134p6430L5243K2561p4762M2102
269a4499P8355p4284k9926P0270l5545k9639Q9047j4730q6628N2858L5818o2253
281b1156L9109M6532q7196p996Q1819l8046k9799O9169l8108p0033P6470K8145
293D8910p3692K9901K9286q0016K0488Q1730n8941l8456O2382l3747m0450Q3729
305C1124j535q6980M1176L6642o4395L0972N8315p7224k1673P8282k9645l4227
$$ plain form
221 10692 41144 -27839 24497 48889 -53865 -25438 70034 14262 -10753 49234 -10630 -48567
233 -48567 60587 57590 -34665 10996 32238 -44785 8361 77068 -16872 -43466 32334 -8333
245 -8333 -32369 52142 16128 -66996 492 26137 -41811 7167 42945 -56234 -49491 39912
257 39912 -8175 -35711 32426 -15293 -74141 16653 36787 -39643 -4400 18161 -56601 -14499
269 -14499 63856 -10428 -40354 29916 -5629 -35268 53779 39049 -47579 5279 41097 -21156
281 -21156 17953 64485 -22711 -30707 51112 13066 -16733 52436 14328 -55705 20765 48910
293 48910 -24782 5119 34405 -45611 -25123 56607 -2334 -40790 21592 -12155 -52605 31124
305 31124 29589 -57391 -16215 20427 -43968 -12996 45319 -31905 -53578 24704 -4941 -39168
317c9168P1412k1273p2844O4053L5133o6058L0164M0775p6906N255Q4222m1643
329A3122l7803O0088k6511m9095P7138J5867p9984K8385L6958o1903K2773O4145
341F3180o7190l3027O9883k2634l9944O6088j0145p6792M6778L7918o1725K0351
353g259M4567p1113j1182P6923l2036l8872N8218k0977n9639O5840K9643p1150
365c7037J8898L8860n9588J3396P1057n1491l8674O4306j4585m1177O5749M332
377C4046p5332L7407M5022n7477J5175N3752o1811k1463P4093k2288m2178N8043
389C6989j0160o5786N3131L6130o5953J4315M0927o2464q91P3904m0149m7069
401c7076N5623j1658m8068N9845J3574p5954K3238M5287n3507O776N6026n4651
$$ plain form
317 -39168 32244 10971 -61873 2180 37313 -28745 1419 42194 -34712 -29457 54765 13122
329 13122 -24681 35407 8896 -40199 36939 52806 -27178 1207 38165 -23738 -965 63180
341 63180 -4010 -37037 32846 10212 -29732 36356 26211 -50581 -3803 34115 -27610 -7259
353 -7259 37308 -33805 -44987 31936 -100 -38972 19246 -1731 -61370 4470 34113 -37037
365 -37037 -18139 20721 -38867 -25471 45586 -5905 -44579 19727 5142 -36035 29714 34046
377 34046 -41286 -3879 41143 -16334 -1159 52593 -9218 -30681 43412 21124 -21054 36989
389 36989 26829 -38957 14174 50304 -15649 -1334 39593 -22871 -23762 50142 9993 -37076
401 -37076 18547 6889 -41179 18666 32240 -43714 -20476 24811 -28696 -21920 34106 -20545
413b0545l1500O8745j3658m4815N3624P82o5796M2174M2567n8415R241M7830n3804
426b3570j1314P1387k4242m4354N2192m609n0746N3908K8119o8688J3314M7281
438C8678m7420J96N9704m3348l9439O1505n776m6677M8057Q713o7459K9867M5172
451D1773n4317L58M8649m8890k4101O6607j7046m8383M6619M49n6975M3176L5843
464C3762o3637M170M6945m5403p010O3779l3981m6398N6269L379m7959M4680J8462
477B7058o4296K1089N0776m8068l835N4256m0471l0670O4195o721m9248M5146
489A9211J0545n8534L2362M2465n4701j390M7457m2596j7151O3319k2436n0277
501c1726M6975O930n0381L7714K6529o4245P399N0704m0986j2625N1256l3283
$$ plain form
413 -20545 -52045 16700 3042 -41773 11851 12633 -53163 -10989 31578 -26837 -17596 30234 -23570
426 -23570 -34884 36503 12261 -32093 20099 15490 -35256 18652 46771 -21917 -8603 38678
438 38678 -8742 -8546 51158 7810 -31629 29876 24100 -22577 25480 34193 -33266 -3399 41773
451 41773 -12544 -12186 36463 -12427 -36528 30079 13033 -35350 11269 11718 -45257 -2081 33762
464 33762 -29875 -25705 21240 -24163 -31173 32606 -1375 -47773 8496 11875 -36084 8596 27058
477 27058 -37238 -16149 34627 -13441 -17276 36980 -3491 -34161 30034 23313 -25935 19211
489 19211 29756 -28778 3584 46049 -8652 -10042 37415 -5181 -22332 40987 18551 -31726
501 -31726 15249 22179 -28202 9512 36041 -28204 -20805 29899 -11087 -23712 27544 -5739
513e739l7224N6179k79m9925L8271J6573n8383K2667M6587m8694q091N0517l4216
526a1757k5927N8952q719m7023M0753J1282m9079L3601L6167n7195K60N2256l5475
539a904j6788N5820k3290m4332N0740J0416m9669L0750K3516n4649J3865M6989
551D1464m4430j3423N1289l0084l4668N5465k023n3461L5221K0037n3743K0216
563h140M0704m9766q708M8290l1526k2724N3400j6310m8191M5733J5546n2041
575c3733K4972L2900n2244L325N0888l4957k0710N0368j8244l6189M8693L778
587A8847m8854L4013K6019n3100J2940M6744m1508j4359N0243k3850l1694M9811
599B5252k153m6552L3600J7450m6987K1296L4934n0332m744N1006l0347k7097
$$ plain form
513 -5739 -42963 13216 12937 -36988 1283 17856 -40527 -17860 28727 -19967 -28058 22459 -11757
526 -11757 -37684 21268 12549 -34474 6279 17561 -31518 2083 38250 -18945 -18685 33571 -1904
539 -1904 -18692 37128 13838 -30494 20246 30662 -19007 11743 35259 -19390 -5525 41464
551 41464 -2966 -16389 34900 4816 -29852 25613 23590 -29871 5350 25387 -28356 -8140
563 -8140 32564 -17202 -25910 22380 -9146 -31870 21530 5220 -42971 2762 18308 -33733
575 -33733 -8761 24139 -28105 -24780 26108 -8849 -29559 20809 2565 -33624 15069 18847
587 18847 -30007 4006 30025 -23075 -10135 36609 -4899 -19258 30985 7135 -24559 25252
599 25252 23099 -23453 10147 27597 -19390 1906 36840 -13492 -18236 32770 2423 -24674
611b4674M8452j2109m3325M0845J3814m9135K1057K8032m5961O158M3473l8590
623a1963j8118N0775j9760l7117M7488N000n0737K9554K7848m6560J0003L9513
635B5926l9695r855M8610k3778k8099M7448o548m4355M1390J8859n2561J6992
647e666L9839m2648n471M5592k9375k3512M7909j1003l9255L8771P805m6376K8071
660D681K8468n1390L001M6885l4406k0485M6013j7015l5470M2248L602m4194K7655
673d07K0356m5113J3626L7292m2937r443M9836k4675l1258M5481j165m2418L2513
686A688J8064m3978J6633L1786l9768p06M2781l0494k0063M7800j1885l9532M0232
699A2558J2039m6920K2212L0256m1877J513L8461l1105j2887M3718k0781l2841
$$ plain form
611 -24674 23778 11669 -31656 9189 23003 -26132 -5075 22957 -23004 -16846 26627 -11963
623 -11963 -30081 20694 934 -36183 11305 16305 -34432 -4878 22970 -23590 -13587 25926
635 25926 -13769 -23624 24986 1208 -26891 20557 14009 -30346 11044 29903 -22658 -5666
647 -5666 34173 -8475 -13946 31646 2271 -21241 26668 15665 -23590 15181 22986 -23390 4681
660 4681 33149 -18241 -15240 31645 -2761 -23246 22767 5752 -29718 12530 16132 -28062 -407
673 -407 19949 -25164 -11538 25754 -17183 -26626 23210 -1465 -32723 12758 11593 -30825 1688
686 1688 19752 -24226 -7593 24193 -15575 -16281 26500 -3994 -24057 23743 11858 -27674 12558
699 12558 24597 -22323 -111 30145 -11732 -10219 28242 -2863 -15750 27968 7187 -25654
711b5654M3207K282m3231K9603K0667m9043J0869M2044l6465j4817M0348k1327
723a517k4074M3568o369m1698L2072J4883m2444K0754L0908m7243l404M8506k5396
736a454k4401M1654r712l5673L6928J1135m1221K1665K3183m1898Q945M1195l5762
749e416j6631M5535j6541l1969M1907M541m3975K4501K2313l8294J0626L1731
761B8328l7628o932M2839k3499k4795M2374o920m1112L3877J7712m3909J3347
773f318L1016l7876l975L9128k5084j7833L8355j4882l2362L9377Q650m3735K0757
786d782K4480m1008O943M0994l2051k0009L9515j1715k4485L7741l024m1039K9079
799F39K1801m0008J2319L1730l9648p239M6441j9660k7918L7257m513l5110L2898
$$ plain form
711 -25654 17553 19835 -23396 6207 26874 -22169 -11300 30744 -5721 -20538 19810 -1517
723 -1517 -25591 17977 11608 -30090 1982 16865 -25579 -4825 26083 -21160 -24564 23942 -1454
736 -1454 -25855 15799 6087 -29586 7342 18477 -22744 -1079 22104 -19794 -10849 30346 -5416
749 -5416 -22047 23488 6947 -25022 16885 21426 -22549 1952 24265 -14029 -3403 28328
761 28328 -9300 -16232 26607 3108 -21687 20687 13767 -27345 6532 24244 -19665 -6318
773 -6318 24698 -13178 -17153 21975 -3109 -20942 17413 2531 -29831 9546 18196 -25539 -4782
786 -4782 19698 -21310 -14367 26627 -5424 -25433 14082 2367 -22118 15623 12599 -28440 639
799 639 22440 -17568 -5249 26481 -13167 -20406 26035 6375 -21543 15714 11201 -23909 8989
812H989J4778m1176J4722K5383l7543M405M0425l1434k2975M2246q633l2415L5839
825A2611O740m4346K0119K7034l4829M185L1084l4015j0744M4055j6642k9468
837b4216L6716p09l9115K9424K1978m1337P618L1496l2566o354L9962k0201k3268
850b0572L5567o993l1634L4927J2323m4602J4334K9882l3905M7L7269k8459k1751
863b3567L9412n281k8352K9846J680l9231K5065K5493l8318K946L1988l1921j1105
876b1345M3688j4951l1397L1709J724l3372K8174J7080m1040P880L0157l0449
888a2142j707L8177k6437k6184M0535J7l3050K8209R236m0505J7470L1144l3230
901h467k572L1549k6769j3488M2011j1524l2900L1859O349l7370K3348K4396l9213
$$ plain form
812 8989 23767 -17409 -2687 22696 -14847 -10442 29983 -1451 -24426 17820 9187 -23228 12611
825 12611 19351 -24995 -4876 22158 -12671 -8486 22598 -11417 -22161 21894 5252 -24216
837 -24216 12500 11791 -27324 2100 24078 -17259 -9641 21855 -10711 -17065 22897 2696 -20572
850 -20572 14995 8002 -23632 11295 23618 -20984 -6650 23232 -10673 -10626 26643 -1816 -23567
863 -23567 15845 10564 -17788 12058 13738 -25493 -428 25065 -13253 -10307 21681 -10240 -21345
876 -21345 22343 7392 -24005 7704 9428 -23944 4230 21310 -19730 -11850 18307 -12142
888 -12142 -13849 24328 -2109 -28293 12242 12259 -20791 7418 16654 -23851 -6381 24763 -8467
901 -8467 -11039 20510 -6259 -19747 22264 10740 -22160 9699 16048 -21322 2026 26422 -12791
914a2791J809L2499k7251r324L8622j8246k8568L3510K123l2266K7087J3888m2311
927b1219J0076L3968k9223p348L3767k3371k1723L9667j437l3833K4470Q794l5083
940b2495J9707K7646l6956l472L4182k3484j4285L9123j0947l2751K9361Q144
952A3773l1739K1821J9185l9647M057L4250k4724j0259L4547j9851k6266L7616
964A2763M234l5038K1155J3561l6612J3659L1885l2453r497L3466j9975j7610
976b0462L8063o720l5570K7180J2522l5161J8136K4625l7298k848L5535k1197
988c195j4108L5685j4777l0516L4140R086l3896J8867J6901l7070Q050L6514k7389
1001a708j4500L3200j5644k1478L6915K3l6296K1773J6269l3587J3391K7460l3682
$$ plain form
914 -12791 -10982 21517 -5734 -15058 23564 5318 -23250 10260 12383 -19883 7204 21092 -21219
927 -21219 -11143 22825 -6398 -13746 20021 -3350 -25073 14594 13157 -20676 3794 12588 -22495
940 -22495 -2788 24858 -12098 -15570 18612 -4872 -19157 19966 9019 -23732 5629 13773
952 13773 -17966 3855 23040 -16607 -12550 21700 -3024 -13283 21264 1413 -24853 12763
964 12763 16997 -18041 3114 16675 -19937 -6278 25607 -6846 -16343 17123 -2852 -20462
976 -20462 17601 10881 -24689 2491 15013 -20148 -2012 22613 -14685 -17533 18002 -3195
988 -3195 -17303 18382 3605 -26911 7229 16315 -17581 1286 18187 -18883 -10833 25681 -1708
1001 -1708 -16208 16992 1348 -20130 16785 16808 -19488 2285 18554 -15033 -1642 25818 -7864
1014g864p600L5346j8007j8153L4763p758l3678K7119J3793l3114J4792K0392
1026B0031l5954J071L5978k1839j6853L1643j3054k5998L4393O977l7082J6608
1038d079J8486l1942Q532L1399l0208j2908L4858j3420k0883L3369j739l5202
1050b3737K4342J7132l2398J1593K5659l4083m931L6994j7187j8952L1794q650
1062G576k9835L1029J3072l5876J2212K1051l2029M331L4320k6178j8251L3860
1074A5282r655k4212L1190L011l7052J9265K0327l2381O890K8367l0049j0996
1086b0013L5967j3407k2457L1281l275l3342K6010J7371l3862Q453K4165l0550
1098a3659j764L6476j9588k1608L0744m387k6564K9586R075l6474J3944K3945
$$ plain form
1014 -7864 -15464 19882 1875 -16278 18485 10727 -22951 4168 17961 -15153 -361 20031
1026 20031 -15923 -14852 21126 -713 -17566 14077 1023 -24975 9418 16395 -20687 -4079
1038 -4079 14407 -17535 -9003 22396 -7812 -20720 14138 718 -20165 13204 11465 -23737
1050 -23737 605 17737 -14661 -3068 22591 -11492 -16423 20571 3384 -15568 16226 7576
1062 7576 -22259 8770 21842 -14034 -1822 19229 -12800 -8469 25851 -327 -18578 15282
1074 15282 5627 -18585 12605 15616 -21436 -2171 18156 -14225 -7335 21032 -9017 -20013
1086 -20013 15954 2547 -19910 11371 8096 -25246 764 18135 -15727 -7274 16891 -13659
1098 -13659 -15423 21053 1465 -20143 10601 6214 -20350 9236 18311 -18163 -4219 19726
1110A9726k9106J944L0326k5404j5241L4937q008k5545K8896K654l4418K0580
1122A341K0530l1919M026K6755k8001q465L5930j4868k3612K8963j832k9814K5752
1135D786J3913l6023Q496K5929k7881k508L2281k1879k0061L4235m208k8154K6604
1148E530P670l4665J6142K3715l0798R84L0708k5503j3256L5880r320k6089K8224
1161I222L173l2061K2014J9418l3696M174K7925k5849o933L4493j7299k4174L1782
1174A2189P34k9678K2891J2767l4653J0538K6358k8287m722L1021k0281j7979
1186a9102L2794n338k7703K5683P195l3773J6330K2923l0894q12K9269k2846j2471
1199a8745L3813j0313k6155K7140M273k9295K0600J6688l4027O178K9252k5277
$$ plain form
1110 19726 -9380 -7436 22890 -2514 -17755 17182 9174 -16371 12525 15179 -19239 1341
1122 1341 21871 -10048 -6022 20733 -7268 -15733 20197 5329 -18283 10680 8848 -20966 4786
1135 4786 18699 -17324 -8828 17101 -10780 -13288 18993 -2886 -22947 11288 7080 -21074 5530
1148 5530 13200 -21465 -5323 18392 -12406 -11422 19286 -6217 -19473 16407 7087 -19002 9222
1161 9222 12395 -19666 2348 21766 -11930 -7756 20169 -5680 -12613 21880 4581 -19593 12189
1174 12189 12923 -16755 6136 18903 -15750 -5212 21146 -7141 -11863 19158 -1123 -19102
1186 -19102 13692 8354 -19349 6334 13529 -20244 -3914 19009 -11885 -12697 16572 -6274 -18745
1199 -18745 15068 4755 -21400 5740 10013 -19282 1318 18006 -16021 -9843 19409 -5868
1211e868q638L2437j5317k1796L1339j66k9436K2685J2419l2573J1758K4646k8547
1224g057l161L0648k0446j6688L3530n901k9575K5792Q409l1424J5573K0661l1487
1237a1126K72K9176k2178j1633L1687j3063k5064L0762L562l2852J9090J7464
1249A6097l1822N992K7260k6082p842L1614j5339k0285L0105k137k8105K4111
1261C567J1703l3466J2131K5411k8527l798L0471j8716j5958L1489n599k6695
1273a7987K5208P583l0196J6349J9193l1330K626L0100k3087j3311L2445j0451
1285G142k4625K7551L867k9622J8222J4887l0586P240K5613k6302p028L0879j6397
1298H41k0482L1173j412l0149K1969J2955l0567R774K2888k7660j957K9350j9789
$$ plain form
1211 -5868 -14506 17931 2614 -19182 12157 11991 -17445 5240 17659 -14914 -3156 21490 -7057
1224 -7057 -10218 20430 -16 -16704 16826 10925 -18650 7142 15551 -15873 -300 20361 -11126
1237 -11126 -10854 18322 -3856 -15489 16198 3135 -21929 8833 12395 -20457 -1367 16097
1249 16097 -15725 -9733 17527 -8555 -16397 15217 -122 -20407 9698 7561 -20544 3567
1261 3567 15270 -18196 -6065 19346 -9181 -12979 17492 -1224 -17182 14307 8708 -17987
1273 -17987 7221 14804 -15392 957 20150 -11180 -8554 21546 -1541 -14852 17593 7142
1285 7142 -17483 10068 13935 -15687 2535 17422 -13164 -5924 19689 -6613 -13641 17238 841
1298 841 -19641 11532 10120 -20029 1940 14895 -15672 -5898 16990 -10670 -12627 16723 -3066
1311c066j5525L1612p188k6095K7103O673l2710J6401K1641k9686j61K8118k0742
1324c625j0888L0578j2275k2043K8107K029k9068K0780J4627l2682P639K7866
1336B1045k5839q915L0624j4597j9238K8747j403k7509K1680R890l0254J2614
1348c155K2305k9190k284L0170j9646j6266L1820o058k7523K4302P848k8084J3904
1361a857J7608k8914L154K7619k2871j0349L0860j2248k2802K8937L130l0449
1373a8182J7971J7207k9281M900K4545k3080n314K8239j6449j7677L0307k504
1385A0682k8300K3203J0255l1289J2541K3816k7828m863K8346j6906j3259K8797
1397A5195r089k4434K5885O209k9994J6626J7305l1479L481K9554k2079j2840
$$ plain form
1311 -3066 -18591 13021 5833 -20262 6841 13514 -19196 -2795 18846 -10840 -11001 17117 -3625
1324 -3625 -14513 16065 3790 -18253 9854 11883 -17185 3595 18222 -14460 -6821 21045
1336 21045 -4794 -13709 16915 2318 -16920 11827 10424 -17085 4595 14485 -15769 -3155
1348 -3155 19150 -10040 -12324 17846 -1800 -18066 13754 7696 -19827 4475 12323 -15761 -1857
1361 -1857 15751 -13163 -10009 17610 -5261 -15610 15250 3002 -19800 9137 12267 -18182
1373 -18182 -211 16996 -12285 -7385 17160 -5920 -11234 17005 556 -17121 13186 10682
1385 10682 -17618 5585 15840 -15449 -2908 20908 -6920 -11783 16563 -343 -13602 15195
1397 15195 6106 -18328 7557 13766 -16228 398 17703 -13776 -10295 19259 -2820 -15660
1409a5660K9481j0825k1537K6998K062k7855J8170J2623k9086R545K4720k7397
1421h761o801L1056j5067j9002K9811k717k8014K1471J1884k7746J0187J9802
1433A6103k6801J78K8603k0083j3840L0113p490k5197K5435P566k9908J4652J8588
1446A7919k7946J583K5720j9871r426K7908j3349j9726K8881J081k9830J8775
1458A719J4207k9271P526K5227k5386q218K8443j2624j5982K6181n420k5207K3161
1471D356J0121k9880J2592J9329k8502p44L0214j7953j5966K7456p027k1746K4790
1484G040N668k8974J4436J6234k6757N949K5438k5147j0273L1301j0569k0892
1496a6546K6175J108k8002J8337J5463k7742O879K1071k4321l588K8847j6573
$$ plain form
1409 -15660 13821 2996 -18541 8457 10519 -17336 834 13457 -15629 -6084 18636 -8761
1421 -8761 -15562 15494 427 -18575 11236 8519 -19495 1976 13860 -13886 -3699 16103
1433 16103 -10698 -10520 18083 -2000 -15840 14273 6783 -18414 7021 14587 -15321 -669 17919
1446 17919 -10027 -8444 17276 -2595 -12021 15887 2538 -17188 11693 12774 -17056 1719
1458 1719 15926 -13345 -5819 19408 -5978 -14196 14247 1623 -14359 11822 6402 -18805 4356
1471 4356 14477 -15403 -2811 16518 -11984 -12728 17486 -467 -16433 11023 3996 -17750 7040
1484 7040 12708 -16266 -1830 14404 -12353 -6404 19034 -6113 -16386 14915 4346 -16546
1496 -16546 9629 10737 -17265 1072 16535 -11207 -4328 16743 -7578 -11166 17681 1108
1508A108j6814K8554m137k6769K2870J1309k9387J0181J9024k5047p33K7371j8474
1521i44j3751K6584q213k0418K5763L550l0653J5465J8301k6832L712K4094k2585
1534e927j0398K9078r156j9045K3896j144k5923K0472J3504k7884P003K1519k4896
1547h901m143K9967j4301j8515K4706k516k2242K2628Q730k9694J0084J9858k3615
1560g954J194K5450k1524j3573K9886n510k2663K2849L345k7708J5833J7573k5989
1573h791K286K2460k2043p014K9089j2279k0222K5307o62k5845K0159J3557k8640
1586a2638N349K1478k1834k696K6497j7161j6875K6600k451k2181K2038O239k9657
1599a7292J2220K1421k4113j062K3880j9109j1367K8431o044k1896K1566K467
$$ plain form
1508 1108 -15706 12848 8711 -18058 4812 16121 -13266 -3085 15939 -9108 -9841 17530 -944
1521 -944 -14695 11889 3676 -16742 9021 12571 -18082 -2617 15684 -11148 -7436 16658 -5927
1534 -5927 -16325 12753 3597 -15448 8448 7304 -18619 1853 15357 -12527 -5524 15995 -8901
1547 -8901 -13044 16923 2622 -15893 8813 6297 -15945 6683 15413 -14281 -4197 15661 -7954
1560 -7954 -6760 18690 -2834 -16407 13479 7969 -14694 8155 11500 -16208 -375 17198 -8791
1573 -8791 -6505 15955 -6088 -13102 15987 3708 -16514 8793 8131 -17714 2445 16002 -12638
1586 -12638 -7289 14189 -7645 -10341 16156 -1005 -17880 8720 6269 -15912 6126 12365 -17292
1599 -17292 -5072 16349 -7764 -8826 15054 -4055 -15422 13009 6965 -14931 6635 9102
1611I102k4789J7183J6206k7077J849K2722k0200o553K8712j2571k0967K3366
1623F983J829k1996J8260R519k8662P853K2306k1516l541K4218j7496j5480K8651
1636A0928k508k3317J8446O318k6041J3361J9637k5258j579K2689j8084q578K8428
1649A4442r238k2941K1996M220k3513J7129J4080k8601K863K3944j7908o008K4862
1662A5327j4727j7919K6607J491k3339J7063Q407k7213J0379K2680k2439n639
1674i322K3047j5034j2245K7357m756k3461J8460O554k4116J4273J6972k6623
1686h894j525K3550j5611q376K5397j0893k2110K2759O239k2752J3710J0425k6458
1699a4539N836K4502j9183q083K2369j2773j4981K6902j12k5193J5445R533k3010
$$ plain form
1611 9102 -15687 1496 17702 -9375 -7526 15196 -5004 -11557 17155 4584 -16383 6983
1623 6983 8812 -13184 5076 14595 -14067 -6214 16092 -5424 -8965 15253 -2243 -17723 10928
1636 10928 8420 -14897 3549 9867 -16174 -2813 16824 -8434 -10013 12676 -5408 -13986 14442
1649 14442 5204 -17737 4259 8479 -15034 2095 16175 -12426 -9563 14381 -3527 -9535 15327
1662 15327 600 -17319 9288 10779 -12560 4503 12910 -14303 -3924 18756 -3683 -9322
1674 -9322 13725 -1309 -13554 13803 9047 -14414 4046 10600 -13516 757 17729 -8894
1686 -8894 -10419 13131 -2480 -10856 14541 3648 -18462 4297 10536 -12216 1494 11919 -14539
1699 -14539 -8703 15799 -3384 -11467 10902 -1871 -16852 10050 9938 -15255 190 9723 -13287
1712a3287J0734J9756k4221n122K4136j3002j0907K5259o698k3581J9675Q923
1724A1665k2441J2372J3881k6512J300K5721j5244j0324K2110j0897j8063K5455
1736I023M005k5196J2261J1367k3517P859K2394k1879q692K3060j0917j3113K5064
1749A1719l444k4711J6471J0886k1808R596J6736k5490l240K6363j2236j2058
1761a1216K2029q362k0386K2681Q954k4307Q746J3004k2490M407K4643j8158j2550
1774a3005K2248p258j5447K3706J654k6125J2338J3817k0899O688J8931k2384
1786e736p445K4913q824j3597K1214m193k3402J8685J2497k2795O327J4585k2640
1799a0411L73K5693j3808j4717K0123m982j7195K2038N651k6297Q788J5853k0168
$$ plain form
1712 -13287 -2553 17203 -7018 -12140 11996 -1006 -11913 13346 6648 -16933 2742 11665
1724 11665 -10776 1596 15477 -11035 -9735 15986 742 -9582 12528 1631 -16432 9023
1736 9023 13028 -12168 93 11460 -12057 -4198 18196 -3683 -12375 10685 -232 -13345 11719
1749 11719 8275 -16436 35 10921 -10887 -1291 15445 -10045 -13285 13078 842 -11216
1761 -11216 10813 2451 -17935 4746 13700 -10607 -1861 11143 -11347 -6940 17703 -455 -13005
1774 -13005 9243 1985 -13462 10244 11898 -14227 -1889 11928 -8971 -2283 16648 -5736
1786 -5736 -13181 11732 2908 -10689 10525 6332 -17070 1615 14112 -8683 -2356 12229 -10411
1799 -10411 -10038 15655 1847 -12870 7253 2271 -14924 7114 12765 -13532 -4744 11109 -9059
1812i059L725K1029j9469j1375K4372n699j5279K0486p89k4846J5417J5301k1489
1825g675M015J6731k1267m202K6758r647j6687J9296k449j9487K0005R842k5184
1838i951N204J6246j8698J156K2806j7179j4137K2922k786j7294J9514L356k5642
1851a4483J0912J6914j9346J407J8245j9134q271K4862n706j6641J7474n91k1343
1864a5701J7316J3668k3903J476J7618j7536k001K3686j2318j7451K0308J53j7151
1877a1836J7382O318k5417P877J8295j7692j345J9830j6063j2147K3997k026j7850
1890a0677J5798K373k2080J3911J5724k1304k75J7344j5869n475K4711q999j9374
1903a4192J8365K788j8227J5091R791k3989L449J9010j5910k743J9675j3851j4097
$$ plain form
1812 -9059 -5334 15695 -3774 -15149 9223 3524 -11755 8731 7942 -16904 -1487 13814 -7675
1825 -7675 -3660 13071 -8196 -12398 14360 4713 -11974 7322 4873 -14614 5391 15233 -9951
1838 -9951 -4747 11499 -7199 -6043 16763 -416 -14553 8369 5583 -11711 7803 11159 -14483
1851 -14483 -3571 13343 -6003 -4596 13649 -5485 -13756 11106 5400 -11241 6233 5642 -15701
1864 -15701 1615 15283 -8620 -7144 10474 -7062 -9063 14623 2305 -15146 5162 5315 -11836
1877 -11836 5546 11864 -13553 -5676 12619 -5073 -6418 13412 -2651 -14798 9199 7173 -10677
1890 -10677 5121 7494 -14586 -675 15049 -6255 -6530 10814 -5055 -10530 14181 5182 -14192
1903 -14192 4173 6961 -11266 3825 13616 -10373 -6924 12086 -3824 -6567 13108 -743 -14840
1916a4840K2815R6j9140J4940N773k2921R282J8196j8315l092J7825j4337q309
1929a2027K3548m903j9426J5809M103j9505J3354J3577k3124o27J9762j3124n931
1942h514K0711j0399j6721J9705L601j8440J2853P530k2124N906J9976j6566n645
1955h127J8989j1866j2329K1976M27j9865J2384O276j9163J0643J5648k0682l288
1968h977J9087j1415q330K1917o790k0203J7488P164j8636R536J0503k1340K765
1981g231J9945j4353p025J8565r980j4163K1265K194k0777J1417R559k0029N832
1994d781J8011j6926n843J7877r667r474K0628m114j9621J5207P841j9053Q929
2007i86J4311k0661k451K0813j0294r342J8121o597j5931J7962N149j9208R981
$$ plain form
1916 -14840 7975 8071 -11069 3871 9644 -13277 -3995 14201 -4114 -7206 10619 -3718 -12027
1929 -12027 11521 6618 -12808 3001 7104 -12401 953 14530 -8594 -9221 10541 -2583 -8514
1942 -8514 12197 1798 -14923 4782 8383 -10057 2796 10326 -11798 -5892 14084 -2482 -8127
1955 -8127 10862 -1004 -13333 8643 9070 -10795 1589 7865 -11298 -655 14993 -5689 -8977
1968 -8977 10110 -1305 -9635 12282 5492 -14711 2777 9941 -8695 841 11344 -9996 -7231
1981 -7231 12714 -1639 -8664 9901 -79 -14242 7023 9217 -11560 -143 9416 -10613 -4781
1994 -4781 13230 -3696 -9539 8338 -1329 -10803 9825 5711 -13910 1297 9138 -9915 -986
2007 -986 13325 -7336 -9787 11026 732 -8610 9511 2914 -13017 4945 10094 -9114 867
2020H67J0032k0579M303J9841j5432q346J8721p528j3400J9498J430k0137J0075
2033f55R403j6818O445J4975j9313m724K0924q799j1748J8604l422j8933J5423
2046A362R031j8381N410J2129j7449K52J9071j2495r700J8359n463j5030J8244
2059E340M471k1064R094J2413j7637K241J7601j4874p471J8466o436j1615J7392
2072G921q77j9295J3511J0378j9246M718J5453j7352m051K0048q190j2643J7214
2085G589k913j6274J5158O503j9032P164J2180j8324M95K0257j3474j1044J8274
2098F559l676j4304J5986L558j9961R142J1531j5817K988J4777j6529n260K0780
2111I774o981j3859J6469L77j7983J3181J0144j8105K918J3929j4428j953J8319
$$ plain form
2020 867 10899 -9680 -5377 14464 -968 -9314 9407 1879 -11521 7977 9407 -10730 -655
2033 -655 8748 -8070 -1625 13350 -5963 -10687 10237 1438 -10310 8294 4872 -14061 1362
2046 1362 10393 -7988 -2578 9551 -7898 -7646 11425 -1070 -10770 7589 2126 -12904 5340
2059 5340 9811 -11253 -2159 10254 -7383 -5142 12459 -2415 -9886 8580 2144 -9471 7921
2072 7921 7044 -12251 1260 11638 -7608 -2890 12563 -4789 -8840 11208 3018 -9625 7589
2085 7589 4676 -11598 3560 10063 -8969 -1805 10375 -7949 -7454 12803 -671 -11715 6559
2098 6559 2883 -11421 4565 8123 -11838 -2696 8835 -6982 -3994 10783 -5746 -11006 9774
2111 9774 2793 -11066 5403 5780 -12203 978 11122 -6983 -4065 9864 -4564 -6517 11802
2124A1802j0969j0995J7960k145j5762J4949N893j9747O521J4404j6230n14J6295
2137A1462j1796r169J8250m739j3343J5324J496j8243J0525J1557j8492J573J6139
2150A0544j4119o456J8590o774j2559J5153j72j5946J2798Q098j8615M941J4244
2163I727j5999j941J8860j0625j2404J8151j159j4852J3585M958j8362P619J2965
2176A0523j5499L80J5279j3085p494K0048n241j5045J4789L701j7475J0003J0556
2189A1440j7212J632J4803j2830m594J7339q336j2445J6721jj6606J2640P274
2202I825j8639M438J5057j5100k724J5805r713r521J6931k605j4842J3645M019
2215F576j7067Q135J2550j7102l54J6780j1518q148J7486m160j3489J4364K369
$$ plain form
2124 11802 833 -10162 7798 5653 -10109 4840 10733 -9014 -2493 11911 -4319 -4833 11462
2137 11462 -334 -9503 8747 4008 -9335 5989 7485 -10758 -233 11324 -7168 -5595 10544
2150 10544 -3575 -10031 8559 1785 -10774 4379 4207 -11739 1059 9157 -9458 -4517 9727
2163 9727 -6272 -8213 10647 22 -12382 5769 4610 -10242 3343 8301 -10061 -2442 10523
2176 10523 -4976 -4596 10683 -2402 -9896 10152 4911 -10134 4655 8356 -9119 884 11440
2189 11440 -5772 -4140 10663 -2167 -6761 10578 2242 -10203 6518 6517 -10089 2551 9825
2202 9825 -8814 -4376 10681 -4419 -7143 8662 -1051 -10572 6359 3754 -11088 2557 6576
2215 6576 -10491 -2356 10194 -6908 -7262 9518 -2000 -10148 7338 3178 -10311 4053 6422
2228F422j6096J0226R381j6860K663J4849j3611m187J7763p873j2677J6018J019
2241G037j5834J1373O572j7005N437J3525j4588k742J6346j0142r383J7142k830
2254D908j5503J3567N031j7407P408J1621j6023k32J5446j1618o806J7067n396
2267B063j3381J4967J986j6026R752R524j7141K699J5171j2854m822J5972p059
2280H51j0694J5563l5j5367J1487P248j6904N528J3187j4787j923J6313r249r634
2294h416J6380k344j4159J2333M426j6064P696J1249j6186j1J5715j1719p062
2307h162J6808n679j3224J4294K582j6069R399Q603j6233K939J3864j3354m093
2320h325J6386p952j1207J5831j82j5384J1403O949j6639N811J2870j4243k423
$$ plain form
2228 6422 -9674 552 9933 -6927 -4264 10585 -3026 -7213 10550 2677 -10000 6018 7037
2241 7037 -8797 2576 9148 -7857 -2420 11105 -3483 -6225 10121 -21 -9404 7738 4908
2254 4908 -10595 2972 8003 -9404 -1996 9625 -6398 -6630 8816 -2802 -9608 7459 2063
2267 2063 -11318 3649 5635 -10391 -639 8885 -8256 -5557 9614 -3240 -8062 7910 851
2280 851 -9843 5720 5685 -9682 1805 9053 -7851 -2323 10864 -3923 -5846 10467 1218 -8416
2294 -8416 7964 5620 -8539 3794 8220 -7844 -148 11101 -5085 -5096 10619 -1100 -8162
2307 -8162 8646 2967 -10257 4037 6619 -9450 -51 8552 -7681 -4742 9122 -4232 -8325
2320 -8325 8061 109 -11098 4733 4551 -10833 570 7519 -9120 -3309 9561 -4682 -7105
2333g105J5744r517p934J5825l103j3790J3374M304j6424Q112J0852j5562M14
2346d810J5153j1191o509J6580n678j2519J4384J830j5574R855Q588j6637K930
2359c598J4057j2603m723J5627p820j0730J5388M2j5117J0536O371j5888N492
2372b966J2125j4415k182J5413r308q572J5967l212j3527J2636M516j5960P947
2385a538J0528j5405P06J4344j0664n918J5874n389j2387J4282K393j4996R397
2398A227Q164j5817L577J3540j2762m560J5652p467r870J5010o48j4988J1130
2411B188O605j6321N686J2315j4596k045J5070r411q068J5687l560j3817J2820
2424B553M031j5285P876R430j5658P35J5300j1244o328J5387n676j1678J4579
$$ plain form
2333 -7105 8639 -878 -8812 7013 3910 -9880 3494 7798 -8626 -514 10338 -5224 -4810
2346 -4810 10343 -848 -7357 9223 3545 -8974 5410 7240 -8334 1521 10109 -6528 -3598
2359 -3598 10459 -2144 -6867 8760 940 -9790 5598 5640 -9477 1059 7430 -8458 -2966
2372 -2966 9159 -5256 -7438 7975 -1333 -9905 6062 2850 -10677 1959 6475 -9485 -1538
2385 -1538 8990 -6415 -5709 8635 -2029 -7947 7927 2538 -9849 4433 6826 -8170 1227
2398 1227 9391 -6426 -2849 10691 -2071 -6631 9021 1554 -8316 6694 6046 -8942 2188
2411 2188 8793 -7528 -1842 10473 -4123 -6168 8902 -509 -8577 7110 3550 -10267 2553
2424 2553 6584 -8701 -825 8605 -7053 -6318 8982 -2262 -8590 6797 1121 -10557 4022
2437D022J855j5158R376P813j5352L674J3328j2825m064J5413p155r788J5038
2450F177p49j4472J0979O058j5187N798J1544j4209k174J5472q646q068J4824
2463G347l568j3616J3425M196j5409P049R351j4537J023J4709j1380o983J5840
2476G447o002j1034J4262J387j5629R123P892j4769L928J2700j3516m027J5510
2489G272o810r266J4892j885j4437J1393O623j4818N589J0181j4019p62J5403
2502I356r228q222J4897l681j2374J3573L557j5672P169R224j4282J825J4390
2515A0532j2007o528J5510n230j0752J4327L77j5706R797P901j4280L602J1718
2528I261j3627l213J5891o772r991J3884k222j3392J1976O563j6058M758J0843
$$ plain form
2437 4022 5877 -9281 95 7908 -7444 -3770 9558 -3267 -7331 8082 927 -8861 6177
2450 6177 5428 -9044 1935 7993 -7194 -1396 10148 -4061 -6235 9237 591 -7477 7347
2463 7347 3779 -9837 3588 7784 -7625 -576 8775 -5762 -4739 9970 -1410 -8393 7447
2476 7447 1445 -9589 4673 6060 -9569 -446 7446 -7323 -3395 9305 -4211 -8238 7272
2489 7272 462 -8804 6088 4203 -10234 1159 7782 -7036 -1447 8734 -5285 -6047 9356
2502 9356 128 -8094 6803 3122 -9252 4321 7878 -7794 -625 8599 -5683 -3858 10532
2515 10532 -1475 -8003 7507 2277 -8475 5852 6229 -9477 320 8221 -6059 -2457 9261
2528 9261 -4366 -7579 8312 1540 -8451 5433 3211 -10181 1795 8358 -7700 -2942 7901
2541G901j3419m50J5316r895q408J4386k932j1344J2944K932j5948P351R990j3616
2555e192J496J3363j2165o027J6085m592j0926J2766q1j3986J0620Q354j5344
2568e629K344J1857j2572k264J5945q189j0235J3724q00j2756J1707M890j5639
2581g617M753J1075j2547l8J3607j0930p330J5253k651j1976J2473K018j5586
2594i496Q390J0584j4200O78J2046j1359m117J5960n908j1501J2982N94j3928
2607i275J1590O931j6528K856J2851j1995j859J4459q577r720J4188q74j1808
2620g761J1368L484j6027O400J2150j3210j186J3267j0768o596J6188k885j2964
2633h540J1126K264j3211R196Q588j5254R42J3080j0755l817J5272p106j1843
$$ plain form
2541 7901 -5518 -5968 9348 -547 -8955 5431 2499 -8845 4099 7031 -8917 -1566 8424 -5192
2555 -5192 -3696 9667 -2498 -8525 7560 2968 -7958 4808 4727 -9259 1361 9715 -5629
2568 -5629 -3285 8572 -4000 -6264 9681 1492 -8743 4981 4181 -8575 3132 8022 -7617
2581 -7617 -2864 8211 -4336 -4374 9233 -1697 -9027 6226 3575 -8401 4072 6090 -9496
2594 -9496 -1106 9478 -4722 -4044 8002 -3357 -7474 8486 2578 -8923 4059 4653 -9275
2607 -9275 2315 9246 -7282 -4426 8425 -3570 -5429 9030 453 -9267 4921 4047 -7761
2620 -7761 3607 7091 -8936 -2536 9614 -3596 -4782 8485 -2283 -8879 7309 4424 -8540
2633 -8540 2586 4850 -8361 835 9423 -5831 -4889 8191 -2564 -6381 8891 1785 -10058
2646a0058J3839K183j3325R321N342j4748M279J2119j1636k616J3686r405q041
2659i060J5722j520j3625J0882M046j4971P361J1095j3904j673J2957r110n562
2672g362J5458n457j2470J2774K637j3769R152P973j5688J082J4213j0131m528
2685f116J3957p166j0115J4317N52j2939R275N172j5024N228J3399j3152m020
2698f632J4033p639p644J4997k020j4056J0427M906j2832P059R015j5646O5J4434
2712H467q810o237J4158n235j2593J3303L957j3970O261P702j4144K845J3505
2725I209j1177m909J3352o842q818J4995m3j4969Q862P275j4055N098J1407j3320
2739c935l329J4349p385o934J4196l905j2727J2289M948j4265O224R464j4477
$$ plain form
2646 -10058 3781 5964 -7361 1960 7302 -7446 -3167 8952 -2684 -5300 8386 -1019 -9060
2659 -9060 6662 5142 -8483 2399 6445 -8526 -1165 9930 -3974 -5647 7310 -1800 -7362
2672 -7362 8096 2639 -9831 2943 5580 -8189 963 8936 -6752 -5670 8543 -1588 -6116
2685 -6116 7841 675 -9440 4877 5429 -7510 1765 6937 -8087 -2859 10540 -2612 -6632
2698 -6632 7401 -238 -7882 7115 5095 -8961 1466 6372 -6460 599 9614 -6032 -5967 8467
2712 8467 -343 -6580 7578 2343 -10250 3053 7010 -6960 -699 7003 -7141 -4296 9209
2725 9209 -1968 -6877 6475 -367 -9185 5810 5767 -9202 -340 6935 -7120 -2022 9385 -3935
2739 -3935 -7264 7085 -300 -7234 6962 3057 -9670 2619 7567 -6698 -474 8990 -5487
2752e487N2J4844q986o533J2849n013j0108J3340K222j4399P555O994j4034M022
2766b682J3789j3104n754J4424n723q504J3405j141j4504J0014O522j3112M674
2779a696R584j3834j223J5596q378p919J3182k716j2645J2257N174j4890N234
2792b274Q937j2486J743J3483j0835o381J4252m424j0022J3521J163j5601Q536
2805c88R089j3345K193J1861j2188l585J4712o242r059J3065k016j3431J2032
2818B698N766j4740M147J0554j3097j175J4451q079q470J3004k709j0994J2191
2831C547K627j4811O358R507j3503J854J3402j1687o665J4968l238j0606J2297
2844D050L90j4062R362Q084j3560K843J0893j2235k276J5476p261j0088J3501
$$ plain form
2752 -5487 -5435 9409 423 -6110 6739 1726 -8382 4958 7180 -7219 336 7330 -6704 -2682
2766 -2682 11107 -1997 -7751 6673 950 -7554 5851 4710 -9794 220 6742 -6370 -1696
2779 -1696 7888 -5946 -7169 8427 49 -7870 5312 2596 -10049 2208 7382 -7508 -2274
2792 -2274 6663 -5823 -4080 9403 -1432 -7813 6439 2015 -8007 5514 6677 -8924 -388
2805 -388 8701 -4644 -2451 9410 -2778 -6363 8349 2107 -6952 6113 4097 -9334 2698
2818 2698 8464 -6276 -2129 8425 -4672 -5847 8604 525 -7945 5059 2350 -8644 3547
2831 3547 6174 -8637 -2279 7228 -6275 -4421 8981 -2706 -9371 5597 2359 -8247 4050
2844 4050 4440 -9622 -260 7824 -5736 -2893 8000 -4235 -6511 8965 1704 -8384 5117
2857E117p79j2327J1115N423j5023M220J0533j1623k17J3249j0100p509J4659
2870F738k649j1527J1504K663j4954P232J0023j3084J64J1561j0553m540J4556
2883G134n060j0823J2194J031j3774R673P281j4364K114J2059j1603l004J4889
2896G747p539r175J3059r20j1629J0667M397j4426N407J0753j2505n36J3401r538
2910h37p671J5275k433j1538J0818K741j3693P845Q807j4109J352J2264j0604
2923a783m315J4467n919j1053J2773J306j3406R475O287j4250K637J1555j0798
2936c024k742J3154q014q670J4090r07j2760J0104M648j4188N729J0631j2593
2949d542j529J2955q472o453J4201l662j0944J1201K727j3334P946Q171j3680
$$ plain form
2857 5117 4338 -7989 3126 8549 -6474 -2254 8279 -3344 -3561 9688 -412 -7921 6738
2870 6738 4089 -7438 4066 6729 -8225 -993 9030 -4054 -3890 7671 -2882 -7422 7134
2883 7134 2074 -8749 3445 4476 -9298 375 7656 -6708 -4594 7465 -4138 -7142 7747
2896 7747 208 -8967 4092 3172 -8457 2210 6607 -7819 -2412 8341 -4164 -4700 8701 -837
2910 -837 -8508 6767 4334 -7204 3614 6355 -7338 507 9314 -4795 -3443 8821 -1783
2923 -1783 -6098 8369 2450 -8603 4170 5476 -7930 1545 7832 -6418 -3781 7774 -3024
2936 -3024 -5766 7388 -626 -9296 4794 3887 -8873 1231 5879 -8309 -2580 8051 -4542
2949 -4542 -6071 6884 -1588 -8041 6160 2498 -8446 2755 5482 -7852 94 8265 -5415
2962e415J359J2635r767m746J3977n557j0065J2645Q87j2682Q695N964j3993L889
2976b174J1896j1838l216J3336p493q283J3929j521j2573R969M537j3834N953
2989a312R293j2690r47J2945r043o085J3814l856j1483J1588K824j3076P134P860
3003F966j3132J342J2563j0388m124J3208n954r490J3314O72j2970Q758O454j3444
3017f225L800J1309j1551k879J3445p280p469J3067j784j1800J0201M551j3365
3030e980N384R421j2518q53J2951q797o133J3067l492j1373J1428L132j3454O807
3044d10P736j3077J972J1728j0366m774J3145n152r386J2171O14j2566Q437O378
3058F450j3333L767J0746j1296k382J3147p065p815J3084j697j1984J0077M608
$$ plain form
2962 -5415 -4056 8579 -1188 -5934 8043 2486 -7579 5066 5953 -6729 1966 7930 -6063 -2174
2976 -2174 9722 -2116 -5332 8004 511 -7772 6157 4636 -7937 2032 6569 -7265 -1312
2989 -1312 7981 -4709 -5656 7289 -1754 -7839 5975 2119 -9364 2224 5048 -8028 -894 6966
3003 6966 -6166 -4824 7739 -2649 -6773 6435 481 -9009 4305 4977 -7993 765 7219 -6225
3017 -6225 -2425 8884 -2667 -5546 7899 619 -6850 6217 4433 -7367 2834 7385 -5980
3030 -5980 -596 8825 -3693 -4546 8405 -392 -6525 6542 3050 -8323 3105 6237 -7217 -410
3044 -410 7326 -5751 -3779 7949 -2417 -7191 5954 802 -8584 3587 4201 -8365 72 6450
3058 6450 -6883 -3116 7630 -3666 -6048 7099 34 -7781 5303 3606 -8378 1699 6307
3071F307j2442N093R218j2591O6J2533q342o350J3140l732j0368J1118K624j3300
3085g026P084Q038j3190J949J1693j0319m515J3292n511r240J2614o47j2573R220
3099H69N660j3230L950J0232j1357k376J3147p137p605J2563j922j1271J0406
3112A929L951j3155N848Q779j2046lJ2303q815n545J3135m144j0214J1240K255
3126E518j2315O959P398j2700K166J1393j0412l394J2649n455q933J2347n39j2192
3140g510Q872N731j2705L948R545j0940k063J2565p607p082J2394j975j1150J0196
3154B219L674j2805N636Q294j2159O50J1622q935n225J2651m193r989J1698J966
3168E104j2899P614O909j2373K382J1041j0541l235J2706n905q188J1854m75j1408
$$ plain form
3071 6307 -6135 -1042 8176 -4415 -4349 8184 -158 -6508 6632 2900 -7468 3650 6274 -7026
3085 -7026 58 8096 -5094 -3145 8548 -1771 -6286 7006 1495 -7745 4869 4222 -8351 869
3099 869 6529 -6701 -2751 7481 -3876 -6252 6895 -242 -7847 4716 2794 -8477 1929
3112 1929 5880 -7275 -1427 7352 -4694 -4697 7606 -1209 -6754 6381 2237 -7977 3263 5518
3126 5518 -6797 162 7560 -5140 -2974 8419 -1993 -5387 7262 1807 -7126 5221 4682 -7510
3140 -7510 1362 7093 -5612 -1664 7881 -3059 -5122 7443 -164 -7246 5148 3173 -7977 2219
3154 2219 5893 -6912 -1276 7018 -5141 -4491 7131 -1804 -7029 5622 1429 -8560 3138 5104
3168 5104 -7795 -181 6728 -5645 -3263 7778 -2763 -5998 6708 803 -7385 4469 3994 -7414
3182g414Q967M862j2109M115R539j1329j162J1997p183o874J2476k656j0789J0469
3196B909L083j1988N456Q089j2172Q37J1629q940n451J2642m494r080J1271J111
3210D902j2297P676O488j2370K495J0427j0018l199J2000n656p712J1830q77j1612
3224g923R208M994j2604M390R366j1589p67J1652o709o893J2089k714r861J0278
3238B917L134j2547N732P956j1500N80J1526r438m422J2408m470q785J0705J033
3252D829j1624P273O292j2006L038R676j0411k699J2462n784p830J1176q24j1084
3266g516Q869N372j2588L987Q708j0517q35J1812q056o106J2026k673r841R920
3280B562K958j2451N987P497j0956P94J0481q552m394J1843m141q702J1049K56
$$ plain form
3182 -7414 1553 6415 -5694 -1579 7960 -3369 -4531 7466 283 -6591 5885 3229 -7560 2909
3196 2909 5992 -5996 -540 7549 -4623 -3786 7843 -1097 -6548 6094 1600 -7480 3791 4902
3210 4902 -7395 281 6769 -5601 -3106 7321 -2697 -5896 6104 448 -7264 4566 3689 -7923
3224 -7923 1285 6279 -6325 -1935 7431 -4158 -4925 6727 18 -6875 5214 2500 -7361 2917
3238 2917 6051 -6496 -764 7192 -4308 -3728 7798 -1640 -6062 6346 1876 -6909 3796 4829
3252 4829 -6795 478 6770 -5236 -2198 7478 -2933 -5632 6830 1046 -6784 4392 3568 -7516
3266 -7516 1353 6725 -5863 -1876 6832 -3685 -4520 7292 -764 -6870 5156 2483 -7358 2562
3280 2562 5520 -6931 -944 6553 -4403 -3609 6872 -1680 -6074 5769 1628 -7074 3975 4231
3294D231j1880Q263O172j1726K049J0042j0090k721J2546n676p908J0565n94r784
3308f511Q832L826j2249M586Q515j0525m11J1424p917o129J1471j961r326Q963
3322B588K306j1453N957P621j1108Q29J0208q844l955J2159m732q683J0362O40
3336C895j0908P525N877j1530K404R144r205j805J0903o272p177J1708j187j0597
3350g225R355L876j2420M525Q585r893j212J1093p672n201J1290k448q908Q720
3364B465J982j1020O777O971j1399N34J0380q191l989J1746m502q710R903J229
3378D176j0236P369M522j1295K694R894r591k447J1170o042p198J1161l25j0212
3392f360P539L929j1013M375Q044j0173o32J0097o817m970J1317k645j0062R085
$$ plain form
3294 4231 -7649 614 6786 -4940 -2891 7151 -2939 -5660 6886 1210 -6698 3867 3273 -6511
3308 -6511 2321 6147 -6102 -1516 6999 -3526 -3937 7487 -430 -6559 4912 2951 -6375 2588
3322 2588 4894 -6559 -602 7019 -4089 -3260 6948 -1896 -5851 6308 1576 -7107 3255 3895
3336 3895 -7013 512 6389 -5141 -2737 6407 -2798 -4603 6300 28 -7149 4559 3372 -7225
3350 -7225 2130 6006 -6414 -1889 6696 -3197 -4409 6684 -988 -6189 5101 2653 -6255 2465
3364 2465 4447 -6573 204 7175 -4224 -3690 6690 -1501 -5490 6256 1754 -6956 2947 4176
3378 4176 -6060 1309 5831 -5464 -2770 7124 -2467 -4914 6256 214 -6984 4177 3852 -6360
3392 -6360 1179 5108 -5905 -1530 6514 -3659 -4291 5806 -1011 -5981 5336 2691 -7371 1714
3406A714L174j0756N611O649j0415P84R569q031l572J1101m677p576J0169O66
3420D410j0246O881N089j1262K672R883r257j974R639n548o495J1026r35j0153
3434f270Q222K920j0679N323Q038j1316p17J0724o609m791J0358l419q623R127
3448B288K059r976N994N151j0823J682J0384q361l975J0793m876p125J0468L69
3462D052j0267O464M895j0265L583Q444r440k718J0889n395n751J0545j830j0130
3476f924Q420M054j0198L755P195r715l66J0266o923m074R977l648q264R546J879
3491D980j0496N489O102j0510J592R827q102m102R911m300o371J0144l30j0291
3505f457O787M767r955K994Q479r890k176J0746m981n636R280j856r078Q379L770
$$ plain form
3406 1714 4888 -5868 -257 6392 -4023 -3239 6330 -1701 -5273 5828 1151 -6425 3744 4410
3420 4410 -5836 1045 6134 -5128 -2456 7427 -1830 -3804 5835 287 -6208 4818 3883 -6270
3434 -6270 1952 4872 -5807 -484 7554 -3762 -4479 6245 -364 -5155 5203 1784 -6839 2288
3448 2288 4347 -5629 365 5516 -5307 -3625 6759 -1602 -5577 5216 340 -6785 3683 4052
3462 4052 -6215 249 5144 -5121 -1538 6906 -2534 -5252 5637 242 -5509 5036 3206 -6924
3476 -6924 1496 5550 -4648 -893 6302 -3413 -3779 6487 -436 -4510 5467 1819 -6445 3101 4980
3491 4980 -5516 -27 6075 -4435 -2843 6984 -1118 -5220 4691 391 -5980 4164 3834 -6457
3505 -6457 330 5097 -4858 -1864 6615 -3275 -5451 5295 314 -5322 3958 2102 -6976 1403 5173
3520E173j0000L973O304r718R64R930p185m945J0018k832p733R143J766j0076
3534e218N034N774r379J983Q586q665l109J0520m037o863R456o46r828P150M891
3549E649r833K103Q075q878j642J0360n930n448R571k499q064Q267L330j0426
3563e365L705O963r179K50R702p085m731R522k498o792Q513P37j0334O273O001
3578E682r484J661Q252q517k635J0631m092o506Q553k35q856O995M407j0366L294
3593a216P016q651l31R967o310o130R644j320q048P953K288j0344M419O871q756
3608b948M24Q374p697l800J0746l302p525Q293Q36r310O013N663j0045J353P910
3623D985p318k582R824m280o713R082n71q255P211L768j0081K867P769p983r92
$$ plain form
3520 5173 -4827 -854 5450 -4268 -3304 6626 -559 -5504 4514 1682 -6051 3092 4858 -5218
3534 -5218 -184 5590 -3789 -1806 6780 -1885 -4994 5526 1489 -5374 4082 3436 -6392 758 5649
3549 5649 -4184 -2081 5994 -2884 -4526 5834 -96 -5544 4027 1528 -6536 1731 5061 -5365
3563 -5365 -1660 5303 -3876 -3626 6076 -1009 -5740 3782 1284 -5508 3005 3742 -6592 -319 5682
3578 5682 -3802 -2141 6111 -2406 -5041 5590 1498 -5008 3545 3310 -5546 1449 5856 -4510 -1216
3593 -1216 5800 -2851 -3182 6785 475 -5655 3989 2669 -5379 2574 4862 -5482 -1063 5808 -2948
3608 -2948 -2524 5850 -1847 -5647 5099 1797 -5728 2565 3401 -5909 104 5767 -4278 -2925 4985
3623 4985 -2333 -4915 4909 629 -6084 2998 2427 -5828 1383 5151 -4930 -2063 5706 -2277 -3269
3638c269R017o178n407J0028j415p639P285J866r314M808O683r252J58Q803p317
3653a143l512R996l230p239P317J564r134O248M904r753J256Q052p441k020R471
3668E336n195o388R025J6q490O448L507r546L214P634q200j322Q800n754m577
3683e492R603j918q141P200K505q911M918O096r355L93Q767o641l149Q962l416
3698A421o997Q461J097r039O089M397r686K103Q305p133k485Q497m624n589R272
3713D089n96q470O001L485r130L588P106q616j235Q533n229m437Q930k264p856
3728f101P295K531q763M409N570r054N14Q722o335l551R286l603p084Q523J301
3743C660q688N230M463q715K178P953p878k319Q984m512n449R198p98q596O607
$$ plain form
3638 -3269 5748 -430 -5837 4191 2776 -4863 2422 4288 -5026 -218 6465 -2787 -2629 6174 -1143
3653 -1143 -4655 5341 2111 -5128 2189 3753 -5381 867 5771 -3982 -2726 5326 -2115 -4135 5336
3668 5336 141 -6247 2778 2794 -5696 752 4259 -5287 -2073 5561 -2639 -3961 4839 -915 -5492
3683 -5492 4111 2193 -5948 1252 3757 -5154 -236 5860 -3495 -3102 5665 -976 -4125 4837 1421
3698 1421 -5576 2885 3982 -5057 1032 5429 -4257 -2154 6151 -982 -3467 5030 406 -5183 4089
3713 4089 3493 -4977 1024 4509 -4621 -1033 6073 -2543 -3778 4755 -474 -4911 4019 1755 -6101
3728 -6101 1194 3725 -5038 -629 4941 -4113 -3599 5123 -1212 -4763 4523 920 -6164 2359 3660
3743 3660 -5028 202 4665 -4050 -1872 6081 -1797 -4116 4868 356 -5093 4105 3307 -5289 1318
3758A318L879r267L350O458q271p51Q781n401m486Q833k457p420P683K123q855
3773d483M350N284r028J240P985o634l468R090l270o831Q697L10r084N676M432
3788D266q755K709O958p549j981Q905m282n508Q395n63q287O634L449q768L421
3803i56O539q557K4Q145n142m411Q610j962p574P610K191q994L902N553q024R15
3819b131P541o464l211Q755l138o306P971J27q340N746M365q739J865P038p235
3834b156k004Q910m317n263Q180j453p581O660L399q778L106O052p731m41Q282
3849D865n649m367Q669j535p197P314J421q790M841N387q501J307P570o827k822
3864d314Q960l190o322P950K99q030N434M396q898K242O819p155j525Q368m599
$$ plain form
3758 1318 5197 -4070 -720 5738 -2533 -3284 5497 96 -4390 4443 1986 -5434 2249 4372 -4483
3773 -4483 -133 5151 -3877 -2637 5348 -1286 -4754 4336 1066 -5765 2932 3242 -5842 -166 4266
3788 4266 -4489 -1780 5178 -2371 -4352 4553 271 -5237 3158 2595 -5692 942 4391 -4377 -956
3803 -956 5583 -2974 -2950 5195 53 -4358 4252 2290 -5284 2326 4517 -4477 -575 4978 -3046 -2131
3819 -2131 5410 -1054 -4265 4490 1352 -4954 3017 3144 -5196 550 4915 -3824 -1959 5079 -2156
3834 -2156 -4160 4750 433 -4830 3350 1897 -5684 976 4375 -4403 -1297 4755 -2976 -3417 4865
3849 4865 -784 -5151 3518 1983 -5214 2100 3521 -5269 -428 4959 -3542 -2235 5335 -1492 -4314
3864 -4314 4646 1456 -4866 3084 3383 -4647 787 5183 -3715 -1473 5346 -1809 -3334 5034 435
3879D35n139Q273q95p641O514K756q785L229O291p526n00P983n337m133Q115k086
3895A554p350P712J451q457M340N539q157N19P729o703k650Q694l192o339Q059
3910B749L69q523N821M603r115K332O985p503j068Q188m666m832Q072o96p790
3925e074O746K597q389L587N753p680k6P789n857l620Q411k509o893P423J251
3940C509q370M803M857q094J052O991o439k112Q333l527n981P484k3p463N634
3955F54L550q298K149O688p236j292Q165m464m786Q137j310p015O478K189q107
3970d498L633N821q001J14P873n278m091Q216k063o767P579J145q125M538M816
3985D912p986J321P363o869k464Q284l542n657P442K66p927N974L344q624K715
$$ plain form
3879 435 -4704 3569 2674 -4967 1547 4303 -4482 -1253 5038 -2488 -2988 4995 -342 -4475 3640 1554
3895 1554 -5796 1916 3367 -5090 -750 4789 -3368 -2849 4880 -1823 -4473 4221 1029 -5310 2749
3910 2749 3118 -5405 416 5019 -4096 -1764 5221 -2282 -3350 4838 172 -4660 3412 2716 -5074
3925 -5074 1672 4269 -4120 -533 5220 -2460 -2486 5303 -554 -4174 4237 1728 -5165 2258 3509
3940 3509 -4861 -58 4799 -3295 -2243 4748 -1691 -3803 4530 1003 -4978 2506 2483 -4980 654
3955 654 4204 -4094 -1945 4743 -2493 -3785 4380 -84 -4870 3267 1957 -5058 1420 3609 -4498
3970 -4498 -865 4956 -3045 -2931 4942 -336 -4427 3789 1726 -5041 2538 3683 -4442 96 4912
3985 4912 -3074 -1753 5610 -1259 -3723 4561 1019 -4638 2804 3070 -4857 1117 4461 -4163 -1448
4000a448O288p172r02Q071m976m656P842j234o903O213K365q142L849N382p525
4015b948p4P556n651l487Q400k790o293P464J348q389M700M884p978R76P154o289
$$ plain form
4000 -1448 4840 -2332 -3234 4837 -139 -4795 3047 1813 -5090 1123 3488 -4654 -805 4577 -2948
4015 -2948 -3022 4534 -1117 -4604 3796 1006 -5287 2177 3525 -4864 -164 4720 -3258 -2282 4872 -1417
$$ [...]
8191D59
##END NTUPLES=NMR FID
##END=
