##TITLE=1H_Pr 5-2-D
 D2O, 8 sc, 
 7.6.2019
##JCAMPDX= 6.0         $$ Bruker NMR JCAMP-DX V2.0
##DATA TYPE= NMR FID
##DATA CLASS= NTUPLES
##ORIGIN= UXNMR, Bruker Analytische Messtechnik GmbH
##OWNER= root
$$ XWIN-NMR		Version 3.5
$$ Fri Jun  7 15:23:45 2019 Russian Standard Time (UT+4h)  she@DPX200
##.OBSERVE FREQUENCY= 200.13155
##.OBSERVE NUCLEUS= ^1H
##.DELAY= (6, 6)
##.ACQUISITION MODE= SIMULTANEOUS
##.ACQUISITION SCHEME= undefined
##.AVERAGES= 8
##.DIGITISER RES= 18
##SPECTROMETER/DATA SYSTEM= spect
##.PULSE SEQUENCE= zg30
##.SOLVENT NAME= D2O
##.SHIFT REFERENCE= (INTERNAL, D2O, 0, 15.7039)
##AUDIT TRAIL= $$ (NUMBER, WHEN, WHO, WHERE, WHAT)
$$ ##TITLE= Audit trail, XWIN-NMR		Version 3.5
$$ ##JCAMPDX= 5.01
$$ ##ORIGIN= Bruker BioSpin GmbH
$$ ##OWNER= she
$$ F:/spectra/data/she/nmr/H-F/1/audita.txt
$$ ##AUDIT TRAIL=  $$ (NUMBER, WHEN, WHO, WHERE, WHAT)
(   1,<2019-06-07 15:22:49.81 +0400>,<she>,<DPX200>,
      <created by zg, POWCHK disabled, PULCHK disabled
       configuration hash MD5:
       00 E9 B6 7A A2 85 ED C7 34 08 36 98 17 FE 4E 26
       data hash MD5: 16K
       D6 98 B5 9C B2 B5 27 17 FB 00 90 5C 9A 25 29 A3>)
$$ ##END=
$$ 
$$ hash MD5
$$ 71 DB 90 53 D5 41 27 0B A1 85 50 5F 5D 12 2B 18
##$RELAX= 
##$RELAX= 
##$RELAX= 
##$RELAX= 
##$RELAX= 
##$RELAX= 
$$ Bruker specific parameters
$$ --------------------------
##$DU= <F:/spectra>
##$EXPNO= 1
##$NAME= <H-F>
##$PROCNO= 1
##$TYPE= <nmr>
##$USER= <she>
##$AMP= (0..31)
100 100 100 100 100 100 100 100 100 100 100 100 100 100 100 100 100 100 
100 100 100 100 100 100 100 100 100 100 100 100 100 100 
##$AQSEQ= 0
##$AQ_mod= 1
##$AUNM= <au_zg>
##$AUTOPOS= <>
##$BF1= 200.13
##$BF2= 200.13
##$BF3= 200.13
##$BF4= 200.13
##$BF5= 200.13
##$BF6= 200.13
##$BF7= 200.13
##$BF8= 200.13
##$BYTORDA= 1
##$CFDGTYP= 0
##$CFRGTYP= 5
##$CHEMSTR= <none>
##$CNST= (0..31)
1 1 145 1 1 1 1 1 1 1 1 1 1 1 1 1 1 1 1 1 1 1 1 1 1 1 1 1 1 1 1 1 
##$CPDPRG= <>
##$CPDPRG1= <>
##$CPDPRG2= <>
##$CPDPRG3= <>
##$CPDPRG4= <mlev>
##$CPDPRG5= <mlev>
##$CPDPRG6= <mlev>
##$CPDPRG7= <mlev>
##$CPDPRG8= <mlev>
##$CPDPRGB= <>
##$CPDPRGT= <>
##$D= (0..31)
0 1.2 0 0 0 0 0 0 0 0 0 0.03 0 0 0 0 0 0 0 0 0 0 0 0 0 0 0 0 0 0 0 0 
##$DATE= 1559906568
##$DBL= (0..7)
120 120 120 120 120 120 120 120 
##$DBP= (0..7)
150 150 150 150 150 150 150 150 
##$DBP07= 0
##$DBPNAM0= <>
##$DBPNAM1= <>
##$DBPNAM2= <>
##$DBPNAM3= <>
##$DBPNAM4= <>
##$DBPNAM5= <>
##$DBPNAM6= <>
##$DBPNAM7= <>
##$DBPOAL= (0..7)
0.5 0.5 0.5 0.5 0.5 0.5 0.5 0.5 
##$DBPOFFS= (0..7)
0 0 0 0 0 0 0 0 
##$DE= 6
##$DECBNUC= <off>
##$DECIM= 24
##$DECNUC= <off>
##$DECSTAT= 4
##$DIGMOD= 1
##$DIGTYP= 9
##$DL= (0..7)
0 120 120 120 120 120 120 120 
##$DP= (0..7)
150 150 150 150 150 150 150 150 
##$DP07= 0
##$DPNAME0= <>
##$DPNAME1= <>
##$DPNAME2= <>
##$DPNAME3= <>
##$DPNAME4= <>
##$DPNAME5= <>
##$DPNAME6= <>
##$DPNAME7= <>
##$DPOAL= (0..7)
0.5 0.5 0.5 0.5 0.5 0.5 0.5 0.5 
##$DPOFFS= (0..7)
0 0 0 0 0 0 0 0 
##$DQDMODE= 0
##$DR= 18
##$DS= 0
##$DSLIST= <SSSSSSSSSSSSSSS>
##$DSPFIRM= 0
$$ [...]
##$SUBNAM2= <"">
##$SUBNAM3= <"">
##$SUBNAM4= <"">
##$SUBNAM5= <"">
##$SUBNAM6= <"">
##$SUBNAM7= <"">
##$SUBNAM8= <"">
##$SUBNAM9= <"">
##$SW= 24.9336996594482
##$SWIBOX= (0..15)
0 0 2 0 0 0 0 0 0 0 0 0 0 0 0 0 
##$SW_h= 4990.01996007984
##$TD= 16384
##$TD0= 1
##$TE= 0
##$TE2= 300
##$TE3= 300
##$TEG= 300
##$TL= (0..7)
0 120 120 120 120 120 120 120 
##$TP= (0..7)
150 150 150 150 150 150 150 150 
##$TP07= 0
##$TPNAME0= <>
##$TPNAME1= <>
##$TPNAME2= <>
##$TPNAME3= <>
##$TPNAME4= <>
##$TPNAME5= <>
##$TPNAME6= <>
##$TPNAME7= <>
##$TPOAL= (0..7)
0.5 0.5 0.5 0.5 0.5 0.5 0.5 0.5 
##$TPOFFS= (0..7)
0 0 0 0 0 0 0 0 
##$TUNHIN= 0
##$TUNHOUT= 0
##$TUNXOUT= 0
##$USERA1= <user>
##$USERA2= <user>
##$USERA3= <user>
##$USERA4= <user>
##$USERA5= <user>
##$V9= 5
##$VALIST= <valist>
##$VCLIST= <CCCCCCCCCCCCCCC>
##$VD= 0
##$VDLIST= <DDDDDDDDDDDDDDD>
##$VPLIST= <PPPPPPPPPPPPPPP>
##$VTLIST= <TTTTTTTTTTTTTTT>
##$WBST= 1024
##$WBSW= 4
##$XGAIN= (0..3)
0 0 0 0 
##$XL= 0
##$YL= 0
##$YMAX_a= 263691
##$YMIN_a= -309884
##$ZGOPTNS= <>
##$ZL1= 120
##$ZL2= 120
##$ZL3= 120
##$ZL4= 120
##$ABSF1= 10
##$ABSF2= 0
##$ABSG= 5
##$ABSL= 3
##$ALPHA= 0
##$AQORDER= 0
##$ASSFAC= 0
##$ASSFACI= 0
##$ASSFACX= 0
##$ASSWID= 0
##$AUNMP= <proc_1d>
##$AZFE= 0.1
##$AZFW= 0.1
##$BCFW= 1
##$BC_mod= 2
##$BYTORDP= 1
##$COROFFS= 0
##$CY= 11.3945322036743
##$DATMOD= 1
##$DC= 2
##$DFILT= <>
##$DTYPP= 0
##$F1P= 18.9103706918063
##$F2P= -1.10871071338519
##$FCOR= 0.5
##$FTSIZE= 0
##$FT_mod= 4
##$GAMMA= 1
##$GB= 0.15
##$INTBC= 1
##$INTSCL= 1
##$ISEN= 128
##$LB= 0.24
##$LEV0= 0
##$LPBIN= 0
##$MAXI= 10000
##$MC2= 0
##$MEAN= 0
##$ME_mod= 0
##$MI= 1.114404
##$NCOEF= 0
##$NC_proc= 0
##$NLEV= 6
##$NOISF1= 3.799351
##$NOISF2= 2.8
##$NSP= 1
##$NTH_PI= 0
##$NZP= 0
##$OFFSET= 15.70392
##$PC= 1
##$PHC0= -8505.687
##$PHC1= 18.60019
##$PH_mod= 1
##$PKNL= yes
##$PPARMOD= 0
##$PSCAL= 0
##$PSIGN= 0
##$REVERSE= no
##$SF= 200.130013532006
##$SI= 16384
##$SIGF1= 3
##$SIGF2= 2
##$SINO= 400
##$SIOLD= 16384
##$SREGLST= <1H.CDCl3>
##$SSB= 0
##$STSI= 0
##$STSR= 0
##$SW_p= 3612.71676300578
##$SYMM= 0
##$S_DEV= 0
##$TDeff= 0
##$TDoff= 0
##$TI= <>
##$TILT= no
##$TM1= 0
##$TM2= 0
##$TOPLEV= 0
##$USERP1= <user>
##$USERP2= <user>
##$USERP3= <user>
##$USERP4= <user>
##$USERP5= <user>
##$WDW= 1
##$XDIM= 8192
##$YMAX_p= 0
##$YMIN_p= 0
$$ End of Bruker specific parameters
$$ ---------------------------------
##NTUPLES= NMR FID
##VAR_NAME=  TIME,          FID/REAL,        FID/IMAG
##SYMBOL=    X,             R,               I
##VAR_TYPE=  INDEPENDENT,   DEPENDENT,       DEPENDENT
##VAR_FORM=  AFFN,          ASDF,            ASDF
##VAR_DIM=   8192,          8192,            8192
##UNITS=     SECONDS,       ARBITRARY UNITS, ARBITRARY UNITS
##FACTOR=    0.0002004,     1,               1
##FIRST=     0,             0,               0
##LAST=      1.6414764,     0,               0
##MIN=       0,             -309884,         0
##MAX=       1.6414764,     263691,          0
$$ Real data points
##PAGE= N=1
##DATA TABLE= (X++(R..R)), XYDATA
$$ [...]
3445A0369o424q369o260n48N724R435P133J207o054r971q049o05O096R324O728
3460I736R29m593p181o884l097K087P530Q794N043k457r092r502m661L988Q279
3475a081Q115L402j393o334q046n418J6N775Q588P109Q32o270r393o855j287O058
3491f182R167P271J233n574q100o493k253L413O784P945M326k301p727r538m933
3506a2962L291Q898Q841L678l179o913p189m670P95N412Q461O243O62o036q790
3521c458p151q62O095Q601P679P39n433q559p018j133M413P325O650L109k159
3536H838p501q274n227K530Q873R243M134l608q021p657l559J817N849P154N399
3551I990M60n600q360o894m20N766Q751P121K96n826q575o787q60N410P487O095
$$ y = [10369, 3945, -4424, -10684, -11232, -5508, 3927, 11060, 12267, 6213, -3758, -11807, -12412, -6316, 3008, 9736, 10665, 6072, -1109, -7993, -11090, -9003, -1473, 7321, 12364, 9907, 815, -8687, -13348, -9360, -1081, 7034, 10436, 9043, 2709, -5337, -10755, -10739, -4964, 3624, 10733, 11565, 5295, -4098, -10953, -12240, -6182, 2985, 10256, 11489, 5915, -2185, -8678, -10931, -7518, -734, 7211, 11537, 9236, 1509, -8029, -12962, -9671, -773, 8068, 11746, 8567, 1654, -5535, -10205, -9410, -3998, 4463, 10706, 11368, 5332, -3458, -10609, -11471, -5376, 3225, 10904, 11643, 6210, -2349, -9367, -10500, -6087, 1238, 7888, 10997, 8838, 1337, -6937, -12164, -9634, -761, 8482, 12616, 9008, 987, -6670, -10229, -8412, -2563, 4591, 9990, 10450, 4850, -3510, -10404, -10824, -5058, 3693, 10814, 11110, 5284, -3291, -10078, -10938, -5528, 1959, 8054]
3567H054K271l052p174p379l894K038P671R297M121k909q763q165l565L013O762
3582a674O864M040p07m545q102o202o93O030Q560O840M47o337q567o088p13N430
3598e417P963O096J423l876p445o579k740K407P260Q298M142k855q176q648l869
3613a2016L569P713P252L493k054n540o559n554m23N668Q274O785L41n999r084
3628d134o376M93N448P645O464R13m819p260o293j735K932P387O735L687k341
3643H746p844q448l875L002Q404P860L097l118o742o597l445Q25M576P866N830
3658A0137L43n537q852o615J30O208Q202N579L96n095p236n872j705M081P038
3673A202O532K841l121o860p913l465K528P544Q531L368l715p039p243k881J929
$$ y = [8054, 10325, 7273, 99, -7280, -11174, -9136, -1465, 7832, 11953, 9044, 281, -7884, -11449, -8436, -1674, 5190, 9230, 8523, 3978, -4124, -10326, -11019, -4989, 3571, 10411, 10858, 4521, -4046, -10134, -10847, -5417, 2546, 8642, 10065, 6189, -1256, -7835, -10575, -8168, -908, 7390, 11532, 8677, 501, -8147, -12016, -8447, -734, 6518, 10011, 7957, 2417, -4142, -9696, -10119, -4451, 3823, 10608, 10949, 4950, -4134, -10510, -10017, -4569, 3076, 9540, 10453, 5634, -1626, -7919, -9654, -6722, 665, 7400, 11087, 8746, 902, -7546, -11421, -8419, -15, 7845, 10942, 7824, 1082, -5515, -8960, -8135, -3559, 4307, 10137, 10480, 4943, -3909, -10524, -10394, -4186, 4016, 9595, 9991, 4896, -2340, -8212, -9917, -5836, 1202, 7734, 10575, 7454, 594, -7319, -10784, -8256, -712, 7819, 11187, 7472, 433, -6810, -9691, -7762]
3688g762N397O624M544L59n307p730o327k13O057Q763N567m5n993p334n602m70
3704i472L838P390N963J933l028p508o883l076L063P242P845L616l481p170p592
3719g320k838K759O085O609L733j245m493p480n245q31N930Q683N616J34o404
3734C693p588n414K66M659O730N659J666l847o711o787k291L019P406P062L004
3749A0526l035p363p323l034L120O902O988K678j921n624o215m268k37N147Q116
3764D457N655k90o088q236n157Q89N277P351M661M37m254o124n951k229L500P108
3780A006O610K718l471p161p068k659K648P325P217K545k560o412o238l100Q48
3795g752N292O640M882L30n655q204n515P45N851P830M478k71n126o065n328j140
$$ y = [-7762, -2365, 4259, 8803, 9162, 3855, -3875, -10202, -10415, -4358, 4405, 9972, 9927, 3934, -3400, -9002, -9472, -5634, 1756, 7719, 9652, 6624, -884, -7767, -10843, -7780, -538, 7307, 10923, 7442, 272, -7320, -10158, -7399, -1314, 5295, 9028, 7783, 3290, -4190, -9435, -10266, -4336, 4347, 9963, 10097, 3693, -3895, -9309, -9043, -4384, 2346, 8005, 9671, 5824, -887, -7674, -9965, -6946, 460, 7522, 10526, 7491, 128, -7195, -10229, -7109, -207, 6781, 9459, 7538, 1914, -4301, -8569, -8806, -3659, 4457, 10112, 9822, 3734, -4502, -9659, -8770, -3493, 3858, 8519, 8956, 4702, -1422, -7373, -9602, -6102, 1006, 7616, 10334, 6863, -298, -7366, -10025, -7377, -52, 7165, 9710, 7150, 738, -5500, -8600, -7752, -2460, 4180, 9062, 9392, 3737, -4467, -9982, -9237, -3386, 4444, 8922, 8651, 3525, -2540, -7868, -9008]
3811i008L420O586O380K160l195p038p297k046L595O602O937K584k846p146n998
3826f310l065K218N390O496L904m54n153p394n393J88N704Q486M907q47n324p199
3842c846m037l67L332O649N426J668l012p199o079k385L418P436O543K186l234
3857F499o288o694k615K542O079O223L220j613n169o358m620L50N241P709N398
3872I904j037n737p336m308P33M544N917M592J400l249o432o230k269L253P112
3887H57O820J831k948o572o576k342K332O392O277K738j470n400o686l754N22
3902g979N013P018N215k79n501p809n065R54N638O552L835K63l628n813n280j796
3918h662K709O678O588K204l234p420n918j957K808O515N814K357k126n408o413
$$ y = [-9008, -5588, 998, 7378, 9538, 6343, -695, -7992, -10038, -6443, 159, 7096, 9680, 6834, -312, -6310, -9375, -7157, -1767, 4729, 8633, 8179, 3026, -4368, -9761, -9573, -3869, 4617, 9524, 8677, 3353, -3846, -7883, -8250, -4918, 1731, 7157, 8825, 5813, -1386, -7465, -9850, -6432, 1004, 7547, 9733, 6499, 211, -6483, -9098, -6556, -477, 5746, 8966, 7353, 2184, -4174, -8794, -8444, -3203, 4506, 9904, 8867, 3130, -4206, -8514, -7781, -3237, 2680, 7272, 8672, 5423, -1009, -7239, -9508, -6255, 857, 7677, 9508, 6560, -12, -6588, -8930, -6598, -206, 6071, 8809, 7339, 1939, -4747, -8501, -7979, -2966, 4052, 9267, 8988, 3487, -4322, -9387, -8433, -2795, 3757, 7592, 7855, 4227, -1586, -6866, -8662, -5953, 725, 7313, 9517, 6283, -1137, -7055, -9012, -6204, 311, 6125, 8482, 6356, 948, -5465]
3933e465l185R54N766O194M293n17m971p570m844O45N574P215M320p46m770n624
3949b731m429q10K917N900O170K124l507o933o124j877L356O675N690J931k353
3964E999n853o109k502J767N428O373L303r76n172o779m194M71N224P258M671
3979H909r98n212o474l675M2L740N714M877J636k993o339o600k016L839O998N958
3995G406J645l732n812n331k233K050N680N636L446j801n198o178l785P56N025
4010b426O750M831j317n156o796l991M90M824N840L912Q42l106n672n804k143
4025h922L141P034O144J640l533o856m915j811K855M969N633K381j414m993o539
4040e186l284J289N011O501L872n75n189o673m593J296M910O070L853m9l899n618
$$ y = [-5465, -8650, -7696, -1930, 4264, 8557, 8040, 3069, -4501, -9345, -8700, -3126, 4089, 8409, 7663, 2893, -2731, -7160, -7970, -5053, 847, 7017, 9141, 5634, -1299, -7423, -9300, -5944, 731, 6421, 8352, 5999, 146, -5963, -8465, -6698, -1270, 5103, 8406, 7430, 2258, -4521, -8715, -8244, -3020, 4238, 8909, 7911, 2699, -3775, -7450, -7408, -3668, 2046, 6923, 8559, 5566, -773, -7373, -9389, -5550, 1448, 7406, 9051, 5319, -493, -5824, -8057, -6007, -327, 5309, 8755, 6954, 1756, -4422, -8207, -7451, -2426, 4324, 9155, 7838, 2682, -4114, -8105, -7615, -2791, 3049, 6961, 7803, 4697, -975, -6779, -8922, -5781, 1253, 7397, 9037, 5504, -1352, -6267, -8078, -5223, -254, 5379, 7760, 6346, 1353, -5186, -8470, -7181, -2170, 4331, 8203, 7628, 2439, -4234, -8827, -7531, -2621, 3449, 7302, 7253, 3354, -2264]
4056b264m566j438L055O455O110J599m013o713n393j187L601N600M692K144k215
4071E467m977n496l298J364N293O321L664r86n693n947m000R59N048O254M002
4086G975q99m263n486m365j79K979N614N334J863l254o606n793j382L813N915
4101A266N574P80k597n057m972k541J688M659O115L356j026n395o157l856J368
4116f795M707O534L454p79m676n656l927N10L713N192M318J142k870n709n908
4131f750j953L994O523N410R19l483n637m481j893J974M340N759K894r50n212
4146A454o202l484J395N109N872L675j152m664n821l716K88M416N203M282L30
4161F985l408n471m978j412L150O145N937J291l736o066m628j469K942M646M659
$$ y = [-2264, -6830, -8268, -5213, 1242, 7352, 8951, 4938, -1775, -7168, -8355, -4754, 846, 5538, 7682, 5467, 490, -5006, -8304, -6940, -1647, 4674, 8338, 7352, 1659, -4288, -8288, -7329, -2281, 3973, 7975, 7076, 2813, -2673, -7038, -7217, -4238, 1376, 6710, 8573, 5319, -1287, -7080, -8462, -4649, 1266, 6840, 7620, 5023, -34, -5006, -7547, -5859, -1200, 4915, 8271, 7245, 1850, -4307, -8163, -6795, -2088, 4446, 7900, 7121, 2445, -3211, -7138, -6628, -2915, 2277, 6595, 7737, 4867, -842, -6750, -8703, -4709, 1814, 7224, 8143, 4660, -977, -5458, -7351, -5377, -1037, 4722, 7616, 6666, 1454, -4748, -8232, -6837, -1728, 4144, 7819, 6667, 2003, -3818, -7534, -7246, -2830, 2373, 6655, 6985, 3577, -1894, -6872, -8284, -5134, 1011, 6948, 8239, 4503, -1563, -6191, -7660, -4718, -72, 4587]
4176D587K630j210m971n905l629J577N337O241L054j395m783n764l348R22M137
4191b520N677L872j00l462n700m295j378L249O158N316J093l159o101n498m88
4206g336L149N115M828J288j887m394n271k985J050N316O131L330j834n086n831
4221d417l190J483M467N192L743m76l698n390m248k25L248N249M946J001l051
4236D634n858n236j511L278O276M592R64k647m697m466j969Q85M912N048L666
4251G871j178n401n902l453K071M870N219K841o35m243m788m079n5L488N201M724
4267F551M93k921n627m880j607L370N982M886J415l558n365m019j423J486M445
4282g72M939K888j148m735n659l580J670N024N618K899j183m275m815l033k54
$$ y = [4587, 7217, 6007, 1036, -4869, -8498, -6921, -1584, 4657, 7711, 6316, 1533, -4231, -7579, -6657, -2520, 3157, 7029, 6929, 3467, -2233, -6528, -7906, -4657, 1501, 6817, 7910, 4751, -1350, -6848, -7336, -4187, 928, 5756, 7044, 5157, 763, -4508, -7493, -6443, -1127, 5004, 8334, 6500, 1414, -4417, -7607, -6124, -1657, 3535, 7278, 6802, 3104, -2286, -6534, -6759, -3511, 1738, 6684, 7685, 4634, -1224, -6460, -7971, -4693, 1583, 6175, 7139, 4492, -205, -4671, -6640, -5755, -843, 4205, 7871, 6693, 1292, -4610, -8063, -5992, -1122, 4097, 6938, 6303, 2060, -2728, -6807, -6862, -3374, 1827, 6551, 7044, 4123, -1504, -6384, -7991, -4621, 1361, 6247, 7662, 4104, -1261, -5280, -6703, -5217, -772, 4167, 7055, 5907, 1172, -4487, -8067, -6397, -1373, 4245, 7144, 5961, 1686, -3129, -6162, -6416]
4297f416L737N023M003N45l211n227m907q02L235N537M487J346l107n553m319
4312e629j148K680M193M660J794j358m041m975l332J065M755N784L015j497m403
4327A563n208k906P30L581M984L637L43l172n383m546m17L280N227M423R75k930
4343D181n376m519j312L000N013M294J097j391m329n077k339Q18N019N217L226
4358G522j251n303n263k464J179M091M754K948rl581n213l808n44L729N376M105
4374F268N90l324m889m710q85K966M926M650J151k666m492m332j830J818L722
4389a037N292K735j306m644n959k410J706M546N234K356j311l263m816l515j05
4404f497L186N589M076L31l538n374l993o59L196M958M265J193l158m672m058
$$ y = [-6416, -2679, 2344, 6347, 6892, 3681, -1546, -6453, -7255, -4020, 1517, 6004, 7350, 4243, -1310, -5629, -6777, -4097, 96, 4756, 6550, 5192, 1151, -3824, -7156, -6091, -1336, 4448, 7463, 5966, 1563, -3645, -6551, -5821, -2240, 2744, 6381, 6724, 3552, -1831, -6377, -6794, -3514, 1713, 6136, 7111, 4181, -1195, -5714, -7026, -4026, 987, 5281, 6378, 4987, 658, -4419, -6758, -5940, -921, 4296, 7522, 6271, 968, -4295, -6759, -5580, -1489, 3265, 6213, 6204, 2623, -2590, -6398, -6942, -3213, 2163, 6268, 6858, 3534, -1355, -6065, -6950, -3984, 942, 5592, 6743, 4077, -415, -4747, -6577, -4759, -1037, 4255, 6990, 5684, 1040, -4919, -7329, -5623, -1077, 4157, 6513, 5202, 1939, -2877, -6392, -6497, -3311, 2278, 6354, 6685, 3147, -2227, -6220, -6879, -3683, 1275, 5540, 6733, 3575, -1097, -5155]
4419e155r60J873M737L955J917p97m887m979k963J613M637N564K335j633l940
4434A317m566k689j27L623M827L808K63l433n205m232m80M040N039L795Q65l374
4450C471m916l975j110K781M574L975J773j747m408m831k391J344M831N140K866
4465G377j791m863m436k488J259L275M344L325k5l337n035l916k94L847N299L404
4481E945L12k766n039m070p74K988M248M159J342k249m131m477k081J353M649
4496e91M781K677j303m900n184k203J609M309L968K476p11k690m475l409o87L524
4512b809N058M379k64l604m975l637l18K605M794L787J348k505m385m319j935
4527f780K442M139M347K246j360m731m849k021J344M495M401K471j367l390m159
$$ y = [-5155, -6115, -4242, 495, 4450, 6367, 5570, 683, -4296, -7259, -5646, -1009, 4555, 6890, 5257, 1317, -3249, -5938, -6065, -2442, 2385, 6193, 6456, 3023, -2182, -6414, -6894, -2854, 2185, 5980, 6845, 3471, -1445, -5420, -6530, -3749, 825, 4800, 6573, 4826, 418, -4413, -6804, -5460, -629, 4511, 7377, 5586, 723, -3713, -6201, -4942, -1667, 2677, 6002, 5977, 2640, -2395, -6311, -6605, -2758, 2541, 5945, 6257, 3491, -1548, -5618, -6392, -3404, 844, 5003, 6345, 4096, -35, -4512, -6593, -5240, -591, 4190, 6867, 5564, 664, -4520, -6723, -5114, -805, 3163, 5639, 4928, 2238, -2237, -5646, -6333, -2809, 2249, 6628, 6364, 2760, -2215, -5852, -6170, -3565, 1229, 5016, 6364, 3859, -526, -4845, -6780, -4338, -199, 4148, 6394, 5034, 303, -4546, -6567, -5223, -728, 3673, 6144, 4777, 1387, -2772]
4542b772k737k48K835M861M254M66l632n339l627m78L143M972L339J003k523m357
4558h40l648j767K337M198M054J834j583m126m768j768J109M614M581K247j518
4573D956l936m422k068O35L038L682L513N02k879n105l982ML074N293L307K15
4589E827k696m111l772r51J812M303M213J328j588m325m067k228J461M375M696
4604D277K198j581l868m580k318J119L492L747K754k6k647m574l951j28L329M988
4620B231L783l31l289m264k881j125K822L507L898J360j474m570l988j882J618
4635d585M532M251J925j567m167m482j968J076M180M004K265o98l150m156l102
4650e642j05L161M647L728j07l337m645l058l57K814M204L097J269j770m267m059
$$ y = [-2772, -5509, -5757, -2922, 1939, 6193, 6659, 3027, -2312, -5939, -6417, -3274, 1698, 5037, 6040, 3517, -840, -4488, -6255, -3918, 280, 4334, 6168, 4585, 459, -4309, -6077, -4968, -354, 4227, 6474, 4956, 1020, -3402, -5470, -4835, -1797, 1885, 5398, 5900, 3021, -2084, -6066, -6062, -2988, 2305, 5612, 5827, 3131, -980, -4752, -5703, -3891, 412, 4625, 5953, 4365, 40, -4027, -6255, -4794, -419, 4277, 6475, 4894, 1026, -3554, -5872, -4753, -1261, 2486, 5240, 5214, 2567, -2007, -5958, -6086, -2757, 2231, 6014, 5683, 2394, -1870, -4751, -5876, -3054, 453, 4351, 5711, 4237, -333, -4321, -6203, -4585, -53, 4198, 6123, 4556, 389, -4093, -6061, -4985, -805, 3199, 5464, 4766, 1616, -2540, -5642, -5747, -2586, 2061, 5789, 5682, 2345, -2300, -5358, -5715, -2901, 1303, 4400, 5669, 3899, -368, -4427]
4666d427j657K063M128M455J545j581l922m753j729J075M135M386K248j181l386
4681A399l841k793K24K844M364L325P06l510m810l453J48K900M258L357L68k330
4697C156l643l590j434J921L644M564J406k249l690m045k114J616L934M346K033
4712E855j210l554l904k574O15K916M502K565N8k614m935l409qL000M613L433
4728E349k20k681l199l862n23J382L989L933J608j552m481l984j582J726L773
4743c24L934J897j347l428m259k147J153L179M183K179j39l033m124k882r14L504
4759b568M593L523l39k856m154l030n56K397L468L645J242j894l595m159j508
4774e791J440M588L865J399j384l657l816j935R31L407L885K592q03l405l683
$$ y = [-4427, -6084, -4021, 107, 4562, 6107, 4526, 604, -4149, -5878, -4803, -668, 3718, 5966, 4785, 1399, -2442, -5235, -5011, -2167, 2197, 5522, 6228, 2718, -2092, -5545, -5397, -2497, 1761, 5118, 5486, 3156, -487, -4077, -5511, -3590, 54, 4618, 6024, 3775, 85, -3960, -6074, -4458, -524, 3822, 5855, 4645, 1091, -2813, -5387, -4772, -1856, 2646, 5211, 5269, 2655, -2280, -5689, -5697, -2697, 1916, 5349, 5129, 2448, -751, -4613, -5136, -3754, 235, 4168, 5776, 4224, -257, -4241, -5823, -4097, -324, 3610, 5507, 4160, 732, -3527, -5674, -4521, -1342, 2841, 5020, 4881, 1848, -2276, -5158, -6072, -2568, 2025, 5548, 5209, 2353, -1801, -4831, -5387, -2990, 478, 4123, 5365, 3471, -124, -4283, -5791, -4351, 237, 4102, 5501, 4117, 460, -3356, -5291, -4360, -953, 2932, 5524, 4721, 1316, -2367]
4789b367k582K24K658M445K859J93l413l955k843l30K871L775K817N51j745l522
4805c64l858j525J778M392M057J014j369l868l834j697J204L299L966K138p70
4820D563l547l611k719O41K755M054K811N57l070m562l156N1K959M176K742R3
4836D737k232l568k888j311J497M149L745J327j537m094l545j389J449L524L352
4851C216J736q10l228l816k548O64L467L859K292o0k846m159l161L87K885M220
4867B098K739j79k238l911k648q24J873L240L958J304j657l978m138r73J510L921
4883I7L752J028j273k685l829k269N47L239L943K487m43k841l981k570jK548M287
4900B036K866Q4k701m126k506l81J721M050K995J291j596l701l865j671J931L891
$$ y = [-2367, -4949, -4725, -2067, 2378, 5237, 5430, 2017, -1938, -4781, -5111, -2240, 1535, 4352, 4903, 3158, -364, -4222, -5747, -3969, 423, 4480, 5494, 4125, 257, -3577, -5274, -4070, -771, 3195, 5333, 4563, 1016, -2595, -5314, -4673, -1918, 2136, 4947, 5504, 2434, -2128, -5284, -5233, -2274, 1902, 4644, 4737, 2505, -1063, -3951, -5262, -3765, 384, 4129, 5456, 3919, -175, -3720, -5109, -3660, -136, 3216, 4952, 4142, 914, -2902, -5450, -4786, -1319, 2540, 4832, 4772, 1926, -2233, -5394, -5007, -2122, 2098, 4837, 4658, 2420, -1491, -4139, -4963, -3090, 150, 4108, 5412, 3755, -223, -4361, -5334, -3824, 97, 3849, 4877, 3604, 919, -2910, -5179, -4632, -1393, 2550, 5037, 4594, 1753, -2228, -4798, -4799, -2251, 2036, 4902, 4986, 2285, -1841, -4347, -4728, -3007, 1043, 4038, 5329, 3733, 32, -3833, -5504, -3573, 318]
4916C18L512J410j538l614l017j757O92L378L608K047o27k682m463k250O52K787
4932a544L652K686j25k740l669k923k89L057L431K556N43j558l365l568j052J198
4948c710M045L623J124j508l971l221j193J179K987L571J893r45l030l263k498
4963d917P48K594L658K695k08l030l439k808J06K387L864K563J86k115l286l424
4979d426m71J739L349L569R42j179m067l330j083J456L567K878J772j010l013
4994F93l080k352K87K924M071K593o81k884l781k739O28K808L564K391M09k584
5010B267l468k815m29K115L102K886J310j723l578l452j197J761L513L379J037
5025D708j558k598l074k156R37K619L627K232m43k990l705k229N74K573L491K415
$$ y = [318, 3830, 5240, 3702, 88, -2929, -4686, -3994, -616, 2992, 5039, 4412, 1730, -2733, -4983, -4331, -1544, 2108, 4794, 4669, 1929, -1740, -4663, -4952, -1895, 1536, 4092, 4635, 3077, -288, -3856, -4908, -3710, 335, 3958, 5082, 3574, -397, -3618, -4811, -3632, -645, 2926, 4819, 3874, 844, -2419, -4917, -4169, -1575, 2083, 4778, 4570, 1540, -1899, -4707, -4601, -2214, 1650, 4213, 4399, 2284, -1002, -4426, -4897, -3158, 191, 3760, 4702, 3523, -544, -3874, -4957, -3501, 66, 2944, 4716, 3706, 693, -2387, -4739, -4452, -1528, 2543, 5136, 4455, 1571, -2210, -4949, -4321, -1513, 2051, 4442, 4851, 2267, -1201, -4016, -4445, -2330, 772, 3658, 4968, 3245, -333, -3785, -4982, -3221, 292, 3671, 4708, 3150, 552, -2522, -4678, -3741, -1122, 2505, 4737, 4294, 1304, -2401, -4630, -4056, -1483, 2008, 4423]
5041D423K14k605l631k169r19K494L218K710R08k255k704l337j160J622L998K938
5057C745J057j535l340l390q65J188K297L394J896l23k971l747j944P14K976L098
5073B250K325p12k400l394k207m39K141L911K536M23k128l118l143q14J848L600
5089F79K801J372j736l617l298n57J361K845K877J255m27k685l504k053M47L109
5105a131L509J984l19k871l232k387L61K162L466K251N69k338l145k558p62K071
5121b370K957K843J126j562l602l081p72J419L337K929J008j095k653l133j556
5136d205M97K757L443K403p63l012l487k038R30K082L156K392K1k150l200k782
5152c956l99K303L142L133L0j846l104k745r62J667L116L110Q28j178l044l134
$$ y = [4423, 4637, 2032, -1599, -3768, -4687, -2193, 1025, 3735, 4643, 2388, -316, -3653, -4813, -3191, 807, 3745, 4802, 3267, -73, -3463, -4328, -3140, -843, 2551, 4447, 4124, 1153, -2594, -4538, -3824, -848, 2250, 4575, 3863, 1463, -1931, -4138, -4577, -2436, 1475, 4011, 4434, 2306, -812, -3955, -4769, -2921, 679, 3480, 4852, 3116, -501, -3799, -4356, -2995, -150, 2727, 3982, 3555, 870, -2634, -4687, -4240, -1131, 2378, 4362, 4043, 1172, -2060, -4447, -4086, -1924, 1542, 3793, 4362, 2024, -1121, -3679, -4441, -2370, 587, 3430, 4556, 2994, -608, -3689, -4461, -3042, 295, 3224, 4232, 3137, 484, -2649, -4205, -3708, -951, 2492, 4895, 4132, 1120, -2367, -4405, -3475, -1393, 1763, 4155, 4176, 2026, -1174, -3956, -4355, -2052, 1090, 4223, 4253, 2407, -697, -3442, -4404, -2737, 379, 3489, 4317, 3139, 95, -3039]
5168c039r53Q45K506L357J553l22k826l465j944M55L063K670K123l13k338k836
5184a464k371k63J988L685K240M41j623l542k352r70J502L296K891R36j611l456
5200f73k811p84J642K135K853J929n77k912l025k204O05K926L131J810n52k362
5216A131k920k044J47J815L182K442L93j844l486k522l36J622L450K493P08j643
5232B588l195k606j172J690K857K737J029r99k122l132k004P11K750L578J543
5247D253n29l081k892j349L48K045K482K331N23k101l570k486m60K533L343K006
5263C396R10j967k887k538j478J846L020K945M79o68k545l257j134O70K528L059
5279B379J612l39k674l185j765O51K140L027J516oj866k823k017o62K240K989
$$ y = [-3039, -3992, -3147, -641, 2716, 4269, 3947, 1121, -2344, -4288, -3833, -770, 1900, 4023, 3710, 1372, -1464, -3835, -4098, -2110, 1575, 3815, 4256, 2633, -909, -3261, -4231, -2729, 567, 3458, 4394, 2783, -673, -3484, -4268, -2626, -491, 2362, 4291, 3714, 802, -2223, -4427, -3822, -896, 2235, 4045, 3493, 1131, -1789, -3833, -3686, -1871, 1311, 3753, 4146, 2302, -1184, -3706, -4042, -2420, 1030, 3523, 4231, 2588, -607, -3213, -4385, -2695, 162, 2899, 3928, 2929, 807, -2325, -4329, -3618, -868, 2710, 4253, 3724, 643, -2249, -3598, -3250, -1205, 1277, 3608, 4131, 2030, -1540, -4026, -4486, -1953, 1390, 3396, 4306, 2339, -548, -3086, -4564, -2718, 302, 3247, 3726, 3058, 513, -2744, -3878, -3208, -680, 2379, 3991, 3652, 978, -2207, -3972, -3321, -1181, 1846, 3362, 3356, 1490, -1333, -3350, -4012, -1772, 1217]
5295A217K445N79k201k559k906n37J395K925K955Q05j278l048k648j094P76K704
5311d70K838J646n29k851l036j788P34K532L230J521l95k052l146j619m72J969
5327a888K922K448Q18k384l082k644J41J549K881K530O00j587k646k527j182J292
5343b759K551K653J131o02k672k564k026Q37K770K998J556o65k296k812j412l4
5359c346J729K829K318K11j872l021k786O9J999K819K515M97j637k528k688j088
5375c980J773K445K456J444j157k733k307k088J156K419K830J892r48k541k982
5390b321j446N81J995K558J826M73k124k797k079o97K448K854K105K74j825k403
5406e78k499m34J240K667K482R23j235k809k443j075P93K486K861J383o21k623
$$ y = [1217, 3662, 4241, 2040, -519, -3425, -3962, -2567, 358, 3313, 4118, 2840, -208, -2856, -3950, -3174, -470, 2368, 4014, 3485, 634, -2402, -4190, -3456, -924, 2306, 3827, 3432, 1380, -1766, -3385, -3857, -1888, 1034, 3482, 4300, 1916, -1166, -3810, -3669, -2120, 761, 3291, 3891, 2304, -342, -2869, -4051, -2759, -208, 2445, 3576, 2974, 302, -2262, -4288, -3451, -681, 2317, 3873, 3208, 912, -1900, -3312, -3346, -1617, 1212, 3530, 3741, 1869, -1152, -3938, -3869, -1870, 949, 3464, 3961, 2324, -204, -2892, -3980, -2207, 238, 2694, 4138, 2981, 248, -2059, -4147, -2991, -572, 2258, 4150, 3202, 661, -2321, -3767, -3186, -1191, 1367, 3193, 3666, 1542, -1255, -3334, -4031, -1583, 1271, 3376, 3650, 1825, -578, -3077, -3511, -2271, 396, 2878, 3801, 2566, -243, -2686, -3761, -2968, -482, 2379, 3762, 3141, 518]
5422E18k768j646K76K581K523J962k70k318k409j783m55K029K794K406J2j474
5438A978l088k063j29J301K452K275Q61r38k663l023r80J009K892K407J317p27
5454B881k447k936j584Q97K744K543J555m96k197k686j542l77K019K895K088K31
5470C588k152k460k682k2K199K375K135M07j288k568k207r31J028K720K635O69
5486C446r56k206k885q52M58K674K533J251l84k581k339j602J65K373K206K121
5502C422M2j784k466k724j00J717L365J871Q4j563k299k438m79J118K614K287
5518B667P62j206k639k311j058J346K243K474J466r52k304k492j512Q44J840K727
5534A895J448l05j597k883k248R7K255K707J925K39k086k210k213lJ077K198K113
$$ y = [518, -2250, -3896, -3620, -1039, 1484, 3446, 3176, 858, -1551, -3334, -3789, -1760, 1034, 3440, 3452, 1978, -1110, -3173, -3302, -2001, 451, 2726, 3587, 2649, -14, -3037, -4017, -3008, -116, 2291, 3608, 2881, 434, -2502, -4086, -3189, -445, 2098, 3653, 3157, 960, -1726, -3268, -3645, -1626, 1269, 3357, 3588, 1436, -1024, -3706, -3728, -1529, 846, 2981, 3388, 2100, -468, -2675, -3606, -2578, 142, 2777, 3446, 2490, 284, -2601, -3453, -2995, -321, 2212, 3463, 3079, 498, -1841, -3443, -3278, -905, 1301, 3422, 3464, 1680, -786, -3510, -3610, -1893, 1472, 3343, 3427, 1864, -435, -2873, -3352, -2234, 380, 2667, 3429, 2223, -416, -2727, -3785, -2439, -196, 2278, 3744, 2792, 488, -2004, -3516, -2672, -832, 1895, 3343, 3038, 1441, -1442, -3690, -3593, -1338, 1369, 3294, 3533, 1447, -763, -2976, -2979, -1902, 296, 2409]
5551B409J081q43k761k717p28J214K403K095J603j168k321k243j550P41K001L151
5567B367P52j02k281k258j798l5K188K446J868O19j822l172j874k43J848K259
5583G62J570Q59j161k319k322p91J076K355K402J034r17k483k535q97N72K370
5599d25K465J388m58k078k533j655J60K219K380J894k25j451k606k418J34J661
5615a548K578J646M41j492k114j910o55Q12K429K516Q46j339k270k561o98J120
5631b199K075K439J357o99k527j887j712L97J971K212J898n24j727k333j877l37
5647c473K113K656J805O2j555k589j571l94R75K472J807Q86o80k749k449r16J606
5664a994J991K370N05n88j900k251j013R4K192K212J204j23j901k371j687K73
$$ y = [2409, 3490, 2647, -114, -2831, -3559, -2345, 58, 2153, 3756, 2588, 267, -1976, -3526, -2785, -784, 2367, 3119, 3017, 736, -1522, -3320, -3355, -1167, 1279, 3147, 3766, 1944, -1228, -3102, -3345, -1497, 762, 2332, 3191, 2030, -289, -2611, -3402, -2326, 29, 2431, 3465, 2548, 65, -2470, -3367, -2795, -425, 2040, 3428, 2970, 892, -1641, -3296, -3136, -917, 1463, 3357, 3132, 1681, -925, -3343, -3209, -1548, 1030, 2676, 3117, 1625, -489, -2399, -3054, -2242, 187, 2703, 3549, 2210, -60, -2621, -3319, -2199, -124, 2315, 3672, 2973, 446, -1441, -3153, -2756, -785, 1427, 3325, 2801, 1074, -1259, -3136, -3473, -1360, 1296, 3101, 3163, 1608, -981, -2552, -2946, -1971, 501, 2308, 3194, 2514, -235, -2684, -3600, -1994, -3, 2367, 2872, 2284, 384, -1867, -2880, -2786, -594, 1618, 2822, 2699, 798, -1573, -3260, -2987]
5680b987J527L024J174K47j544k429j531l57J334K055K107N86j241k413j983j127
5696c558J317K322K100J223j078k358j821j346M76K098K342J360l01k082k424
5711a730j259N07J805K019J538L50j982k481j957K63J375K765J501L13j078k083
5727a34k237j052J235K316K297P78n87l050j901p46P40K009K372J223n05j975
5743G83k521j256L95J595K495J479l9k010j680k223J55J743K275J803l26j148
5759A520k491j857j83J184K139K152Q71j014k846j799p17Q45K416J602J116n38
5775B400j824k091j359K81J786K448Q40N34j905k572j527k1J803K428J782o3j312
5792A628k354j948l01J109K191J725R99n87k753j945j149J370K157K378N32p75
$$ y = [-2987, -1460, 1564, 2738, 2985, 1441, -988, -2519, -2876, -1542, 513, 2620, 3206, 1965, -448, -2431, -3558, -2241, 81, 2181, 3404, 2326, -32, -1853, -3199, -2723, -625, 1717, 3077, 2776, 694, -1730, -2989, -2482, -677, 1342, 2880, 3230, 1248, -1233, -3190, -2927, -1552, 1213, 2714, 3027, 1949, -134, -2371, -3423, -2188, 128, 2425, 3203, 2616, -434, -2335, -3081, -2341, -332, 2040, 3263, 2758, 783, -1738, -2994, -2599, -1004, 1491, 2970, 2931, 921, -759, -2982, -2827, -1084, 1191, 2994, 2668, 1520, -971, -2828, -3011, -1827, 312, 2464, 3335, 2321, -525, -2324, -3041, -2196, 220, 1822, 2938, 2400, 576, -1515, -2874, -2593, -807, 1641, 2481, 3015, 1110, -1462, -2989, -3010, -1207, 1221, 3003, 2940, 1628, -726, -2674, -2975, -1866, 325, 2050, 3049, 2462, -291, -2236, -3385, -2015, 142, 2520, 3052, 2277]
5808B277k069j871j245K87J913K098J821o42k111j991j507M2J750K388J563L02
5824C005j784k480j539k82J560K285J487M96j323j765j704j093J199K024K379
5839B465O00r39j961k242j014O61J902K089J748l96k597k103j395O20J769K308
5855A515J345J7j781k338j514P6J308K257J578M76j255k216j657m83P49K009K536
5872B622N23p71k247k503p88R38K126J807R53j29j999k440r72L23J564K393J433
5889B833k39j698j984j600k84J689K101J737J93j454k041j538m07P73K235J878
5905B194Q08j228k088j969o25R92J916J738J008p09j859j604j797Q34K040J747
5921A398J398l54j747j907j650L01J650K058J670J0j628k347j305l69J407J824
$$ y = [2277, 208, -1663, -2908, -2621, -708, 1390, 3211, 2569, 458, -1533, -3040, -2998, -1248, 1140, 2703, 3005, 1221, -1259, -2798, -3080, -1520, 765, 2252, 2748, 1425, -340, -2044, -3137, -1938, 86, 2465, 3065, 2126, 165, -2077, -3091, -2430, -528, 1561, 3309, 2913, 316, -1787, -3182, -2562, -793, 1515, 2860, 2877, 1096, -1242, -2756, -2680, -1372, 885, 2463, 2939, 1684, -532, -2189, -2672, -1923, 86, 2622, 3145, 2374, 127, -2376, -3164, -2226, -100, 1707, 2660, 2531, 532, -1908, -2880, -2557, -993, 1400, 2833, 2594, 896, -1088, -2688, -2972, -1283, 818, 2555, 2748, 1294, -747, -2285, -2692, -1919, 316, 2194, 3002, 1774, -314, -2283, -2908, -1916, 0, 1738, 2746, 2037, 178, -1426, -3223, -2389, -349, 1398, 2796, 2442, 695, -1212, -2862, -2561, -911, 1147, 2817, 2827, 1199, -1148, -2453, -2822, -1415, 409]
5937D09K055J11p07k366j826o35J028J855K096R23j426j485j801q38M07J909J968
5954A677J121m11j522k528j195M00J711J916J578r2j539j970j703k81J468K172
5970H02J487K24j166j957j543n76Q77K106J907N20p41k177j621q16Q27J521J958
5987A632R83o00j628j758j346K26J551K391J382l27j482k225j144l87J471K426
6003A165J213K66j435j699j701m96J083J959K085M50j033k331j950k01Q41J984
6019B00J371J054o39j755j912o93N1J887K134J086k24j734j978j645N18J073K183
6036I77J328j39o98k157j968j50J344K205J402P20j475j429j949j056R89K460
6052D04J665P62q47j628k261p14M39J797J852J411l51k015j671j465M91J281J979
$$ y = [409, 2464, 2575, 1868, -498, -2324, -2959, -1931, -76, 2020, 2943, 1517, 32, -1769, -2607, -2200, -291, 1677, 2798, 2387, 865, -1663, -2858, -2458, -747, 1169, 2747, 2655, 1116, -854, -2557, -2838, -1370, 802, 2289, 2513, 1347, -610, -2153, -2729, -1852, 254, 2161, 2681, 1940, -237, -1858, -2674, -1847, -326, 1632, 2615, 2015, 387, -1371, -2717, -2491, -940, 1451, 2833, 2506, 1024, -1201, -2345, -2732, -1261, 1165, 2378, 2644, 1209, -490, -2191, -2687, -1604, 355, 2440, 2890, 1857, -474, -2424, -2625, -1784, 200, 1571, 2625, 1986, 231, -1681, -2374, -2323, -436, 1698, 2784, 2560, 826, -1152, -2797, -2279, -1206, 977, 2305, 2166, 1468, -689, -2657, -2807, -1463, 742, 2144, 2864, 1389, -40, -1989, -3045, -2056, 404, 2069, 2831, 1984, 356, -1905, -2619, -2180, -383, 1469, 2880, 2529, 514, -1157, -2622, -2131, -850, 1129]
6069A129J544l75j030k058j629J0J032K153J458L30j070k103j573k28P92J637
6085A9K213O89j109k019j514j185J036J536J893J085o08j583k216j015N62J560
6101f56J971J187k15j424j978j290N2R88K203J320O78j487j790j724n21J547J726
6118E87J629L77q26k136j673p01Q25K031J513R16n73j396k233o87K15J367K004
6135A239J255j98j848j749j029K54J168J688J520K20j213j965j569m49J593J741
6151F58J556N93j397j695j720o29O15K316J801P18j117j599j758p98M46J313J784
6168A087J465o04j547j691j487M44J885J767J072j55j054j859j287m72J567J489
6184F20J463K8n78k167j586m53J146J577J627J000j023j871j567n43L59J598K029
$$ y = [1129, 2673, 2298, 1268, -790, -2419, -2409, -1377, 776, 2234, 2564, 1494, -609, -2182, -2410, -1618, 19, 2232, 2921, 1812, -207, -1721, -2906, -1870, -334, 1559, 2644, 2036, 453, -1763, -2778, -2216, -656, 1315, 2502, 2287, 863, -1115, -2405, -2353, -1365, 838, 2158, 2836, 1349, -441, -2165, -2686, -1139, 587, 2216, 2593, 1767, -369, -2042, -2743, -1918, 113, 1626, 2542, 1969, 573, -1660, -2347, -2132, -765, 1239, 2494, 2296, 448, -1301, -2330, -2076, -908, 780, 2300, 2520, 1307, -658, -2227, -2676, -1083, 658, 2214, 2807, 1410, -285, -2005, -2634, -2019, 297, 2098, 2816, 1699, 100, -1658, -2456, -2010, -697, 1087, 2552, 1948, 401, -1290, -2777, -2333, -448, 1319, 2391, 2236, 1182, -677, -1964, -2436, -869, 620, 2083, 2111, 1533, -634, -2220, -2673, -1527, 50, 1677, 2677, 1654, -217, -1784, -2327, -1968, -370, 1659]
6201A659J053n27j701j978j102O54J392J619J230j91r78k203j113l19J292J932
6217G19J357K42j303j617j506m07Q48J825J659N31o35j752j921m30M15J685J777
6234A487Q85m26j528j744j309N39J565J868J049m43j421j895q66J01J160J513
6250E35J641J25j056k087j266j11R40J717J640p9m09k057j353l81P25J604J322
6267A450J031r17j302j673r76N43J403J926Q34k79j319k125n58m9J492J536R47
6284A964L86j083k275j242p0J235J705J617l05p17j589j786K9P21J416J869O38
6301B513p07j874j575m42L20J258K162Q39o76j467j608q07K11J211J867R03K00
6318B328j175j902j176l12J089J719J656k89j097j359j550l4Q39J241J330Q63
$$ y = [1659, 2712, 2185, 484, -1494, -2596, -1942, -550, 1069, 2299, 2108, 1130, -1073, -2186, -2505, -1213, 719, 2076, 2318, 1015, -602, -2108, -2515, -1667, 158, 1817, 2348, 1713, -39, -1960, -2390, -1975, -290, 1487, 2372, 1946, 418, -1326, -2635, -2096, -531, 1337, 2386, 1943, 522, -1373, -2239, -2138, -978, 535, 2176, 2301, 1245, -842, -2108, -2219, -1279, 438, 2078, 1999, 1590, -467, -1820, -2201, -1476, 128, 1450, 2481, 1564, 262, -1411, -2387, -1844, -441, 1485, 2319, 2040, 721, -1404, -1962, -2011, -519, 1017, 1964, 2350, 1267, -1008, -2250, -2320, -1085, 620, 2237, 1932, 1215, -374, -2160, -2131, -1410, 6, 1875, 2513, 1806, -68, -1643, -2085, -1765, -507, 1655, 2494, 1818, 351, -1257, -2064, -1853, -642, 1225, 2128, 2328, 1153, -749, -1925, -2237, -1148, 571, 2227, 1938, 841, -518, -2068, -2102, -1263, -22, 1308, 2171]
6334B171o94j583j831m90R79J344J766P09m80j551j822j023P90J497J205J258
6350B245l66j456j221j413m6J354J825J169J28j131j816j363K1P76J600J045Q75
6367B226q23j668j375n35P66J475J822P3l36j529j563o82J86J636J655Q11m08
6384A731j420j469p37n5J232J752J264l41j094j545j678qJ313J861J176mp73j651
6402d46j073m95P94J537J486N25p18j647j758n82P17J528J494P53k93j703j653
6419a534p05O77Q95J443J223K30j313j729j141j08J325J620J172j31j094j153
6435c23j541j75O51J503J620N32n11j830j660k92P41J123J409R39m36j699j774
6452a723o59O25J299K103L33p2j256j615r56k34J524J659J199j27j366j453j078
$$ y = [2171, 1477, -106, -1937, -2427, -1448, -104, 1662, 2371, 1891, 340, -1482, -2505, -1715, -218, 987, 2245, 1879, 423, -798, -2211, -2257, -903, 922, 2091, 2219, 1088, -728, -2091, -2070, -1294, 306, 1351, 2226, 1403, -265, -1640, -2175, -1409, 66, 1888, 1961, 1625, 96, -1467, -2149, -1963, -327, 1328, 2139, 1731, 311, -1158, -1895, -1950, -718, 1034, 2298, 1957, 863, -682, -2360, -2368, -1055, 806, 1982, 1978, 1205, -446, -1519, -2014, -1220, 317, 1803, 2328, 1610, -37, -1795, -2377, -1660, -132, 1362, 2115, 1822, 119, -1534, -2239, -1562, -667, 776, 1999, 2229, 916, -813, -1954, -2062, -737, 883, 2055, 1924, 830, -323, -1864, -2039, -1388, 115, 1735, 2267, 1756, -74, -1734, -2026, -1285, -162, 1247, 2186, 1750, 51, -1723, -2382, -1757, -458, 1645, 1978, 1906, 650, -965, -1921, -2155, -631, 1028, 2227, 2100, 734, -719, -1797]
6469a797j16R46J317J140P56j248j278j366n52J012J108J975J61o15j499j338
6485a394p89Q50J129J410R25m10j447j485r23L76J286J516J101l33r34j671j168
6502a961K3J088J671Q48K91q89j322j540m45R99J376J336P23p41j536j571n70
6519b220R73J079J731O10m28j389j671r79O29J453J575Q69o65p87j738r74JJ028
6537i03J922P40K51j047j265j354l20O27J896J159J25o86j405j230k73O25J044
6554i4J392O19k96j259j470j134O26J371J392J088m65j030j537j124j6J342J362
6571G67J135r4r96j833j000j35J276J288J094O19j056j305j355o20Q47J599J346
6588A577M61j001q98j140p67J01J466J436P27n36r75j559p38k7J278J509Q51J4
$$ y = [-1797, -1913, -967, 350, 1490, 2246, 998, -280, -1646, -2198, -1186, -78, 1897, 2058, 1443, -56, -1394, -2183, -1333, -204, 1206, 2131, 1721, 274, -1211, -2134, -1758, -472, 1044, 2145, 1812, 878, -793, -1961, -1938, -850, 821, 1669, 1960, 1071, -251, -1791, -2236, -1237, 139, 1475, 2198, 1457, -79, -1650, -2220, -1247, -168, 1563, 2173, 1745, 356, -1315, -2294, -1665, -212, 1363, 2232, 1567, 780, -958, -1932, -1931, -903, 1019, 1759, 2010, 963, -302, -1656, -1976, -1349, 547, 1706, 1831, 1145, -260, -1490, -1763, -1138, -94, 1298, 1917, 1621, 362, -1108, -2242, -1616, -245, 1147, 2235, 1770, 740, -797, -1921, -1937, -595, 767, 1902, 1808, 812, -1021, -2021, -2156, -880, 408, 1502, 2121, 1065, -240, -1595, -2215, -1368, 231, 1577, 2038, 1037, 139, -1001, -1768, -1667, -201, 1235, 1962, 1426, 451, -1108, -1846, -1873, -595, 914, 1765, 1779]
6606A779j454j128r63n3J129J225J258M9p81j413j029n70R40J366J305L43o81
6623A322j474j299m96N70J040J169J073m43j014j717q07N25J218Q91J139Jr16
6640G82j501r85k31J116J397J043N6p18j552j061l02R52J028J674M82r25j678
6657d23j164j30M58J321J134O78j03j794j058r15J78J632J092R26k93r47j408
6674h16r75L13R97J195P84J02q36j273j112k33J124R67J615j26n96j543r57m82
6692a852P82J460Q67O08q32j090j002o05J48J110J401R69k92j352j263n04j88
6709a635J019J494J003k7j324j264q87j67Q65J454J026J02m42j515j048l41M50
6726a237J441R99O53m58j424j356JK05R31J301O68j94j050j380r76K84J140J319
$$ y = [1779, 325, -803, -1766, -1819, -690, 535, 1793, 1842, 1061, -352, -1381, -1951, -1011, 355, 1660, 2003, 1322, -152, -1451, -1947, -1377, -337, 832, 1905, 1462, 448, -1269, -2076, -1551, -333, 558, 1697, 1698, 782, -719, -1704, -1935, -819, 578, 1621, 1677, 959, -593, -1654, -1956, -1004, 24, 1698, 2180, 1255, -423, -1587, -1717, -1259, 62, 1196, 1874, 1771, -23, -1081, -1996, -1818, -186, 906, 1832, 1539, 592, -816, -1791, -1478, -481, 714, 1498, 1600, 764, -509, -1621, -1854, -730, 237, 1852, 1726, 1130, -413, -1370, -1852, -1070, 390, 1257, 1865, 1033, -57, -1059, -1664, -1516, -406, 995, 1964, 1672, 320, -943, -1447, -1635, -616, 878, 1881, 1854, 530, -734, -1621, -1788, -923, 531, 1557, 1659, 1217, -298, -1346, -1687, -1237, 204, 1203, 1856, 1398, -26, -1382, -1381, -1176, -245, 1056, 1724, 1530, 480, -900, -1876, -1592, -452, 867]
6744H67P41Oj336j144p14l8O98J498J108j14q50j126j182m08R02J085J364N10
6762A867o76j492p40r28P74J243J115Q37o92p90j678n57K80J339J147O73j69r56
6780E97j341j168M58P25J343J090K68j156j192r59m06P96J591N92N66p10j617
6797e23o54p09N91J710Q15N08n72q29j461n55j63J824J021O64j83j115j318q17
6815a766J1J456J229M60K78o72j802n15l70R65J172P13N44r80j230j283J10O18
6833a062J382J123J61n82r41r51p62N30P22J375N88m57r89j074p95M6J289J076
6851F79R79j15j148r85p86q8P62J242J508p01n93j354n40n36P28J175J131M49
6869A807j064o52j274k91j11J447J382J76l8r28j597p08M41J031J293M81q2r74
$$ y = [867, 1608, 1614, 278, -866, -1580, -1618, -920, 578, 1686, 1572, 722, -404, -1586, -1994, -1092, -7, 1357, 1867, 1191, -301, -1041, -1969, -1195, 48, 1163, 2000, 1308, 518, -1160, -1717, -1437, -98, 1049, 1722, 1553, 597, -744, -1912, -1454, -729, 614, 1704, 1972, 816, -376, -1335, -1741, -945, 646, 1238, 1804, 1094, -523, -1177, -1886, -1295, 415, 1230, 1738, 1166, 337, -1124, -1679, -1842, -18, 1003, 1667, 1484, 369, -949, -1766, -1755, -299, 930, 1390, 1668, 996, -806, -1321, -1691, -726, 446, 1159, 1703, 723, -507, -1790, -1680, -1062, 320, 1443, 1604, 1022, 81, -870, -1632, -1102, -380, 995, 1583, 1126, 137, -937, -1732, -1686, -397, 679, 1658, 1543, 395, -590, -1376, -1464, -702, 540, 2048, 1347, 754, -600, -1140, -1676, -948, 227, 1358, 1807, 743, 91, -1183, -1474, -1585, -138, 1244, 1420, 1382, 454, -1143, -1851, -1410, -379, 914, 1395, 1313, 339]
6887C39j248p18J34J034J176O40K64j080j166n31o92J000J320R06R2m55j436p19
6905a140m86Q08R79J055L45l33q65j420q64P60J053J266N18m14p62j268r60L90
6923a338O08J455Q52J08j130p50j447J68Q00R63J310J65r05j002j180l02P49Q76
6941@J360L01o45j121r85o32O10O62J401Q65l68j355r76o84L20P10J073P70J79
6960A485r17j058j067K26O76J330Q26o8m45j452p44l37O14J368N83N60o61j048
6978a29j309m98J027P64J030P40k87j153j464n24J81J248J394M25Kj072q72j133
6996a630J1J067J077Q92M37j299r51j029o5O82J125R19P7k50j312q31k27M14J249
7015C56P66O80n68j119j111p75N34R99J213O36n50n25j257q06K18Q35J019Q71
$$ y = [339, -909, -1627, -1493, -459, 717, 1357, 1621, 541, -625, -1156, -1848, -848, 472, 1378, 1470, 1015, -421, -1140, -1626, -818, 161, 1216, 1561, 1228, 363, -1057, -1921, -1161, -108, 1158, 1676, 1262, 500, -768, -1728, -1338, -730, 725, 1577, 1685, 555, -195, -1642, -1474, -674, 289, 1599, 1764, 859, -143, -1323, -1625, -876, 0, 1360, 1661, 1016, -105, -1090, -1722, -1112, -450, 951, 1816, 1448, 93, -883, -1567, -1247, -537, 536, 1306, 1485, 568, -490, -1557, -1331, -655, 675, 1501, 1433, 988, -464, -1208, -1545, -931, 437, 1020, 1580, 919, -129, -1438, -1936, -909, -145, 885, 1625, 1338, 185, -1279, -1803, -1622, -374, 1020, 1445, 1447, 375, -497, -1630, -1619, -552, 525, 1417, 1854, 555, -396, -1425, -1490, -808, 317, 1236, 1313, 1063, -249, -1080, -1307, -893, 356, 1122, 1802, 1234, 115, -996, -1771, -1237, -238, 975, 1611, 1061, 536, -721, -1527, -1309, -474, 545, 1416]
7033A416Rj166p98j014m6J130Q34J002k06m31j429l73j56K98J053J221R6j94j369
7052a23p16n57K05J026J223N09j79j284j043l79J67J005M94J275m39m31j701o04
7070a552R8O69J222R63j88n20j008r00n71O76J332J108K53n39j146j164j66K78
7088a155Q79J423J68k48r32j055o44K31J023J098M79K67j139q86q54o4P60J082
7106D33Q33Lp92r38j132j0P07J268J097j0o36j068r66q6M11Q39J070L16k69j178
7126a08r56n66L95J108J215N58m38o51j358o35j22P72J481P88k7p95j542n16j11
7145a508J145O98P66L03o32q63j095l72P69J116P51M09l86j074q85p15M24J181
7163C2N86Q82k88j041j029o44J56R23J000O44k48m00j304p27R2R60Q43J005J84
$$ y = [1416, 1425, 259, -539, -1553, -1599, -469, 365, 1367, 1161, 730, -699, -1072, -1228, -930, 123, 1344, 1440, 1246, -123, -839, -1396, -1191, -165, 1058, 1567, 1388, 104, -939, -1318, -1151, -146, 348, 1623, 1184, 753, -948, -1552, -1454, -785, 437, 1400, 1212, 692, -316, -1216, -1787, -1111, 221, 1329, 1582, 1043, -103, -1267, -1433, -1155, -276, 1147, 1315, 1067, 135, -920, -1564, -1333, -310, 788, 1267, 1534, 395, -491, -1345, -1409, -649, 433, 1266, 1269, 477, -461, -1593, -1603, -896, 372, 1469, 1459, 823, -245, -1211, -1297, -886, -47, 1023, 1339, 1070, -108, -1064, -1630, -1235, -127, 1088, 1646, 1208, 557, -801, -1436, -1558, -786, 695, 1483, 1456, 661, -881, -1397, -1508, -363, 335, 1101, 1404, 772, -91, -1186, -1558, -789, 327, 1078, 1487, 1101, 27, -858, -1573, -1149, 32, 618, 1500, 1212, 171, -858, -1502, -1346, -423, 577, 1221, 973, 573, -731, -1458, -1366, -406, 437, 1442, 1626]
7182A626r29q73j010j08K73R23J143O28r89p83r19k43L35O64J124Q83p82p82j227
7201a046m44J70J007R23O25j59n99j195n69K05M88J350L14K29n42p99j199j30
7219a371P79J002Q96L07o64j280p12j79N56Q69Q84J38j53q68j113n40L30J186
7237F7P67N45k12q40q56m97k39O85J115P75j44o99r68o83k27Q95Q68J024L48q24
7257I00j115j109p4N07J061R24K82m96r36p78m98M4J314J102L91l92q46j098m92
7276a309N8R42J024K34J98p26r19j016Q3Q27R53N06L69o43q86q65j51M11J357
7295D47P16M03q44o85q23o55N22R36Q70M06j00j138j118k14J53Q35P64O80R1o96
7315E50j098q04l9P21J246N81K52p77j065p03l03P33J053O92K02l03r59j039k22
$$ y = [1626, 697, -176, -1186, -1294, -1021, -98, 1045, 1673, 684, -99, -1018, -1261, -926, -262, 862, 1745, 963, 181, -1046, -1490, -1320, -313, 610, 1235, 1076, 477, -718, -1287, -1082, -594, 756, 1070, 1299, 757, -42, -1241, -1371, -592, 410, 1306, 1613, 949, -331, -1043, -1222, -666, 203, 1087, 1225, 1072, 204, -909, -1449, -1119, 67, 834, 1379, 1167, 327, -529, -1026, -1265, -580, 535, 1310, 1166, 467, -501, -1184, -1411, -516, 352, 1376, 1724, 900, -215, -1324, -1398, -891, 170, 1094, 1376, 880, -56, -834, -1332, -1288, 26, 1128, 1519, 1127, 281, -817, -1309, -1251, -309, 715, 949, 1147, 421, -498, -1514, -1431, -604, 349, 855, 1224, 581, -305, -1170, -1321, -910, 447, 1163, 1566, 722, 37, -786, -1441, -919, 17, 887, 1293, 1193, 55, -1063, -1277, -1124, -289, 475, 1155, 1246, 550, -548, -1352, -1391, -670, 576, 1157, 1409, 632, -433, -1136, -1439, -706, 347, 1039, 1241, 938, -21, -1060, -1282]
7334a282N47R14N84Q75k60j112j328l45K84J254O07P43l97r36p41n27l3P31R40
7353E18P94P1r21n86j214J88O28R14N07J23m29r13q89kM33J304L67M30m35n90
7373B98j245k81J31R51J083L61k55j076o42l28n2O42R61P82l74l05j540o75L88
7392a176N64J123O24J81o31r19j155J73J16J433N29P33q92q30r21r4L03J032Q47
7411A040N06m50j028o66q38L53P60J106L19K22j057q61n10k24P95J132M06Q7m56
7430F36r62p72n29Q87R52P26K51m97p83r26k27M95P81O32O18l02j100m39o54J53
7450a060P81R65O20l15o85j197k44j5M53J384P88k72n41j085q29j94J202N59O74
7469I89L45n98q64j005k63P75O47R24K21j65r07r69l03j19J337M58P43j37r31
$$ y = [-1282, -735, 179, 763, 1638, 1378, 266, -1062, -1407, -1123, 131, 738, 1481, 1084, 148, -593, -1120, -1153, -422, 518, 1312, 1383, 462, -124, -1338, -1150, -522, 392, 899, 1022, 593, -320, -1209, -1211, -778, 526, 893, 1323, 888, 298, -947, -1228, -1097, -146, 937, 1298, 1043, -33, -675, -1003, -1055, -413, 548, 1330, 956, 651, -889, -1564, -1176, -612, 511, 1135, 1316, 685, -234, -1389, -1216, -1100, 333, 862, 1595, 703, -127, -1048, -1142, -839, 193, 1040, 1546, 1096, 68, -598, -1436, -1083, -323, 783, 1102, 1324, 267, -594, -1104, -1328, -533, 599, 1005, 1092, 636, -326, -1098, -1627, -740, 212, 938, 1189, 692, -91, -1017, -1244, -749, 32, 664, 1282, 980, -120, -559, -1213, -1060, -279, 686, 1306, 991, 306, -891, -1135, -1150, -697, 687, 1475, 1203, 662, -423, -1252, -1446, -244, 315, 989, 1334, 736, -128, -1133, -1396, -621, 26, 950, 1171, 1006, 99, -870, -1173, -1292, 45, 503, 1246, 1109, 178]
7488A78j298K20k53N18J503J94L49j399n19p86j53R11R49N18q6K86j480q97Q8
7507a157N33Q43Q00J42l56p22r42l12L69P41R27K86o9q77q84m27J14Q78J122K6
7527A035L67j106p29q80J81P81R41M55L5o34n64r88p7M46J035P99L86o22j056
7546a95o55j71P2Q10P54O48l51o83r71n06K94P98P42P27k66p61p13n91K47K78
7566d93J388K24k21m58q12j088K87N67P97O63L25n13j044o79l6J91J015Q02J08
7585A023j02q63o69n82L18M70J068O45j76j048q85k82P8N41Q89Q25l36l35j047
7604d68o47K8N34Q29Q44o5m26p09r03k88N06J047N78J17o63p1r43n32J30R70R29
7625G97M08j86r77o00n84L47P29N50M91q3m72r69m31r6N23R42N90J04o82o79q49
$$ y = [178, -1120, -900, -1153, -635, 868, 1062, 1411, 12, -507, -1293, -1446, -535, 414, 932, 846, 1132, -348, -1245, -1157, -624, 219, 1019, 1161, 805, 83, -859, -1171, -802, -61, 866, 1152, 1083, 206, -678, -1105, -991, -113, 1009, 1035, 1402, 296, -433, -1313, -1132, -351, 590, 1045, 1080, 446, -118, -1106, -1183, -737, 298, 1097, 1483, 861, -195, -850, -1021, -949, -139, 615, 1263, 912, 229, -742, -1248, -954, -156, 586, 1313, 1047, 286, -427, -1018, -771, -493, 895, 1119, 898, 440, -372, -1460, -1173, -606, 191, 854, 1179, 666, -378, -1057, -1093, -902, 113, 915, 1023, 921, 58, -611, -1193, -875, -405, 663, 1308, 1132, 84, -801, -1083, -1005, -464, 425, 1250, 914, 579, -468, -1115, -1087, -553, 276, 1120, 1055, 629, -80, -983, -1271, -765, 282, 860, 977, 314, 243, -700, -1232, -1102, -132, 797, 1205, 1019, 42, -558, -1142, -795, -66, 484, 975, 892, 420, -549, -980, -1076, -553, 389, 979, 1083, 401, -278, -1127]
7646a127PN15Q94P63K82q49p49p05k60N79R05N59j25J36q38p11n80O41L88J040
7666G65J31K51p40r41l05j6N27R74L92k6m61j052n56L04L81N29Q16L57n68q60
7686i8o35m41L84R60L42O76r6j069n31q70P41M32R66L67j53o14j331j06K55M45
7706c76R61M07k0n33p61m60m89Q01R85N19J88n99p88q29k54N92J240P1L69n62
7726D62n10p30m56K96Q78J044N2j48r64o96q0%N18Q40P59l63m21r85m22K39K44
7747d43Q82K99L52o15p19p16j63O72O72N18K61j49j080n13m52L71Q20P14O87o67
7767G31p47o69m29J95R54N36K10j22m02q81n29O6P67Q96M7K68p02q45k45j35O85
7788c51M66Q16J25o62n87o37k17K70Q43P12J60M0r24j104j90L17J179O96j59R3
$$ y = [-1127, -1120, -605, 289, 1052, 1334, 485, -264, -969, -1229, -650, 255, 814, 689, 825, -13, -724, -1304, -663, -275, 765, 896, 1147, 407, -534, -839, -855, -328, 646, 1038, 1012, 551, -501, -1057, -753, -372, 157, 973, 1330, 762, -98, -733, -1174, -790, 170, 512, 1188, 1092, 23, -508, -1378, -637, -205, 761, 1128, 975, 361, -970, -1076, -821, -376, 585, 992, 972, 439, -322, -782, -1271, -470, 515, 1034, 1222, 623, -165, -994, -1248, -656, 584, 655, 1024, 462, -48, -778, -1234, -938, -60, 984, 1036, 888, -76, -772, -852, -852, -334, 506, 1265, 902, 481, -504, -926, -687, -443, 439, 738, 1090, 475, -244, -960, -1123, -451, 221, 739, 1000, 851, -229, -742, -1194, -823, -3, 711, 1398, 731, -16, -685, -1114, -919, 35, 571, 781, 659, 257, -624, -1153, -1087, -320, 576, 623, 891, 189, -656, -901, -1036, -351, 115, 931, 1056, 394, -193, -830, -1047, -777, 66, 778, 938, 978, 54, -1050, -1240, -923, 256, 952, 793, 886]
7808H86r24o18m18Q4N04R14P20l3p42q33m17j61M81Q40O50J03l60q06o52l29Q68
7829b43N44M53q5k83l22n06n01J55O91J234q5k87n32q74mj60J121K32K76J5n11
7850C28q96n62N3O14P57O72N8n80o88n59k46M59R89N71J72l51r23o80k20N70K95
7871a67N50Q31o25n12p08l39J26P52P85J64j51k35r20n62N4M76Q75M12J02o30
7891B78l12q71j62O90P43M65N78r81p54r18K66J21Q59O29N90m94o86m78l75J72
7911f40N65P80J71K9j062m19j81j85J033L20N83j17n56n10m62k81N60N23R11l4
7931A028n47p69r41K58M63O67N34M09p57n29m03k30j10P39J151j15j77o50n52
7950e31n40L63O85L82K40L38q82o11j70n9N35Q20K55K56m67j060l62l30Q67K87
$$ y = [886, -38, -656, -1074, -990, -486, 428, 1148, 1115, 373, -460, -877, -1038, -557, 283, 933, 1036, 676, -130, -782, -1111, -243, 301, 754, 669, 386, 64, -442, -943, -788, -97, 1137, 1052, 765, 233, -641, -645, -805, 316, 548, 824, 839, 328, -568, -1130, -1077, -463, 294, 966, 1024, 444, -244, -803, -1049, -590, 399, 970, 1142, 791, -132, -812, -1032, -462, -167, 383, 1214, 589, 77, -631, -970, -844, -92, 693, 857, 706, 471, -449, -1011, -957, -481, 394, 806, 908, 278, -34, -905, -1067, -377, 366, 831, 1409, 428, -326, -1244, -978, -857, 2, 631, 1221, 727, 41, -437, -812, -640, -75, 705, 876, 905, -157, -576, -757, -942, 91, 411, 994, 877, 321, -189, -651, -932, -372, 151, 1062, 1028, 481, -288, -1229, -971, -508, 159, 693, 1102, 345, -184, -587, -817, -927, -188, 963, 848, 671, 21, -531, -1071, -708, -23, 359, 599, 937, 55, -556, -726, -785, -250, 570, 825, 1081, 614, -446, -808, -1138, -271, 16]
7970A6J114j38l68n02q84J8Q8O25O84J17P8p23q16l83K33O36R38J2m5m10o56n08
7992h74k1P44O05L60r0m79o37j80k77M00N21N67N53p33l60r25k20L75O88N43O02
8013A162n99p45n62n15M60O50P07N80m75m80n27n11J61J07J113K94j00n08m07
8032a95q06J07P4P79Q04M24q01o65o79J92M46M87P60J0m30m51p86rL87M41R33
8053A022j11k68q03m74j78j60M88R01Q19m46o16m17q84L15N97P27M95j48m90m98
8073a29n22j53O14J83J180k00m96l73q58m29N61P33O26N37p08l96p28k65J13O62
8093d8N43L73J00o30p44n11p2P11Q01O09n10m97m46n90k08P56O89N41J19m66o26
8114a06p81M3L48O03K32Q00n61p21m97j24J00N48R47j53k96k46o57o36M56L50
$$ y = [16, 1130, 992, 624, 122, -762, -744, -656, -31, 653, 770, 848, 125, -691, -1074, -841, -205, 733, 745, 700, 290, -366, -874, -895, -151, 454, 814, 724, 245, -392, -572, -849, -449, 72, 639, 1192, 459, 99, -826, -1046, -671, 17, 560, 1162, 563, -182, -744, -1259, -799, -149, 558, 1138, 663, 183, -344, -855, -694, -587, 526, 820, 720, 212, -195, -1001, -894, -820, -41, 763, 1187, 386, -279, -958, -766, -320, 167, 927, 937, 507, 56, -730, -739, -352, 89, 1022, 911, 643, -160, -634, -812, -972, -484, 417, 1236, 790, 174, -243, -1127, -812, -215, 512, 1007, 859, 369, -129, -651, -804, -190, -7, 1173, 973, 477, 104, -754, -1183, -622, 111, 737, 1274, 566, 170, -558, -823, -710, -48, 495, 868, 968, 338, -406, -917, -989, -278, 523, 1132, 622, 125, -321, -911, -1119, -363, 326, 867, 986, 520, -106, -887, -844, -496, 107, 339, 1139, 578, -143, -640, -764, -664, -116, 831, 678, 382, 136, -521, -1157, -701, -351]
8134c51R19L05o0n15p61m57K56M47P49K65j16r4n51q70J8M57O25O44j56j69o50
8155f5r49j9M91P69J85L87k18m17o82n11N08N83M42N19M4q33o27l41J15J15J047
8176E43J73r3m94k70m92k71N09O77M17K92l69p17n86j93N75
$$ y = [-351, 568, 873, 813, 298, -463, -920, -664, -217, 532, 797, 681, 587, 36, -834, -816, -359, 266, 910, 754, 585, -65, -1014, -1033, -542, 227, 412, 799, 581, 164, -518, -1029, -521, 62, 504, 1023, 1067, 234, -393, -734, -619, -504, 543, 716, 623, 129, -141, -633, -904, -395, 282, 699, 991, 622, -95, -681, -874, -299]
8191b99
$$ Imaginary data points
##PAGE= N=2
##DATA TABLE= (X++(I..I)), XYDATA
0@%%%%%%lLqJ6j6J7k1K8l5M1m9O0o8Q0r7J12j32J53j73J99k26K57k94L30l71M18
32B21m69N24n84O52p25Q04q96R94j099J218j346J490j651J830k034K264k529K837
50A501l196L629m159M823n688O863q568J1275j6259K8504j14620k13989J02236
63b07648J89039J65778J7423o5615r7669o2348m5499k0753J1530R0987J39451
74A14676J00134m3515j69704j81425n1538J08659J89152J29016k647j04035j12407
85b3634o6442j8037J6999O0327J01516J02883L0885r0717j76156j38002J4805
96a85573J61912J82161P0551o7176j28520j01682l7319J5303M6798P3147R2984
107A22586O5547k6673j34838j60394o7026Q1323J72466J41015J7629j06004j43607
$$ y = [0, 0, 0, 0, 0, 0, 0, -3, 0, -8, 8, -8, 9, -12, 16, -19, 22, -27, 33, -35, 45, -52, 60, -72, 81, -92, 107, -119, 138, -156, 174, -197, 221, -248, 276, -308, 344, -381, 423, -473, 521, -578, 640, -706, 784, -867, 963, -1071, 1193, -1336, 1501, -1695, 1934, -2225, 2598, -3090, 3773, -4795, 6480, -9779, 18725, -95895, -309884, -207648, -18609, 147169, 164592, 98977, 1308, -61040, -106539, -127292, -115762, -24775, 114676, 214810, 171295, 1591, -179834, -231372, -122713, 66439, 195455, 192808, 88773, -23634, -90076, -108113, -91114, -30787, 70729, 173612, 204497, 113780, -62376, -200378, -185573, -23661, 158500, 229051, 161875, 33355, -68327, -105646, -90343, -43545, 29602, 122586, 188133, 161460, 26622, -133772, -200798, -119475, 52991, 194006, 211635, 105631, -37976]
118c7976q8643j5N6409P4315P2721N6500J0364o7181j32436j21712j4544J24391
130f7807J80031R8747n2393j48793j30423l8396M5104P7978P0775N3651K9300
141A17774k2896r6210j32783p3603N7309J60077J46823K8718j02211j51742r8824
152a67568M347P9862R2523O3437K7079j1583n8667r7821r3330j8285R3247J59856
164G3097J12576k4189j44000j52143n2921O1791J09290Q4172L2239p067l5336
175E7509o7639r0473o1379L1530J31020J45847N0024q6169j56789j13179L77R5412
187f3909J12949O5179L044l5935n7331p1497o4519j3996O9237J30092J08721L18
199A82353j21217j58335p7682N4023J30133J06507K5315l9394n9828n5954n2848
$$ y = [-37976, -126619, -126634, -70225, 4090, 76811, 133311, 143675, 76494, -55942, -177654, -192198, -67807, 112224, 210971, 158578, 9785, -120638, -159034, -113930, -35952, 34823, 88474, 117774, 94878, -1332, -134115, -207718, -150409, 9668, 156491, 185209, 82998, -68744, -167568, -163221, -83359, 9164, 72601, 99680, 88097, 29430, -68391, -161721, -180006, -86759, 73097, 185673, 161484, 17484, -134659, -187580, -125789, -16499, 67673, 99912, 92845, 57509, -10130, -100603, -161982, -130452, 568, 146415, 196439, 110270, -46519, -159698, -159321, -63909, 49040, 114219, 117263, 81328, 23997, -47500, -112019, -126015, -56778, 73314, 182035, 182353, 61136, -97199, -174881, -120858, 9275, 115782, 141097, 101703, 41875, -14079, -66927]
210f6927l7668J6270R2945J26213O4218o1270j50176j28659j5372R6886J29472
221F5932P5343q299o3729p3083n7556l3796K911N5541R7450Q5637P474r3083j41376
234h0634r0051K8377J23885J26378M2498n1230r1737p2102l0849J448K9411O4002
246f04Q5616N4433l4595j21817j28108l6310Q3595J38351R2114p747q2617r2063
258d9752n3366p573K6710N2952P2078O1472N566p2681j18638q6439J3557J10829
270d5285J31143N8276m7864j08136q8378k3649L0737N1909N4352N3011L2705k2146
282G6675q8995j10510m7955O3138J35243J07401L837q9883j09407n7646J1100
293a07002N1633N9406N2746L5791j378n6472r4165p5429M079R4111J24205O8052
$$ y = [-66927, -104595, -88325, 4620, 130833, 195051, 133781, -16395, -145054, -160426, -63540, 65932, 141275, 132976, 69247, -3836, -61392, -95188, -92277, -36736, 60714, 146351, 153825, 60742, -80634, -170685, -142308, -18423, 107955, 150453, 99223, 7486, -64616, -95465, -94017, -64606, -604, 85012, 139445, 104850, -16967, -145075, -181385, -97790, 40561, 132675, 124928, 42311, -49752, -103118, -110691, -83981, -31029, 41049, 102521, 108087, 35406, -83232, -169671, -156114, -45285, 85858, 144134, 96270, -11866, -100244, -123893, -93156, -41247, 13105, 66116, 98821, 76675, -12320, -122830, -170785, -107647, 27596, 134997, 138834, 48951, -60456, -118102, -107002, -55369, 4037, 56783, 92574, 91196, 34724, -59441, -134870, -130791, -36680, 87525, 155577]
305A55577l5720j09604j02816l0743M5394P5079O0844L0404K365k7126o3145q0594
317h0085m5684L9174J13120J11578K3967q2226j22523p4592J3528P2831P4415
328D3503M2103R314j8036m6028o9669o1180m002P2888J10935P2485k1757j03720
340B6836j11375m3647M4532R0227P2917K1827k2071m3759n1982n2487k9781K3817
352g4946Q4403R8344L8374o0020j21286r2346K8Q0819R4035M7543q774m1535m9154
365d515m8570l8251k432N3941R1171O9732p990q9274j11562n5569L6727R6702
377i890Q6528K5573l6466o2571n3191l1129o344K6127O1100P5564L9658l8153
389G6806j03033r8398j8570P5976J09526O4153j3494o3554o3064l6649j0469J1763
$$ y = [155577, 119857, 10253, -92563, -123306, -77912, -2833, 58011, 88415, 90780, 63654, 509, -80085, -125769, -86595, 26525, 138103, 162070, 79844, -42679, -117271, -103743, -30912, 43503, 85606, 94920, 76884, 30856, -38813, -99993, -103995, -31107, 79828, 152313, 130556, 26836, -84539, -128186, -83654, 6573, 79490, 101317, 79246, 35487, -16495, -68982, -98763, -74946, 9457, 107801, 146175, 86155, -35131, -127477, -127449, -46630, 47405, 94948, 86174, 44639, -4515, -53085, -91336, -93768, -39827, 51344, 121076, 113086, 23812, -87750, -143319, -106592, -9890, 76638, 102211, 65745, 3174, -50017, -81146, -87490, -61363, -263, 75301, 114959, 76806, -26227, -124625, -143195, -67219, 42307, 106460, 92966, 29412, -33652, -70301, -80770, -69007]
401f9007M2694O7745N9402J186p2179j04038o0903K8272R6365R5036L2103m0552
413G6124p5721o0345k1736J4546L7310N0917N2702K7662k7382q1166q8535k9587
425a25211N8791J09128P9744m232p3463q2427m0732Q055L4479M2400M5860L7821
437I0213K841n2873q7678o3782J2505Q6898R9417M3023l8393q5075p1948k0752
449h5604K8116M9982M9108L4383R603k5998o3048p1697l2793M0359R5767Q5204
461A13382J1567o9423r6418n5408J2425N4411N4461L3635J3145q577l9357o5844
473d2001n7057l46O9816R7736N3513l0292q9583q3604k4564L7148O3829N1472
485D6067K2283o862l2194n1417n3658k4622L0614P8317Q0095K1627n6947r7793
$$ y = [-69007, -26313, 41432, 100834, 102020, 29841, -74197, -135100, -106828, -10463, 84573, 116676, 76124, 403, -59942, -81678, -67132, -29822, 21095, 73797, 101459, 74077, -7089, -95624, -125211, -66420, 42708, 122452, 118220, 44757, -37670, -78402, -70347, -35868, 6532, 52392, 90213, 93054, 40181, -47497, -111279, -98774, -11876, 87541, 130564, 92171, 7096, -64852, -85604, -57488, -7506, 41602, 75985, 85588, 59590, -3458, -75155, -107948, -67589, 28178, 113382, 124949, 55526, -40892, -96300, -83875, -29464, 24997, 58632, 71777, 63200, 23843, -42001, -99058, -99404, -29588, 68148, 121661, 91369, 1786, -81818, -106382, -69234, -5405, 46067, 68350, 61488, 29294, -22123, -75781, -100403, -69789, 8528, 88623, 110250, 53303, -44490]
497d4490o8208N972O5737P2293L5568n412k8567l8148m4337l7031k394N1541Q4657
510D7181N8887j6263q4736r1443l3595M0987P7873O0461J5427k3929m1435m3576
522c4161l5671j1871K6642O3692O8557K5001m3616q9267p3745m813O5588Q5264
534D1600M6855j2194m7130m8082l2285j4298P475L8699O3387N2822k343o9307
546B5199r1536m5444L3783Q4085P2483J7625l5487n4767m3695k1683K206K7626
558b9605N0645N3903K2458l3565p7698p1974j4036N6360Q8063N7532q125n8177
570C5781o3026l2360J544K3451L6885M3537L5669M8n0858q0142n3181J9029Q0440
583c183Q2249K6107m0035o8403n1446j3643J7760L3440M0821L8138J5623k6848
$$ y = [-44490, -112698, -106726, -40989, 31304, 66872, 61460, 32893, -5255, -49592, -86623, -89017, -37476, 47181, 106068, 89805, 5069, -86374, -119969, -78982, -1109, 59352, 74779, 50850, 9415, -34161, -69832, -81703, -55061, 8631, 77188, 102189, 58573, -30694, -104439, -109252, -43664, 41600, 88455, 76261, 29131, -18951, -51236, -65534, -58059, -19360, 44027, 96849, 94506, 25199, -66337, -111781, -77998, 6087, 78570, 96195, 60708, 5941, -37754, -59437, -57231, -29605, 21040, 74943, 97401, 63836, -13862, -85836, -99872, -43512, 44551, 102083, 93958, 35781, -27245, -59605, -58061, -34610, 2275, 45812, 81481, 81529, 30671, -49471, -102652, -83623, -3183, 79066, 105173, 65138, -3265, -54711, -68354, -50594, -17154, 23667, 61805, 77428, 50580]
595E0580o5454o6141j9606M6484Q3133O3243j03n9370p3534m0283Q545L8926M2748
608I168L2987J7708o365l8429o1247m9248N090O6250Q5125M0076l3559p7518o3697
621g3659j3999L1366M7836L9277K1890K270k3775m9995n5009k0398L6899P5790
633A8493O4649Q384n4172p7750m8894P667N0690N5326L1226K748j9864l5571m3542
646d0610l3937J166N0282P5752M7858j9300p6315p5408k1674L8447O2914M5517
658E4692J1866j5710k9352l7010l7276j7410K6100O4983O3204J4636m8237p7978
670b7492n4524M135N4556O4225L4320o204l2822l9873l3802j9541P040M0182N9297
683D9497M3308r053o5087p7810l3204L3722P0589N5592J0811k8480m1821l5535
$$ y = [50580, -14874, -81015, -100621, -54137, 28996, 92239, 92136, 32766, -40768, -81051, -72506, -33580, 9168, 42155, 59863, 53498, 15069, -46178, -95426, -90336, -24086, 61039, 101115, 67556, -9962, -73659, -87658, -56292, -8456, 30821, 52711, 54981, 31206, -18789, -73798, -94196, -57297, 18493, 83142, 91526, 37354, -40396, -89290, -81623, -30933, 24393, 55619, 58367, 38503, 2932, -40610, -74547, -73381, -23099, 52653, 100511, 81211, 4896, -70512, -92186, -53739, 9175, 54692, 66558, 50848, 21496, -15514, -52790, -70200, -44100, 20883, 84087, 98723, 50486, -27492, -82016, -77881, -23325, 40900, 75220, 69016, 36194, -3679, -37481, -57022, -49982, -9800, 49497, 92805, 83752, 18665, -59145, -92349, -58627, 11962, 67554, 78365, 49885, 8064, -27471]
695b7471k2114n161K1316M9270N3815J8953l9060p3948n8310l049N2390O9209
707C5840M0787p951m3658m7348l0707p035J6328L6062M5700L1913n672n0756o8959
720e5456m0484K1005O8886O6410J9127l4064n4672m1681j2645J1417K6274L5897
732A0014L9217J7272k6086o3760n9733j0614M7873P2865M7321n322m9276n5733
744c5962l0174L498K6468L5900L5242K2298o861l9790n7395l9150J0733O0585
756a4608P0990L0070k9762o3885n1470j1095K5118L8164L3670K1700O764j9189
768C6467m7855n2209j7652L7850P0740N4072K91m9917o2775l4917P664L6757M0985
781A9501K9449J0720j2259l5707m6091l1603P040M9872O4188L5456k1091o3714
$$ y = [-27471, -49585, -54746, -33430, 15840, 69655, 88608, 49548, -24400, -82710, -85759, -33369, 35840, 76627, 68676, 25018, -22330, -53037, -60072, -43744, -7682, 38018, 69931, 64259, 13503, -55456, -95940, -74935, -6049, 60361, 79488, 45424, -9248, -50929, -63574, -52157, -25883, 10014, 49231, 66503, 40417, -23343, -83076, -93690, -45817, 27048, 74369, 69047, 19771, -35962, -66136, -62638, -36170, -270, 34972, 57270, 50409, 10619, -46776, -85926, -75193, -14608, 56382, 86452, 56690, -7195, -58665, -69760, -44642, -6478, 27192, 48892, 55656, 36467, -11388, -63597, -81249, -43399, 27341, 81413, 81704, 31787, -30988, -65905, -58241, -21484, 19501, 48950, 59670, 47411, 11704, -34387, -65990, -58950, -9078, 55110, 90566, 69475, 5761]
793E761n9991j6980K9620M9290L8181J3244q922k4677l6020l7743j6007K6122
805c8122O0606N4892P477m5941o7220m2033O543M3988M8341K6793P55k0863l4689
818E27l7661k3763Q065M2229N5199L3241j4657n6669o2248k5156K6979N5536M5819
831D7441J1809j9903l3904l2737k3858p049K0249M6051M9492J5466l6731o6035
843b9709m9709J379M6669N7098L1522o359l1433l6130k9057j3296R924L5702M6830
856C3431L0323q938m8939n8908k9576K0852N6933N3264J6556k4255m3442l5809
868c8508j5070O244K2841L6142L7391J5436k5057n7383n2118p009M4736O2917
880C0562L8676p351m0345m2253k4315j914J6101L0660L7639K5907n849m1515n4972
$$ y = [5761, -54230, -71210, -41590, 7700, 45881, 59125, 50203, 25526, -10494, -48237, -64244, -38122, 22484, 77376, 84853, 38912, -28308, -70341, -63798, -19810, 28531, 55324, 56079, 35216, 527, -37134, -60897, -52832, -10603, 44596, 77837, 63180, 6511, -55737, -80893, -53914, 1622, 47441, 59250, 39347, 5443, -27294, -51152, -58201, -37952, 8099, 57591, 73057, 36326, -29709, -79418, -78039, -31370, 25728, 57250, 50891, 19458, -16672, -45729, -59025, -49101, -13399, 33431, 63754, 54816, 5877, -53031, -82607, -61755, -4822, 48442, 64998, 40743, -2699, -38508, -53578, -47334, -24493, 11649, 49040, 64476, 39419, -17964, -70082, -77091, -32355, 30562, 69238, 61887, 21542, -20711, -45026, -46940, -30839, -179, 37460, 63367, 57518, 16003, -38969]
893c8969l1791J5750N4094N6831K1225k3630m9860m1707j2485J4881K9501L2102
905B5942K5219P974j9425m5347m7795j4575L4328O2593M6018k078m3595n2344
917b3085k8469M851K6906L1869K7542J5333p261l4212m7202l0814R604M8071N5095
930D8228K6286k0840n1789m7245j6506J9617L7618L4614J7376l270k2604l6185
942a4700l6269j3886K4395N3327M7838P126l9903n7986l6458N293L6055L9360
954A4192K4274M163j3911k9212l6997k5804O373M1104N2509K8598j5978n0335
966a024n0714j8896K1342M3529L8383J4702j0895k7808l1953k5674o874K0687
978c5195M3217M3908J2573l1571n6949m2819J114M0140M9168K6884m018k4374
$$ y = [-38969, -70760, -55010, -916, 55915, 77140, 53510, 3650, -38057, -50542, -35661, -6160, 25942, 51161, 59135, 39710, -5637, -53432, -68007, -33679, 28914, 74932, 72854, 29259, -23085, -51554, -46703, -19797, 12072, 39614, 54947, 47686, 13474, -33728, -64542, -54938, -6867, 48228, 74514, 53674, 1885, -45360, -61866, -42249, -4631, 29983, 47359, 44089, 21485, -14700, -50969, -64855, -40460, 12867, 60705, 67831, 27928, -30058, -66516, -61223, -25168, 14192, 38466, 42629, 28718, -494, -37491, -63295, -56922, -15818, 36691, 65289, 49311, -1024, -51738, -70634, -49292, -5763, 32620, 47322, 36427, 8619, -23334, -49008, -55882, -35195, 8022, 51930, 64503, 32932, -24017, -66836, -65722, -25582, 23586, 50470, 46452, 22078]
990B2078k9403k6571j5543O864L2357M6237K9698j0707m7074n2451k2182K1547
1002d5150M7666M2463J3897j7328l3186l2331j8315J268K1743L6716L4834J0920
1014F3197k5125n0617m4145m882L7735N4179L2238n777l3717l6455k1918m965
1026d0252J2123K7316L5471K5132o430m0678n1400k6327J8687M8530M6026J4171
1038F2369k0930l9035l3840j4315P553K4794L1899K7112O704k2637m3742m0528
1050e4596q635L1855N2568L7956k529l7205m3963k4649K927K1215K7912K5817
1062B8673J6009n504l1903m4853k8114J1505M6315M9773J8757k1864m4265l7700
1074d3171j1514J4811K9603L0417J9790L94k1299l6901l3812q372K6836M7814
$$ y = [22078, -7325, -33896, -49439, -42575, -10218, 36019, 65717, 55010, 7936, -44515, -66697, -45150, 2516, 44979, 58876, 41548, 8362, -23969, -42284, -41016, -19273, 17443, 52277, 63197, 38072, -12545, -56690, -61572, -23837, 30342, 62580, 56803, 23086, -13369, -35287, -40252, -28129, -813, 34658, 59790, 53360, 12682, -38718, -65045, -46358, 2172, 48198, 62369, 41439, 2404, -31436, -45751, -38198, -13404, 18495, 45607, 52311, 29674, -14068, -54596, -63231, -31376, 21192, 59148, 56619, 19414, -24549, -49198, -46271, -25056, 2856, 28673, 44682, 39178, 7275, -37578, -65692, -54187, -7872, 41901, 60658, 38794, -5471, -43171, -54685, -39874, -10271, 20146, 39936, 40330, 19031, -17870, -51682, -60054, -33218, 14596]
1086A4596L9455L401l5700m8752k9321N010L0434L3886K1661N407j0717k6283
1098C077l4333k3883N989L9666M9526K4001j8491m6892m2425j1660K0469L5285
1110C29L0690J3436n241k2422l2140k6837o080K2977M3189L6943N860l1430m8745
1123a9471l3463K607L4112M0234K3352j900k0230k6744k5882j4945O259L1140
1135d931M2499K5867j2638m5005m6956j5940K2393M1694L3052R004j3262k6187
1147I590k7852k0183k592K0973L7062L3061O417k7966m6458l5559j78L3500M4310
1160B4125K6327m621k7558l1604k1452n827J0952K5967L2905K2109p131l8806
1172E386m6765k1548J9548M5164L8704R355k0331l2141k6877j3222L899K0635
$$ y = [14596, 54051, 57452, 21752, -27000, -56321, -51311, -20877, 13009, 34670, 40077, 29360, 3077, -31256, -55139, -49150, -9484, 40042, 64043, 45552, -1340, -43765, -55425, -34956, 329, 31019, 44455, 39214, 16792, -15348, -42185, -48265, -25288, 17901, 54844, 60704, 29274, -19471, -52934, -50327, -16215, 24019, 47371, 45471, 25241, -1503, -27385, -42330, -36071, -4931, 37568, 63435, 50797, 5792, -41164, -57104, -34711, 6983, 40035, 49039, 35777, 9590, -18262, -38445, -41037, -20064, 16998, 50059, 56476, 28510, -17948, -53507, -53685, -20185, 24125, 50452, 45831, 18273, -13331, -34783, -40610, -29658, -3691, 29214, 51323, 44192, 5386, -41379, -62927, -43379, 1785, 40489, 49844, 29513, -2628, -29505, -42727, -38828, -18193]
1184a8193L1418K7657N969k4831m2648l4342k263L2085M5285K8960l941l0886
1196A4270l6132k1566K52J8234K6671K5675J4346o647l0940m0282k3296J3065
1208d6350M3639M3484J4147k1654l8765l0595q149J2370K3215K6576K0352L819
1220D2089k0239l7346l2371m665K9278M4508L1516k054l2117l9690k3213L864
1232d0440K3850K9259K1842P140j0627k6690l2223k0568Q535L7567M3658J8650
1244E9953j9721m2130l5869p706J8626K9475K5174J2140l126j8430l0718k7865
1256d0197n411K4700M1610L1975O7l1521m1682k5682M457K7343L2176K0764J914
1269D0513j6652k6425k6213j3945Q187L0868L8398K0393j4222m1864l9930j1686
$$ y = [-18193, 13225, 40882, 46851, 22020, -20628, -54970, -57233, -25148, 20137, 49097, 45156, 14270, -21862, -43428, -43176, -24942, 1729, 27404, 41750, 35103, 4163, -36119, -59415, -46350, -2711, 40773, 54920, 33266, -5499, -36094, -44243, -31873, -8658, 17918, 38270, 42089, 21850, -15496, -47867, -52532, -23254, 21254, 52770, 50716, 18599, -21091, -44304, -40440, -16590, 12669, 34511, 41651, 31024, 4334, -27889, -48457, -39922, -2355, 41303, 59953, 40232, -1898, -37767, -45473, -26847, 2628, 27802, 39942, 36816, 18386, -12332, -40197, -45608, -20908, 20702, 52677, 52744, 21223, -20459, -46141, -41684, -14341, 17835, 38599, 40513, 23861, -2564, -28777, -42722, -34535, -3667, 34731, 55124, 40902, -962, -40892, -52578]
1281e2578K1139L5947K7643P431j1508k1610k4487k0152m092J9783L7429L0952
1293D5897K921l0197m2748k7384M535L0724L5380K0187l035k0683k7560k1736
1305c3699p975J1225K7523L1515J7672j0546l6158l9870j5675J9361L9423L2403
1317C5199P243j6930k7833k3387j1702K370J7995K9941K7299N043k5060m1252
1329b1074k9439K532L1225L9095K1752n182k5373k8752j9465k494J4598K6014
1341C437K6591J3131j0006l0404l5571j7855J4833L8662L6746J0530j9436l4050
1353c392k6137p498J0764K1617K3497J8800L704j9669l5917k9826j375K9592M1194
1366B5354K4441n901k9340l2415j7707K171J8396K5188K2369Q737j1023k8168
$$ y = [-52578, -31439, 4508, 32151, 39582, 28074, 6464, -18023, -38175, -42267, -22484, 14945, 45897, 48818, 18621, -24127, -51511, -46976, -16252, 19128, 39315, 36280, 15597, -11963, -33699, -41674, -30449, -2926, 28589, 46261, 35715, -443, -40313, -55988, -36627, 2796, 35199, 42442, 25512, -2321, -25708, -37410, -35040, -17045, 12896, 40195, 45238, 20178, -21074, -50513, -47981, -16756, 22339, 44091, 38909, 13536, -15216, -34681, -37175, -22577, 3437, 30028, 43159, 33153, 2749, -32822, -50677, -35844, 2818, 39564, 50094, 30658, -3392, -29529, -37027, -26263, -4646, 18851, 37651, 41355, 21686, -14231, -44057, -45432, -15840, 25354, 49795, 43894, 14554, -17861, -35568, -33397, -15001, 10187, 32556, 41293, 30270, 2102]
1378B102l1275j5677J1954L5030L6357J3499j8727l6424l0065p744J5656K6235
1390I21K3282J1345k705j7745k8816k6486l707K5118L9286K7266l994l0285l6467
1403b2987j9379N494K2882K6430J8479M090j2600k6345k7183j2819J1673L1024
1415a241L3698J4052j5333l6367l2664q967J7581L0545K4778Q371r437k0389k3692
1428a9065j8492k709J9713L5051K8062M29k9329l8585k2691P008K7853K9774J6315
1441C3334j828j5712k4109k2589r318J1239K8469L1038J3747j3137l3719l3144
1453c5729j1100J7285L3230K7923P987j3573k5143k2575j2019L061J8173K8056
1465A5576K4308K744k4518l7343k5054M017K9851L4506J7489o401k2159k4350
$$ y = [2102, -29173, -44850, -32896, 2134, 38491, 51990, 33263, -3161, -33226, -40970, -25314, 921, 24203, 35548, 32843, 15098, -13718, -40204, -43911, -18793, 20493, 47759, 43765, 13480, -22987, -42366, -36872, -13990, 12440, 30919, 35009, 22409, -3936, -31119, -43938, -32265, -1241, 32457, 46509, 31176, -5191, -37855, -46822, -29241, 1304, 26082, 34453, 25016, 4627, -19065, -37557, -40266, -20553, 14498, 42560, 42989, 13660, -24925, -47616, -40608, -12755, 17019, 33334, 31506, 15794, -8315, -30904, -40222, -28983, -514, 30524, 44271, 31134, -2585, -35729, -46829, -29544, 3686, 31609, 39596, 26023, 880, -21695, -33714, -30653, -12480, 15576, 39884, 42628, 18110, -19233, -44287, -40270, -10419, 24087, 41576, 35175, 13016, -11334]
1477a1334j7364l560J2092K5472K6344J2072j2488l1335l1294j2022J6363L4299
1489G245K9495P406j6728k8540k4046q197R036K0478K3247J7570N21k0185l3094
1502a5792k5534J129K8200L6403K0227p473k7263k8090j4389J899J5384K2548
1514G249K1538Q953j1783k8947k9610j1277J4966L2872L0029Q526j7980l0740
1526f204k5443o678J2561K3673K2363J1591l513j9106k7496k2274n30K4364L5330
1539A8638K2784n140k8589l2486j5836P172K1001K3068J5999L836j1475k4778
1551e806k6015j1044J3349L1874L0215Q719j7179l2333k6176n659J5380K6230
1563A555K2409R011p934k0071k4191j6257O67K0974L1631K3010j798k7126l4184
$$ y = [-11334, -28698, -32258, -20166, 5306, 31650, 43722, 31234, -101, -31395, -43417, -27054, 7245, 36740, 44146, 27418, -1122, -25168, -33365, -24329, -3851, 19396, 36966, 37487, 17302, -15792, -41326, -40197, -11997, 24406, 44633, 37160, 9897, -18193, -32582, -30683, -15299, 7249, 28787, 37740, 25957, -2990, -32600, -43877, -28911, 3961, 33990, 42516, 24536, -6204, -31647, -38325, -25764, -2091, 20272, 31863, 28350, 9244, -18252, -40526, -41056, -16692, 18638, 41422, 36282, 7693, -24793, -40629, -33457, -12456, 10612, 26611, 30447, 18972, -5806, -31821, -42865, -29516, 2358, 32573, 41292, 24113, -8220, -34396, -40055, -24675, 1555, 23964, 32975, 25041, 4970, -19221, -35478, -34811, -13837, 17794, 40804, 39006, 11880, -22304]
1576b2304j8310P470K5731K6121J4134k398j4038k1818k0634q979J1012K8555
1588D542K9208J0663j6520l2323k7842n950J7440K8189K2732O634j1075k1794
1600C904k2527j2441L867J9466K7056K0341r76k3521l3578k1072N175K7161L0622
1613B3477J4608o589k0273k2125j5551l276J1161K3173K4738J1259j3182l1274
1625c854k9276p929J7937L0549K3948M643j4639k3915k1684r065P439J9858K4276
1638A8288J5430k161k1564k9706k0877L038K6062L1872J7067p418k4322k5230
1650a9521j2977J938J4715K0617J9611Q528j1410k7235k8162r290J6818L1580
1662E212K6211M591j7478k6542k0812n978J0677K0836K1523J2904m182j9743k6873
$$ y = [-22304, -40614, -33144, -7413, 18708, 32842, 30444, 16406, -5412, -26046, -35025, -24013, 4542, 33750, 44413, 27893, -4430, -32272, -38222, -20782, 7407, 30139, 36773, 25698, 3904, -18623, -31064, -27197, -7731, 19325, 39666, 38690, 15169, -18409, -39481, -34306, -7145, 23477, 38085, 31496, 11223, -10902, -26453, -29729, -18568, 4605, 29343, 40602, 27420, -3854, -33130, -41059, -23122, 7427, 31375, 36018, 21379, -2536, -24220, -33285, -25846, -5988, 18288, 33718, 31557, 9993, -19713, -40590, -37552, -11490, 20382, 37449, 30031, 5709, -19521, -32498, -30560, -15845, 4772, 24383, 32911, 21501, -5734, -33896, -43186, -26368, 5212, 31423, 36014, 18536, -8006, -28818, -34796, -24119, -3283, 18240, 31144, 26962, 7219, -19654]
1675a9654j8119K139K3582L1104J9148n150k5860k8872j3517O421J9434K0944
1687A1600J4899L333j0919k2460k4172j0303J3241L0988K8024O648j8631k9611
1699g363k1970k636J4254K1926J9278Q982n733j9171k3887j6295L177K1923K8969
1712B1454J8571m770k5249k9206j5310P326K2562K3449J2505k114j3762k0213
1724d757j9466p558J0934K7313K6540Q136j7579l1284k3978k253J7370K3980J8534
1737B5932M607q770j8844k1154j3079L063K0633K6781J7372m525k4120k9270j6402
1750c7776O856K3802K5852J2935n737j8197k0845j4246k648J0654K2413K3032
1762B6095Q854j3253k9593k6552m979J8561K8187J9861J903j3169k0428j7880
$$ y = [-19654, -37773, -35634, -12052, 19052, 38200, 33050, 7190, -21682, -35199, -28778, -9344, 11600, 26499, 29832, 18913, -3547, -27719, -38022, -24781, 6207, 34231, 40879, 22248, -7363, -29333, -31969, -17715, 4211, 23489, 32471, 26738, 7567, -16320, -32615, -29438, -7515, 21454, 40025, 35255, 10006, -19200, -34510, -27184, -4622, 18827, 31332, 29218, 15456, -4757, -24223, -31781, -20847, 6466, 33006, 41142, 23563, -7721, -31699, -33952, -16582, 7398, 25932, 30539, 21769, 2925, -18229, -31308, -28245, -7612, 19169, 36541, 32016, 7896, -21374, -37776, -30920, -7118, 18734, 31669, 25932, 7735, -13110, -27356, -30004, -19350, 3063, 26095, 34949, 21696, -7897, -34449, -39428, -20867, 7320, 27181, 29084, 15915, -4513, -22393]
1774b2393q829N013J8421K4001J5800l534k2003k8302j6026N479K3893K7054J3963
1787C2537n995k0596k2847j2549J480J4164K0053J8196O874j0804k5276k5114
1799b9877q028J6111L0097K3262K714j7110k3563j6950m443Q544J7454K0054J3310
1812C1575k630j9847k6633j6267M248K3687K7509J4943o481k2166k4051j2415
1824b8528M206J6853J9797J4546L482j1201k1766k2010q557J2587K8607K4878
1836C2894N021j7658k7373j8785j768J2522J8455J6423R003l607j7345k3606j6430
1849c2254L343K2235K7258J5154p034k2514k4745j2837N582J8089K1204J3079
1861B6560n72j3140k0448j8001o251J1346K4571K3941O478j5854k7905k1357k135
$$ y = [-22393, -31222, -26209, -7788, 16213, 32013, 28479, 6476, -21826, -37852, -32373, -8480, 18574, 32537, 26542, 5946, -16901, -29450, -27970, -13806, 6247, 24443, 31317, 20513, -4763, -29877, -37905, -21794, 8303, 31565, 34279, 17169, -6394, -23344, -27787, -19243, -1789, 18265, 31575, 28945, 9098, -17535, -33802, -29554, -5867, 21642, 36585, 30104, 7938, -16113, -28528, -24322, -7469, 12328, 26874, 30356, 19155, -2611, -24621, -33178, -20591, 8016, 32894, 37915, 20257, -7116, -25901, -27669, -15147, 3308, 19731, 28734, 25127, 7782, -15824, -32254, -28911, -6676, 20582, 35736, 28702, 6188, -18557, -31394, -25812, -7723, 13481, 26560, 25988, 12848, -7600, -25601, -31852, -20506, 4065, 28006, 34484, 18630, -9275, -30632, -32767]
1874c2767J5800K1851J5962M372p407j6292j9416j3554K841J9656K6356J5428
1886C2830n458k3636k5749j2092O851K0369K1674J1710k884j5419j9347j5110
1898b6261l012J1872K1921K0606P044j3603k6298k2607l946J6639K5196J8070
1910B5621J727j2093j7347j6099q382L759J6709K3150J5430l633k2529k6083j3216
1923c2986P346K2399K2614J0841n890j6557j9619j2486p4J3143K0318J7139M785
1936C0973j1994k3681k1693n477J5142K5896K0048K354j4734k1823j5388l596
1948b3973P261J5515J8264J2519k514j9153k5114j5015O020K2467K4531J1603
1960C2411p900j9202k0189j0495K469J3697J8789J4779L117j1853k1513j9531
$$ y = [-32767, -16967, 4884, 20846, 25218, 17811, 1519, -17897, -31451, -28610, -8954, 17402, 32830, 27372, 3736, -22013, -34105, -27254, -6885, 14789, 26499, 23615, 8196, -11151, -26261, -29273, -17401, 4520, 25126, 32170, 18567, -7731, -30338, -34284, -17645, 7551, 25621, 27348, 15255, -2092, -18191, -26573, -22814, -6105, 17045, 32475, 28842, 6313, -19770, -32986, -25640, -3241, 19373, 30214, 24324, 7767, -11852, -24338, -24412, -11269, 9049, 26188, 30973, 18979, -4702, -26395, -31872, -16730, 9166, 29214, 31568, 16834, -4989, -20377, -23973, -16712, -1197, 17067, 29586, 27072, 7919, -17195, -32210, -26190, -3723, 20808, 32411, 24511, 5309, -14880, -25375, -22906, -9209, 9580, 24359, 27476, 15623, -5890, -25421]
1972b5421n855J3349K4658K1078L384j5342k3437j7248k324J1240J7195J5348
1984A6625Q077l625j6007k2178j4639L789K1254K5361J2541p694k1390k1104r272
1997b8262N002J5048J7725J3143J363j2250k0589j7262m008J2255K3635J9588
2009B5388M110j4652k3741j8295k122J3874J9993J5292L624o835j5273j8019j1511
2022b8167L048J8544K4137J3921o378k1771k3242r800P699J8274J8060J0033j890
2035B2468j2605j8233j5216k707J2458K1584J8302M268j4115k3234j8383k785
2047b8198J4621K1290J6207K662j0651j6792j5294p501L965J5949K0836J3707
2059C0801m197k0911k3845j1494P516K0483K0264Q312n309j4240j7004j2198j504
$$ y = [-25421, -31276, -17927, 6731, 27809, 31193, 15851, -7586, -24834, -27158, -15918, 1277, 16625, 24702, 21077, 5070, -17108, -31747, -27958, -6704, 18657, 31198, 23504, 2114, -18990, -28262, -23260, -8212, 9513, 22656, 24019, 11769, -8820, -26082, -30090, -17835, 5800, 25388, 29498, 14846, -8895, -27190, -29312, -15438, 4555, 19847, 23471, 16636, 1363, -16656, -28167, -25119, -6575, 17562, 31483, 25105, 3334, -19908, -29708, -22009, -3735, 14325, 24358, 22468, 9863, -8370, -23586, -26293, -13835, 7749, 26051, 30319, 16204, -7030, -25413, -28198, -13577, 7713, 23920, 26582, 15931, -861, -16155, -23656, -19691, -3742, 17094, 30801, 26604, 5693, -18152, -29646, -22130, -1647, 18617, 26929, 21620, 7380, -9624, -21822, -23326]
2072b3326J1683J9667J6778L860j3194k2214j8542k989J4062K2319J6699K274
2084B7077j2585j9309j4737m238P346J4945J7166J0429l314j7591k2736j2936
2096c0483O025K0677K2117R783p625j7652j7227r091J820J1105J7583J5133K655
2109B4820j1334k1514j8211l000J4040K2075J7616J699j3400k0040j5597k859
2121b5705R987J6688J4966P074m904j5313j9231j2612M470J9811K2538J0686o941
2134B1514k0390j9130p158N869J3107J5608J1512J819j0853j9632j6514l354J3334
2147a4268K2361J7299J363j3844k0727j5112j380J1488J7253J4719M696p092j5558
2160A198j6255r703L807J7589K1446J1466o107k0171k1161q271P761J6723J5720
$$ y = [-23326, -11643, 8024, 24802, 28662, 15468, -6746, -25288, -28277, -14215, 8104, 24803, 27077, 14492, -4817, -19554, -23792, -16446, -1501, 15665, 26094, 22780, 5189, -17547, -30483, -24458, -3781, 18336, 28119, 20494, 2842, -14385, -23476, -21656, -10551, 7032, 22165, 24820, 13486, -8028, -26239, -29239, -15199, 6876, 24492, 26191, 12791, -7249, -22846, -25705, -15718, 970, 15936, 23010, 18106, 2793, -16438, -29050, -24580, -4769, 17769, 28455, 21514, 1124, -18006, -25164, -19295, -6188, 9420, 20932, 22751, 11898, -7734, -24248, -27602, -14268, 8093, 25392, 26755, 12911, -7816, -22928, -24308, -12820, 4433, 19152, 23848, 16756, 1198, -15057, -24760, -20953, -3364, 18082, 29548, 23441, 3270, -17891, -26162, -18401, -1678, 14042]
2173A4042Q653k008j0844j6521j4589l397J2337K0998J7170K499j4832k1151j5573
2186b3216r54J2830J8073J4653K625q973j5936j5102p073N280J5519J8441J1337
2199B7504m673j8854k1608r960P266J8974J7878P215n347j3208j5177j0569j457
2212b2016J0435J8312J6328K940j3413k1683j5929p50J3590J9612J3173K008j0558
2225A2049j6564j4092m922O727J5270J6208R334m562j6907k0208j0643O112J9141
2238c057J9915P982p330j5966j5416p853J887J0586J5645J3769L458j1450k0614
2251h444j6753j803J4692K1369J3874m76j1906j6888j2928k927P671J5381J5256
2264A6118P107n443j5709j8128r811N458J8167J9627R174p101j7271j7304p252
$$ y = [14042, 22695, 20687, 9843, -6678, -21267, -24664, -12327, 8671, 25841, 28340, 13508, -7643, -23216, -24170, -11340, 6733, 21386, 24011, 15038, -898, -16000, -23073, -17793, -2274, 16167, 27504, 22831, 3977, -17631, -27591, -20325, -1351, 16527, 23742, 18395, 5187, -9990, -20559, -22016, -11581, 6731, 23059, 25999, 12586, -9097, -25026, -25776, -12186, 7426, 20599, 22607, 12049, -4515, -18607, -23529, -16802, -1532, 14676, 24010, 19448, 2541, -17667, -28310, -22198, -3057, 16858, 24840, 17510, 1544, -13872, -21725, -19838, -9252, 6393, 20162, 23620, 12170, -8444, -25197, -27000, -12308, 9061, 22935, 22459, 10553, -6335, -19263, -22190, -14519, 862, 16118, 23225, 17782, 2073, -16055, -25866, -20408, -2241, 17386, 26560, 19459, 2188, -15116, -22368]
2277b2368N432J2875J3864J0206J856j0413j7518j5826l122J3403K1298J5236
2289B4923N1j3804j8394j2396r09R569J4779J3863N250o105j5222j6747q474N122
2303a8494J6913J8854R584o218j8167j8090q069O308J5406J5004P630k026r991
2316H644j5473j3333k797J0906J9860J5892J890j4408k0365j2884M47J1832J5140
2329E351J1932L312o863j4396j5260p755N519J6326J7903Q173o032j7102j8769
2342a7661p696O619J6877J5714O877m530j2454j4178r935p93J0069J7326J5006
2355B1241K335j3136k0685j4136P32J4268J7015J1000K26r001j3439j2766n537
2368b1883N308J4899J7398Q081o096j7347j7587p892O849J7207J6608O835o149
$$ y = [-22368, -16936, -4061, 9803, 20009, 21865, 11452, -6066, -21892, -25014, -11611, 9687, 24923, 24974, 11170, -7224, -19620, -20529, -10960, 3819, 17682, 22932, 16827, 1605, -15142, -23616, -18494, -1581, 17273, 26857, 20639, 2472, -15618, -23687, -17379, -1973, 13031, 20661, 18635, 8644, -6829, -20162, -22959, -12053, 7807, 23699, 25589, 11181, -9184, -22068, -21621, -9789, 5351, 17283, 20595, 13732, -664, -15924, -23679, -18160, -1834, 16069, 24242, 18210, 1108, -17661, -25357, -18738, -1861, 13853, 20730, 16200, 3746, -10432, -20367, -21160, -11091, 6235, 21241, 23576, 10440, -10245, -24381, -23649, -9381, 7634, 18634, 18860, 9859, -3580, -16346, -21883, -16575, -1676, 15722, 23803, 17707, 360, -17227, -25119, -18270, -1063, 15545, 22380, 16231]
2381A6231j3984j4605p320K506J0129J4519J2826K165j1079j9119j4979o58J3960
2394i408J9465J2092j215j1284j4967j0917k576O640J3392J4780P345n390j6342
2407A615j7431p257O401J7421J6316O827o378j5215j5144o707L777J1982J3984
2420A0191R375Q47j0511j6357j4208j990J2997J9455J3236n57j4005j6467j0025
2433a8019k15Q368J2906J1953N517m990j4779j6680p555O228J7173J7178N910
2446B2995p305j5867j5196o208N211J3482J3751P863j848j0900j4696j1489j567
2459b1774J1045J8307J3943K2j3633j8100j1445J605J1255J3901R996K477n916
2472A1683j3317j3836p459N795J6423J6733O980q079j6702j5150n194O596J3984
$$ y = [16231, 2247, -12358, -19678, -17172, -7043, 7476, 20302, 22467, 11388, -7731, -22710, -23368, -9408, 10057, 22149, 20934, 9650, -5317, -16234, -18810, -12170, 1222, 16002, 23347, 17957, 1615, -15816, -23073, -16672, 749, 17065, 23892, 17514, 2299, -12845, -19552, -15775, -3793, 10191, 19566, 20413, 9902, -6455, -20663, -22653, -9656, 9799, 23035, 22478, 8473, -7994, -18019, -18234, -9866, 3040, 14993, 20510, 15520, 741, -15939, -23494, -17266, -93, 17085, 22995, 15690, -177, -15373, -21581, -16370, -2888, 10863, 18726, 16878, 5978, -8718, -20207, -21774, -10729, 7578, 21521, 21543, 7910, -10190, -21635, -20030, -8775, 5126, 15122, 17599, 11683, -1634, -15470, -22929, -17134, -711, 16022, 23002, 14923, -1779, -16929, -22123, -15527, -1543]
2485a543J4148O738l949j1530j3973r208J93J1053J6378J2216R36j2886j8135
2498i562j2136J303J3053J6082R584q3q991j2289j1073m880M971J4485J5890P453
2512B3807p211j7126j5713n508P886J5350J3476N475n039j2024j3278p796J370
2525a6331J0683J4771J1120N92j1446j7203j2514j1J3113J7159J0723j442j1220
2538G994j3526r343j894N672J2497J3482P067n676j6392j6372o041P895J6214
2551A577J4243M745o527j3105j2969o472K955J1158J3818R257p64j1495j5415
2564h994j1413m8J2077J7251J0756r52j1968j5025r821M92Q024J2207J0797M811
2578A8194n300j3598j5452o645O897J6611J5039M657p745j4709j2185m680M237
$$ y = [-1543, 12605, 19343, 15394, 3864, -10109, -19317, -19124, -8071, 8307, 20523, 21459, 8573, -9562, -21698, -20395, -7342, 8740, 18324, 18241, 9250, -3039, -14112, -18992, -14021, 464, 16354, 23807, 16596, -530, -16243, -21751, -13865, 1485, 14961, 20436, 15397, 3373, -9905, -17701, -16331, -5648, 9123, 20243, 20835, 9389, -7814, -20328, -20339, -7226, 9933, 20656, 19214, 7994, -5532, -14875, -16769, -11097, 1400, 14882, 21949, 16273, -119, -16491, -22532, -14637, 1577, 15820, 20565, 14038, 933, -12036, -18508, -15553, -4395, 9423, 18680, 17916, 6421, -8994, -20407, -20455, -8378, 8873, 19629, 18677, 6709, -8316, -18137, -17645, -9621, 2586, 13383, 18194, 12894, -704, -16156, -22801, -15904, 707, 15746, 20403, 12658, -2051, -14236, -18916, -14679]
2591a4679J1304J2892Q010j240j0750j4995j0215L34J1509J6172J1174m21j2238
2604F857j5817j0163J073J0760J3066R191K031o007j2123j3008o181N598J5195
2617D72J5994N926p802j5601j3946l878O407J2449J2105N898k487j0389j3522
2630h374r403Q36J1014J5356J0656o06j1530j5733j0701Q54J1317J4234R296L42
2644A7558q116j1974j0501m575N337J3373J4158O395o716j5943j4906l886P513
2657a2283J3851J1616M182m167r890j2452p893M17J0836J4786R968p56j1333j5795
2671h913j0331J009J1364J4270R853m10r663j2883r521k065O075J2020J2458N825
2685A9088n206j4739j5020n808P594J5698J2562L573o130j1859j0948o048J784
$$ y = [-14679, -3375, 9517, 17527, 16287, 5537, -9458, -19673, -19339, -7830, 8342, 19516, 19095, 6857, -8960, -19123, -18050, -7290, 5776, 14967, 16998, 10991, -1132, -14140, -20321, -14723, 472, 16466, 22392, 14590, -1011, -14957, -18835, -12428, 21, 12126, 18024, 15537, 5148, -8374, -17777, -16941, -5927, 9429, 20085, 19479, 7949, -7784, -18485, -17631, -6314, 7920, 17216, 17558, 9442, -2532, -13033, -17608, -12271, 1102, 15260, 21655, 14939, -1004, -15910, -19796, -12283, 1568, 13184, 17366, 13199, 3309, -9143, -17036, -16619, -5783, 9003, 18971, 18215, 6882, -8913, -19244, -18235, -6871, 7399, 17252, 16842, 7179, -5704, -15225, -17290, -11215, 805, 13263, 19088, 13882, -857, -15877, -21685, -14091, 1607, 14169, 17742, 11612, -247, -11195, -17243, -15459]
2698a5459R893J3750R210o06j1232j5209j0149J051J2018J4747R510r07j0500
2711F117j3347r355l21Q416J1899J0391L584n584j2795j3325o069O356J5509J4281
2725A5757L579p329j3856j0868l792M224J0009J1449P641p71j0184j4414j0164
2738a8719J509J1823J5072R175j651j0590j3888q954M11R262J2192R398J727o382
2752A0385j1688j2107m525N546J4065J3944M969p191j5121j2326l167O279J1531
2765E94J0191N470k001r289j2861r195M72J1103J4985R603j852j1733j3818q872
2779a7203J344R513J2578Q924R30p768j1948j0184l282N446J2895J2493N277o440
2793A2575j4273j3559l966P112J3469J0585L456m232r204j1227p120N97R746J4088
$$ y = [-15459, -5566, 8184, 17394, 16788, 5556, -9653, -19802, -18751, -6733, 8014, 17524, 16617, 6117, -7230, -16585, -16906, -8490, 3409, 13800, 17384, 11800, -995, -14320, -20389, -14033, 1476, 15757, 19336, 12007, -1849, -12717, -16509, -12285, -2276, 9173, 16814, 16043, 5859, -8555, -18719, -17210, -5387, 9685, 18860, 17209, 6619, -7269, -16223, -15812, -6550, 5642, 15040, 16767, 10385, -1303, -13410, -17935, -12389, 1676, 15620, 20589, 13398, -1723, -14049, -17216, -10937, 594, 10785, 16255, 14254, 4965, -7896, -17091, -16619, -5516, 9469, 19072, 17220, 5487, -8331, -17203, -15859, -6346, 6232, 15156, 16086, 8318, -3630, -13814, -17096, -11650, 1245, 13738, 19015, 12575, -1698, -15257, -19223, -12111, 1358, 11943, 15399, 11167, 1963, -9264, -16384, -15787, -6041, 8047]
2807H047J0013j417j1692j5126q281J961J0561J2902P955J26q470j1585r271k233
2821a6510O289J1710J1661M758n620j3934j2879m848P039J4375J1643L146o704
2834A0126j0607r961m690K068Q680J2278Q967k87j0922j4998q940J930J1778J3491
2848H913P605j406r061j1471q324j379P006J1892J0046L529o019j2853j2138m253
2862a7913O477J3817J1999L610o562j2360j0633l259M028R283J0222P334o34r753
2876E656j3745r426J278J1670J4404P840k408j0267j1982p203Q0P161J1435R033
2890A3526K626o230j2295j0792l709N614J3091J2182L965o550j2693j1666l263
2903a6194N504J0276R904N156k411q217j1960q883P96J0346J4392Q782k023j1407
$$ y = [8047, 18060, 16643, 4951, -10175, -18456, -16495, -5934, 6968, 14923, 15049, 6579, -5006, -14277, -16510, -10221, 1489, 13150, 17908, 12288, -1646, -14525, -19373, -12334, 2041, 13684, 16830, 10126, -481, -10442, -15132, -13064, -4384, 7894, 16861, 16574, 5652, -9346, -18286, -16356, -4578, 8913, 16518, 15112, 6051, -5420, -13744, -15123, -8117, 3775, 13821, 17350, 11331, -1522, -13660, -17913, -11436, 2381, 14380, 17990, 11428, -932, -11565, -14824, -10796, -1513, 8709, 16043, 15409, 5656, -8089, -17515, -16237, -4567, 9837, 17677, 15269, 5002, -6980, -14183, -14103, -6942, 4493, 13526, 16152, 9922, -2373, -13165, -16874, -11260, 1831, 14013, 17978, 11428, -1265, -12931, -16194, -10690, -414, 9490, 14646, 12235, 4018, -7942, -16825, -16029, -5683, 8709, 17491, 15468, 4061]
2917D061j2874p054J746Q320J0325Q179J639o303j1143j0622l409O238J2372J1933
2931A3408L684o245j3158j1598l547O395J2078J0270L313m227q834j0200o680
2944a5341P86R248J3195R079j254j1560j3642p408K871J0047J0990O915k70o899
2958F757j0096r394k897O023J2209J1026L626o534j3238j0913l161O648J2053
2971B109J0806K944n149j0279r740m681K191Q660J1336Q085q19j0080j3943q559
2985a7119K708J1044J2342O580k115q127r866p733j601N711J1156J0141L828o556
2999A0393j2824j1056k588O444J2099J0432K982n759j0849r882m218L943R550
3012a333R872O185j276r172j2594q193J133J1349J3235O704k497r913j0619o247
$$ y = [4061, -8813, -15867, -14121, -5801, 4524, 12703, 14342, 8039, -3104, -13726, -17135, -10897, 1475, 13408, 17092, 10847, -2311, -13909, -17456, -11061, 1017, 11287, 14600, 10373, 1539, -8661, -15341, -14555, -5307, 7888, 16967, 15713, 4153, -9489, -16897, -14026, -3979, 7011, 13926, 13656, 6757, -3339, -12733, -15630, -9607, 2602, 13628, 17254, 10720, -2518, -13431, -16592, -9944, 2109, 12915, 15859, 10710, 431, -9309, -13990, -11799, -3139, 8197, 16282, 15463, 5383, -8560, -17119, -14411, -3367, 8975, 15555, 13440, 5313, -4553, -12286, -13887, -8176, 2980, 13121, 16949, 10393, -2431, -13487, -16075, -9631, 2468, 12900, 15882, 10123, -726, -10608, -14826, -10883, -1333, 8539, 14724, 13448, 4276, -8318, -16511, -15378, -4029, 9206, 15910, 13413, 3500, -7119, -13366]
3026a3366L48O335R583R273K980o158j1821j1097k866O806J2156J0434K859o195
3040I271j1371r915l122M824R591R677M867k485q293j1168p376R11R760J3163
3054H334P840k192j0746j1938o258K574P713R334P199J395n210j0569j0194l626
3068a6344O700J2462J0702K359o937j1620r636k344N522J0014R691L549l266q818
3082B034j0245o081J757Q791J2409P137j616j0360j2512o730L007R693J0193N819
3096A3296o31o268r725q180k794N767J1869J0445K426p111j2079r715j982O612
3110h070J0233R136L075m322r513r698m656K867R054J0643O464j921r679j2057
3124h444o895K674J0129J0929N711k162p567r336o767j258N907J0265R229L014
$$ y = [-13366, -13018, -6683, 2900, 12173, 15153, 8995, -2826, -13923, -16789, -9983, 2173, 12607, 15466, 9271, -2100, -12015, -15137, -10313, -722, 8955, 13822, 11337, 3044, -8124, -15500, -14589, -4829, 8334, 16174, 13982, 3236, -8702, -14960, -12386, -4673, 4661, 11860, 13255, 8045, -2524, -12718, -16344, -9644, 2818, 13520, 15879, 8942, -2678, -12314, -14658, -9136, 878, 10569, 14118, 10852, 2034, -8211, -14292, -12535, -3744, 8665, 15802, 14186, 3826, -8686, -15416, -12409, -2716, 7477, 13296, 12665, 6397, -3328, -11508, -14302, -8535, 3334, 13779, 16205, 9094, -2985, -12700, -14682, -8070, 2163, 11299, 14374, 10052, 539, -9159, -13815, -10948, -1894, 8749, 15213, 13292, 3613, -8444, -15339, -12665, -2536, 8393, 14104, 11942, 4375, -4961, -11728, -12986, -7079, 3186, 12415, 15429]
3138A5429o906j2248r987j663P479J0935Q477K020n306r286q762m199K950R175
3152a892J0472N563k675q920j1505o466J962J0091J1676N981k624q965j0053n218
3166a2573N72O126R309P579K626n616j1289j0129k582P701J1840Q763J541o540
3180G328r476q223k762M041Q224R447N183k657q998j0888n692K014R915J1131
3194H587O441k670r598j0539n779J900P668R310O367Q24n377r984r128k535O271
3209h242J2377R662J229p325j0906q003j465N270Q482Q364M308l336q617j0463
3223h665n147K511R365J1063N738k905r147j0515n820K134Q517R748N675j009
3237A1543o368r061p440j921N605J0899R531K235p294j1677q578p78O189R364
$$ y = [15429, 8523, -3725, -13712, -15375, -7896, 3039, 11516, 13536, 8230, -1056, -9818, -14017, -11067, -1892, 8580, 14143, 11468, 2548, -8957, -15423, -13461, -3370, 8306, 14287, 11663, 2698, -7355, -12573, -12001, -5875, 3434, 11013, 13639, 8023, -3266, -13395, -15977, -8276, 3564, 12327, 13868, 7328, -2148, -10371, -13133, -9092, -868, 8579, 13762, 11105, 2107, -8781, -14473, -12459, -2544, 8587, 15028, 12358, 2760, -7779, -13558, -11658, -3990, 5320, 11687, 12511, 7134, -2850, -11978, -14513, -8242, 4135, 13797, 15026, 7701, -3205, -11208, -12673, -7403, 1079, 9443, 13751, 10415, 1798, -8665, -13812, -11301, -1936, 9127, 14865, 11960, 2813, -7702, -13522, -11388, -2871, 6877, 12552, 11543, 5175, -3886, -11326, -13247, -7642, 3257, 12788, 15023, 7729, -3948, -12526, -13304, -7115, 2249]
3251B249P779K557l642q318r593m945K699R397J0280N642l048q874j0744n318
3265a3879J893R019J0006N549j840p369q961o532j73N519R628Q062K658n958j1243
3280c621r544j280P132J0494P614J023m758q246q300l503K845Q693R624N247k142
3295A1278j0070j0030n457K803R268J0135N303k305q293q779n755R36O401Q491
3309C926P360J409n648r776r361k063P064J1338Q098J020o929q771o732k174L255
3324g984P652Q845M812k798q546j0464n149K782R734R811M852k581q751q953m958
3339a1696J532O674Q701O447m9n564r481p522j915O188J0464Q663J122p218r874
3354c528o974q94M700P941P262L411k301q266r578n336K702R262J0442M802l510
$$ y = [2249, 10028, 12585, 8943, 625, -8968, -13913, -11214, -1817, 8463, 14105, 11057, 2183, -8561, -13879, -11986, -2967, 7039, 12588, 10748, 3379, -5582, -12114, -12287, -6768, 2860, 10922, 13580, 7622, -3621, -13165, -14445, -7313, 3181, 10795, 11818, 7060, -1186, -9486, -12989, -10144, -1451, 8173, 13420, 11278, 1208, -8822, -14279, -11476, -2208, 7927, 13230, 10925, 2632, -6147, -11902, -10966, -4565, 3926, 11286, 12695, 7047, -2729, -12090, -14153, -7089, 4249, 12347, 13367, 6438, -2333, -9065, -11239, -7984, -332, 8513, 13325, 10527, 1981, -8483, -13632, -10850, -1116, 8695, 13547, 10966, 2215, -6738, -11696, -10164, -3490, 5211, 11658, 11609, 6045, -3436, -10958, -12873, -6685, 3779, 12442, 13564, 6346, -3528, -10502, -11396, -6696, 1245, 8507, 11918, 9617, 1351, -8227, -13563, -10861, -1599, 8843, 13645, 10135]
3369A0135q597r374m307J876P201Q759N953o25o037r196o889j309N614R762Q201
3384A1167K043o625j0643p838q79O406Q662O827J745l439p478q147m478K680Q187
3399a810J0131M904l256r181r493m195K891P673Q509N372j150o835q165o400l34
3414a1339N706R091P665J324n673j0231q009j406O734R369P267R89n066p199p165
3429g943l342K420P644Q788N831k615r167j0034m316L556Q153Q593M105k012o949
3444B712p680n299k6N884Q663O902J089n942r417p565j771O406R642P402P29n447
3460F282q611o229j939L012P418P584M970k361q215j0058n099L232R674Q415L808
3475A1883l088o949p535n219Q26O093Q398O236k2n402r461o965o42O129Q920P311
$$ y = [10135, 1538, -7836, -12143, -10267, -3066, 5693, 11646, 11021, 4984, -4212, -11101, -12410, -6796, 2966, 11167, 13210, 6585, -4058, -11896, -12775, -6369, 2293, 9120, 10865, 7426, -52, -8199, -12677, -9997, -1810, 8321, 13225, 9969, 788, -8705, -12900, -10009, -2336, 6173, 11545, 10395, 3560, -4605, -11005, -11339, -5633, 3458, 11123, 12447, 6774, -3457, -11466, -12872, -6138, 3231, 10498, 11487, 6421, -778, -7943, -11285, -8865, -1221, 7567, 13398, 10783, 1616, -8418, -12734, -9178, -1025, 7568, 11673, 9661, 2712, -4968, -10267, -10293, -4409, 4254, 11156, 12245, 6303, -3114, -10679, -12450, -6044, 3598, 11000, 11729, 6282, -2329, -8558, -10497, -7485, -67, 7517, 12487, 10126, 1911, -8147, -13246, -10014, -340, 8075, 11883, 8795, 1846, -5689, -10908, -10082, -3989, 4409, 10645, 10623, 5221, -4240, -11205, -11847, -5718, 3202, 10513]
3491A0513J098n688r443o359r60M231P367O623L286k343p445q740n210K976Q869
3506a225R430L763l340p934p946l788J775O231P319N813J68n775q660o939k2N485
3522e645R298P036P40n682q954p234p65M969Q410O322J758k938p253p423m228
3537a1589K078Q135R163M908k667r074q869l472K941P040P398M293q26n376p783
3552c700o339n96N921Q960O879L57o057q646o651j233N781Q730O111J331m254
3567F594p280o973k643K218P434Q196M396k613q206q987m028L709P860P379L021
3582A0077j688n430p196n503j8N089Q827O170P41n846r248o703M0N732P865O688
3598I597P91m843p514o323j949L198P072P177L525k057p826q998m077L155Q509
$$ y = [10513, 11611, 5923, -3520, -9879, -10839, -6608, 759, 7382, 10668, 8325, 880, -7860, -13070, -10094, -1225, 8205, 11968, 8628, 694, -7252, -11040, -9265, -3034, 4285, 10098, 10266, 4491, -4169, -11108, -11130, -5645, 3653, 10689, 11429, 5747, -3207, -10441, -11206, -6237, 2173, 8495, 10253, 7315, 62, -7361, -11589, -9511, -1376, 7787, 12695, 10028, 954, -7915, -11387, -8446, -1406, 5992, 10285, 9459, 4083, -3700, -10039, -10635, -4714, 4246, 11125, 11482, 5425, -3221, -9872, -11105, -5324, 3406, 9517, 10848, 6594, -686, -7659, -10302, -8084, -650, 7546, 11942, 9329, 1123, -7864, -11892, -8183, -323, 7056, 10077, 8389, 2959, -4237, -9740, -9758, -4669, 4158, 10328, 11069, 5223, -4025, -10728, -10688, -4956, 2909, 9597, 10388, 5545, -1969, -8292, -10241, -7043, 29, 7206, 10731, 8674, 848, -8150, -12227, -9072, -563]
3613e63Q037L132k729o919o799l754O41N174P558O047N16n799q988o750M79N960
3629d757Q404N980J70m754p749o412j080L771P372O851K459k845p144p783m028
3644a1545L009Q260Q036L427l292p338p450k858K073N325O535N526n1n458q153
3659c954o384j87N956Q768O116n7n609p860n202j201M628O878O222J869k946p259
3675b22o960l390K945P473Q080L705l207p991p500k991K781O292O633L608p88
3690H468m927p459n413n55N700Q664O192l58o337p778n559j02N144O717N711J538
3706I646l765o839o723k843L236P508P297K880k501p884p789l235L440P063P011
3721F502K870k322n016o652m512l20N370P825O184J82o256q501n715Q53N435P365
$$ y = [-563, 7474, 10606, 7877, 958, -5841, -9595, -8954, -3780, 3778, 9825, 10341, 4542, -4446, -11196, -10717, -4757, 3647, 9627, 9797, 5043, -2706, -9118, -10198, -6427, 945, 7796, 10255, 7410, 266, -7517, -11545, -8536, -276, 7760, 11187, 7895, 557, -6893, -9751, -7678, -2353, 4182, 9708, 9657, 4199, -3954, -10338, -10525, -4569, 4199, 10315, 10258, 4649, -3211, -8413, -9614, -4986, 1892, 8114, 9983, 7037, -222, -7182, -10572, -7627, -154, 7926, 11631, 8424, 433, -7067, -10058, -7277, -985, 5648, 9256, 8468, 3541, -3918, -9331, -9886, -4186, 4478, 10670, 10312, 3975, -3803, -9362, -9464, -4320, 2397, 8108, 9646, 5881, -958, -7681, -10524, -7288, 220, 7517, 10397, 7896, 12, -7777, -11012, -7572, -509, 6502, 9372, 7050, 2034, -4618, -9130, -9450, -4080, 3745, 9929, 10111, 3855, -4646, -10361, -9508, -4073, 3292]
3737C292M847R30l802o966o199j996L385P000P187K193k939p046p228l583L322
3752g603P243P366K667k882n789o507l264R77M853O936N116P51n807q381n909
3767a0233N68O275P556M780j51m828o724m853j331L315P052O364K289l425o913
3782b59p157k766K961P507P389K657l132o899o733k694K208N613N892M405j25
3797H867n230p535n490k35O409Q028N374j001n820o987m371m20L964O448N848
3812G849J720l525p306o260k547L818O866O728K828l121p144o730k522K685O039
3827f22O377K974j178n173o632m977J79N698P759N543p09o227p792m407O36M936
$$ y = [3292, 8139, 9069, 5267, -1699, -7898, -9894, -6509, 491, 7678, 9871, 6932, -114, -7342, -10925, -7603, -360, 7006, 9673, 6791, 1002, -5505, -8769, -7792, -2939, 3997, 9113, 9864, 4057, -4324, -10233, -9665, -3390, 4166, 8946, 8795, 3967, -2757, -7610, -8941, -5626, 1426, 7790, 10079, 6654, -259, -7416, -10182, -7221, 286, 7675, 10332, 7200, 301, -6432, -9126, -6918, -1305, 4587, 8992, 8867, 3637, -3898, -9388, -9623, -3214, 4814, 10188, 9187, 3367, -3620, -7991, -8411, -4447, 2001, 7849, 9569, 6044, -1262, -7522, -10069, -6251, 615, 7343, 10171, 7050, -94, -6824, -9346, -6661, -622, 5755, 8729, 7551, 2378, -4254, -9231, -9052, -3354, 4405, 9948, 9239, 3012, -4780, -9187, -8551, -3615]
$$ [...]
8191H25
##END NTUPLES=NMR FID
##END=
