##TITLE=1H_Pr 5-2-C
 D2O, 8 sc, 
 7.6.2019
##JCAMPDX= 6.0         $$ Bruker NMR JCAMP-DX V2.0
##DATA TYPE= NMR FID
##DATA CLASS= NTUPLES
##ORIGIN= UXNMR, Bruker Analytische Messtechnik GmbH
##OWNER= root
$$ XWIN-NMR		Version 3.5
$$ Fri Jun  7 15:30:07 2019 Russian Standard Time (UT+4h)  she@DPX200
##.OBSERVE FREQUENCY= 200.13155
##.OBSERVE NUCLEUS= ^1H
##.DELAY= (6, 6)
##.ACQUISITION MODE= SIMULTANEOUS
##.ACQUISITION SCHEME= undefined
##.AVERAGES= 8
##.DIGITISER RES= 18
##SPECTROMETER/DATA SYSTEM= spect
##.PULSE SEQUENCE= zg30
##.SOLVENT NAME= CDCl3
##.SHIFT REFERENCE= (INTERNAL, CDCl3, 0, 15.7039)
##AUDIT TRAIL= $$ (NUMBER, WHEN, WHO, WHERE, WHAT)
$$ ##TITLE= Audit trail, XWIN-NMR		Version 3.5
$$ ##JCAMPDX= 5.01
$$ ##ORIGIN= Bruker BioSpin GmbH
$$ ##OWNER= she
$$ F:/spectra/data/she/nmr/H-F/1/audita.txt
$$ ##AUDIT TRAIL=  $$ (NUMBER, WHEN, WHO, WHERE, WHAT)
(   1,<2019-06-07 15:29:11.40 +0400>,<she>,<DPX200>,
      <created by zg, POWCHK disabled, PULCHK disabled
       configuration hash MD5:
       00 E9 B6 7A A2 85 ED C7 34 08 36 98 17 FE 4E 26
       data hash MD5: 16K
       B6 79 31 0E 3D BE 61 68 67 BE 68 DF 5F B1 91 F1>)
$$ ##END=
$$ 
$$ hash MD5
$$ 99 02 94 CA 6F 00 5B 07 6B DC 7C EA 6D DD 18 FE
##$RELAX= 
##$RELAX= 
##$RELAX= 
##$RELAX= 
##$RELAX= 
##$RELAX= 
$$ Bruker specific parameters
$$ --------------------------
##$DU= <F:/spectra>
##$EXPNO= 1
##$NAME= <H-F>
##$PROCNO= 1
##$TYPE= <nmr>
##$USER= <she>
##$AMP= (0..31)
100 100 100 100 100 100 100 100 100 100 100 100 100 100 100 100 100 100 
100 100 100 100 100 100 100 100 100 100 100 100 100 100 
##$AQSEQ= 0
##$AQ_mod= 1
##$AUNM= <au_zg>
##$AUTOPOS= <>
##$BF1= 200.13
##$BF2= 200.13
##$BF3= 200.13
##$BF4= 200.13
##$BF5= 200.13
##$BF6= 200.13
##$BF7= 200.13
##$BF8= 200.13
##$BYTORDA= 1
##$CFDGTYP= 0
##$CFRGTYP= 5
##$CHEMSTR= <none>
##$CNST= (0..31)
1 1 145 1 1 1 1 1 1 1 1 1 1 1 1 1 1 1 1 1 1 1 1 1 1 1 1 1 1 1 1 1 
##$CPDPRG= <>
##$CPDPRG1= <>
##$CPDPRG2= <>
##$CPDPRG3= <>
##$CPDPRG4= <mlev>
##$CPDPRG5= <mlev>
##$CPDPRG6= <mlev>
##$CPDPRG7= <mlev>
##$CPDPRG8= <mlev>
##$CPDPRGB= <>
##$CPDPRGT= <>
##$D= (0..31)
0 1.2 0 0 0 0 0 0 0 0 0 0.03 0 0 0 0 0 0 0 0 0 0 0 0 0 0 0 0 0 0 0 0 
##$DATE= 1559906950
##$DBL= (0..7)
120 120 120 120 120 120 120 120 
##$DBP= (0..7)
150 150 150 150 150 150 150 150 
##$DBP07= 0
##$DBPNAM0= <>
##$DBPNAM1= <>
##$DBPNAM2= <>
##$DBPNAM3= <>
##$DBPNAM4= <>
##$DBPNAM5= <>
##$DBPNAM6= <>
##$DBPNAM7= <>
##$DBPOAL= (0..7)
0.5 0.5 0.5 0.5 0.5 0.5 0.5 0.5 
##$DBPOFFS= (0..7)
0 0 0 0 0 0 0 0 
##$DE= 6
##$DECBNUC= <off>
##$DECIM= 24
##$DECNUC= <off>
##$DECSTAT= 4
##$DIGMOD= 1
##$DIGTYP= 9
##$DL= (0..7)
0 120 120 120 120 120 120 120 
##$DP= (0..7)
150 150 150 150 150 150 150 150 
##$DP07= 0
##$DPNAME0= <>
##$DPNAME1= <>
##$DPNAME2= <>
##$DPNAME3= <>
##$DPNAME4= <>
##$DPNAME5= <>
##$DPNAME6= <>
##$DPNAME7= <>
##$DPOAL= (0..7)
0.5 0.5 0.5 0.5 0.5 0.5 0.5 0.5 
##$DPOFFS= (0..7)
0 0 0 0 0 0 0 0 
##$DQDMODE= 0
##$DR= 18
##$DS= 0
##$DSLIST= <SSSSSSSSSSSSSSS>
##$DSPFIRM= 0
$$ [...]
##$SUBNAM2= <"">
##$SUBNAM3= <"">
##$SUBNAM4= <"">
##$SUBNAM5= <"">
##$SUBNAM6= <"">
##$SUBNAM7= <"">
##$SUBNAM8= <"">
##$SUBNAM9= <"">
##$SW= 24.9336996594482
##$SWIBOX= (0..15)
0 0 2 0 0 0 0 0 0 0 0 0 0 0 0 0 
##$SW_h= 4990.01996007984
##$TD= 16384
##$TD0= 1
##$TE= 0
##$TE2= 300
##$TE3= 300
##$TEG= 300
##$TL= (0..7)
0 120 120 120 120 120 120 120 
##$TP= (0..7)
150 150 150 150 150 150 150 150 
##$TP07= 0
##$TPNAME0= <>
##$TPNAME1= <>
##$TPNAME2= <>
##$TPNAME3= <>
##$TPNAME4= <>
##$TPNAME5= <>
##$TPNAME6= <>
##$TPNAME7= <>
##$TPOAL= (0..7)
0.5 0.5 0.5 0.5 0.5 0.5 0.5 0.5 
##$TPOFFS= (0..7)
0 0 0 0 0 0 0 0 
##$TUNHIN= 0
##$TUNHOUT= 0
##$TUNXOUT= 0
##$USERA1= <user>
##$USERA2= <user>
##$USERA3= <user>
##$USERA4= <user>
##$USERA5= <user>
##$V9= 5
##$VALIST= <valist>
##$VCLIST= <CCCCCCCCCCCCCCC>
##$VD= 0
##$VDLIST= <DDDDDDDDDDDDDDD>
##$VPLIST= <PPPPPPPPPPPPPPP>
##$VTLIST= <TTTTTTTTTTTTTTT>
##$WBST= 1024
##$WBSW= 4
##$XGAIN= (0..3)
0 0 0 0 
##$XL= 0
##$YL= 0
##$YMAX_a= 538186
##$YMIN_a= -643018
##$ZGOPTNS= <>
##$ZL1= 120
##$ZL2= 120
##$ZL3= 120
##$ZL4= 120
##$ABSF1= 10
##$ABSF2= 0
##$ABSG= 5
##$ABSL= 3
##$ALPHA= 0
##$AQORDER= 0
##$ASSFAC= 0
##$ASSFACI= 0
##$ASSFACX= 0
##$ASSWID= 0
##$AUNMP= <proc_1d>
##$AZFE= 0.1
##$AZFW= 0.1
##$BCFW= 1
##$BC_mod= 2
##$BYTORDP= 1
##$COROFFS= 0
##$CY= 11.3945322036743
##$DATMOD= 1
##$DC= 2
##$DFILT= <>
##$DTYPP= 0
##$F1P= 18.9103706918063
##$F2P= -1.10871071338519
##$FCOR= 0.5
##$FTSIZE= 0
##$FT_mod= 4
##$GAMMA= 1
##$GB= 0.15
##$INTBC= 1
##$INTSCL= 1
##$ISEN= 128
##$LB= 0.24
##$LEV0= 0
##$LPBIN= 0
##$MAXI= 10000
##$MC2= 0
##$MEAN= 0
##$ME_mod= 0
##$MI= 1.114404
##$NCOEF= 0
##$NC_proc= 0
##$NLEV= 6
##$NOISF1= 3.799351
##$NOISF2= 2.8
##$NSP= 1
##$NTH_PI= 0
##$NZP= 0
##$OFFSET= 15.70392
##$PC= 1
##$PHC0= -8504.747
##$PHC1= 20.60019
##$PH_mod= 1
##$PKNL= yes
##$PPARMOD= 0
##$PSCAL= 0
##$PSIGN= 0
##$REVERSE= no
##$SF= 200.130013532006
##$SI= 16384
##$SIGF1= 3
##$SIGF2= 2
##$SINO= 400
##$SIOLD= 16384
##$SREGLST= <1H.CDCl3>
##$SSB= 0
##$STSI= 0
##$STSR= 0
##$SW_p= 3612.71676300578
##$SYMM= 0
##$S_DEV= 0
##$TDeff= 0
##$TDoff= 0
##$TI= <>
##$TILT= no
##$TM1= 0
##$TM2= 0
##$TOPLEV= 0
##$USERP1= <user>
##$USERP2= <user>
##$USERP3= <user>
##$USERP4= <user>
##$USERP5= <user>
##$WDW= 1
##$XDIM= 8192
##$YMAX_p= 0
##$YMIN_p= 0
$$ End of Bruker specific parameters
$$ ---------------------------------
##NTUPLES= NMR FID
##VAR_NAME=  TIME,          FID/REAL,        FID/IMAG
##SYMBOL=    X,             R,               I
##VAR_TYPE=  INDEPENDENT,   DEPENDENT,       DEPENDENT
##VAR_FORM=  AFFN,          ASDF,            ASDF
##VAR_DIM=   8192,          8192,            8192
##UNITS=     SECONDS,       ARBITRARY UNITS, ARBITRARY UNITS
##FACTOR=    0.0002004,     1,               1
##FIRST=     0,             0,               0
##LAST=      1.6414764,     0,               0
##MIN=       0,             -643018,         0
##MAX=       1.6414764,     538186,          0
$$ Real data points
##PAGE= N=1
##DATA TABLE= (X++(R..R)), XYDATA
0@%%%qJ6k4L2l2M0n6P7r9J18j42J75k18K66l13L66m32N13o05P00q05R28j068J225
27F54j394J576j784K021k280K558k858L193l568L978m423M907n440O030o682P398
43C886q185R060j0044J1151j2395J3812j5445J7353j9617K2345k5706K9977l5621
56a9429M3466n5184P4797j15671L34913m73995j92593R41882n39364k74336P24027
67D48513k72086o91150P32982J75368p36258L55386M30485p76238J24087P36582
77E27671o04232l72549Q32470k17326o54562O68403J88174q27008L72875N78721
87D92637p30654r0073P32898m33116l69034P14389j67718o44345O23757K45895
97C74636p66361K79267N47756o75904o6552P54415m29567m76292P14437j6931
$$ plain form
0 0 0 0 0 -8 8 -16 16 -16 24 -32 45 -54 64 -78 97 -121 145 -168 198 -234 279 -326 374 -431 497 -571 654
27 654 -740 836 -948 1073 -1207 1351 -1507 1686 -1882 2096 -2327 2580 -2860 3170 -3512 3886
43 3886 -4299 4761 -5283 5868 -6527 7285 -8160 9193 -10424 11921 -13785 16192 -19429
56 -19429 24037 -31147 43650 -72021 262892 -211103 -403696 538186 -1178 -275514 448513
67 448513 176427 -514723 218259 393627 -342631 12755 443240 -332998 -208911 527671
77 527671 -76561 -449110 383360 166034 -488528 179875 368049 -458959 -86084 492637
87 492637 -238017 -328090 404808 -28308 -397342 317047 149329 -495016 128741 374636
97 374636 -391725 -112458 435298 -240606 -307158 447257 17690 -458602 255835 238904
107B38904o52145M85453K88694o93421K07664N53095n85319j34006O66610l54680
117B0849m14145O74219m9712o71336M95979L46922p14983J37822O05964n50026
127a18447k27932O86517k40249m94415N68568P1712o08094L69318L38601o16514
137b70935J02840N54292m99658k19699O57515k20213m99891N56457J08305o27824
147c58811L27552M08344n96481m424N74503l81678k76158N72512j46232m76524
157c57397M88465J47997n88068K52300M01990n33054k6312N63421l54013l32255
167c36926N59010m7249m97535L90599K05201n36040J70954M18808m50941j00247
177b24366N04359k62919l10377M92892l6075m83362L69249K41916n32694J10941
$$ plain form
107 238904 -413241 72212 360906 -332515 -124851 428244 -157075 -291081 375529 20849
117 20849 -393296 280923 231211 -440125 55854 402776 -312207 -174385 431579 -118447
127 -118447 -346379 340138 99889 -394526 174042 245754 -362340 6978 345579 -270935
137 -270935 -168095 386197 -113461 -333160 324355 104142 -395749 160708 269013 -358811
147 -358811 -31259 377085 -219396 -223820 350683 -30995 -307153 265359 119127 -357397
157 -357397 131068 279065 -309003 -56703 345287 -187767 -214079 349342 -4671 -336926
167 -336926 222084 174835 -322700 67899 273100 -262940 -91986 326822 -124119 -224366
177 -224366 279993 17074 -293303 199589 163514 -319848 49401 291317 -241377 -130436
187a30436M50401m08244j66441N09628j86781l74569M37564P2768m69162K50605
197a4667K69729m45554N9743M19842l58154j88538M81643j38726l74532M07143
207A17929R3532m86905K28374L39980m38385l5958M43107k77204k43485M50646
217A91631o3864l98429L35308J53491m42194J67959L36012m06944o5050M54110
227B62030k39877k87635M35870r444m28098K96110K22683m37254Q1372L69453
237B65210l37893j26559M24605j73650l04186L86304L3335m12391K55303K36475
247B46553m26195N3933L97445l22305j85820M38626j10374l53759L48350J05504
257A91958m18533J83396K87384l76692k0309L82432k54442j99032M05396q4517
$$ plain form
187 -130436 319965 -88279 -254720 254908 68127 -306442 131122 203890 -265272 -14667
197 -14667 255062 -190492 -130749 289093 -69061 -257599 224044 85318 -289214 117929
207 117929 211461 -275444 -47070 292910 -145475 -181433 261674 -15530 -259015 191631
217 191631 127767 -270662 64646 218137 -224057 -56098 279914 -127030 -192080 262030
227 262030 22153 -265482 170388 160944 -267154 28956 251639 -185615 -104243 265210
237 265210 -72683 -199242 225363 51713 -252473 133831 167166 -245225 10078 246553
247 246553 -179642 -125709 271736 -50569 -236389 202237 91863 -261896 86454 191958
257 191958 -226575 -43179 244205 -132487 -152796 229636 -24806 -223838 181558 97041
267I7041l60505L32370J41829m24492J49380L18321l71887o2199M22413k17569
277B4702k74150L90088q89l70515K72110J72561m08472J10068L42627l40264j05508
288a87642M09322j89746k82378L98652J9442m21482K54339K44285m09141M4347
298a20002L68086l08384j51730M18681j37312l23691L56747O7410m01248K24323
308g120K46298m11807L1966M02781k99125k00119M26360r8152l51294L49909J11469
319B01166m31711J78182L05953l74650l2504L86682k53644k06273M15260p4991
329A13470l70667L22678J44022m15249J56799L10042l84180n6772M27807k20472
339B7478k68516L90016j6695l70181K86963J70792m12614J10079L31609l37397
$$ plain form
267 97041 -263464 68906 210735 -213757 -64377 253944 -117943 -180142 242271 24702
277 24702 -249448 140640 139751 -230764 41346 213907 -194565 -84497 258130 -82134 -187642
288 -187642 221680 31934 -250444 148208 167650 -253832 507 244792 -164349 -120002
298 -120002 248084 -60300 -212030 206651 69339 -254352 102395 169805 -231443 -7120
308 -7120 239178 -172629 -140663 262118 -37007 -237126 189234 91082 -260212 89697 201166
319 201166 -230545 -52363 253590 -121060 -153564 233118 -20526 -226799 188461 113470
329 113470 -257197 65481 209503 -205746 -48947 261095 -123085 -179857 247950 27478
339 27478 -241038 148978 132283 -237898 49065 219857 -192757 -82678 248931 -88466
349h8466q7811L97110k01715k63235L94669k281m00900K66725K15597m04862O9946
360a05223L46231l19203j23573M10447j54964l00049L52666M1730l74511K38137
370A1688K10853m02083N9132L70195l02542j56688M02321j32483l08616L58566
380A10343O9287m08995K00759K63121l68987J0335L54975k73746j65377L99629
390A91344j04120l27013L24336R3046l85809J88081K60158l79085q529L86821
400B39230k45144k10844L77931o2257l27129K99275J18334l85803J42620K80860
410B27073l29030l9522L50411k21776j99564L74176m8520l46042K72175J51084
420A90465l64359J13294K82287l18242o9890L65520j70296k34309L21108p433
$$ plain form
349 -88466 -176277 220833 19118 -244117 150552 148271 -252629 14096 229693 -175169 -105223
360 -105223 241008 -78195 -201768 208679 53715 -246334 106332 148062 -226449 11688
370 11688 222541 -179542 -120410 249785 -52757 -209445 192876 60393 -248223 110343
380 110343 179630 -229365 -28606 234515 -134472 -124137 230838 -42908 -208285 191344
390 191344 87224 -239789 84547 177593 -208216 -20135 240023 -139062 -147591 239230
400 239230 -5914 -216758 161173 98916 -228213 71062 189396 -196407 -53787 227073
410 227073 -101957 -141479 208932 -12844 -212408 161768 113248 -232794 39381 190465
420 190465 -173894 -60600 221687 -96555 -166445 199075 28779 -205530 115578 108145
430A08145l12088K41361J50270l54282Q5779K92164k79163q8078L38284j55967
440B6425k35492L23595K2298l33491J97012J85668l17111M8122K80608k51716
450e4082j08188L28569j14947k43284K79822L8708l07616J84645J85508l19105
460a29970K5022L00340k21918j39899L10085q4209k49957K62347P1912l09642
470a65889J35013K04554k71992k103K73995j99597j42247L02684n8843k59050
480a83475K31825R1590k93617J17320K16666k65723l9990K85650j49525j69425
490a58704K62802k3240k45620K00274J09550k75594P8984K17298k27460n4304
500a16014K66521j32037j78951K54631R170k55495J60537J38684k51244L9858
$$ plain form
430 108145 -203943 37418 187688 -166594 -80815 211349 -67814 -155892 182392 26425
440 26425 -209067 114528 136826 -196665 347 186015 -131096 -82974 197634 -54082
450 -54082 -162270 166299 51352 -191932 87890 126598 -181018 3627 189135 -129970
460 -129970 -104948 195392 -26526 -166425 143660 59451 -190506 71841 143753 -165889
470 -165889 -30876 173678 -98314 -100417 173578 -26019 -168266 134418 75575 -183475
480 -183475 48350 139940 -153677 -36357 180309 -85414 -125404 160246 10721 -158704
490 -158704 104098 80858 -164762 35512 145062 -130532 -51548 165750 -61710 -116014
500 -116014 150507 18470 -160481 94150 103320 -152175 8362 147046 -104198 -64340
510f4340K20039j93677q5819K50430q6685j85288K13284L0970k37184J36797J46418
521A44945k38920J1710K27468j64724j10813K38723n5801k01166J90775P0439
531A12636k33326Q9715J64446k04454j8928K18782j34157j26205K21366k7000
541F2875k03109J69055Q8055k30282O7866J84905j91638n2835K25847j01454j53280
552a33995K05616J1833k09666J33127J14352k12681L6238J89192j68713p3620
562a08317K20880p7295j67992J93220L5510k18830J13455J42890k09137j340K05326
573A28370j38070j05853K09560m3264j80021J69315O3733k13242Q2646J53638
583A26812j90783k0226K09046j24659j29006K10385j1263j98207J45587R3458
$$ plain form
510 -64340 155699 -37978 -123797 126633 39948 -145340 67944 98914 -138270 -1473 144945
521 144945 -93975 -82265 145203 -19521 -130334 108389 52588 -148578 42197 112636
531 112636 -120690 -30975 133471 -70983 -89911 128871 -5286 -131491 89875 62875
541 62875 -140234 28821 116876 -113406 -45540 139365 -52273 -105108 120739 19285 -133995
552 -133995 71621 83454 -126212 6915 121267 -91414 -55176 134016 -34697 -108317
562 -108317 112563 35268 -132724 60496 96006 -122824 -9369 133521 -75616 -76956 128370
573 128370 -9700 -115553 94007 50743 -129278 40037 103770 -109472 -26826 126812
583 126812 -63971 -84197 124849 190 -128816 81569 70306 -127901 17686 111144
593A11144k11049N3783J76252j72541n8338K07665q6972j41224J89674O715k01072
604a25963J33230J15261k10051K7925J87984j59282p6100K16186p1013j71139
614a32962J84766M5660k10025J00871J34770j97637N686J97566j43434j01653
624a16392K13168m6612j78930J74137N6733k20094R4329J61568k03417k6021K15280
635A23749j21954j24920K10592k5716j97021J61774Q7569k18876O5927J67387
645A28511j89098l2312K21501j21075j47039K18515M22k11473J47511J04165k24391
656a04763N2424J93856j81477o9814K22480q7328j52665K00924Q393k14876J41306
667H460J23701k22725L0127J96708j70664p5128K30238q2150j79440J98842M3813
$$ plain form
593 111144 -99905 -46122 130130 -42411 -100749 106916 19944 -121280 68394 75109 -125963
604 -125963 7267 122528 -87523 -59598 128386 -30896 -106996 109190 38177 -132962
614 -132962 51804 97464 -112561 -11690 123080 -74557 -68871 128695 -14739 -116392
624 -116392 96776 50164 -128766 45371 102104 -117990 -23661 137907 -65510 -91531 123749
635 123749 1795 -123125 87467 61751 -135270 26504 114073 -104803 -38876 128511
645 128511 -60587 -92899 128602 7527 -139512 79003 79425 -132048 15463 119628 -104763
656 -104763 -52339 141517 -39960 -109774 112706 25378 -127287 73637 82030 -132846 8460
667 8460 132161 -90564 -60437 136271 -34393 -109521 120717 38567 -140873 57969 101782
678A01782k18978J11108J33264k11415J6681K07402j58772j01166K21106n5422
688D5590j75698J85488M3517k26312J10022J56819k11519j2370K10852j38286
698a1897j09467K20810m4092j95688J74165P4767k18483Q3421J53300j99832j2545
709h5541K18572j35916j30058K19800k2214j97450J65014Q0489k28031P5787J79992
720A40444j92441m5056K14239j09393j30570K09632j7374k04513J56107R9157
730A20232k18972N6288J74957j85354m4667K24218j06647j55143K05479J2048
740H2439k04013J34906J03882k14342M3968J88023j69013o9534K09259q2487j47115
751a24027J92632J3228k08513J25837J23502k04257K0986J82752j53231p4655
$$ plain form
678 101782 -117196 -6088 127176 -84239 -67558 139844 -18928 -120094 101012 45590
688 45590 -130108 55380 98897 -127415 -17393 139426 -72093 -84463 126389 -11897
698 -11897 -121364 99446 55354 -140334 33831 108598 -109885 -26464 126836 -72996 -85541
709 -85541 133031 -2885 -132943 86857 64643 -132807 32207 112696 -115335 -39548 140444
720 140444 -51997 -97053 117186 7793 -122777 86855 69481 -135032 21075 120232
730 120232 -98740 -42452 132505 -52849 -97516 126702 20055 -135088 70391 82439
740 82439 -121574 13332 117214 -97128 -53160 134863 -34150 -103684 105575 23088 -124027
751 -124027 68605 81833 -126680 -843 122659 -81598 -60612 122140 -31091 -105746
761a05746K10086o7472j64752J73687M0844j93765J01034J19285j91467J3348
771f4918J87616j38732r1954J97086m7426j59723J63038M6708j99179Q6706J39908
782A19130j76059j4463J78768j14957r5324J86314l3073j65569J43822O4043j83998
793i1366O8529J34166j67664j9980J85864j04058j14851J76619j0175j65111J28870
804B0843P3694j82985N0135J47776j47674m2604J72433q2237j13067J65149q91
815F0572j67004J13226Q8926j70627L1050J46605j35432n2675J73636o3603j28471
826a03797J47732K3845j59613R0341R5891j58673J3939J49895j14953o8545J59880
837G5942m3948j27730J34989L5988j61176P1474J11420j43223j0645J46308r2525
$$ plain form
761 -105746 104340 36868 -127884 45803 86647 -107118 -6084 113201 -78266 -64918
771 -64918 122698 -16034 -107988 89098 41672 -118051 44987 91695 -107484 -20778 119130
782 119130 -56929 -71392 107376 -7581 -102905 83409 50336 -115233 28589 92632 -91366
793 -91366 -22837 111329 -56335 -76315 109549 5491 -109360 67259 57084 -108027 20843
804 20843 94537 -88448 -38313 109463 -38211 -80815 91618 9381 -103686 61463 60572
815 60572 -106432 6794 95720 -74907 -43857 102748 -32684 -85359 88277 24674 -103797
826 -103797 43935 67780 -91833 -1492 94399 -64274 -50335 99560 -15393 -83938 75942
837 75942 31994 -95736 39253 75241 -85935 -14461 96959 -46264 -56909 89399 -3126
848c126q0573J48889k1938j32832J11607N2940j46908N1197J10834j30551k2381
859f2842J47139p7333r4593J39932k067j37570R6092P0579j43590K7277J22660
870H5684j10347m4851J39413n3975j00910J25482J4682j36450P9195Q2175j35293
881e5195J1261J27687r9615n9831J41247l5611j15808J14040L6524j37735N9211
892a3825R6698j25740q698J31377q2474p3895J34737j8903j23210J03307N3163
903G2537j38951M2272J09429j18220k9077J38373o4408r3042J25866M075j26884
914g8030Q5411O7465j34262K4271J17498j04693m4466J36205n1915j02548J23758
925C8694K0359j38530P1249Q8608j30015L371J27205r2792o3736J36961k8407
$$ plain form
848 -3126 -83699 65190 43252 -89580 22027 74967 -71941 -20744 90090 -40461 -62842
859 -62842 84297 6964 -87629 52303 50236 -87334 8758 79337 -64253 -36976 85684
870 85684 -24663 -69514 69899 15924 -84986 40496 55178 -81272 -2077 80098 -55195
881 -55195 -43934 83753 -15862 -75693 65554 29943 -85865 28175 64699 -73036 -13825
892 -13825 82873 -42867 -51565 79812 -2662 -76557 58180 39277 -83933 19374 72537
903 72537 -66414 -24142 85287 -32933 -62010 76363 11955 -81087 44779 48854 -78030
914 -78030 7381 74846 -59416 -35145 82353 -22340 -66806 69399 17484 -85064 38694
925 38694 59053 -79477 -8228 80380 -49635 -46264 80941 -11851 -75587 61374 32967
936C2967j15598J06883L7989j33455N8511R5898j27475j1617J36379p9137p9554
947g8209J33131j4982j24595J03655N6536j42042L8575J12303j14879k8405J36220
958G7308p0360r1075J35348J360j35679R0558O9448j40136L0784J22966j17936
969b7414m6771J48538n2391j08326J26461J5400j39940Q5013Q4586j43895J1711
980d7028J32959j04194n5842J45878m9238j16892J31654L1051j51973P1210R8770
991H6355j39611K237J41674j02134p4732J51958k7366j27936J16339M1676j47721
1002g9261O5480J07607j40904j3695J48001q7239q3057J47103k2626j35285J17050
1013B3174N8824j54686M5701J17695j28161k3599J47771q1877r5046J46833m151
$$ plain form
936 32967 -82631 24252 62241 -71214 -12703 83195 -44280 -55897 80482 1345 -78209
947 -78209 54922 39940 -84655 19000 75536 -66506 -27931 84372 -30507 -58912 77308
958 77308 6948 -84127 51221 52581 -83098 7460 76908 -63228 -32444 90522 -27414
969 -27414 -74185 74353 21962 -86364 40097 55497 -84443 570 85156 -58739 -47028
980 -47028 85931 -18263 -74105 71773 22535 -94357 37297 68348 -83625 -12415 86355
991 86355 -53256 -51019 90655 -11479 -86211 65747 38381 -89555 26784 68460 -79261
1002 -79261 -13781 93826 -47078 -60773 87228 -11 -83068 64035 41409 -93876 23174
1013 23174 81998 -72688 -26987 90708 -37453 -61052 86719 4842 -90204 56629 52478
1024E2478j40266J01509O4976j50371M2535J24805j29396l9838J53866o5226j04319
1035h9247J38413L783j43912R7663P9318j51178K3663J29842j14982m4816J50061
1046G8608o2975j11384J40653J7574j49435Q5385Q5685j46575J9271J37582j14754
1057b0365o1168J54276m3874j18484J27533K4669j47090Q0957R4862j46554M492
1068e0746J39831j01641o4588J49690m2275j24762J28505L9284j51870O4205J01472
1079H7105j35543l088J40415r6461p6494J46869k4128j25453J11728M3081j45254
1090g7223O0139J07360j33395j7998J41569p8971q2176J36958j6409j28169J05076
1101A6761N8023j41421L9131J08990j16124k3602J36212p2815q8713J32463p32
$$ plain form
1024 52478 -87788 13721 78697 -71674 -29139 95666 -33730 -73568 80298 15072 -89247
1035 -89247 49166 52949 -90963 6700 86018 -65160 -41497 88345 -26637 -71453 78608
1046 78608 15633 -95751 44902 62476 -86959 -1574 84111 -62464 -43193 94389 -20365
1057 -20365 -81533 72743 28869 -89615 37918 62587 -84503 -3546 91316 -55238 -50746
1068 -50746 89085 -12556 -77144 72546 30271 -94491 34014 73298 -78572 -14367 87105
1079 87105 -48438 -51526 88889 -7572 -84066 62803 38675 -86778 24950 68031 -77223
1090 -77223 -17084 90276 -43119 -61117 80452 1481 -80695 56263 39854 -88315 16761
1101 16761 74784 -66637 -27506 81484 -34640 -58242 77970 5155 -83558 48905 48173
1112D8173j27679Q9853O1841j35052L4043J14596j11529l9788J34629n2884r2616
1123g6413J18951O077j25501Q1439P1320j28096J6770J12703r7230m1837J29349
1134F7532m8206r9748J14599K1626j25559O5131P6340j20309Q769J16003q7968
1145a1790n6237J23538l0608r8423J01040K6210j22368N8164Q4013j13640n578
1156d5679J14208p4295o1164J18210k0267j04961R0992M1985j16148L9340Q6248
1167F8469j00639j5074J12489o1895o9398J08200n821j02443P7853M8247j11783
1178e1795K8099R2796r0379l0161J08835m5292p6207R8158P801j02492O2060N8635
1190F0058j01346J2319R2012p7182l8540J03882l2538q2287Q8691K0873j02396
$$ plain form
1112 48173 -79506 10347 72188 -62864 -28821 85775 -25754 -65542 69087 16203 -76413
1123 -76413 42538 48615 -76886 4553 75873 -52223 -35453 77250 -19980 -61817 67532
1134 67532 19326 -80422 34177 55803 -69756 -4625 71715 -48594 -39825 76178 -11790
1145 -11790 -68027 55511 24903 -73520 27520 53730 -68638 -10474 73539 -40101 -45679
1156 -45679 68529 -5766 -66930 51280 31013 -73948 17044 59029 -57119 -17779 68469
1167 68469 -32170 -47244 65245 3350 -66048 42152 36331 -66112 11741 59988 -51795
1178 -51795 -23696 69100 -21279 -51440 57395 12103 -64104 34054 41855 -60637 1423 60058
1190 60058 -41288 -28969 63043 -14139 -52679 51203 18665 -63622 25069 45942 -56454
1201e6454M9180O7692r5120k528R5660o3115n1400R8471j7235q6019P6388L2830
1213D8350r8752L5858P3528q7115j3744R7748n3149o1303R4164k721r1326O6033
1225G571M5744r7948K1971Q2670p7805k8324R6499l8920o9178Q8362Q228r5001
1237e6131N6937N6112r4507Q692Q8174p0352m0176R9000k6618q1207Q0660K4577
1249D5161r6182M2939O5721q9790m124R3636n9707n2346R4750j4289q5201P4310
1261A4878L4574r9524L2308P7992q4211j9600R6342m8271o2902R3135m41r3011
1273e8731O3114M8717r5739J9560Q2764p9035k9252J01207l8796p4694Q8826J2406
1285D0347r6618N6564N8620r8321P740R3878p0499m3859R9109k7503q0182Q5849
$$ plain form
1201 -56454 -7274 60418 -34702 -37230 58430 -4685 -56085 42386 25151 -60868 15520 48350
1213 48350 -50402 -14544 58984 -28131 -41875 55873 2724 -58579 35585 32864 -58462 7571
1225 7571 53315 -44633 -22662 60008 -17797 -46121 50378 11458 -57720 30642 38870 -56131
1237 -56131 806 56918 -37589 -28897 59277 -11075 -51251 47749 21131 -60076 20584 45161
1249 45161 -51021 -8082 57639 -32151 -36275 57361 -2346 -54692 40058 25769 -59432 14878
1261 14878 49452 -50072 -17764 60228 -23983 -43583 52759 4488 -58414 34721 34280 -58731
1273 -58731 4383 53100 -42639 -23079 59685 -19350 -48602 52605 13809 -60885 27941 40347
1285 40347 -56271 293 58913 -39408 -31668 62210 -8289 -52148 46961 19458 -60724 25125
1297B5125K1989j03297M8097P0270r5445k536R6810o7207n2104J05366j8498r3213
1309f4643Q0426L5683j04002L9119P6770r5240j2375J05169n8832o3879J01826
1320D0022r722r5342P9194M2446j11232L2157Q9108r1183k4050J06480n2538p0927
1332f5587J04615O53j05068O9911N4496j06040K2682R0593q8819l0587J12332
1343E9181m4505q0926R8716R916j04693O6250O0557j09860J2589J00734p9830
1354a1871m2845J07959l5916q3575R7038J8317j10578N5829O9745j03222N435
1365c3684R9331p7622m8231J12639k7051r3130Q9232K7816j07785N0189P3788
1376F5492j03816l554J06096o7831n6461J05767k0914r2154Q8353L3184j12951
$$ plain form
1297 25125 47114 -56183 -8086 62184 -33261 -35797 61013 -6194 -58298 47068 28570 -64643
1309 -64643 15783 51466 -52536 -13417 63353 -31887 -44262 60907 2075 -61804 40022
1320 40022 30300 -65042 14152 56598 -54634 -22477 66631 -24552 -48602 57878 5340 -65587
1332 -65587 39028 39681 -65387 4524 59020 -47020 -24338 66255 -22564 -53151 59181
1343 59181 14676 -66250 32466 42382 -62311 3939 64496 -45364 -32775 67959 -11871
1354 -11871 -54716 53243 17327 -66248 30790 49107 -61471 -5642 64103 -39119 -33684
1365 -33684 65647 -11975 -60206 52433 25382 -67748 21484 49300 -58485 -8296 65492
1376 65492 -38324 -41878 64218 -3613 -60074 45693 24779 -67375 20978 54162 -58789
1387e8789M2623Q2000r7229j1026J05381o5129o1958J09216j1259r9660P8557
1398A2727M1993j06976L6634Q2604r6373j8112J09057n5777o7402J01686o928
1409C3133r7944P7667M6644j10572K7458Q9037q7391k4748J03933n0040p0644
1420f3467J00148K719j00613O5186N2171j01620K1831Q7416q4304l1216J04980
1431E3231l9047p5756R0801R420r7562N9713N7268r8885R946Q9732p1094l7393
1443d9626R7288l2853p4990Q6054J7080r7177M8731O1703r0591L398Q8660o5857
1455h180m3542R5501k1079p9040P5123K4164r1234M0824O3470q5248n185Q8024
1467E3598n5149m7624Q7848j5801p7763P0417L0480r0926L0740O7734p6534j3034
$$ plain form
1387 -58789 -16166 65834 -31395 -42421 62960 -2169 -64127 45089 33830 -65830 12727
1398 12727 54720 -52256 -15622 66982 -29391 -47503 61554 5777 -61625 40061 33133
1409 33133 -64811 12856 59500 -51072 -23614 65423 -21968 -46716 57217 7177 -63467
1420 -63467 36681 39400 -61213 3973 56144 -45476 -23645 63771 -20533 -51749 53231
1431 53231 14184 -61572 29229 38649 -58913 800 58068 -40817 -30871 58861 -12233 -49626
1443 -49626 47662 14809 -60181 25873 42953 -54224 -5493 56210 -34381 -30983 57677 -8180
1455 -8180 -51722 43779 22700 -56340 18783 42947 -48287 -7463 56007 -29241 -34426 53598
1467 53598 -1551 -49175 38673 22872 -54891 15526 46006 -44920 -14180 53554 -22980 -36014
1479c6014Q5243m7863n2669Q4059n091p8818N8587L6252q3931K3655O8091p1401
1491a9900j9498Q4011l7591n6595P5907K805p8008N2074M2136p9791J2096P0135
1503D7781o0155k6238P8266k8738n8653O9387J1249p6217M0984M6546p2824M559
1515b4053P0699n2910l4567P5469j7025o1886N8668K0497p2711L0357N1555o5353
1527b1260o457O8669m0825l9839O9064q939o3130N1006K8571p0454K0249N5663
1539D2318n8429j5551O8622l1400m6426O2636K657o4095M1352L5418o5855J0342
1551a8411N8500n0447k3752O6847k2401n1504N7770J2248o6124L3291M2819o2005
1563b3169M61O1939m3021l2133O4688j2411n5648N0700K0421o5041K5159M8613
$$ plain form
1479 -36014 49229 1366 -51303 32756 27665 -51153 7434 43686 -40245 -16590 51501 -19900
1491 -19900 -39398 44613 7022 -49573 26334 29139 -48869 3205 45341 -34450 -22354 47781
1503 47781 -12374 -38612 39654 10916 -47737 21650 32899 -43318 -2334 44212 -28612 -24053
1515 -24053 46646 -6264 -40831 34638 17613 -44273 14395 34892 -37819 -7462 44093 -21260
1527 -21260 -27717 40952 127 -39712 29352 20413 -42717 8289 36860 -33594 -13345 42318
1539 42318 -16111 -31662 36960 5560 -40866 21770 24427 -39668 1684 37102 -28753 -18411
1551 -18411 40089 -10358 -34110 32737 10336 -41168 16602 28850 -37274 -3983 38836 -23169
1563 -23169 -22708 39231 -3790 -35923 28765 16354 -39294 11406 31827 -33214 -8055 40558
1575D0558n8900q856O4982l5486l9763O2625l785o0827M5694L0052o5695J4547
1587a4854N4698n2656j7310O5291k8493m6739O0280N414o3237L7896L6240o4046
1599b7516P901O0231m9373k7326O7245j8650n2830N5775J3683o6662L1816M6035
1611D0329o2332k979O2888m1082l3562O6047j2205n9175N2783K4213o8356K3246
1623a0185N1043n9952q702O7842l7096m3599O5583j755o2586M6468K9459o9267
1635c2747J8695N8211n7923j8938O9277l0029m7597O4969K542o9271M4533L9581
1647D1303o9912Q834O1900n3956k3818P2766k6361n5841O3521J1505p0252L9045
1659a266M2385p0888O630O7902n2097l2743P3564j9374n8982O1774J6431p5033
$$ plain form
1575 40558 -18342 -27198 37784 2298 -37465 25160 21375 -39452 6242 36294 -29401 -14854
1587 -14854 39844 -12812 -30122 35169 6676 -40063 20217 25631 -37606 290 36530 -27516
1599 -27516 -19615 40616 -8757 -36083 31162 12512 -40318 15457 29140 -37522 -5706 40329
1611 40329 -22003 -24982 37906 -3176 -36738 29309 17104 -42071 10712 34925 -33431 -10185
1623 -10185 40858 -19094 -27796 40046 2950 -40649 24934 23179 -39407 7061 36520 -32747
1635 -32747 -14052 44159 -13764 -32702 36575 6546 -41051 23918 26460 -42811 1722 41303
1647 41303 -28609 -19775 42125 -11831 -35649 37117 10756 -45085 18436 29941 -40311 -1266
1659 -1266 41119 -29769 -23139 44763 -7334 -40077 33487 14113 -44869 16905 33336 -41697
1671d1697L4997N1301o8342k754O8857m7053l5478P4069j5215o4951N8811K3986
1683C6531p3881K9224N2839o7973o017P3737m3298m3917P1895p304o5021N4305
1695A1120K6679p4784K4124N8993o4062j3683P2072l8247m4817P1232m304o9897
1707d5574N1395L4404p3582J7817N9859o1469j6937P4097l3662n0819O7613K490
1719B5632o7989M6969L4797p3164J5542O3513n8238k2815P2711k9084n1526O6768
1731B3116N517p1863M3009M2171p0034Q409O2409n3805k4543P2883k5504n5544
1743d3779O2658J1389o9345L9124M1214o9346N846O6038n0086l0915O9583j8837
1755A3544n5297N9110J3772o9795L3531M6285o4033m34O2709m5358l0995O8370
$$ plain form
1671 -41697 -6700 44601 -23741 -26495 42362 -4691 -40169 33900 18685 -46266 12545 36531
1683 36531 -37350 -8126 44713 -23260 -29277 44460 1162 -42755 29140 21836 -43185 11120
1695 11120 37799 -36985 -12861 46132 -17930 -31613 40459 2212 -42605 28627 24323 -45574
1707 -45574 5821 40225 -33357 -15540 44319 -17150 -34087 40010 6348 -44471 23142 25632
1719 25632 -42357 4612 39409 -33755 -18213 45300 -12938 -35753 36958 7874 -43652 23116
1731 23116 28633 -43230 -221 41950 -28084 -19675 42734 -11071 -35614 37269 11765 -43779
1743 -43779 18879 30268 -39077 47 41261 -28085 -22239 43799 -6287 -37202 32381 13544
1755 13544 -41753 17357 31129 -38666 -5135 41150 -22883 -23317 39392 -5966 -36961 31409
1767C1409j5443n8226N4108J9759o5976K7005M6248o0375m500O3937l8074l6930
1779c7058O2087q117n4944M8257K1417o4264K2106M9096n4540r915N9892l2706
1791A311l7088N9822l755n7200M2136K7205n9187J5208M8024m9893j3389N9567
1803C2761k7063l9899N3483J321n3993L7194K8390n7240J0540M9642m3660j8582
1815b7106N5401k0924m1078M9851O711n4237L0080L1953n1387M309M8281l9014
1827g160k1108N3916j5956m2746M4520J1236n1265K4976L4057m8025j549M8811
1839B9707l2008k5756M9027q773m1959L8093J5885m8826J8092L6092m2784o437
1851a9647M7198k6409k8722M5745k392m3263L1634K1243m6243J1093L8036l6676
$$ plain form
1767 31409 15966 -42260 11848 31607 -34369 -7364 38884 -21491 -25991 37946 -128 -37058
1779 -37058 25029 16912 -38032 10225 31642 -32622 -10516 38580 -15960 -25875 34017 1311
1791 1311 -35777 24045 20290 -36910 5226 32431 -26756 -11548 36476 -13417 -26806 32761
1803 32761 5698 -34201 19282 20603 -33390 3804 32194 -25046 -14506 35136 -8524 -27106
1815 -27106 28295 7371 -33707 16144 22855 -31382 -1302 30651 -20736 -16427 31854 -7160
1827 -7160 -28268 25648 9692 -33054 11466 22702 -28563 -3587 30470 -17555 -19104 29707
1839 29707 -2301 -28057 20970 12197 -29762 8331 24216 -24610 -6518 29574 -13210 -19647
1851 -19647 27551 1142 -27580 18165 15773 -27490 4144 25387 -20856 -9763 28273 -8403
1863h403j2300M4272j8188l1864M0300L655m2574K5434K4901m2530M491L8910
1875B6104l1478j7475M3638j2105l5077L5598J0009m2274J9069K8708l8811k015
1887a6109M0186k5509k2424M1182o350l6948L2062J5722m2447J2812L3028l5444
1899a0239q185M1507k0701k7299L9143M35l8569K6102K0572m0308P896L5106l2329
1912f869j3643M1957j4909l1356L6412N961m0750K2403K5848m0651J659L8961
1924B5023k7787j9522M1162r554l4993L4099J1901m2187J6457L0411l7491l809
1936a6290M0438k4976k4277M1683l472l9437L0557J7932m2776J2242L4711l6702
1948a0367r954M3300j9507k8921L9619R63m1049K8292K2266m3873P080L9036l3544
$$ plain form
1863 -8403 -20703 23569 5381 -26483 13817 17472 -25102 332 25233 -17297 -12806 26104
1875 26104 -5374 -22849 20789 8684 -26393 9205 19214 -23060 -3991 24717 -14094 -16109
1887 -16109 24077 -1432 -23856 17326 10976 -25972 6090 21812 -20635 -7823 25205 -10239
1899 -10239 -18424 23083 2382 -24917 14226 14661 -23908 2194 22766 -17542 -9646 25460 -6869
1912 -6869 -20512 21445 6536 -24820 11592 17553 -23197 -794 25054 -15597 -13938 25023
1924 25023 -2764 -22286 18876 9322 -25671 8428 20329 -21858 -5401 25010 -12481 -16290
1936 -16290 24148 -828 -25105 16578 13106 -26331 4226 22158 -20618 -8376 26335 -10367
1948 -10367 -20321 22979 3472 -25449 14170 15133 -25916 2376 24642 -19231 -12151 26885 -6659
1961f659j5070M4360j6569l3512L9781P338m4436K3169K7515m2321K969M1326
1973B7891l2192k0089M6138j1580l7751L7734J0279m5655K2288L1549m4219k286
1985a7893M4758k8169k4272M5764r102m0630L7720J5579m7932J6854L4921m1443
1997a3845n027M6511k8309k8412M7705l640m3996L4100J9022m8326J6017L8434
2009C0234m2454j0089M8873k3780l0736M5601k057m5409L3833K3620m9593J0431
2021a1526M0925l9118j2462M8956k1678l5209M5548M030m6769K8625K5550m7743
2033b0871Q763M3233l8668j7299M9282j6767l6656M3077N233m8044K7945K9821
2045B9049m8086L172M4476l4309j9538M8833j4973l9735M1975J1208m8486K3491
$$ plain form
1961 -6659 -21729 22631 6062 -27450 12331 19669 -24767 -1598 25917 -16404 -13435 27891
1973 27891 -4301 -24390 21748 10168 -27583 10151 20430 -25225 -2937 28612 -15607 -17893
1985 -17893 26865 -1304 -25576 20188 11086 -29544 8176 23755 -24177 -7323 27598 -13845
1997 -13845 -18872 27639 -670 -29082 18623 14983 -29013 5087 24109 -24217 -8200 30234
2009 30234 -12220 -22309 26564 2784 -27952 17649 15592 -29817 4016 27636 -21957 -11526
2021 -11526 29399 -9719 -22181 26775 5097 -30112 15436 19466 -27303 1322 26872 -20871
2033 -20871 -12108 31125 -7543 -24842 24440 7673 -28983 14094 19327 -28717 -772 29049
2045 29049 -19037 -15865 28611 -5698 -25236 23597 8624 -31111 10864 22072 -26414 -2923
2057b923L0207m5330K071M4896l2976k3345M9043j0918l9779L8916J2144m8468
2069b6462K2147L3716m4684k751M5606k9274k3999M6937r398m1172L7417J5670
2081B3753m7264J7834L3680m1614m441M6401k8254k7202M5756m315m1729L3706
2093F311J7077m5944J5090L5878l9688q486M4305k2646k7590M2435k396m1954
2105b7608L1377K0346m4552J0650L5975l5988j0387M3465j9721l0234L9840K484
2117A5647m0440K6188K1290m1542Q379L6094l2543j3664M1042j5055k9916L6488
2129A1968M248l9557K2940K4131l8924L185L5640k8044j5420L9153j1764l1276
2141b3720L2970Q109l7846J8802K4378l6247R83L5747k5704j7958L7053p568l1038
$$ plain form
2057 -2923 27284 -18046 -15975 28921 -4055 -27400 21643 10725 -29054 9862 22006 -26462
2069 -26462 -4315 29401 -15283 -18034 27572 -1702 -25701 21236 11838 -29334 8083 23753
2081 23753 -23511 -5677 28003 -13611 -18052 28349 95 -27107 18649 14334 -27395 6311
2093 6311 23388 -22556 -7466 28412 -11276 -19762 24543 1897 -25693 16742 14346 -27608
2105 -27608 3769 24115 -20437 -9787 26188 -9800 -20187 23278 3557 -26677 13163 15647
2117 15647 -24793 1395 22685 -18857 -10478 25616 -6927 -20591 20451 5396 -24520 11968
2129 11968 16216 -23341 -401 23730 -15194 -12009 23631 -4413 -19833 19320 7556 -23720
2141 -23720 9250 17359 -20487 -1685 22693 -13554 -12571 23176 -2528 -20486 16567 8999 -22039
2154b2039K8900J0634l6878J5191K5798l2538l092L4188k0795j9449L4469m465
2166I924l1769K6366J3409l4732J0142K6872k9023o359L3636j6310k2266L1462
2178A1352k1l0664K1342J5484l2092O822K7698k5311j0059L1892j2116k3130K8173
2191I370L699l0961J7294J9144k9826J585K8034k0875j3540L0089p063k4922K3970
2204E998Q445k9802J2245K0895k6803k673K8402j6790j6498K8176l387k5774K0615
2217C049J1718k8458P793K2884k3517o677K8295j2974j9591K6127J754k6597J6866
2230F72J5059k8039M467K4954k0929j0807K8127q560k1633K3756N336k8213J3765
2243b045J9012k6020p80K6252j7684j4152K8220n044k5175K1827J0380k8652R774
$$ plain form
2154 -22039 6861 17495 -19383 -4192 21606 -10932 -14024 20164 -631 -20080 14389 9924
2166 9924 -21845 4521 17930 -16802 -6660 20212 -8811 -15170 18466 2156 -20110 11352
2178 11352 11331 -19333 2009 17493 -14599 -7777 19921 -5390 -15449 16443 4327 -18803 9370
2191 9370 13069 -17892 -598 18546 -11280 -9695 18339 -2536 -16076 14013 6950 -17972 5998
2204 5998 14443 -15359 -3114 17781 -9022 -11695 16707 -83 -16581 11595 8208 -17566 3049
2217 3049 14767 -13691 -5898 16986 -6531 -13208 15087 2113 -17478 8649 10403 -16194 672
2230 672 15731 -12308 -7841 17113 -3816 -14623 13504 4944 -16689 7067 12403 -15810 -2045
2243 -2045 16967 -9053 -9833 16419 -1265 -15417 12803 7759 -17416 4411 14791 -13861 -4087
2256d087K1446k5119l854K8113j4754j8468K6791l57k6122J8865J3152k8951O224
2269g121K5152k3119q692K8427j1617k1035K7191K684k9162J6527J7918k8767
2281a1614K681K6316k1618j1940L0181p756k4979K4823P413k9761J4212J9875
2293A7833k8783n75K9580j9294j5784K9887m911k6640K4223J0660l2243J0943
2305e104K4522k7228m929L0814j7525j9024L1379k254k9988K2553J3983l1728
2317a4529Q856K6163k8531p224L3603j5594k2514L0597N24l0950K1675J6485l3659
2330a5098O551K8976k6618r674L3289j4099k4223L1455K522l3541J9947J9838
2342A9325l3379M450L0569k6459j2779L5575j1293k7272L0006N736l3810J8717
$$ plain form
2256 -4087 17359 -7760 -11614 16499 1745 -16723 10068 9711 -16411 2454 15606 -13345 -7121
2269 -7121 18031 -5088 -13780 14647 3030 -18005 9186 11870 -17292 -765 17153 -11614
2281 -11614 -8933 17383 -4235 -16175 14006 6250 -18729 6094 13507 -16254 -2042 17833
2293 17833 -10950 -11525 18055 -1239 -17023 12864 7953 -18687 5536 16196 -16047 -5104
2305 -5104 19418 -7810 -12739 18075 550 -18474 12905 10651 -19337 3216 17199 -14529
2317 -14529 -5673 20490 -8041 -15265 18338 2744 -19770 10827 11351 -19599 2076 18561 -15098
2330 -15098 -8547 20429 -6189 -15863 17426 3327 -20896 10559 13081 -20460 -513 19325
2342 19325 -14054 -9604 20965 -5494 -18273 17302 6009 -21263 8743 14479 -19331 -614
2354f14K1586l4505K058L2669k3868j5514L4642r397k8511K9797Q364l5487J5850
2367b930K3907l2008j166L2942k2973j7233L5467o910l0457K7580J0629l5197
2379a8349J4566K5587l3040l409L5179k0529k0029L4048m632l0908K6692J2889
2391A8065l5777J1359K7524l0543n008L3705j9119k1377L4226j713l2660K4439
2403C121J5467l5487J0370K8208l0173p558L5087j6304k2716L2063j59l2164K3252
2416C007J6213l4783P483K9132k7413r130L3926j5207k3603L1819K384l3325J9940
2429D43J8660l3081N718K8922k6002j1643L3958j1572k5517K9334L856l1635J8666
2442A07J9280l2460K523K9986k3077j3097L1898r557k5557K7053P300l2015J5203
$$ plain form
2354 -614 20972 -13533 -11475 21194 -2674 -18188 16454 7057 -21454 8343 16707 -18780 -2930
2367 -2930 20977 -11031 -12197 20745 -2228 -19461 16006 9096 -21361 6219 16848 -18349
2379 -18349 -3783 21804 -11236 -14645 20534 5 -20024 14024 9392 -21516 5176 18065
2391 18065 -17712 -6353 21171 -9372 -14380 19325 206 -21171 13055 11342 -21318 3121
2403 3121 18588 -16899 -6529 21679 -8494 -16052 19035 2731 -19985 12078 11919 -20245 3007
2416 3007 19220 -15563 -8080 21052 -6361 -15491 18435 3228 -20375 11444 13828 -19497 443
2429 443 19103 -13978 -8260 20662 -5340 -16983 16975 5403 -20114 9220 13076 -18559 107
2442 107 19387 -13073 -10550 19436 -3641 -16738 15160 5603 -19954 7099 14399 -17616 -2413
2455b413K0631k9001J41K9127k0800j5060L1085o345k6140K4599Q869l0666J2597
2468c376K1781k7530k487K8466j6962j5874K8071m177k5703K2062J0737k8720
2480a3712Q970K2083k4740m302K7862j4929j7841K7023o76k6065J8705J2314k7114
2493a2422O292K2773k1970p277K6582j1788j8420K4597J255k5359J6107J4569
2505A4939k6047L452K3261j9464r417K5586q442j9848K2262M397k4588J2472J5999
2518A4562k3286L95K2457j5665j1693K3959m933k0497J9079P366k3698R151J7139
2531A4336k0954k860K3034j2808j3906K1976j259k0883J5648J0023k2663N456
2543d860J8788j8082o351K2405r343j5894K0165J765k1377J2736J2637k1174J661
$$ plain form
2455 -2413 18218 -10783 -10642 18485 -2315 -17375 13710 7365 -18775 5824 14693 -15973 -3376
2468 -3376 18405 -9125 -11612 16854 -108 -15982 12089 7912 -17791 4271 15008 -13712
2480 -13712 -4742 17341 -7399 -11701 16161 1232 -16609 10414 9738 -16327 2378 14692 -12422
2493 -12422 -6130 16643 -5327 -12604 13978 2190 -16230 8367 9622 -15737 370 14939
2505 14939 -11108 -7656 15605 -3859 -13276 12310 3868 -15980 6282 10679 -13909 -1437 14562
2518 14562 -8724 -8329 14128 -1537 -13230 10729 5796 -14701 4378 11744 -11954 -2803 14336
2531 14336 -6618 -9478 13556 748 -13158 8818 7559 -13324 2324 12347 -10316 -4860
2543 -4860 13928 -4154 -10505 11900 2557 -13337 6828 8593 -12784 -48 12589 -8585 -6924
2556f924J9804j5613q674K1747o124j7718J7989N284k1603R316J5038j9494j498
2569h470K1125j3242j1980K0811k202j9059J5673Q480k1710O392J7881j8460n103
2582i864K1505r583j4477J9646Q92k0750J3495J1814k1917L439J9306j6980p636
2595a1110K2531p705j7244J9279M148k2120J0983J4453k1112L44K0632j4629j1059
2608a2609K2466m558j9214J7918O964k3101R133J7158k1004k854K2800j2994j3745
2621a3640K2682k098k1608J6855J0271k3715O497J8959j9997n390K4442j1131
2633B127j6941K2804J057k3043J5137J2529k4211M118K2263j9785q611K5140q679
2646C905j8607K2197K973k5080J4193J5528k4650J844K2934j8162j0496K6282
$$ plain form
2556 -6924 12880 -2733 -11407 10340 4216 -13502 4487 9771 -11832 -2516 12522 -6972 -8470
2569 -8470 12655 -587 -12567 8244 6042 -13017 2656 11136 -10574 -4182 13699 -4761 -9864
2582 -9864 11641 2058 -12419 7227 8119 -12631 864 12678 -9239 -5800 13506 -3474 -11110
2595 -11110 11421 3716 -13528 5751 9899 -12221 -1238 13215 -7897 -7553 13079 -1550 -12609
2608 -12609 9857 5299 -13915 4003 10967 -12134 -3001 14157 -6847 -9701 13099 105 -13640
2621 -13640 9042 6944 -14664 2191 12462 -11253 -4756 14203 -5794 -11184 13258 2127
2633 2127 -14814 7990 9047 -13996 1141 13670 -10541 -6423 15840 -3945 -12556 12584 3905
2646 3905 -14702 7495 10468 -14612 -419 15109 -9541 -7697 15237 -2925 -13421 12861
2658A2861p614k1684K2253O148k5893J2160J7341k5251K76K5194j7220j3523K6830
2671A1878n834k2262K1740O945k7391J1376J9982k4589k588K5828j5787j4694
2683a5396K6860l701k4795K0683J0257k7266R332K0506k4084l996K7241j4676
2695I65j7286K6575j586k4813J9485J1285k8103Q159K2483k2713p062K7495j3040
2708A844j8048K6369M6k6754J8293J3550k7475N758K3397k2495q094K8279j1465
2721C205k0031K4960K648k6848J6921J4931k8037M317K4893k0929r883K7590j0224
2734C513k0541K5066L122k7614J5673J6485k6327K342K4835k0248j0788K8055
2746A3573q461k1794K2927N385k6685J4088J7075k6158J203K5248j8376j2349
$$ plain form
2658 12861 5247 -16437 5816 11964 -13929 -1769 15572 -9679 -9403 15791 -1429 -14952 11878
2671 11878 6044 -16218 5522 12467 -14924 -3548 16434 -8155 -10743 15085 -702 -15396
2683 -15396 11464 7763 -17032 3651 13908 -13358 -4026 16480 -7604 -11600 15641 965
2695 965 -16321 10254 8668 -16145 3340 14625 -13478 -5319 17164 -5549 -12611 14884 1844
2708 1844 -16204 10165 10211 -16543 1750 15300 -12175 -6417 16980 -5515 -13609 14670 3205
2721 3205 -16826 8134 10782 -16066 855 15786 -12251 -7934 16959 -3970 -13853 13737 3513
2734 3513 -17028 8038 11160 -16454 -781 15704 -10623 -8281 16554 -3694 -14482 13573
2746 13573 5112 -16682 6245 11630 -15055 -967 16108 -10050 -8847 16401 -1975 -14324
2758a4324K6629o493k2089K2605O204k6874J2095J8154k4338r31K4714j6465j3129
2771a4242K5734m754k2510K0141Q228k5804J0152J8706k3494k413K4777j4665
2783a44j4309K4161k727k2448J8669R383k4948P894J9159k0694m497K3908j2823
2796E84j4901K3282j259k1988J6015J0758k3205N698J9269j9283n563K2903j0024
2809B286j5713K0715J338k1600J3919J1871k2012L467J9204j6886p100K1476p882
2822C083j5992J9015L094k0996J1420J2786k0252J310J8993j4398r161K0834n574
2835D162j6787J6655N262j9911Q762J3355j8132j056J8939j1667j0421J8749k971
2848D939j6945J4499O569j8513O293J4274j5905l096J7830r441j1036J6988m33
$$ plain form
2758 -14324 12305 5812 -16277 6328 12532 -14342 -2247 15907 -8431 -9362 15352 -1113 -14242
2771 -14242 11492 6738 -15772 4369 12597 -13207 -3055 15651 -7843 -10256 14521 -144
2783 -144 -14453 9708 6981 -15467 3202 12585 -12363 -4469 14690 -6004 -10501 13407 584
2796 584 -14317 8965 7706 -14282 1733 12491 -10714 -5016 14253 -5030 -10593 12310 2286
2809 2286 -13427 7288 8626 -12974 945 12816 -9196 -5729 13475 -3411 -10511 10965 3083
2822 3083 -12909 6106 9200 -11796 -376 12410 -7842 -6532 12461 -1937 -11098 9736 4162
2835 4162 -12625 4030 9292 -10619 -1857 11498 -6634 -7690 11249 -418 -10839 7910 4939
2848 4939 -12006 2493 9062 -9451 -3158 11116 -4789 -7885 9945 504 -10532 6456 6023
2861F023j6630J1844Q256j7436L797J5251j4379m954J6967o251j2725J5520J856
2874G139j6717R245J0385j6049Q91J5371j1614p346J6331l785j3961J3325M364
2887G579j6071P032J1151j4419j745J5716q960r581J5211j096j4414J1072O718
2900H193j5823M036J3368j3115m171J5391o730j0764J4718J105j5579R109R377
2913I115j5290J462J4549j1478o733J5903m020j3094J3166L872j5875P591J0531
2926I699j4940p01J5387r852q314J5556k249j4529J2414O276j6584N161J2404
2939I728j3745l114J6205q164j1093J5778N76j5657J0253Q353j6903L861J4667
2952A0745j3813n607J7322o287j3171J5428K093j6752R618J0723j6975R42J6084
$$ plain form
2861 6023 -10607 1237 9493 -7943 -4146 11105 -3274 -8228 8739 2488 -10237 5283 7139
2874 7139 -9578 -333 10052 -5997 -5106 10265 -1349 -8695 7636 3851 -10110 3215 7579
2887 7579 -8492 -1460 9691 -4728 -6473 9243 283 -9298 5913 4817 -9597 1475 8193
2900 8193 -7630 -3594 9774 -3341 -7512 7879 1149 -9615 5103 6208 -9371 -262 9115
2913 9115 -6175 -4713 9836 -1642 -8375 7528 3508 -9586 3580 7452 -8423 -832 9699
2926 9699 -5241 -5942 9445 -407 -8721 6835 4586 -9943 2471 8747 -7837 -2676 9728
2939 9728 -4017 -7131 9074 910 -10183 5595 6171 -9486 767 9120 -7783 -3922 10745
2952 10745 -3068 -8675 8647 2360 -10811 4617 6710 -10042 -424 10299 -6676 -5734 10350
2965A0350j2069p357J7651m958j5004J5470M097j7742P835J2429j6617n16J7614
2978A1183j1998r903J8412k676j6071J4230N989j8452O980J3744j6488k562J8197
2991A0585j0195j0711J7779j594j7526J4082Q119j9614N648J5160j6563l567J9055
3004A0658r804j2431J8356n3j8453J3101Q990j9497M664J6484j6301n395J9962
3017A0281q430j3626J8040P79j8991J2598J0729j9795L233J7510j5535o259J9972
3030A0506p722j5279J8297K906j9996J1185J1561j9553K219J8285j4872q244K0649
3043I942o360j5284J7217L121k0034J0840J2341j8971P91J8010j3514q532K0344
3056I911n661j6805J7066M777j9980Q950J3498j8741l44J9297j2743j0501J9715
$$ plain form
2965 10350 -1719 -9076 8575 3617 -11387 4083 8180 -9562 -1727 10702 -5915 -6431 11183
2978 11183 -815 -10718 7694 5018 -11053 3177 9166 -9286 -2306 11438 -5050 -7612 10585
2991 10585 390 -10321 7458 5864 -11662 2420 10539 -9075 -3427 11733 -4830 -8397 10658
3004 10658 854 -11577 6779 6726 -11727 1374 10364 -9133 -4469 12015 -4286 -9681 10281
3017 10281 1851 -11775 6265 7044 -11947 651 11380 -8415 -5182 12328 -3207 -9466 10506
3030 10506 2784 -12495 5802 8708 -11288 -103 11458 -8095 -5876 12409 -2463 -10707 9942
3043 9942 3582 -11702 5515 8636 -11398 -558 11783 -7188 -6397 11613 -1901 -10433 9911
3056 9911 4250 -12555 4511 9288 -10692 -1742 11756 -6985 -7329 11968 -775 -11276 8439
3069H439l595j7035J5718N533j9671Q637J3849j7762j932J8678j1444j0459J9338
3082H294l244j6947J4358P392j9786P399J3998j6702k228J8788j0631j1715J8349
3095G325j418j7051J3565P464j8897N763J4769j5705l711J8186r105j1564J7022
3108F643m45j7147J2311Q417j7893M313J4348j4637m240J7846p876j2421J6265
3121E484M97j6130J0805Q579j6758K956J4705j2843n656J6299n858j2143J4819
3134D756J655j5997R121R753j5724J658J4040j1195o313J6385n123j2498J3175
3147C693L189j5207P543R933j4449K55J3914r315p444J4604l422j1863J1691M039
3161G161j4732O124J0071j2804j076J3472q416p415J3293k101j1603R859M958
$$ plain form
3069 8439 4844 -12191 3527 9060 -10611 -1974 11875 -5887 -7819 10859 -585 -11044 8294
3082 8294 5050 -11897 2461 9853 -9933 -2534 11464 -5238 -7466 11322 691 -11024 7325
3095 7325 5907 -11144 2421 9885 -9012 -3249 11520 -4185 -7896 10290 1185 -10379 6643
3108 6643 6198 -10949 1362 9779 -8114 -3801 10547 -4090 -8330 9516 1640 -10781 5484
3121 5484 5981 -10149 656 9235 -7523 -4567 10138 -2705 -8361 7938 2080 -10063 4756
3134 4756 6411 -9586 -465 9288 -6436 -4778 9262 -1933 -8246 8139 3016 -9482 3693
3147 3693 6882 -8325 -782 9151 -5298 -5043 8871 -444 -7888 6716 3294 -8569 3122 7161
3161 7161 -7571 -1447 8624 -4180 -5256 8216 -200 -7615 5678 3577 -8026 1833 6791
3174F791j3513M668R959j1320k465J2920o292q445J2169j79j1780Q260O093j2888
3188f022K910J0653r576m057J2219m428q958J0786J258j1480O591O944j1017N09
3202c668J0558q039n025J1679k775r325R134K555j0894M905P908j0421p12J0387
3216F267o215o139J0606j110r948P685M612j0541K622Q560q637k867J0624m465
3230A054p243Q967J335r948N613O043r819P61R511p085m943J0475k686q209Q302
3245B128K796j0928M697P446r138j431J0484o031o099J0221m75r896P181M806
3259E761j0723K923Q653q947k524J0744m645q039J0108J034j0540O518N906j0570
3273d341J180R784q134m197J1131l288r015R519K397j1107N249P819j0756l35
$$ plain form
3174 6791 -6722 -2054 7905 -3415 -5880 7040 748 -7697 4472 4293 -7487 773 6866 -6022
3188 -6022 -3112 7541 -2035 -6092 6127 1699 -7259 3527 4785 -6695 -104 6840 -4177 -3668
3202 -3668 6890 -1149 -6174 5505 2730 -6595 2539 5094 -5800 -895 7013 -3408 -4120 6267
3216 6267 52 -6087 4519 3409 -6539 1146 5758 -4783 -2161 6399 -2238 -5105 5519 1054
3230 1054 -6189 2778 4113 -5835 -222 5821 -3998 -3237 6274 -811 -5754 4721 2035 -6174 2128
3245 2128 4924 -6004 -1307 6139 -2999 -4430 6054 23 -6076 4145 3670 -6226 955 5761
3259 5761 -4962 -2039 6614 -2333 -4857 5887 1242 -6797 3311 4345 -6195 323 6229 -4341
3273 -4341 -3161 6623 -1511 -5708 5423 2135 -6880 2639 5036 -6071 -822 6997 -3759 -4094
3287d094J0762p441n797J1421j811j0491R056M222j1804M005R087j0707j550J1780
3301F638o414p010J1166m75j1353Q571N392j2664L517J0417j0454l257J2771n709
3315A136q630J1594P07j2106P729O862j2826K225J1139r975m268J3371m792j0062
3329g896J1536J710j2968P871P509j3066R38J2459r504n373J3083l911j0665J1821
3343C544K751j3906O776R030j3263M43J2831r333o608J3768l013j1680J1722L066
3357F128j3817O514R884j3398p17J3560r119o876J3744k733j1809J1217M697j4463
3371g188N263J0094j2282j125J3485q388q182J4351j811j2542J0248N152j3766
3384f691M473J1075j2790k086J4153p516q730J3598j034j3308J0578N832j4277
$$ plain form
3287 -4094 6668 -773 -6570 4851 3040 -7451 1605 5827 -5977 -1972 7115 -3592 -5142 6638
3301 6638 224 -6786 4380 3905 -7448 1123 6515 -6149 -2632 7785 -2669 -5926 6845 1136
3315 1136 -7494 4100 4807 -7299 430 7292 -5534 -3309 7830 -2145 -6413 6958 2166 -7896
3329 -7896 3640 5350 -7618 253 7762 -5304 -4366 8093 -1411 -6784 6299 2388 -8277 3544
3343 3544 6295 -7611 -835 8195 -5068 -4625 8206 -1127 -7735 6033 3020 -8660 3062 6128
3357 6128 -7689 -1175 8709 -4689 -5406 8154 -965 -7841 5903 3170 -8639 2578 7275 -7188
3371 -7188 -1925 8169 -4113 -5238 8247 -141 -8323 6028 4217 -8325 1923 7075 -6691
3384 -6691 -2218 8857 -3933 -6019 8134 618 -8112 5486 4452 -8856 1722 7554 -6723
3397f723L907J1222j1707l066J4155p138r181J3595m99j2568R210O026j4036L492
3411c311J1714j1419l590J3989o076r393J2545P29j3287Q632P282j3795K773J1562
3425H355j0416m293J3329n412r504J1928R86j2496P746P239j2716J825J1726j0275
3439a978m523J3183m287r873J1036J818j2465O843P974j2039M28J1115q520n136
3453f424J2046l298r886J0364K525j2135O467P402j1007k11J1001p414n804J1628
3467E254k509r850R149L169j0933M364P996j0289o63J0741o399o334J0495r68
3481C223r709Q033L922j0568L274Q347r350j443J0064n023o871R805q3r465O943
3496A099M269r669K120Q286q141k538R584m360o070Q551N87r237N629N102r058
$$ plain form
3397 -6723 -2816 8406 -3301 -6367 7788 650 -8531 5064 4565 -8003 1207 7233 -6803 -3311
3411 -3311 8403 -3016 -6606 7383 1307 -8086 4459 5188 -8099 533 7815 -5980 -3207 8355
3425 8355 -2061 -6354 6975 1563 -7941 3987 4973 -7523 223 7462 -5254 -3429 8297 -1978
3439 -1978 -6501 6682 2395 -7478 3558 5376 -7089 -246 7728 -4311 -3883 7232 -1288 -6424
3453 -6424 5622 2324 -7562 2802 5327 -6808 -341 7061 -3946 -4157 6844 -570 -6374 5254
3467 5254 2745 -7105 2044 5213 -5720 -1356 6640 -3649 -4312 6429 30 -6304 4191 3223
3481 3223 -6486 1547 5469 -5099 -1825 6522 -2828 -4271 5793 770 -6101 3704 3621 -5844 1099
3496 1099 5368 -4301 -2181 6105 -2036 -4574 5010 650 -5420 3131 3718 -5519 110 5212 -3846
3511c846J179Q151o779l501R221k906p291Q030J462q426M118N448p797k47Q100
3526D916n399m125Q082j179p099O071K550p964K653O219o672j457P705l818n000
3541d517P277j02p190N176L835p493J251O534o057k317P548k809n240O291R65
3556C152p226L975M746p448J68P084m877l645O951j139o283N624K502p207K578
3571a045N035o124q10O639l582m494O678K10o632M449L434p132J466O566n843
3586a185k547P415k271o043O580J211p778L920N067o977L12P002n114m074Q004
3601C522j415o669N833K572p597K557O104o951j209Q147m694n006P805l36p643
3616d980N434L853q272K186O975o932k125Q435l640n845P570P08q556M959N161
$$ plain form
3511 -3846 -2667 5484 -1295 -4796 4425 1519 -5772 2258 3720 -4706 -588 4860 -2937 -3184 4916
3526 4916 -483 -4608 3474 2295 -4804 1267 3817 -4147 -1494 4725 -1947 -3404 4301 483 -4517
3541 -4517 2760 2658 -4532 644 4479 -3014 -1763 4771 -1286 -3603 3945 1136 -4104 2187 3152
3556 3152 -4074 -99 4647 -2801 -2633 4451 -426 -4071 2880 1741 -4542 1082 3584 -3623 -1045
3571 -1045 3990 -2134 -2944 3695 113 -4381 2297 2507 -4125 324 3758 -3374 -1908 4658 -1185
3586 -1185 -3732 3683 1412 -4631 1949 3160 -4618 -698 4369 -2608 -2296 4706 -408 -4482 3522
3601 3522 2107 -4562 1271 3843 -3754 -1197 4907 -2044 -3253 4894 200 -4806 2999 2663 -4980
3616 -4980 454 4307 -3965 -1779 5196 -1736 -3861 4574 934 -4911 2659 3367 -5189 -230 4931
3631D931q250M37Q084o426l396Q993k722p553Q230J448q818M858N720q871P2Q900
3647E637o352m276R071k113p900Q144K356r553M030O896q730o23R101n973n203
3662e488R692j454q633P641L152j0058L763P528r094j224J0107n873n772R913
3676D200j212r176P215M196j0337L160Q302q841k346J0642n176o765R791m03r781
3691f531P575M632j0579K531Q832r158k309J0553m676p281R906M12j0322P086
3705F71N214j0937K283R456q626l398J0967m468p569R683J144j0712O524N975
3719F207j0390J287R268p697l804J0365l382q369R170J811j0401N775O240j0311
3733d231P64J0058p741m336J0202k789q492Q869K437j0537N064O863r802J12R705
$$ plain form
3631 4931 -3319 -2882 5202 -1224 -4620 4373 1651 -5902 2328 3776 -5042 -184 5536 -3335 -3263 5637
3647 5637 -715 -4991 4080 1967 -5933 2211 4567 -4986 -956 5940 -2790 -3413 5688 -285 -5488
3662 -5488 4204 2750 -5883 1758 4910 -5148 -1385 6143 -2951 -4175 5932 59 -5713 4200
3676 4200 2988 -6188 1027 5223 -5114 -1954 6348 -2493 -4839 5803 627 -6138 3653 3250 -6531
3691 -6531 1044 5676 -4903 -2372 6460 -2698 -5007 5546 870 -6411 3495 3907 -6415 671
3705 671 5885 -5052 -2769 6687 -1939 -5337 5630 1162 -6407 3276 4420 -6292 232 6207
3719 6207 -4183 -2896 6372 -1325 -5129 5236 1854 -6515 2655 4466 -5935 -160 6080 -4231
3733 -4231 -3467 6591 -1150 -5486 4716 1927 -6565 2304 4741 -5796 -732 6131 -3671 -3559 6146
3748F146p001m996J0726k508r107R031K501j0328M741O973r656m90R940o091n609
3763e728J0276k185q374P843L337j0481M263P252r268l79R261n976n310R794j665
3778B660q490P508L350r728L165P493q634j353R346n177n714R075o52q603O743
3793I89L958r354K413P278p564j479Q528m468n788Q447K39q698O114M151q677
3808c911J752P193o534k619Q454l453o020P823O07q241N297M468q168R98P163
3823D809n882k721P762k749o174O860J737p774L831N140p837L33P333m982l754
3838d068P425j766o150O134J830p032K809N173o510n25O819m125m161O789p86
3853A856o090M757K847o578J581N588n233j988O968l355m470O297K56o112L772
$$ plain form
3748 6146 -855 -5851 4875 2367 -6740 2291 4792 -5536 -795 6178 -3478 -3968 5972 -119 -5728
3763 -5728 4548 2363 -6011 1832 5169 -5312 -1049 6203 -3065 -3444 5817 -159 -5469 4325 2660
3778 2660 -5830 1678 5028 -4700 -1535 5958 -2676 -4029 5317 140 -5574 3501 2849 -5754 989
3793 989 4947 -4407 -1994 5284 -2280 -3759 4769 301 -5487 2960 3199 -5499 615 4766 -3911
3808 -3911 -2159 5034 -1500 -4119 4335 882 -5138 2685 3292 -4949 348 4816 -3352 -2354 4809
3823 4809 -1073 -3794 3968 1219 -4955 1905 3642 -4132 -301 4839 -2998 -2665 4668 -314 -4068
3838 -4068 3357 1591 -4559 1575 3405 -3627 -818 4355 -2155 -2680 4139 14 -4147 2642 1856
3853 1856 -4234 523 3370 -3208 -1627 3961 -1272 -3260 3708 353 -4117 2180 2436 -3676 96
3868I6L303o010P09N854m974k009O329k239m628N421P06n919L035L913n490j20
3884b023N489l518l225N896q43n464M538K258o183K305M549n392q82N766k884
3899C87l874N598kn766M063K947n946R57N168m525k290O325k178m696N225J221
3915B614o285L144L904n353k06N555l737l250O181r75n223M643J991o204K232
3930i69M788n396j160O114l038l746N687j2o005M494K959o381J291N375n185k136
3946c320O856k478m963N824R51o668L627M095o528M21O268m768k893O714j548
3961A590n706N785J367o773L099M680o717j55O698m204l823P497j680o306N830
3976A182K294p265K335O065o550r91P103m196m699P706m43p465N613L433p989
$$ plain form
3868 96 3399 -2611 -1902 3952 -1022 -3031 3298 1059 -3569 1852 2558 -3361 -326 3587 -1903 -2023
3884 -2023 3466 -52 -3277 2619 1776 -3688 850 3108 -3075 -770 3779 -1613 -2495 3271 387
3899 387 -3487 2111 2109 -3657 406 3353 -2593 -1636 3532 -993 -3283 3042 864 -3832 1393 2614
3915 2614 -3671 -527 3377 -1976 -2182 3373 -364 -3614 2567 1592 -3631 1012 3003 -3201 -969
3930 -969 3819 -1577 -2737 3377 339 -3407 2280 2268 -3737 757 3716 -2665 -1374 4001 -1184 -3320
3946 -3320 3536 1058 -3905 1919 2870 -3798 -171 3924 -2604 -2183 4085 -683 -3576 3138 1590
3961 1590 -4116 1669 3036 -3737 -638 4042 -2675 -2830 3868 -336 -4159 3338 1658 -4648 1182
3976 1182 3476 -3789 -1454 4611 -1939 -2930 4173 -23 -4722 2984 2541 -4924 689 4122 -3867
3991c867K524O356o793j828Q157l645n615P539p2p377N247L946q208J559P405
4006E328p035k242Q519l525n935P564O94q194N089M523q353J289P629o473l331
4021d453Q468k783o528P645J316q648M951N204q875J186P744o106l708Q868k529
4036A752o884P166J906q636M095N782q504M41Q124o090l727Q399j740p405P566
4051B245J960q922M040N949p955k46Q216n612m586Q834j638p637O711K633q629
4066d637L536O667q068r42Q501n095n025Q838j536p388O416L118q754K856O544
4081E031p412j150Q347n062m958Q576o81p965O246L304q529K911O597p300j958
4096d003Q762m309n315Q094o01p411N602L484p819J869O524o572j718Q011l817
$$ plain form
3991 -3867 -1343 5013 -1780 -3608 4549 904 -4711 2828 2756 -4621 626 4572 -3636 -2077 5328
4006 5328 -1707 -3949 4570 1045 -4890 2674 3368 -4826 263 4786 -3567 -2278 5351 -1122 -4453
4021 -4453 4015 1232 -5296 2349 3665 -4983 -32 5172 -3703 -2517 5227 -879 -4587 4281 1752
4036 1752 -5132 2034 3940 -4696 -601 5181 -3323 -2882 5242 -848 -4575 3824 2084 -5321 2245
4051 2245 4205 -4717 -677 5272 -2683 -2929 5287 -325 -4911 3923 2285 -5352 1359 3992 -4637
4066 -4637 -1101 5566 -2502 -3444 5057 -38 -5063 3775 2239 -5149 1267 4385 -4369 -1513 5031
4081 5031 -2381 -3531 4816 -246 -5204 3372 2691 -5274 972 4276 -4253 -1342 5255 -2045 -4003
4096 -4003 4759 450 -4865 3229 2628 -4783 819 4303 -3516 -1647 4877 -1695 -3413 4598 781
4111G81n324P517l06p446N562L508p742J613O651o337j996P456k803n655P009
4126B488N50p518M788L698o702O67O620n943k609P656k628n618O325J104o782
4141c904L647M565p136O01O392m643l267O851k187n419N757J788o434K992M172
4156C775o259M1O169m224k999O411j499n279N062J935o288K426M794n817r45O052
4172C355k917l965N915n60n329M282J993n503J705M455m703j236N601k453m047
4187c407N172L41n052L220K524n135J007M321l950j655N455j916l996M506P19
4202B154m572J948L296m577L12M231l162k434M837p40m437M052J387m635J834
4217e06L463l819q15L997k041k877M238k75m132K931K390m638R34L708l370j600
$$ plain form
4111 781 -4543 2974 2668 -4778 784 4292 -3450 -1837 4814 -1523 -3519 3937 1134 -4521 2488
4126 2488 3038 -4480 308 4006 -2696 -2029 4591 -1352 -3961 3695 1067 -4551 1774 2878 -3904
4141 -3904 -257 4308 -2828 -2227 4165 -478 -3745 3106 919 -4500 1257 3045 -3389 -397 3775
4156 3775 -2484 -2443 3726 -498 -3497 2914 1415 -3864 1198 3133 -3155 -729 4065 -1752 -2697 3355
4172 3355 438 -3527 2388 1828 -3501 781 2774 -2729 -1024 3431 -1272 -2508 3093 640 -3407
4187 -3407 1765 2106 -2946 274 2798 -2337 -1330 2991 -959 -2614 2841 925 -3071 1435 2154
4202 2154 -2418 -470 2826 -1751 -1439 2792 -370 -2804 2033 1293 -3144 908 2295 -2340 -506
4217 -506 2957 -862 -1677 2320 279 -2598 1640 1365 -2767 164 2554 -2084 -1150 2558 -812 -2412
4233b412M686j699l109L505J094m247K156K633m359L44L932k622k388M286o77
4248A123l715L083J740m685J815L142l878o57M173j857k917M167km207K574K521
4264B420m594Q56M121l290j696M672j440l986M002J071m734K270L387m850n4M638
4280B793k718k846N177r84m232L741J538m866J886L898n005j96M939k975l189
4295c039M950l43m671L580K240n449J625M360m432j492N296k138l861N244J22
4310A992n316L652K675n304O93N107m484j901N822k290m030N145M13n487K839
4325d74L749n370N23N162m237k189N775j855m546M950J237o173K958M080n515
4340a925R3N601m270k513N826j330n480N077J764o173K973M143n713k84O123m313
$$ plain form
4233 -2412 2274 575 -2534 971 2065 -2182 -26 2607 -1752 -1408 2524 -98 -2486 1800 1123
4248 1123 -2592 491 2231 -2454 -639 2503 -1375 -2032 2141 284 -2633 1534 1532 -2675 -101 2420
4264 2420 -2174 -1318 2803 -487 -2183 2489 1049 -2937 1065 2136 -2598 -328 3059 -1791 -1845 2793
4280 2793 75 -2771 2406 1422 -2810 931 2469 -2397 -511 3387 -1618 -1814 3125 150 -3039
4295 -3039 1911 1568 -3103 477 2717 -2732 -1107 3253 -1179 -2671 2625 487 -3374 1870 1992
4310 1992 -3324 328 3003 -2301 -1608 3499 -985 -2886 2936 646 -3384 1761 2174 -3313 -474
4325 -474 3275 -2095 -1572 3590 -647 -2836 2939 1084 -3462 1488 2725 -3448 -490 3590 -1925
4340 -1925 -1832 3769 -501 -3014 2812 1482 -3998 1079 2843 -3330 -357 3786 -1927 -2211 3912 -401
4356d01l276O714j391n777N110K121o320K354M607n803m80O455m087l562O455
4371B719j056n846M907K364o409K255N092n869p47O183l547l649O015n42o080
4386d210N316K254o547J967N403n986j054O681l476m018O216k28o157M460K986
4401C607o664J636N597n810r59N962k770m153N843j77o069M484K700o127J251
4416a649N593n269j621O071k687m285N881L22o436M212L245n821P66N572n072
4431a178j647O024k254m752N505O52o033L653L274n605Q55M918m204k020O024
4446C212j958m700N438L74n543K924L802n619M50N135l921k242N264j640m609
4461c633N285P05n336K723L197m897K4N174l668k503N228j235m101M192J218n315
$$ plain form
4356 -401 -3677 3037 1646 -4131 979 3100 -3220 -866 3741 -2062 -2542 3913 -174 -3736 2719
4371 2719 1663 -4183 724 3088 -3321 -1066 4026 -1843 -2590 3593 46 -3603 2412 1870 -4210
4386 -4210 1106 3360 -3187 -1220 4183 -1803 -2857 3824 348 -3670 2546 2318 -3839 621 3607
4401 3607 -3057 -1421 4176 -1634 -2593 3369 599 -3554 2289 2112 -3957 527 3227 -2900 -1649
4416 -1649 3944 -1325 -2946 3125 438 -3847 2034 2356 -4080 132 3377 -2444 -1678 3894 -1178
4431 -1178 -2825 3199 945 -3807 1698 2350 -3683 -30 3244 -2361 -1506 3412 -792 -2812 3212
4446 3212 1254 -3446 1992 2366 -3177 -253 3549 -2070 -1620 3515 -406 -2648 2616 976 -3633
4461 -3633 1652 2357 -2979 -256 2941 -1956 -1932 3242 -426 -2929 2299 1064 -3037 1155 2373 -2942
4477b942K066L820m573MM285l027k119M286m69m398L730J942n196J882L514m319
4493a514k15M273k901k142M052k97l638K831J940m533J121L704l627r96M406j801
4509F63k854L604Q6l672K240K008l686O17L175l119j083L944j529k946L443L34
4525A225l376J828K399l683N96L183k646j514L183o31k693K430J122l238J276
4540e39K451k885m25K925j500j898K954k22k596K192J309l192N61K764k377r96
4556a474L209j157k404K702N09l024J826J850l250K73K442j671j275K620l54k318
4572a496K063J051k864N42K569k495p60K839j082k104K418K98k969J805J480k591
4588a296M10K712k479j154K891m61k758K747O08k899J224K052k597k7K981j898
$$ plain form
4477 -2942 -876 2944 -1629 -1625 2660 -367 -2486 1800 1331 -3067 663 2605 -2591 -709 2805 -1514
4493 -1514 -1729 2544 -357 -2499 1553 1256 -2382 449 2389 -2144 -1023 2681 -946 -1942 2464 663
4509 663 -2191 1413 1499 -2173 67 2075 -1611 -994 2181 -938 -2021 1923 394 -2552 891 1225
4525 1225 -2151 -323 2076 -1607 -1011 2172 -474 -1988 1195 564 -2129 301 1423 -1815 -539
4540 -539 1912 -973 -1398 1527 27 -1871 1083 861 -1735 457 1766 -1426 -865 1899 -478 -1474
4556 -1474 1735 578 -1826 876 1385 -1639 187 2037 -1213 -940 1502 -169 -1444 1176 822 -1496
4572 -1496 567 1618 -1246 -704 1865 -630 -1390 1449 367 -1737 681 979 -1990 -185 1295 -1296
4588 -1296 -886 1826 -653 -1807 1084 623 -2135 612 1220 -1679 -455 1597 -1000 -1027 1954 56
4604E6k038L189m62k240J858J308l211P24K833k454j291L396j448k160L065k0
4620A105l177K078K008l552P13K924k693j367M102j672k648L109M42l515K074
4635f9K284l895K20L736k290k087L947r64l359L323P47l578J427K955l803k40
4651a646L860k705j755L719l78l449L216J183m053J027L621m207l60M164j960
4666B77k761M029n9l935L054J328l959J412L518l911p97M406k266k766M197k4
4682A743m327L238J857m594J074L891l658j299M474k010l149M352K16m379K873
4697C02K199m599J147L611l780q84M955k667l219M495L95m830L130K538m577P24
4713a060L906l496j709M649j550l855M411O45m630K636L252m988N43M035l481
$$ plain form
4604 56 -1982 1207 745 -1495 363 1671 -1540 -816 2017 -437 -1728 1668 220 -1940 1125 1105
4620 1105 -2072 6 2014 -1538 -825 2099 -594 -1961 2141 469 -2179 930 1372 -2143 -69
4635 -69 2215 -1680 -1460 2276 -14 -2101 1846 882 -2477 846 1593 -1985 -558 2397 -1406 -1646
4651 -1646 2214 -491 -2246 1473 1095 -2354 862 2045 -2008 -981 2640 -1567 -1927 2237 277
4666 277 -2484 1545 1486 -2449 605 1933 -2026 -614 2904 -1007 -1804 2602 336 -2430 1767 1743
4682 1743 -2584 654 2511 -2083 -1009 2882 -776 -2075 2399 389 -2760 1592 1808 -2571 302
4697 302 2501 -2098 -951 2660 -1120 -2004 2951 284 -2935 1560 1955 -2875 255 2793 -1784 -1060
4713 -1060 2846 -650 -2359 2290 740 -3115 1296 1941 -2689 -53 3199 -1789 -1246 2789 -692
4728f92j614M696j480l776M068Q75m828K749K722m624O50L987l374k000M991j422
4744I28l891M253O27m467K192L044m417K98M367l508j784M698j623l569M102Q00
4760B050m686K237L052m248j36M418k987k064M185q45l660L250J666m444J873
4775c39K907m111q2M112k610k017M002q23l689L617J283m559J730L115l963o05
4791b032M512k637k167L786p55l198L167J253l756J047L006l351n58M044k105
4806B56k200L127j61l263K695J370l669J278K780k999p85L529j709k383L126L50
4822A342l409K539J236l304O81K899k881o42L370j496k138K786K76l014J801J702
4838A748k952K62K896k146j455L174r89k327K466O41k984J489J963k738k2K827
$$ plain form
4728 -692 -2306 2390 910 -2866 1202 2077 -2751 -2 2720 -1904 -1254 2733 -641 -2641 2350 928
4744 928 -2963 1290 1917 -2550 -358 2686 -1731 -1433 2934 -574 -2358 2340 717 -2852 1250 2050
4760 2050 -2636 -399 2653 -1595 -1731 2687 -300 -2364 1821 976 -2684 566 2232 -2212 -339
4775 -339 2568 -1543 -1625 2487 -123 -2140 1862 1039 -2650 967 2250 -2309 -579 2536 -1427 -2032
4791 -2032 2480 -157 -2324 1462 707 -2491 676 1929 -1827 -780 2226 -1125 -1683 2361 256
4806 256 -1944 1183 1022 -2241 454 1824 -1845 -567 2213 -786 -1571 1958 249 -2134 992 1342
4822 1342 -2067 472 1708 -1596 -915 1984 -897 -1539 1831 335 -1803 983 1259 -1755 46 1748
4838 1748 -1204 -942 1954 -192 -1647 1527 538 -1789 677 1318 -1666 -177 1786 -952 -974 1853
4854A853j867j279K454l84k410J826J192k333M33J782j857m43K521j513j492K246
4870G29j0j976J523J186k342K02K138j719p77K156q54j597K071J24k306J268J381
4887A197j804R6J969j527j129K064m27j719J682P55k268R28J701j941o78K381
4903A280j192j233J745L20k017J235J218k256J01J962j350j037J944m16j509J689
4919D84N08k205Q47J916k212l19K185j322j354K131Lk277J912R69k396N70K001
4936A441k063q47K479o64j962K210J73k267J339J708k484J41K443j899r55K352
4952A145l52k467K258O99k858J277J667k204r0K797j801j491K782l93k739K260
4968D90J165k956O83K405k710m99K871j207j933K782j31k823K273J123k930N43
$$ plain form
4854 1853 -14 -1293 1161 777 -1633 193 1385 -948 -515 1267 -590 -1033 1488 -25 -1517 729
4870 729 719 -1257 266 1452 -890 -688 1450 -269 -1046 1110 256 -1341 730 854 -1452 -184 1197
4887 1197 -607 -511 1458 -69 -1198 866 439 -1280 402 1157 -1111 -183 1518 -423 -1101 1280
4903 1280 88 -1145 600 920 -1097 138 1356 -900 -799 1163 -187 -1224 720 304 -1205 484
4919 484 992 -1213 -366 1550 -662 -981 1204 -118 -1472 659 662 -1615 297 1266 -1130 -560 1441
4936 1441 -622 -1469 1010 346 -1616 594 767 -1500 -161 1547 -937 -796 1647 -252 -1207 1145
4952 1145 793 -1674 584 1283 -1575 -298 1369 -835 -925 1872 71 -1420 1362 969 -1770 490
4968 490 1655 -1301 -618 1787 -923 -1422 1449 242 -1691 1091 960 -1863 410 1533 -1397 -854
4984h54K697k423o94K812j519j926K744L25l158K370J407l123P54K725k609r69
5000a441L381j746k441K917N97l068J942J741l202N65L039k558j565L594j532
5015B23k325L025O87l457J677K728m027N69L109k516j713L437p78k832L001Q83
5031A691l643J624K358l522L69L214k355j965M140j092l100L119M41l363J480
5046f04K919l811l3L513k216j697L482p80l259L051P73l053J407K530l569j11
5062a458L682k192k156L727n37l188K691J401l729J492K510k936q77L587k028
5077a1k469L799j96l262K920R97l417R80K598l118k65L387j810k328L427q7l301
5094b156K396J856l958J217L020l269o42L571j827k173L299j51l170K503J233
$$ plain form
4984 -854 1843 -580 -1274 1538 19 -1907 837 1162 -1996 374 1781 -1342 -588 2137 -472 -1441
5000 -1441 1940 194 -2247 670 1267 -1801 141 1882 -1320 -755 2284 -274 -1839 1755 223
5015 223 -2102 923 1610 -1847 -170 2558 -1469 -900 2209 -307 -2020 1417 639 -2193 808 1691
5031 1691 -1952 -328 2030 -1492 -1123 2091 -264 -2229 1911 819 -2281 838 1279 -2084 -604
5046 -604 2315 -1496 -1529 1984 -232 -1929 1553 773 -2486 565 1338 -1715 -308 2222 -1347 -1458
5062 -1458 2224 32 -2124 1603 1066 -2122 569 1970 -1759 -267 2243 -693 -1570 2017 -11
5077 -11 -2480 1319 1123 -2139 781 1778 -1639 -659 1939 -1179 -1444 1943 133 -2195 1232 1145 -2156
5094 -2156 240 2096 -1862 -645 2375 -894 -1536 2035 208 -1965 1334 1183 -1987 516 1749
5109A749l381R71K821k842q80L326j482k083K906L01l190J947J728l187O02K790
5125B096k520q89K850j084k349K893J98l006K126J271l072P80K322j994j096L132
5141A658j038k229K465L05k549J189J712k366L68K117j982j449L120q14k298K555
5157G64L46k360R09K006k883%K669j501j117K439p37j943K002P24k475R91J512
5174A346k020k77K168r24j589K367n34k167K088J007k544Q61J670j683q53K239
5190A155j172j223J910k66j458J260R27j849J54K124j816o86J542n69j496J941
5206D78K50j639Q34J126j765nJ857j200j413K306m64j742J679N73j583L50J484
5223A126j258q13K016q87j464J741L28j781J181P69j602k4J565j036o82J631n01
$$ plain form
5109 1749 -1632 -661 2160 -682 -1562 1764 282 -1801 1105 1406 -1784 163 1891 -1296 -694 2096
5125 2096 -424 -1313 1537 453 -1896 997 1195 -1811 315 1586 -1486 -706 1616 -378 -1474 1658
5141 1658 620 -1609 856 1161 -1388 -199 1513 -853 -485 1632 -350 -1799 1321 507 -1791 764
5157 764 1110 -1250 -341 1665 -1218 -1218 1451 -50 -1167 1272 535 -1408 594 1318 -1157 -166 1346
5174 1346 -674 -951 1217 293 -1296 1071 537 -1630 458 1465 -1079 -218 1452 -231 -1084 1155
5190 1155 -17 -1240 670 404 -1054 206 1133 -716 -562 1562 -254 -940 602 33 -1463 478
5206 478 728 -911 -77 1049 -716 -721 1136 -64 -1477 829 365 -1377 302 875 -708 -358 1126
5223 1126 -132 -945 1071 184 -1280 461 789 -992 189 958 -644 -668 897 -139 -821 810 309
5240C09j178J164P59j858N87J333j497l0J410r76r63J702j22j729J294O08j589
5257g76O50J545j687o29J731m66j557J657J27j338P30R03j637JJ653j265n86J640
5275F96j21k191K025M05k067Q28J494j512n17J992j039j372K097J8k130J269J033
5292I08j986N24J872j638p80K209q79j508J994J12k149J213J329k402O88J820
5308A327j768o57K365q09j963K157P0j836J149J593k515J49K032j532j043K526
5324A245q63k138K322L76k381J235J679k391j61K798j939j010K532o98k213K236
5340F29O06k888J049K321k698J31K594j837j606K942m48k684K261J046k605R64
5356b23K010k582k55K744j933j402K904n12k703K225J213l092J051K378k550l28
$$ plain form
5240 309 -869 295 1054 -804 -217 1116 -381 -411 999 23 -940 762 640 -1089 205 813 -776
5257 -776 -126 1419 -268 -897 834 368 -1189 468 595 -743 -13 890 -747 -746 907 -358 -944 696
5275 696 575 -1616 409 814 -1253 -425 1069 -443 -960 1032 -7 -1379 718 736 -1394 -125 908
5292 908 -1078 -554 1318 -320 -1100 1109 230 -1278 716 828 -1321 -108 1221 -1181 -493 1327
5308 1327 -441 -1098 1267 458 -1505 652 722 -1114 35 1628 -887 -738 1294 -238 -1281 1245
5324 1245 382 -1756 566 942 -1439 -204 1475 -916 -1077 1721 -218 -1228 1304 606 -1607 629
5340 629 1235 -1653 -604 1717 -981 -850 1744 -93 -1699 1243 795 -1889 372 1418 -1187 -223
5356 -223 1787 -795 -1050 1694 -239 -1641 1263 751 -1952 273 1486 -1606 -555 1823 -727 -1055
5372a055K904j792j626K485j23k432J761J274k902J018J928k112q59L183j567
5387H5j809K841k38k641K194J190k802O27J894k303l57L075j639j917K722m2k633
5404a753J756J599l036J101K373k390q41K842j189k154K804p9k480J392J552k948
5420a451O62K295k007r80K981j424j911K716Q0k330J182J633k665K94K669k211
5436d67q35K628j085j755K139N71k752J505J373k173J07K177j724j014K665j140
5452B20k007K378M33k347J305J474k369M5K352j865j075K694q24j652J951M51
5468A164k620J303J518j985j95J932j334r28K284o77j922J984N21j894M78J545
5484A174j724k42K144j180j321K246o27j527J239R07k292O51J774j654k00J789
$$ plain form
5372 -1055 1849 57 -1569 916 793 -1639 122 1396 -1506 -488 1440 -672 -1531 1652 85
5387 85 -1724 1117 879 -1762 432 1622 -1180 -553 1341 -962 -1319 1756 117 -1800 922 880 -1753
5404 -1753 3 1602 -1434 -333 2040 -350 -1191 1651 462 -1692 1112 1033 -1447 -55 1497 -1451
5420 -1451 -789 1506 -501 -1481 1500 76 -1835 881 961 -1369 -187 1446 -1219 -925 1744 -467
5436 -467 -1302 1326 241 -1514 625 1196 -1556 -51 1322 -851 -744 1433 -291 -1305 1360 220
5452 220 -1787 591 1024 -1323 -18 1456 -913 -868 1484 -381 -1456 1238 414 -1238 713 1164
5468 1164 -1456 -153 1365 -620 -815 1117 -217 -1145 1139 462 -1460 524 1045 -849 -371 1174
5484 1174 -550 -792 1352 172 -1149 1097 470 -1057 182 1089 -1203 -552 1222 -432 -632 1157
5500A157r54j416J991N1j808J128Q88k116Q15J538j630m74J644p83j064J660J45
5517G72j816J247Q68k086O47J205j167l60J502n23j398J406M64j693R54N64j093
5534e07p2J209q35o19J553j74j333R01M28j053J97J012q68n72J201n45n91J007
5552C39J44j233Q33R47j211J72N71o85n46J303k21j288J137K62j271Q51P45j110
5570b61j13J284r03o22J226m94q85R31P41j408K95R69p22n36J178l81r78J245
5588E66N8j109M89P62j071k48J516r45p23J144j78j010J016K49j331M36J256j386
5606e09k60J553q10r62J618n9j332N22J118j494J92J309j120k16J421o97j383
5623a109J447J70j354O49J056j531n4J715j024p20J589o69j507J768L43j748J097
$$ plain form
5500 1157 203 -1213 778 829 -979 149 1037 -1079 -264 1274 -356 -830 814 31 -1033 627 772
5517 772 -1044 203 1071 -1015 -368 837 -330 -690 812 289 -1109 297 761 -932 22 586 -507
5534 -507 -579 630 -205 -824 729 555 -778 123 551 -502 -305 707 -161 -733 468 -77 -668 339
5552 339 483 -750 83 1030 -181 -9 562 -123 -669 634 413 -875 262 524 -747 104 849 -261
5570 -261 -374 910 7 -615 611 117 -768 163 904 -504 -209 760 38 -498 680 299 -679 566
5588 566 624 -485 4 766 -305 -553 963 18 -705 439 261 -749 267 516 -815 -379 877 -509
5606 -509 -769 784 -26 -988 630 571 -761 -239 879 -615 -423 886 -234 -450 971 274 -1109
5623 -1109 338 508 -846 -197 859 -672 -726 989 -35 -755 834 165 -1342 426 769 -979 118
5640A18R25j248j93J605j132p71J151k17j247J265O54k049N58J876j758l73J630
5657G94p76j031J724r7j789J212P97j519K13J627j471n39J825p62j238K174m88
5674F56j817J099J340k154M07J725j657k62J965j229r42J803k11j943J552Q72
5690A204k124L3K142j453r72K153o21j260J603J38k066J164J325j945K33J829
5706A383j840q20K220n97j752J969L27k388J415J043k045M47J671j341q59K492
5722A325j090j600J743N65k176J155J495k433L68J808j392r78K164n02j880K068
5738F40M16k254J063J794k329j75K345j314j342K235n07j674J962L6j969J083
5754A0J456k359J60K070j415r33K052l37k010J618M74k032J059J248j703k5J759
$$ plain form
5640 118 1043 -205 -398 1207 75 -696 455 238 -1009 256 910 -1139 -581 1295 -463 -836 794
5657 794 18 -1013 711 614 -1175 37 834 -685 -472 1155 -316 -855 970 208 -1030 1144 656
5674 656 -1161 -62 1278 -876 -469 1256 -401 -663 1302 73 -869 934 723 -1220 332 1204
5690 1204 -920 -887 1255 -198 -1170 983 362 -898 705 843 -1223 -59 1266 -679 -446 1383
5706 1383 -457 -1277 943 346 -1406 563 890 -1498 -83 960 -1085 -638 1033 -308 -1167 1325
5722 1325 235 -1365 378 943 -1233 -78 1417 -1016 -648 1160 -232 -1210 954 452 -1428 640
5738 640 1056 -1198 -135 1659 -670 -845 1500 186 -1156 1079 572 -1102 860 896 -1073 10
5754 10 1466 -893 -733 1337 -78 -1011 1041 704 -1306 312 786 -1246 -187 1061 -642 -667 1092
5771A092j208r95J821l83j583J399Q02j768P92J018j648m6J950j559r00K000l19
5788D65j624J389M89j281K73J261j495k50J797p00j267J653J5j668J346K86j663
5805i74O99J117j180l10J604r75r52J596k41j565J397O75j573L70J175r16p81
5822h34J614o19j258J514K35j337N07R02j371N52R69j324k29J677p04j111J059
5839B42j57o03O67N64j162p4R72m01q10J460o00p17J084Q4r48J01R28p72j45Q51
5859E64q05j53P58j69r14J038L38j167L81O57j004J79N85j21p44P71K34r41P42
5878B29J72p94R7R13p18n00J056k92p24P04K15r69M02N50m10k52M46k90O5P7M54
5899D31r26N99M15r71N46K27k91m93R51l09o30P45o4q77N97N12o74R0P55o17m67
$$ plain form
5771 1092 -116 -1111 710 327 -1256 143 945 -823 -31 987 -661 -707 1243 -316 -1216 784 465
5788 465 -1159 230 719 -562 -289 972 -523 -773 1024 324 -943 710 725 -943 403 689 -974
5805 -974 -275 842 -338 -648 956 -19 -971 625 384 -1181 216 891 -682 -312 863 -53 -834
5822 -834 780 161 -1097 417 652 -685 -178 724 -647 -95 874 -450 -679 998 294 -817 242
5839 242 85 -518 149 713 -449 -523 449 48 -762 698 98 -619 465 549 -399 -298 630 -142 -287 564
5859 564 -241 -394 364 195 -719 319 657 -510 -129 528 -476 -297 288 167 -577 194 428 -513 229
5878 229 401 -393 -296 617 -101 -601 455 163 -561 143 358 -611 -209 341 -69 -321 125 -165 -100 -23 431
5899 431 -495 104 519 -452 94 321 30 -463 488 179 -451 294 230 -647 -50 462 -212 -122 633 16 -451
5920d51N63k20n10N97M73p76J39N47m92m61J362r11m61N04M21j029O89O18o44
5939d2K1P03o47n80R00p1j020R23K52j389R08M87n39m84J489p64r81J211r1o42
5959c56P44K44j215O83M92o55k53N75l52n80R51P2r35O24P69j311K60J201q48
5978A10p45J273l92j183J176K31j025N91P00j360N6J178q17m28J358o09q69J222
5996D67Kj303O67P72r35j69J397r51n11J341p70j073J548O5j472P79Q56j169P7
6015c82J294r32n96J143j55r45R64K03j435P78R84j571K42J304q03r04J443j81
6033D51j217J070K55j322K12J847j827m42J990p78j576K002m09j193Q99O34j260
6050f64M34R43j272j12J408n96r89J529m73j268J072Q38j437L27J296j322k89
$$ plain form
5920 -451 112 -108 -618 -21 452 -324 -185 362 -130 -591 771 -140 -601 -97 324 -705 -16 602 -42
5939 -42 -21 682 35 -545 355 284 -736 187 439 -950 -42 445 -94 -578 911 147 -834 377 286 -356
5959 -356 388 632 -583 100 592 -63 -316 259 -93 -673 278 350 -585 39 808 -503 -243 958 110
5978 110 -635 638 246 -937 239 470 -555 36 736 -624 -568 610 -207 -635 723 114 -755 467
5996 467 469 -834 -167 605 -330 -499 898 -53 -564 777 7 -1066 482 547 -925 -146 710 -459 -382
6015 -382 912 -20 -616 527 372 -573 391 594 -841 -63 921 -650 -408 896 93 -811 632 451
6033 451 -766 304 559 -763 -551 1296 -531 -973 1017 239 -1337 665 256 -937 -38 596 -664
6050 -664 -230 713 -559 -671 737 141 -848 681 208 -1060 12 850 -587 -260 1036 -286 -575
6067e75J291p90o64J441j39j418J074N01j773P45J291j352m57J720q19j109J412
6084C79m7j110R49N35j586O39J188j180o89J687n53j180J720j06j394J034M04
6101F90j243J41J310j246m61J355o64q46J517r6j520J200O63j039j24J482j170
6118e1o49J506n54r30J197nj322Q42J000j594L30J002q88m41J102j71j167J332
6136E39j49j195Q84N84q93k28J264r60k39J108l93j239J247L55j407Q42N59j339
6154f60L57R94m12r03J242n60o59R79Q5j063N28Q42j100p0R67o11k92J070n67
6173A67q17O23M46r65M17O22p60J28M15l73k95R35l89o55N74N00p36j08O26n83
6193b28r5O23q4o97P10K5o57L08O71q38K98M06o06NK16N6m00M72n5k13K85Q9k79
$$ plain form
6067 -575 716 -74 -738 703 564 -854 220 721 -1052 -307 984 -368 -825 895 76 -1033 379
6084 379 332 -778 171 706 -880 -241 947 -233 -922 765 212 -968 752 646 -748 286 690
6101 690 -553 -412 898 -348 -809 546 -118 -964 553 457 -1063 137 800 -239 -363 1119 -51
6118 -51 -700 806 252 -678 519 514 -808 34 1034 -560 -230 772 -116 -557 545 374 -793 539
6136 539 390 -805 79 663 -230 -458 806 -154 -393 715 322 -917 330 685 -722 120 679 -660
6154 -660 -303 691 279 -624 618 58 -601 378 463 -600 -72 770 -330 -400 567 -44 -336 734 167
6173 167 -650 -27 419 -546 -129 493 -267 -139 276 -97 -392 543 154 -501 73 573 -163 -271 355 -228
6193 -228 -323 300 216 -481 229 254 -403 -95 576 -262 36 442 -164 -159 57 113 -287 185 130 -83 202 291 12
6216A2k64M85o15J06N55R7l80M4n3n34M29M47l93k88M65J37m92O24k4o11J58K66
6238A71k42r5N84o52k4M65J22o70Q35p5o94K65N56k70m52M71k62k90K40L85o08
6259b40L5O44q07J52N11k39n42O34K54q82N34Jm36N77J45n69j76Q14n07k35N90
6280B58k6q44O17O02r69Q1O83m09l4K76mo60M91R7o06L68L62o37J66N94m19j58
6302a71M27j06r09J133K46j010M67L98n51j15Q30m17o93J002k33j157R56P70j401
6321e34N79N89j036l1R31m26l82R06l87r44P20N56j104M33O42q05k46J206m64
6340B03q82J053j52p85N24O25j332K44J038n42m58J064l17q12J090J51j407P19
6358B4M58j215M77R38p60o15J322k33j160R34J13r19N62Q35j131j69J225p97l94
$$ plain form
6216 12 -252 233 -382 -276 279 376 -4 40 -13 -547 -118 329 -64 -352 113 250 -242 382 358 -253 -95 171
6238 171 -71 -166 418 -234 -258 207 329 -341 494 419 -275 -10 546 276 -176 295 33 -257 -17 368 -240
6259 -240 -205 439 -368 -216 295 56 -486 148 402 -480 54 55 -381 196 341 -228 -404 410 -97 -332 258
6280 258 232 -612 5 607 -362 -281 402 -7 -41 235 231 -429 62 159 -447 -79 283 -354 -188 406 -13 -171
6302 -171 256 150 -759 374 620 -390 77 475 -76 -191 639 222 -471 531 298 -859 97 867 -534
6321 -534 45 634 -402 -433 498 72 -310 596 209 -735 -15 541 -563 -130 512 -293 -539 667 203
6340 203 -679 374 222 -563 -39 586 -746 -502 536 -6 -464 600 283 -529 561 712 -695 24
6358 24 482 -733 -256 682 -78 -693 629 396 -764 170 283 -636 -74 761 -370 -539 686 -111 -505
6377e05R92j77j075J076J58j262L97R95j189N7J140q43j73J134l80j189J031K84
6395D71j283P79M76j329J32J351p12n02J075k22j057J207q8j241R34P49q08o9
6413a37P26p07m71J054p8j236J393j7r08j1R72j100K46J068j112k79J123m31r15
6432h20Q71N38j290O57O50r28l30J201n60n86J245m49q37R54L42j276N35P33j242
6451e92J53R69p48m26J003j43n90M73N41r59q6J284j034l37Q74l95m42O74n4n86
6471d21L41N38r01M20O34j058J32N31j68n12Q59j97o14M77M03j143O26M05m35
6490h3l29P06k91n16J013j68o29M68L50j164M47M85k7m80P67l25r61P46l4j70
6510a95J61N09p15p8R11q90q2P40m95m41Q12k62k91L37L55m86k72R78q42j9N68
$$ plain form
6377 -505 487 310 -765 311 469 -793 -396 599 -590 -533 607 -236 -409 725 345 -844 187 471
6395 471 -812 -33 443 -886 -754 597 -115 -617 458 236 -821 386 298 -943 -9 740 -68 -137
6413 -137 589 -118 -589 465 387 -849 544 527 -381 -392 580 -520 -274 794 -318 -597 526 95 -820
6432 -820 51 589 -701 -44 606 -322 -652 549 -11 -597 648 199 -638 316 658 -618 -83 650 -592
6451 -592 -439 530 -218 -644 359 216 -374 99 640 -319 -405 879 -155 -492 382 -13 -455 219 165 -421
6471 -421 -80 458 -443 -23 611 -447 -315 216 48 -464 395 198 -416 61 464 -679 -53 352 -83
6490 -83 -412 294 3 -513 500 332 -297 171 521 -643 -196 289 262 -218 549 224 -737 9 -25 -195
6510 -195 -34 475 -240 -318 593 -297 -379 361 -134 -575 237 -25 -316 21 376 -110 -382 596 -246 -265 303
6531C03j25n23N30p2l29K19K45k59j50N35j81k76K05Ml87K09Q1k88J73N45n47
6552h8j19N65j57m11K67N4l39pO06p09J66L51l34l25L90K32l50M11j70L8j04N14
6574D81o64K4K11P9l22j3K69n7J80L44r09O6O12l49r5L54j5l93M93Jo79J86K76
6597H0k11n9K52J19o55O62K0m37l5K10k10L02qk26Q0K65q1m32L35L80p37L80L04
6620B98k25k05L65j93o48P29J12p12N44L48j002M76N21q33o9Q19l93j99L86j01
6640A8l14O03J10p39J49L98l47j58O74j06o30O48j52p08O67N60r39K24J78m48
6660c12N7P41K7j026Q37K46j011K67O77p92J35N64n23l49J068k54j088P06K21
6679A91n55K10O65p99M26L57q68JQ04m7j226J150J15j018K59Q71r75K64O14n91
$$ plain form
6531 303 178 -345 185 113 -216 3 248 -11 -161 374 193 -83 122 126 -261 -52 29 -259 -86 459 -88
6552 -88 -207 358 201 -210 57 111 -228 -235 371 -338 -172 179 -155 -480 -90 142 -208 203 33 71 -33 481
6574 481 -183 -159 52 131 -191 -204 65 8 188 532 -377 -311 301 -48 -143 211 196 -197 296 297 -382 -196 80
6597 80 -131 -190 62 181 -474 188 208 -229 -264 -54 -264 38 30 -196 -116 149 68 -364 -29 351 -386 -6 298
6620 298 73 -132 233 40 -608 121 233 -479 65 413 -589 -113 408 -425 -494 325 -68 -267 119 18
6640 18 -296 307 417 -322 -173 225 -122 -280 394 288 -342 306 154 -554 113 673 -266 -42 136 -312
6660 -312 -255 486 513 -513 324 570 -441 -174 503 -289 -154 410 -113 -462 606 352 -736 -30 191
6679 191 -364 -154 511 -288 138 495 -373 -372 432 385 -841 309 424 -594 -335 536 -439 -175 439 -152
6699a52m89J255n25n49M98J98q51P82L14j054K62O54k48n09N46K08r78P15P66
6718H43j232J45R62q44l98J088n80o76J105n4p76P39J1j134O50Q51q15k31Q37
6737D91l53l64O70j42n74K97N09p86QQ50r27K4Q55n69l15O84j36q03P63L82r02
6758c38o5R12n81j80P64m77o50R15n2o66O39M9m40o1O78o13m3R33p37l93M96J40
6780B30o02O45Pn16P8N65m56m58R90n87l63O42m6n84L40M87r65K90Q71q78J88
6801a22O81n18n36O73K2n96L20P43j039P6P94o37o2O91m49p97J016q5r42P07L25
6822B65k63K10j46j99l96Q23l26l30M27K13o53K35L20n03L5P22m81m29Q66l90
6842@n13M89L17m39P6L57m92j48Q01n09rl4L50n82O43K8q16J86L94j37k48L28
$$ plain form
6699 -152 -641 614 89 -460 38 236 -615 167 481 -573 -311 343 95 -414 132 340 -638 77 843
6718 843 -389 -244 718 -126 -524 564 -16 -692 413 359 -417 322 333 -801 -151 700 -115 -346 491
6737 491 138 -226 444 302 -272 25 534 -252 -244 606 -321 -297 558 -11 -326 358 222 -581 182 564 -338
6758 -338 -403 509 -72 -252 512 35 -615 300 248 -418 221 270 -170 -231 447 -166 -209 724 -13 -406 90 230
6780 230 -372 273 280 -236 -158 407 -49 -507 483 -104 -467 175 129 -455 -115 372 -593 -303 568 -310 -122
6801 -122 559 41 -495 178 200 -396 -76 667 -372 -296 498 -139 -201 490 41 -756 260 175 -767 -60 265
6822 265 2 212 66 -133 -529 294 -32 -362 65 278 -375 -140 180 -323 -288 434 -47 -476 390 0
6842 0 -513 -24 293 -146 -70 287 -205 -353 448 -61 -70 -104 246 -336 307 335 -481 -295 99 -38 -286 42
6864D2k9j61K93L22n75L04j3o07J65L69rj32L25n81J29M80j33l68PJ90p5LJ57
6887A03k89j3K16J93j78R9J51n08j1M20K6l05K87j98l2l5L08m10K72J20j58j97
6909a39L47k74k64P28j23n95N64l47L4l03N07k25k34O51j59k58J26J34n16L87
6929D1K76l64J41K41q65L45O31j33o83O27l70k17N0L91m68J11N13k69k02J80J50
6950A26n31K98M64m22k06J84k44J27N58l40l51O93j32m51R4K40o07K51L21n05
6970d33J30L71J10m39O12R1p06J91M14o43M24j0j79m24N83J22n21M82J49j89k38
6991a03N03m25j11K54j64O2K97l36k89K86j28j65J50O06o40j82Q51o60m32P90
7011A64k40j65K93J83m17l4L64k55m26J094o34l98R45m45k75Q8L28o46N16N78
$$ plain form
6864 42 13 -148 145 467 -108 196 183 -424 -259 110 101 -31 294 -287 -158 322 189 -179 -172 18 -57 -54 103
6887 103 -186 -199 17 210 32 131 282 -226 -237 183 209 -96 191 -7 -39 -74 234 -176 96 216 58 -139
6909 -139 208 -66 -330 398 275 -320 244 -103 -69 -372 135 -90 -324 327 168 -90 36 170 -346 41
6929 41 317 -47 94 335 -530 -185 446 313 -370 257 -113 -330 -280 111 -357 -246 267 -2 -204 -24 126
6950 126 -405 -107 357 -65 -271 -87 -331 -204 354 14 -337 356 224 -227 -133 107 -500 -249 72 -433
6970 -433 -303 68 178 -261 351 442 -264 -73 341 -302 122 112 -67 -491 92 214 -307 175 324 135 -103
6991 -103 400 -25 -136 118 -46 16 313 -23 -312 -26 -154 -319 -169 437 -203 -385 466 -194 -626 164
7011 164 -76 -241 52 235 -182 -216 148 -107 -533 561 -73 -471 474 29 -246 -158 170 -476 40 618
7031F18p53k3K82p8l38M14K47q12M94L14o11j20Q52o98P2P73n77k65K94P0o52
7052d97O28J62p38J82Q29m34k72O08j95o24O06M05j096N86L21o60K01N69q60P2
7072b07N03m36j54M12J39o47M79O3l25N7N80n89l38Q98n03n70J094j48q69O85
7092A24N38r86J54N25o58L2O72k66k86K29O9l18J15M89n17L1J98j34k34K98L4
7113A09n24K05M79n89M85M5l99J22M15n43o1M07Qo17N81K86p82N62q3n47J89P50
7135D98n72L9J91k59j34N97j07l40M61k09j92O6K43j52l93L70Mn71N70M89j059
7156d60L36K70j55m4K16n65L89J63k6n91J79L30q7R4K00l23o6J99J54m93O60j8
7178C62l15l9j14n3M70o2n43M07L0j80N6j29M6K84l75M65m42O01l81n44M58J9
$$ plain form
7031 618 -135 -158 124 46 -292 122 369 -443 51 365 -246 -366 486 -212 -140 633 56 -209 85 155 -497
7052 -497 131 293 -445 -263 566 132 -140 468 273 -351 255 660 -436 150 471 -189 12 581 -279 -207
7072 -207 296 -140 -294 118 257 -390 89 152 -173 -116 464 -125 -463 435 -68 -638 456 308 -561 124
7092 124 662 -324 -170 355 -303 -271 401 135 -151 78 147 -171 -56 433 -84 -53 145 11 -223 75 109
7113 109 -415 -210 269 -320 165 210 -189 -67 348 -195 -256 151 159 -458 123 409 -373 189 106 -441 -252 498
7135 498 -74 -35 156 -103 -237 360 253 -87 374 165 -27 39 282 130 -263 107 111 -460 110 599 -460
7156 -460 -124 146 -9 -53 163 -402 -13 150 124 -467 -288 42 -45 49 249 -74 -140 59 213 -280 380 362
7178 362 47 8 -106 -159 311 249 -294 113 143 -37 19 -110 -64 220 -155 310 -132 469 88 -456 2 21
7200B1Pj39K37k66k03P3Q04o29K57K80n34K03m11K5K32j2K19k78p0L70j96k87
7222b97M79k58m4J23J66j07j27J90l02J02J68n4k01J05M47o43L27j66J24J16R8
7243B46n29N16k13O5l21N60N7n86K96l6J03j44N3k71N2K09j29j60L44M0j52k27
7265b27L74j50j13M12j13m64K88J36l03K59L98n50K18J30j21l42K87j34J96k20
7285c9N0n7L39j53j38k52M57j79J65j64M5p9L0j11k70L58M54n09j44L34k3m28
7307c14L91j5l35N21j22l28p8M73m26NN17n81O9L50j29l5K82J22m45l0K81l74
7329b01O1L73j98m00N87Pm42L50K00o54K60L68n30R6J31P6o73N75J62k81q8K8
7351a93K97L7K94n20r8K97r1k95O48l60l54J92M71m50P3N45p02o6N83k67k95K84
$$ plain form
7200 21 28 -111 126 -140 -343 -270 534 -95 162 442 -92 111 -300 -275 -43 -55 164 -114 -184 186 -10 -297
7222 -297 182 -76 -120 3 169 62 -65 125 -177 -75 93 39 -162 -57 390 -253 74 -92 32 148 246
7243 246 -283 233 20 85 -236 324 381 -205 91 55 158 14 67 -204 -152 57 -72 -232 112 152 0 -227
7265 -227 147 -3 -116 296 183 -281 7 143 -160 99 497 -53 165 295 174 -168 119 -15 181 -39
7285 -39 11 -46 293 140 2 -250 207 28 193 29 74 -5 25 -86 -356 2 456 -53 -197 137 114 -314
7307 -314 77 62 -273 248 126 -202 -280 193 -233 -228 289 -292 -223 127 -2 -37 245 367 -78 -108 173 -201
7329 -201 -140 233 35 -365 222 229 -213 137 337 -317 -57 311 -219 -123 8 84 -589 -14 148 -133 -221 -193
7351 -193 104 141 435 -85 -183 114 23 -272 376 16 -338 -146 325 -125 -52 493 -209 -275 308 41 -254 30
7373C0m4k76M95L43p49pL55m86N13p8K25l78J24J65m28K42J72m32Q8M72l50j59
7395a63M12q7n28L65M85o80P4M48m50o5O61k70l64N06j45l39M37k42k80J28M81
7416C84l22m0j7j82j51N93j16k97L04J95p32K00L79n21L76L21m21K1M26k69m21
7437b90O79k34k08J03K94l23j95N05m18q1N65n61j76O71l80j10J02K55k50Q0N7
7458H5P8j71M86j21l71J05J80n81K68j46J43j52L40l35Q8L15j91j39K14l2j29
7479f6K53k19j1m8l7J08k44M70j0n29J53M82o61M19J37l39J12K76j26m91L15J14
7501E8l28K48N14p94K60J32l75J20L31L1q04N26j3o4L08j0k25J50J40l47k14K74
7523h2k0k50N52p9J94k80L3Rm46N63j6l16J38n7J05r8kM8K3Q1q5j92M32Rl82K31
$$ plain form
7373 30 -14 -290 205 548 -201 -208 147 -339 174 96 321 -57 67 232 -196 46 218 -214 -126 346 -4 -163
7395 -163 249 162 -366 -1 484 -196 -122 326 -124 -189 472 202 -162 344 199 -140 297 55 -225 -97 384
7416 384 62 22 5 -177 -328 265 149 -148 156 351 -381 -181 198 -323 53 374 -47 -26 400 131 -290
7437 -290 389 155 -53 50 344 21 -174 331 -87 -168 397 -164 -340 331 -49 -159 -57 198 -52 28 85
7458 85 163 -8 478 357 -14 91 271 -310 -42 -188 -45 -197 143 -192 -104 211 20 -119 95 63 -66
7479 -66 187 -32 -43 -91 -128 -20 -264 206 196 -333 -180 302 -359 60 197 -142 -30 246 120 -371 -56 58
7501 58 -270 -22 492 -302 -42 90 -285 -165 166 197 -607 -81 -94 -158 150 140 -85 65 205 -142 -356 -82
7523 -82 -102 -352 200 121 315 35 68 77 -369 194 178 -138 0 -57 48 -50 -52 -4 19 100 15 -177 255 264 -118 113
7549A13j67LJ4J76j92J63k2K3k84M66l03o50P38j00K02l98J80l87M58j48J10j01
7571a06L9mJ76k61J52k53L01o2j08QnL04l49M30j4l66J63n2o0j01K19k9m0K05
7595A87p9j84k45M69j13n9K14p4j80kL0l1O4q9J49L6K44n33l4K34j52K23k93K27
7619Ij66J14LnJ99l06J32K28k73J72k24j05M09m36K18J31l62N08n9o4k38l2k26
7642c73Q1L44M6k12J44J33l56J38p5P1N9K50o5l57J1J43k18K92M28p73L15J91
7664B17k91P2K7K08o01L32M57l35j22J67q0N9J3k00j29M03j44k84M08l21j32J18
7686a58L80m06J31K0N3l10N01k21l68J74L74m57N8M85k84l24M20j92K33J15k60
7707c6k52L10J67k31J59R6j55j11J52j67l2L74k29j79K07j9q3r8M10o06N9M56
$$ plain form
7549 113 -54 -51 -37 139 -53 110 88 111 -173 293 -10 -660 78 -22 180 -218 -38 -425 33 -115 -5 -106
7571 -106 -67 -71 105 -156 -4 -257 44 -18 -126 -118 -123 181 -168 262 248 -118 45 -7 -67 -168 51 22 -18 187
7595 187 108 -76 -321 148 35 -24 190 116 -64 -66 -36 -67 -3 -92 57 93 337 -196 -230 4 -148 75 -218 9
7619 9 -157 -43 -40 -45 154 -152 -20 208 -65 107 -117 -222 187 -249 -31 100 -262 246 187 123 -115 -147 -373
7642 -373 -292 52 98 -114 30 163 -193 -55 -130 -59 0 250 185 -172 -161 -18 -236 56 484 -289 26 217
7664 217 -74 -2 25 233 -368 -36 421 86 -36 131 51 110 123 -77 -206 197 53 -231 177 -144 -276 -158
7686 -158 222 -184 -53 -33 20 -290 211 -10 -378 -204 170 -287 -229 256 -28 -352 68 -124 109 224 -36
7707 -36 -288 22 189 -42 117 213 58 -53 99 -68 -100 274 45 -134 73 54 -29 -127 283 -323 -264 192
7729A92nj49N1K14l77J01M04p03K94K68n12J06K50Nk88M78j42l95K31o1k95K84
7751d9L75n21nrJ27J46J92J67m57R8K01p57M75L72n67K91k32QJ38J82j80L4J08
7774A37q2l83J31L40k9n17O14r1r8j73M31n89j00M87k8O1P4l27j24O57m03j89
7796b01M40j29n71O49j25m55K99L33m76L55J82l85m1M62l02j77n6K57k06J39J96
7817A88k97p5N55l22k14K15j21j01Q8M73n61JO0j1m6L28j04l55N43p1k47M7M5
7840A8j58Q8K36l25j12N27p7m07K05J15n75O52l77K73l60KJ30k57J73L93k83K49
7862A30J66l84Q5J87nJ19l57P7j65L14j13j19J95j65mj03L62k89J58P4j56j05
7884i8J9j44J80j97M02k55O0J99R6l97K45K9l08n2L14l2k05P6K3p5N8K05m34J72
$$ plain form
7729 192 187 38 89 303 -74 27 431 -272 22 290 -222 -116 134 139 -149 329 187 -208 23 -38 -333 -49
7751 -49 326 -195 -200 -209 -82 64 256 423 -34 64 265 -492 -17 355 -212 79 -153 -145 -7 175 -5 29 137
7774 137 55 -328 -197 143 114 -403 211 120 22 -151 280 -309 -409 78 50 111 185 -142 -266 391 -12 -201
7796 -201 239 110 -461 188 63 -392 -93 240 -236 119 301 -84 -125 337 35 -142 -198 59 -147 -8 188
7817 188 -109 -184 371 49 -165 50 -71 -172 -84 389 -172 -171 -111 -122 -168 160 56 -299 244 173 -74 -27 18
7840 18 -140 -52 184 -141 -253 274 197 -210 -5 110 -465 187 -190 83 -277 -275 -145 -402 -229 164 -119 130
7862 130 296 -88 -3 184 179 298 -59 18 -147 167 54 -65 130 -35 -39 -142 220 -69 89 163 7 -98
7884 -98 -79 -223 -43 -240 162 -93 -33 166 262 -135 110 139 -169 -221 93 61 -144 -68 -45 -120 -62 143 -291 -119
7908a19j15j3M23K37m30J96r4j10j1j60R1JP1J98j42MJ67k61j99K79P9k23k32
7931c63K67J63o0J96m95K67L2L5j95J62J90l34j1M43m38L9Q4j3k99O26k34K62
7953C24K4l59M3j02J36J20l12k01J92P7J69J32j59j47O0j22o9K50m22L33J10k9
7975D8j1K40k87k69K68j15M84l72N7m10K19M43k72k55L17j58m3Q1n5M99m87n1
7997a29J42j35L66P7l95N54n72j82K75j40j6K77K96l81j80L8O0j69K16J71m3j62
8019c2J96k62JL53n19N2J97L3q2P9k0l90L50k0k75K41J76qk9k7L06l16J03l15
8043b08L17o0L8j77nO1p8l02N54j53l9K36k83o2K53P6j73N3K24m87N08k41r9J39
8067I2%j99o4J04M0l50L86J52m64K42J44J18m18k3J64O2N8j5j03m1L15o3k84K80
$$ plain form
7908 -119 -234 -247 176 413 -17 179 85 -25 -36 -196 -105 -104 -33 165 23 27 194 -67 -266 13 92 -131 -363
7931 -363 -96 67 7 203 -292 -25 7 42 -153 9 199 -135 -146 297 -141 -102 -18 -31 -330 296 62 324
7953 324 348 -11 32 -70 66 186 -126 -327 -135 -58 111 243 84 -63 -3 -125 -194 56 -366 -33 77 48
7975 48 37 277 -10 -279 -11 -126 358 -14 43 -367 -148 295 23 -232 85 -73 -116 -35 -90 409 -78 -129
7997 -129 13 -122 244 321 -74 480 -92 -274 1 -139 -155 122 418 37 -143 -105 -45 -214 2 173 130 -32
8019 -32 164 -98 -97 256 -263 -211 -14 19 -63 16 -4 -394 -44 -64 -339 -98 78 70 41 14 320 4 107 -208
8043 -208 109 49 87 -90 -95 -34 -112 -414 140 -13 -52 184 -99 -161 92 168 -5 48 272 -215 293 52 -47 92
8067 92 92 -107 -171 -67 -27 -377 9 161 -303 -61 83 201 -217 -240 -76 -14 44 29 -74 -115 200 137 -147 133
8091A33k92q6P8K22j59J41J25l01M33k51k72j33J77J61j91M58j96j65J79j22j15
8112a76L99j71j27j70L17N1p7k32L60k98J28K28k70P9J40j63j08J64J63j30j27
8133b0j66q3L89l3k11K95L45m18k29K04JO6j44J84l60k0N19m56j02K04j05j96
8155c36M55j48m8P1Lj95o4O36j63j45Q7j25j55K38j82O6j59K97j57K91k32j38
8177a03K40l5j38jJ04q0j72L01pL0j74Q7M2P2
$$ plain form
8091 133 -159 -245 -167 55 -104 37 162 -139 294 43 -229 -362 -185 -24 -215 243 47 -118 61 -61 -176
8112 -176 223 52 -75 -245 72 123 46 -186 174 -124 4 232 -38 41 181 18 -90 74 237 107 -20
8133 -20 -186 -269 120 87 -124 171 516 98 -131 73 74 140 -4 180 -180 -200 319 -137 -239 -35 -140 -336
8155 -336 119 -29 -77 -6 -3 -198 -262 374 211 66 153 28 -127 111 -71 -5 -164 133 -24 267 35 -103
8177 -103 137 102 -36 -37 67 -13 -185 116 109 139 -35 52 94 166
8191A66
$$ Imaginary data points
##PAGE= N=2
##DATA TABLE= (X++(I..I)), XYDATA
0@%%%Qj6J6j6J6k4M0m8M9n9Q2j04J22j43J67j99K39k81L21l65M25m94N66o40P20
28C82q16R26j045J168j302J457j629J815k016K232k472K745l045L367l721M118
44B164m567N073n640O282p028P905q945J0196j1735J3695j6285J9864k5126L3609
58A9462m9412Q7977l31503l69542J042011k45646n96888O51172J5148p73018N59318
69I079M56999p71995Q8610O33002o10721j56244Q06430l78777n95690P69249Q0413
80C30355p86796M70086M51543p99187J02200P44295n89164l55734P82414j88392
90A61620n87600O12877J07107p26838M23794M74835p40904J6038O99729n09188
100f8530l26364P61452j94389o55076O11509K42938p27233K71115N00673o31341
$$ plain form
0 0 0 0 0 8 -8 8 -8 8 -16 24 -24 25 -34 48 -56 66 -77 90 -109 130 -151 170 -195 230 -264 302 -338 382
28 382 -434 492 -553 615 -687 770 -859 956 -1060 1172 -1300 1445 -1600 1767 -1954 2164
44 2164 -2403 2670 -2970 3312 -3716 4189 -4756 5440 -6295 7400 -8885 10979 -14147 19462
58 19462 -29950 58027 -273476 -643018 398993 153347 -443541 207631 222779 -550239 9079
69 9079 466078 -305917 -217307 415695 -195026 -351270 455160 76383 -519307 249942 330355
80 330355 -456441 13645 465188 -333999 -231799 512496 -76668 -432402 350012 161620
90 161620 -425980 186897 294004 -432834 -9040 465795 -275109 -259071 440658 -68530
100 -68530 -394894 366558 172169 -482907 128602 371540 -355693 -84578 416095 -215246
110b15246m1158O66629m25192l67377O69701j17217n77710N48231J95233p16927
120c81033K89897N42086o43668j10737P01259l68048m42203O59097r049o29361
130c91760M33848K99698o29766J60829N06419n27614j26645O25636l21107m13316
140c83778O16878o8o16185M13626L23579o30674J18760N51069m93377k17323O24439
151C06946k02699m52819N09822O7950n59819L39928L33336n74909N6059N27736
161C51531m18007k28083N83865j75456m76244M87102J49485n62691K34387L72643
171C18532m95237j6087N09013l33619k76809N09722q7894m34893M03265J46234
181B42227n20972K15331L86005m79699o9524N22491k76634l26817M88282j2249
$$ plain form
110 -215246 -256404 410225 -14967 -382344 287357 170140 -407570 140661 335894 -381033
120 -381033 -91136 450950 -192718 -303455 397804 29756 -412447 246650 237601 -391760
130 -391760 42088 341786 -287980 -127151 379268 -148346 -274991 350645 29538 -383778
140 -383778 233100 233032 -383153 30473 354052 -276622 -157862 393207 -100170 -317493 306946
151 306946 104247 -348572 161250 229200 -330619 9309 342645 -232264 -176205 351531
161 351531 -66476 -294559 289306 113850 -362394 124708 274193 -288498 -54111 318532
171 318532 -176705 -192792 316221 -17398 -294207 215515 127621 -307272 95993 242227
181 242227 -278745 -63414 322591 -157108 -226632 295859 19225 -307592 180690 168441
191A68441m69229L34351K36612m83584R6459L94393l71911j11314M61619k22894
201C2943l24826M47956K7548m55962K89802K48418m75632P2231M39314l55107
211e3315j99879M68656j30265l64837L88363R4222m53256K13203K93800m14440
221a57748P098M14625l06914k14215M58415r2744l94239L59255J47747m59622
231b38342J63800L46171l90830p3452M29654k24349k63825M08330k5168l88828
241b56839K99795J80258m25181J18343L46304l61745r7153M38291j99582l10046
251b67555M05030L9710m20917K45110K43790m08634M2485L75990k99328j63945
261b08264M05124j25274l11019L51689O1697m09048K21787K67407m03409L436
$$ plain form
191 168441 -300788 33563 270175 -213409 -116950 277443 -94468 -205782 255837 32943
201 32943 -291883 156073 183621 -272341 17461 265879 -209753 -137522 301792 -53315
211 -53315 -253194 215462 85197 -279640 108723 202945 -250311 -37108 256692 -157748
221 -157748 -150650 263975 -42939 -257154 201261 108517 -285722 73533 221280 -238342
231 -238342 -74542 271629 -119201 -192653 237001 12652 -251173 157157 131989 -256839
241 -256839 42956 223214 -201967 -83624 262680 -99065 -196218 242073 42491 -267555
251 -267555 137475 177185 -243732 1378 245168 -163466 -120981 255009 -44319 -208264
261 -208264 196860 71586 -239433 112256 173953 -235095 -13308 254099 -149310 -145874
271a45874L95099k77272k02555M22171q3548l71158L24039J45135m05981J46111
281e3833K89340l63617l3617M01298k39438k39933L98982m3771l68802L13505
291F0114J60802m36702J24921L54438l53194j05418M14496j89105k76885L88306
301A41773P507l96109K64103K08567m04899Q3773L46065l38862j15362M34253
311B30809j75710l21451L86522N3845m14113K38974K46213m16427L5903L93515
321B58080k95647j80252M06520j17886l16829L57475O9783m19424K12185K74990
331B48995l93205O555L86275k88152j95118M32725q7552l70946L26136J33548
341A99261m05430J62793K88291l73613l1958L96977k38982k23875L92305o0515
$$ plain form
271 -145874 249225 -28047 -230602 191569 108021 -263137 60902 206037 -199944 -53833
281 -53833 235507 -128110 -161727 239571 133 -239800 159182 115411 -253391 60114
291 60114 220916 -215786 -90865 263573 -89621 -195039 219457 30352 -246533 141773
301 141773 149280 -246829 17274 225841 -179058 -95285 250780 -88082 -203444 230809
311 230809 55099 -266352 120170 174015 -240098 -1124 245089 -171338 -135435 258080
321 258080 -37567 -217819 188701 70815 -246014 111461 181244 -238180 -25995 248995
331 248995 -144210 -137655 248620 -39532 -234650 198075 110523 -260423 65713 199261
341 199261 -206169 -43376 244915 -128698 -160656 236321 -2661 -226536 165769 105254
351A05254l52952L18248J39734m24224J43245L27994l58139p6864M00363k08233
361A4426k49844L89633j7679l79247K71984J82144l88516J04911L12628l42054
371a01614q1089M12687j93123k80967L75331J2904l78947K61815K01293m09406
381a81116P0483L58033l04138j34111L85930j52010k78098L59317L3394l88704
391b31020K28330K24503l79214N0738L44513l02789j43351M08420j26801l18566
401b45237L32732P8503l75756J93591K37067l66241J3866L56417k52255j71359
411a98672L63424r7227k93242L18144Q0981l84488J71909K64750l38961j9676
421a33058L45238k30816j86862L65417n4206l19638K63008J20176l37950J33816
$$ plain form
351 105254 -247698 70550 210284 -213940 -70695 257299 -100840 -177704 222659 14426
361 14426 -235418 154215 136536 -242711 29273 211417 -177099 -72188 240440 -101614
371 -101614 -182703 229984 36861 -244106 131225 144129 -234818 26997 228290 -181116
381 -181116 -110633 247400 -56738 -190849 195081 43071 -235027 124290 157684 -231020
391 -231020 -2690 221813 -157401 -106663 237850 -64939 -208290 200130 73329 -245237
401 -245237 87495 165998 -209758 -16167 220900 -145341 -131475 224942 -27313 -198672
411 -198672 164752 67525 -225717 92427 173408 -211080 -39171 225579 -113382 -133058
421 -133058 212180 -18636 -205498 159919 105713 -213925 49083 169259 -168691 -34875
431c4875K46997l18727l4060L44941j94637k02991L29300l6627l05989K55953
$$ plain form
431 -34875 212122 -106605 -140665 204276 9639 -193352 135948 99321 -206668 49285
$$ [...]
8191c
##END NTUPLES=NMR FID
##END=
