##TITLE=1H_Pr 5-2-52
 CDCl3, 8 sc, 
 25.6.2019
##JCAMPDX= 6.0         $$ Bruker NMR JCAMP-DX V2.0
##DATA TYPE= NMR FID
##DATA CLASS= NTUPLES
##ORIGIN= UXNMR, Bruker Analytische Messtechnik GmbH
##OWNER= root
$$ XWIN-NMR		Version 3.5
$$ Tue Jun 25 16:25:20 2019 Russian Standard Time (UT+4h)  she@DPX200
##.OBSERVE FREQUENCY= 200.13155
##.OBSERVE NUCLEUS= ^1H
##.DELAY= (6, 6)
##.ACQUISITION MODE= SIMULTANEOUS
##.ACQUISITION SCHEME= undefined
##.AVERAGES= 8
##.DIGITISER RES= 18
##SPECTROMETER/DATA SYSTEM= spect
##.PULSE SEQUENCE= zg30
##.SOLVENT NAME= CDCl3
##.SHIFT REFERENCE= (INTERNAL, CDCl3, 0, 15.7039)
##AUDIT TRAIL= $$ (NUMBER, WHEN, WHO, WHERE, WHAT)
$$ ##TITLE= Audit trail, XWIN-NMR		Version 3.5
$$ ##JCAMPDX= 5.01
$$ ##ORIGIN= Bruker BioSpin GmbH
$$ ##OWNER= she
$$ F:/spectra/data/she/nmr/H-F/1/audita.txt
$$ ##AUDIT TRAIL=  $$ (NUMBER, WHEN, WHO, WHERE, WHAT)
(   1,<2019-06-25 16:24:03.26 +0400>,<she>,<DPX200>,
      <created by zg, POWCHK disabled, PULCHK disabled
       configuration hash MD5:
       00 E9 B6 7A A2 85 ED C7 34 08 36 98 17 FE 4E 26
       data hash MD5: 16K
       0A FF 15 5A 0E B4 81 8F EF B2 3A C3 77 D2 1B 50>)
$$ ##END=
$$ 
$$ hash MD5
$$ 86 FD 00 7E 0B E4 72 1C 31 45 85 0A F6 52 2D A4
##$RELAX= 
##$RELAX= 
##$RELAX= 
##$RELAX= 
##$RELAX= 
##$RELAX= 
$$ Bruker specific parameters
$$ --------------------------
##$DU= <F:/spectra>
##$EXPNO= 1
##$NAME= <H-F>
##$PROCNO= 1
##$TYPE= <nmr>
##$USER= <she>
##$AMP= (0..31)
100 100 100 100 100 100 100 100 100 100 100 100 100 100 100 100 100 100 
100 100 100 100 100 100 100 100 100 100 100 100 100 100 
##$AQSEQ= 0
##$AQ_mod= 1
##$AUNM= <au_zg>
##$AUTOPOS= <>
##$BF1= 200.13
##$BF2= 200.13
##$BF3= 200.13
##$BF4= 200.13
##$BF5= 200.13
##$BF6= 200.13
##$BF7= 200.13
##$BF8= 200.13
##$BYTORDA= 1
##$CFDGTYP= 0
##$CFRGTYP= 5
##$CHEMSTR= <none>
##$CNST= (0..31)
1 1 145 1 1 1 1 1 1 1 1 1 1 1 1 1 1 1 1 1 1 1 1 1 1 1 1 1 1 1 1 1 
##$CPDPRG= <>
##$CPDPRG1= <>
##$CPDPRG2= <>
##$CPDPRG3= <>
##$CPDPRG4= <mlev>
##$CPDPRG5= <mlev>
##$CPDPRG6= <mlev>
##$CPDPRG7= <mlev>
##$CPDPRG8= <mlev>
##$CPDPRGB= <>
##$CPDPRGT= <>
##$D= (0..31)
0 1.2 0 0 0 0 0 0 0 0 0 0.03 0 0 0 0 0 0 0 0 0 0 0 0 0 0 0 0 0 0 0 0 
##$DATE= 1561465442
##$DBL= (0..7)
120 120 120 120 120 120 120 120 
##$DBP= (0..7)
150 150 150 150 150 150 150 150 
##$DBP07= 0
##$DBPNAM0= <>
##$DBPNAM1= <>
##$DBPNAM2= <>
##$DBPNAM3= <>
##$DBPNAM4= <>
##$DBPNAM5= <>
##$DBPNAM6= <>
##$DBPNAM7= <>
##$DBPOAL= (0..7)
0.5 0.5 0.5 0.5 0.5 0.5 0.5 0.5 
##$DBPOFFS= (0..7)
0 0 0 0 0 0 0 0 
##$DE= 6
##$DECBNUC= <off>
##$DECIM= 24
##$DECNUC= <off>
##$DECSTAT= 4
##$DIGMOD= 1
##$DIGTYP= 9
##$DL= (0..7)
0 120 120 120 120 120 120 120 
##$DP= (0..7)
150 150 150 150 150 150 150 150 
##$DP07= 0
##$DPNAME0= <>
##$DPNAME1= <>
##$DPNAME2= <>
##$DPNAME3= <>
##$DPNAME4= <>
##$DPNAME5= <>
##$DPNAME6= <>
##$DPNAME7= <>
##$DPOAL= (0..7)
0.5 0.5 0.5 0.5 0.5 0.5 0.5 0.5 
##$DPOFFS= (0..7)
0 0 0 0 0 0 0 0 
##$DQDMODE= 0
##$DR= 18
##$DS= 0
##$DSLIST= <SSSSSSSSSSSSSSS>
##$DSPFIRM= 0
$$ [...]
##$SUBNAM2= <"">
##$SUBNAM3= <"">
##$SUBNAM4= <"">
##$SUBNAM5= <"">
##$SUBNAM6= <"">
##$SUBNAM7= <"">
##$SUBNAM8= <"">
##$SUBNAM9= <"">
##$SW= 24.9336996594482
##$SWIBOX= (0..15)
0 0 2 0 0 0 0 0 0 0 0 0 0 0 0 0 
##$SW_h= 4990.01996007984
##$TD= 16384
##$TD0= 1
##$TE= 0
##$TE2= 300
##$TE3= 300
##$TEG= 300
##$TL= (0..7)
0 120 120 120 120 120 120 120 
##$TP= (0..7)
150 150 150 150 150 150 150 150 
##$TP07= 0
##$TPNAME0= <>
##$TPNAME1= <>
##$TPNAME2= <>
##$TPNAME3= <>
##$TPNAME4= <>
##$TPNAME5= <>
##$TPNAME6= <>
##$TPNAME7= <>
##$TPOAL= (0..7)
0.5 0.5 0.5 0.5 0.5 0.5 0.5 0.5 
##$TPOFFS= (0..7)
0 0 0 0 0 0 0 0 
##$TUNHIN= 0
##$TUNHOUT= 0
##$TUNXOUT= 0
##$USERA1= <user>
##$USERA2= <user>
##$USERA3= <user>
##$USERA4= <user>
##$USERA5= <user>
##$V9= 5
##$VALIST= <valist>
##$VCLIST= <CCCCCCCCCCCCCCC>
##$VD= 0
##$VDLIST= <DDDDDDDDDDDDDDD>
##$VPLIST= <PPPPPPPPPPPPPPP>
##$VTLIST= <TTTTTTTTTTTTTTT>
##$WBST= 1024
##$WBSW= 4
##$XGAIN= (0..3)
0 0 0 0 
##$XL= 0
##$YL= 0
##$YMAX_a= 213633
##$YMIN_a= -391009
##$ZGOPTNS= <>
##$ZL1= 120
##$ZL2= 120
##$ZL3= 120
##$ZL4= 120
##$ABSF1= 10
##$ABSF2= 0
##$ABSG= 5
##$ABSL= 3
##$ALPHA= 0
##$AQORDER= 0
##$ASSFAC= 0
##$ASSFACI= 0
##$ASSFACX= 0
##$ASSWID= 0
##$AUNMP= <proc_1d>
##$AZFE= 0.1
##$AZFW= 0.1
##$BCFW= 1
##$BC_mod= 2
##$BYTORDP= 1
##$COROFFS= 0
##$CY= 11.3945322036743
##$DATMOD= 1
##$DC= 2
##$DFILT= <>
##$DTYPP= 0
##$F1P= 18.9103706918063
##$F2P= -1.10871071338519
##$FCOR= 0.5
##$FTSIZE= 0
##$FT_mod= 4
##$GAMMA= 1
##$GB= 0.15
##$INTBC= 1
##$INTSCL= 1
##$ISEN= 128
##$LB= 0.24
##$LEV0= 0
##$LPBIN= 0
##$MAXI= 10000
##$MC2= 0
##$MEAN= 0
##$ME_mod= 0
##$MI= 1.114404
##$NCOEF= 0
##$NC_proc= 0
##$NLEV= 6
##$NOISF1= 3.799351
##$NOISF2= 2.8
##$NSP= 1
##$NTH_PI= 0
##$NZP= 0
##$OFFSET= 15.70392
##$PC= 1
##$PHC0= -8503.698
##$PHC1= 22.20097
##$PH_mod= 1
##$PKNL= yes
##$PPARMOD= 0
##$PSCAL= 0
##$PSIGN= 0
##$REVERSE= no
##$SF= 200.130013532006
##$SI= 16384
##$SIGF1= 3
##$SIGF2= 2
##$SINO= 400
##$SIOLD= 16384
##$SREGLST= <1H.CDCl3>
##$SSB= 0
##$STSI= 0
##$STSR= 0
##$SW_p= 3612.71676300578
##$SYMM= 0
##$S_DEV= 0
##$TDeff= 0
##$TDoff= 0
##$TI= <>
##$TILT= no
##$TM1= 0
##$TM2= 0
##$TOPLEV= 0
##$USERP1= <user>
##$USERP2= <user>
##$USERP3= <user>
##$USERP4= <user>
##$USERP5= <user>
##$WDW= 1
##$XDIM= 8192
##$YMAX_p= 0
##$YMIN_p= 0
$$ End of Bruker specific parameters
$$ ---------------------------------
##NTUPLES= NMR FID
##VAR_NAME=  TIME,          FID/REAL,        FID/IMAG
##SYMBOL=    X,             R,               I
##VAR_TYPE=  INDEPENDENT,   DEPENDENT,       DEPENDENT
##VAR_FORM=  AFFN,          ASDF,            ASDF
##VAR_DIM=   8192,          8192,            8192
##UNITS=     SECONDS,       ARBITRARY UNITS, ARBITRARY UNITS
##FACTOR=    0.0002004,     1,               1
##FIRST=     0,             0,               0
##LAST=      1.6414764,     0,               0
##MIN=       0,             -391009,         0
##MAX=       1.6414764,     213633,          0
$$ Real data points
##PAGE= N=1
##DATA TABLE= (X++(R..R)), XYDATA
$$ [...]
349 66120 18042 -69441 20451 29036 -52766 16088 41406 -67192 -15191 77471 -30671 -59597
361 -59597 59538 16900 -58713 25883 21383 -51941 29126 49404 -65316 -14491 77116 -23861
373 -23861 -49619 52194 4088 -47871 41045 14645 -63287 33672 57466 -65967 -22548 66703
385 66703 -22255 -39257 47553 -9996 -45160 53372 13656 -71534 29136 58165 -56777 -18661
397 -18661 55299 -24335 -20296 57047 -18661 -46470 63744 20880 -70347 23472 54949 -45034
409 -45034 -8722 45381 -34318 -12657 61378 -30261 -59386 56111 18515 -71665 11878 38244
421 38244 -46089 -3912 33178 -49670 -14800 62634 -31842 -60823 52113 21192 -55294 20702
433 20702 30953 -41252 16782 41889 -53286 -11181 74898 -17610 -54231 45819 19353 -41933
445 -41933 26091 15814 -53053 19232 43567 -58460 -20213 64111 -18575 -47010 38529 1748
457 1748 -40991 38028 14912 -58128 25071 55701 -47234 -16171 61329 -11217 -28865 41950
469 41950 -8209 -37161 50571 16512 -65656 16778 47990 -49675 -21961 39738 -30094 -29858
481 -29858 38524 -24396 -48627 48754 15508 -66249 12733 45192 -35497 -3263 42641 -24302
493 -24302 -2806 65438 -12563 -39615 63423 35603 -46876 18292 40917 -27558 10429 38685
505 38685 -40700 -14539 55789 -25411 -58601 34808 11295 -54293 5752 11516 -49219 7434
517 7434 33979 -54189 -25069 54679 -15942 -45300 38570 15142 -34456 28247 20242 -40966
529 -40966 22860 46803 -44938 -17688 57124 -11207 -38244 32336 -484 -36926 30038 6638
541 6638 -60716 14688 46759 -43761 -22302 45708 -10321 -19240 43508 -2479 -27850 53790
553 53790 27870 -44451 29949 62913 -22373 -5187 47182 -10738 -8125 46984 -18438 -45782
565 -45782 42730 16165 -63038 -4185 21300 -47208 -17940 16635 -51689 -32581 37642 -26685
577 -26685 -55005 32288 11805 -51835 12468 33418 -28717 8947 40218 -26207 1334 67401
589 67401 -4657 -36611 46423 26431 -30906 22081 21461 -38386 12380 37817 -44940 -24747
601 -24747 42915 -20521 -47295 24722 831 -42196 16151 9290 -44546 16776 40176 -44265
613 -44265 -20070 52951 -204 -22403 34155 972 -24351 46863 23629 -50312 9934 45517
625 45517 -28535 -13991 33943 -21877 -24165 36828 -12582 -45125 29216 11474 -52469 9737
637 9737 37939 -34095 -10875 37581 -15402 -9591 47001 -8880 -34880 47375 29789 -37288
649 -37288 16564 36811 -26628 2914 36749 -30724 -19532 42385 -17888 -49221 28669 11486
661 11486 -51190 -2318 12577 -40793 -1997 24291 -46705 -24814 48758 -6407 -41534 25934
673 25934 14442 -24511 30573 24763 -35824 19110 56949 -17026 -8790 53716 5863 -18007
685 -18007 40748 15323 -21888 36084 25755 -36968 17090 50687 -25005 -19515 37525 -5594
697 -5594 -19604 32063 -5776 -37801 31907 21644 -47814 148 34015 -31723 -20249 28159
709 28159 -19157 -25636 26406 -16362 -43280 30195 14205 -58706 -8765 31832 -23738 -14218
721 -14218 17899 -29030 -13707 47388 -8971 -46751 31250 31504 -28671 11615 32742 -16500
733 -16500 13753 45798 -16903 -6982 58750 7893 -29662 38627 34496 -18512 18940 26593 -22430
746 -22430 15311 42374 -29015 -21457 44761 634 -34359 21412 7590 -34927 12071 13272
758 13272 -41969 -1705 29137 -37818 -28446 34586 -7923 -39202 11062 -1944 -30114 19582
770 19582 6717 -51002 3221 44175 -24970 -28138 25912 -3249 -15944 27662 -5038 -32593
782 -32593 32581 27624 -36922 3670 39910 -15895 -11281 29885 -8565 -12089 36120 -4071 -34526
795 -34526 32668 27137 -38525 -2756 29618 -18697 -7672 23981 -22906 -19263 35602 -7083
807 -7083 -42190 19532 15444 -38457 -1538 19727 -27912 -6511 24254 -27795 -21225 36065 -7199
820 -7199 -41576 19375 18855 -27549 7417 18894 -24394 9390 37779 -23207 -17902 44359 9393
833 9393 -24040 24922 18465 -15700 24671 22688 -29311 9020 43135 -18096 -20365 32708 2058
846 2058 -21054 20744 -213 -31456 18972 15997 -41496 -5245 30980 -22538 -22181 22699 -9237
859 -9237 -22129 21787 -3828 -32077 22345 20305 -35016 1331 33845 -14994 -10848 25651 -10562
872 -10562 -13739 32896 -1695 -33068 24740 24187 -31074 -1156 25432 -18068 -6022 23476 -19295
885 -19295 -15758 36049 -1682 -35712 20975 21898 -25512 3635 19146 -21539 4182 33051 -20673
898 -20673 -19924 36767 3768 -29996 16377 12009 -25429 9960 15842 -30761 -934 30652 -24621
911 -24621 -25228 28565 -2307 -29912 14184 4829 -26331 15542 16212 -33945 354 35296 -17702
924 -17702 -20268 28022 943 -16715 23669 3469 -25406 22535 21376 -33123 -1304 32890
936 32890 -15914 -17581 22450 -6702 -17225 23126 -5088 -34140 19243 19672 -34378 -5844 25985
949 25985 -15397 -9636 22596 -13903 -15955 31697 895 -32609 19966 24259 -23490 2728 24092
962 24092 -15809 -1716 27521 -16442 -17466 33909 2439 -31749 16999 18950 -24207 3985
974 3985 17304 -25060 -1913 29328 -20044 -22404 30254 2703 -29090 13692 10320 -23907 10331
987 10331 15742 -30164 -89 33781 -18345 -23021 27451 2054 -23808 15324 4702 -25155
999 -25155 16628 18533 -31728 -2116 33306 -14692 -20311 22893 -1662 -17638 21411 2100
1011 2100 -27260 20405 23395 -30452 -4158 30522 -11613 -12763 22854 -5744 -14441 27826 2098
1024 2098 -30411 18495 23447 -27609 -3747 24893 -13653 -7277 23704 -12955 -18499 28161 1970
1037 1970 -33739 12946 19506 -24423 -1595 18080 -18858 -4146 25473 -17620 -22141 28998
1049 28998 4287 -30068 12262 16272 -20677 6080 18054 -23335 -2066 31170 -14972 -22277
1061 -22277 27789 6699 -23349 13674 10371 -21850 11388 17664 -28785 -3799 32540 -14258
1073 -14258 -22606 23070 2526 -20796 15192 3885 -25579 14783 20670 -28748 -4669 31810
1085 31810 -10436 -17076 21077 -1494 -16172 21299 2871 -28638 15902 23433 -27341 -7765
1097 -7765 25045 -11163 -14102 17350 -10267 -18890 23111 1693 -32406 10821 20284 -25158 -6363
1110 -6363 19357 -14543 -7692 22349 -11216 -18031 28093 6654 -28802 11651 20791 -18147 1201
1123 1201 18907 -16110 -1339 28363 -13022 -21957 25970 7135 -26411 8516 12392 -20338
1135 -20338 5160 16697 -23463 -5259 27976 -13743 -23238 22538 5898 -21833 11557 9313
1147 9313 -19108 12408 19083 -26255 -5129 31520 -8500 -20201 19641 3110 -16242 16287
1159 16287 3829 -25814 11716 19927 -26547 -7831 25785 -9998 -16708 17907 -2963 -16164
1171 -16164 20142 3680 -26987 14084 24692 -20489 -4786 24980 -5772 -6119 21829 -6476
1183 -6476 -14741 26876 8339 -25804 11265 21058 -19129 -3616 17521 -15343 -9116 19188 -13499
1196 -13499 -22328 20840 3033 -31156 3773 12580 -21033 -2914 10943 -21795 -5724 24835
1208 24835 -13226 -23641 22013 8000 -22591 7973 11539 -16577 8622 18122 -20537 -2284
1220 -2284 30562 -8320 -20509 20819 6831 -17033 12187 6522 -20331 12729 19988 -24842
1232 -24842 -7431 27650 -7086 -17687 17503 760 -14833 17530 5262 -23552 12689 21146
1244 21146 -23876 -7374 25035 -7779 -13504 16909 -5514 -16518 19700 1940 -30286 7891
1256 7891 18674 -23099 -8657 17146 -12642 -10688 17125 -11206 -18623 21777 3821 -28044
1268 -28044 9639 21355 -16364 -2087 17867 -11023 -1155 25364 -10138 -18724 26302 12143
1280 12143 -21515 7728 14451 -15304 4838 15567 -20487 -6445 24966 -10333 -22003 18946
1292 18946 4811 -23211 6316 8582 -19050 6014 15124 -22991 -4734 28832 -7334 -19460
1304 -19460 18421 5634 -14701 14719 7586 -20188 11725 21840 -20120 -5686 26227 -8156
1316 -8156 -17190 17705 1000 -15865 14592 3278 -23904 12555 20954 -24554 -10000 22911
1328 22911 -5873 -11212 16546 -6469 -15684 23536 7851 -27080 6887 19772 -17198 -3955
1340 -3955 17539 -13402 -9177 20138 -8603 -20101 18562 3880 -27776 5607 15906 -18756
1352 -18756 -3429 14874 -15056 -5475 24109 -8691 -19908 21756 11272 -17719 10655 16038
1364 16038 -13185 7647 21263 -14741 -3842 27201 -5425 -17720 20868 8230 -19374 7623
1376 7623 8645 -18767 5055 14303 -24500 -10613 23811 -7838 -21889 12188 746 -17289
1388 -17289 11667 3982 -24770 7163 21056 -19107 -8804 22810 -4632 -12750 16671 -1310
1400 -1310 -15945 17957 7619 -24154 7567 21175 -17243 -7902 18185 -8719 -10203 18344
1412 18344 -5569 -18317 19456 9353 -22752 6963 19313 -14711 -2271 19266 -8873 -4775
1424 -4775 23181 -4728 -16991 22014 10730 -22831 4692 15597 -14507 -1269 12834 -17473
1436 -17473 -7598 21360 -10673 -24912 13443 5935 -21964 2006 6912 -17670 3436 15372
1448 15372 -20340 -8954 24803 -3604 -19097 14837 8076 -12801 11910 9607 -16497 9109
1460 9109 20928 -16933 -7671 23830 -2779 -14746 15111 2544 -15218 12404 5711 -22372
1472 -22372 6071 19178 -19034 -10164 19629 -4149 -11625 13948 -2982 -15217 17331 7159
1484 7159 -23338 6051 20935 -14517 -7061 16659 -7147 -9071 15956 -6493 -18009 17719
1496 17719 7514 -24449 2347 16566 -13681 -5263 11869 -13520 -6831 21183 -6695 -20643
1508 -20643 17213 11504 -18180 4196 13305 -12463 2909 16689 -13391 -5645 23864 -2976
1520 -2976 -18130 16407 8975 -16408 5893 9542 -14869 4243 16361 -17290 -8843 22317 -4143
1533 -4143 -18613 11867 4686 -14910 8670 6649 -18262 6132 18147 -17503 -9247 20802 -3223
1546 -3223 -14585 12376 1402 -13175 13317 6351 -22070 4885 19319 -15732 -10690 16037
1558 16037 -4722 -9830 14188 -4593 -16931 15691 7955 -23048 2824 17479 -13164 -5483
1570 -5483 15373 -7723 -7399 17749 -4688 -17526 17267 10096 -19933 3698 15839 -11549 -1266
1583 -1266 14384 -12070 -6560 20851 -4840 -19223 15916 9951 -17705 4054 11447 -13448 1377
1596 1377 14140 -15551 -7609 21561 -4328 -19305 12800 7203 -15942 5020 6853 -16787 3858
1609 3858 16457 -17001 -9874 20540 -2660 -16517 10709 2729 -14079 9889 6874 -19154 5084
1622 5084 18906 -14939 -9606 18701 -2686 -12388 12778 49 -13374 14385 8752 -19961 4597
1635 4597 19793 -12247 -7461 16452 -4185 -7790 16065 -1961 -15325 16255 10290 -20244 2466
1648 2466 17410 -11280 -4819 14173 -8628 -7281 17893 -4891 -19393 14076 9041 -20267 429
1661 429 11953 -12947 -2242 12481 -14106 -8998 19278 -4615 -20486 12474 9476 -15760 3717
1674 3717 10481 -12440 3096 16623 -13420 -8123 22247 -279 -16164 13114 8237 -12429 8139
1687 8139 8550 -15307 3922 17743 -13813 -10058 19184 -676 -14207 10080 2615 -13323 9522
1700 9522 7298 -19164 2527 18652 -12787 -10343 15909 -2140 -10991 11643 -684 -14527 12814
1713 12814 8986 -19694 1058 17506 -11226 -8708 12489 -6280 -9670 13799 -3367 -17621
1725 -17621 12358 9882 -19673 -714 14353 -10545 -4945 12361 -7895 -7203 18203 -1502 -17014
1738 -17014 13539 11694 -15496 1827 12853 -9547 395 15169 -10717 -7872 19510 -1201
1750 -1201 -18262 10050 8486 -14107 2531 8019 -14127 1264 14976 -13834 -11071 17414 -923
1763 -923 -16603 8964 5809 -12454 7441 8395 -15613 2445 17549 -11327 -9836 16555 298
1776 298 -11811 9956 2208 -12746 9632 7593 -18877 80 16812 -10743 -10362 12619 -2498
1789 -2498 -10126 10905 -1411 -15264 11002 9567 -17496 276 16555 -7813 -5655 13004 -4313
1802 -4313 -6687 15546 -509 -15477 12871 12311 -15002 -41 13618 -7819 -2586 11972 -9002
1815 -9002 -8237 16489 -998 -17528 9852 9752 -14450 651 9625 -11031 -579 13112 -10740
1828 -10740 -9038 17725 -182 -16530 8476 7537 -11843 3758 7266 -13524 1466 15421 -11808
1841 -11808 -11049 15111 76 -14074 7387 3497 -12521 6705 7741 -15084 896 16354 -9953
1854 -9953 -9561 14842 481 -9265 10246 2724 -10621 11776 10259 -15831 776 16985 -6560
1867 -6560 -7709 12048 -2334 -7376 11986 -959 -15410 9074 8715 -17110 -1918 12412 -8819
1880 -8819 -6583 9545 -7231 -8098 13397 -2478 -17652 9147 10719 -13905 -1135 10546 -7883
1893 -7883 -1120 11651 -9333 -8727 15812 205 -15878 8782 9156 -12134 1624 8727 -10773
1906 -10773 -524 13218 -10278 -9489 16621 1630 -14452 7563 7053 -10005 5202 8054 -12972
1919 -12972 1644 16896 -8762 -9508 14863 1861 -11579 7582 3006 -11734 7200 7505 -15911
1932 -15911 -291 15497 -9242 -11644 10712 -1570 -9661 8007 -918 -13881 9444 9564 -15872
1945 -15872 -1738 14730 -6109 -6741 11190 -2633 -6498 13541 909 -13791 10485 11457 -13344
1958 -13344 -1858 12393 -6099 -4052 10221 -6500 -8197 13880 -306 -16977 6653 9429
1970 9429 -13126 -1432 9036 -8306 -2074 11347 -8519 -8882 15277 1041 -15505 7236 9829
1983 9829 -9430 2121 8146 -9879 934 14833 -8947 -10795 14659 3088 -12421 6096
1995 6096 5184 -10241 5244 7465 -13441 -531 15235 -8184 -10766 12937 1976 -10543 7068
2008 7068 2570 -10613 7530 8569 -14680 -1029 15760 -5698 -9192 10285 -1008 -8989 9191
2021 9191 583 -13547 7165 9300 -14384 -2752 13282 -6381 -8183 8703 -2932 -7471 10902
2034 10902 206 -13603 8777 11265 -12249 -2421 11365 -4950 -3066 10468 -5253 -7389 14379
2047 14379 2378 -14411 6094 9585 -10663 -1120 8310 -8240 -2168 10792 -7899 -10099 12691
2060 12691 1305 -15000 3860 6852 -9613 1203 6964 -11153 -1683 13063 -7277 -10887 11161
2073 11161 1994 -10697 6203 5115 -9729 5106 8592 -11270 -703 14578 -5660 -8961 11371
2086 11371 2119 -8445 7562 3057 -10267 6752 9007 -12646 -2071 13848 -4717 -8263 9433
2099 9433 -838 -7682 9332 825 -13488 6332 10050 -12228 -3911 10762 -4333 -5560 8014
2112 8014 -4351 -8397 10762 1616 -14001 5302 9747 -9588 -2302 8772 -6256 -3335 10348
2125 10348 -4870 -8504 12035 3481 -12366 5112 9112 -8421 37 7861 -7725 -1163 12177
2138 12177 -5456 -9394 11953 3639 -11369 3691 5950 -8139 2640 7199 -9963 -1420 13209
2151 13209 -5655 -10457 9876 2428 -9993 4249 2909 -9183 5196 7986 -12418 -2916 13140
2164 13140 -3929 -9696 7889 951 -7052 7486 1923 -10977 6219 10101 -11225 -2934 11749
2177 11749 -3462 -6176 8399 -919 -6722 9635 1755 -12991 5488 9902 -10451 -3715 9521
2190 9521 -4111 -4179 8112 -4690 -8151 10255 1778 -13873 3437 8850 -8895 -2351 7560 -5889
2204 -5889 -2954 9847 -5410 -9123 11022 3639 -12009 3577 8291 -7426 263 6738 -8408
2217 -8408 -1380 12236 -4978 -10095 10189 4067 -9591 3426 4741 -8110 2733 7475 -10335
2230 -10335 -2817 12622 -3914 -9861 8367 2358 -8956 4513 2454 -9942 4268 8524 -10998
2243 -10998 -3829 11875 -3225 -8840 6746 -350 -7434 7069 2008 -11139 5165 10213 -10361
2256 -10361 -4167 10978 -2926 -5819 8027 -1364 -6653 10055 3567 -11540 5158 10948 -8177
2269 -8177 -2810 9213 -3491 -2776 8848 -3768 -8595 10149 3223 -13213 1758 7795 -8429
2282 -8429 -2780 6158 -7149 -3957 9389 -5347 -11002 8067 3350 -11649 1610 6068 -7591
2295 -7591 553 7060 -8678 -3091 11750 -3512 -10389 8536 4573 -8667 3863 5110 -7221
2308 -7221 3411 8626 -8929 -3280 13065 -1779 -8413 8058 3811 -6713 5730 3886 -9407
2321 -9407 4228 10119 -9018 -4151 11835 -1474 -7496 6687 -81 -7435 6772 2094 -12103
2334 -12103 2687 9646 -9598 -5950 8303 -3719 -6615 5915 -3533 -9103 7582 3041 -12580
2347 -12580 1298 9053 -7782 -3622 7217 -4407 -3733 8856 -2941 -8818 9794 5495 -10688
2360 -10688 2084 8870 -5652 -712 7882 -5150 -2207 11614 -1984 -9493 8681 5189 -9446
2373 -9446 1989 5950 -6415 1224 7648 -7863 -3968 11206 -2533 -10473 6442 3841 -8382
2386 -8382 2479 3941 -8207 2098 8143 -9613 -5243 10373 -2103 -9500 5230 1632 -7549
2399 -7549 4851 3085 -10277 1986 9174 -8741 -5695 9605 -1352 -6442 6096 116 -6870
2412 -6870 7513 3746 -10764 2621 10869 -6414 -3909 9043 -1314 -3669 7876 -1406 -7618
2425 -7618 8680 5034 -10690 1721 9540 -5526 -2475 7170 -4424 -3808 8890 -2469 -9096
2438 -9096 8099 5159 -10076 914 7191 -6047 -1119 6121 -6533 -3730 10174 -2484 -9896
2451 -9896 6547 4448 -8862 1165 4283 -7035 541 7077 -7872 -4433 10228 -1508 -9574
2464 -9574 5292 2999 -6947 3379 3489 -8024 2882 8770 -7333 -4673 10139 -396 -7124
2477 -7124 5864 1828 -5843 6086 4208 -9164 2495 9823 -7180 -4754 8898 -1211 -5175
2490 -5175 6189 -375 -6691 6946 3782 -10786 1226 9455 -6310 -4305 7340 -2545 -3721
2503 -3721 7244 -2241 -8327 7151 4428 -10199 669 8063 -5385 -2339 6639 -4637 -3785 8611
2517 8611 -2388 -9300 6834 5077 -8887 751 5919 -5530 -416 6740 -6616 -3878 10084
2530 10084 -1155 -8855 6765 5143 -6808 2509 4836 -6396 1557 8377 -6733 -4191 10793
2543 10793 258 -8056 5179 2573 -6348 3931 3556 -8456 1761 9267 -6895 -5534 8697
2556 8697 -1194 -7039 4883 447 -7138 5231 3545 -9920 1454 9105 -6800 -4977 7240
2569 7240 -1728 -4861 6326 -1130 -7666 7176 4896 -10097 603 8559 -5579 -3395 6985
2582 6985 -3096 -3947 8168 -1721 -8170 7121 5005 -9575 418 7092 -4960 -1032 6596 -5132
2596 -5132 -3145 9783 -1172 -9319 6199 5241 -7398 1576 5372 -5771 660 7291 -6283 -4362
2610 -4362 9878 -641 -8730 5973 4305 -6802 2389 4013 -7491 1087 7860 -7344 -5777
2623 -5777 9132 -334 -7488 4449 1858 -6908 4114 3820 -9525 1062 8983 -6128 -5398 8578
2637 8578 -263 -6388 5347 576 -6564 5846 4576 -9181 817 9680 -4910 -4590 6846 -1472
2651 -1472 -4294 6618 -1201 -8079 6580 5519 -9246 -73 7948 -4408 -2900 5849 -3794 -3894
2665 -3894 8235 -1400 -8733 6517 5864 -8874 36 6033 -5249 -1129 6438 -4707 -4466 9265
2679 9265 -595 -9570 4936 4607 -7703 663 4660 -6189 60 7357 -6133 -5065 9245 -479
2693 -479 -8881 4643 3864 -6043 2518 4076 -6930 1292 8624 -5972 -5752 8589 1095 -6413 5057
2708 5057 2126 -5855 4936 4491 -8444 627 9192 -5474 -5411 7386 133 -5022 5137 78
2722 78 -7266 5108 4533 -9223 -468 8603 -4232 -4448 6114 -2088 -4668 6484 -920 -8475 5417
2737 5417 5035 -9010 -446 7119 -4259 -2958 5592 -3853 -4224 7845 -758 -8764 5373 5807 -7219
2752 -7219 150 5786 -4604 -683 7166 -4433 -4424 9183 416 -7995 4957 5163 -6052 1340 4635
2767 4635 -5720 602 7865 -5372 -5373 8523 528 -8004 3330 2565 -6265 2776 3921 -7639 55
2782 55 8532 -5272 -5954 6978 81 -6016 4652 1493 -6461 4326 4736 -8011 -301 8549 -4525
2797 -4525 -5492 6198 -720 -4344 5606 114 -7408 5072 5161 -8420 -1235 7540 -3899 -3498 6254
2812 6254 -2004 -3766 7184 -161 -7724 5553 6114 -7296 -271 6652 -3693 -1290 6298 -3941
2826 -3941 -4643 8232 292 -8987 4112 5335 -6745 -207 4569 -5862 -948 6591 -5696 -5674
2840 -5674 7683 251 -8072 3747 3793 -5900 1738 4125 -6664 512 8365 -4910 -5150 8358
2854 8358 1444 -6212 4149 2706 -5741 3821 4725 -7703 161 8477 -4783 -5715 6485 -113
2868 -113 -6002 4146 675 -7002 4282 4382 -8369 -712 8247 -4387 -4602 5473 -1377 -4510
2882 -4510 5871 166 -7846 4951 5759 -7821 -1281 7220 -3729 -2995 5775 -2769 -4336 7481
2896 7481 95 -8611 4323 5443 -7290 -767 5701 -4546 -1123 6208 -4323 -4907 7796 427
2910 427 -8787 3773 4925 -6224 298 4728 -5583 -407 7281 -5118 -5905 8033 922 -7801
2924 -7801 3431 3628 -5603 1773 3887 -7110 -484 8110 -4522 -5498 7464 1032 -6050 3927
2938 3927 2130 -5900 3575 4857 -7511 -448 8752 -3425 -5015 6806 272 -4767 4662 769
2952 769 -7015 4081 5435 -7743 -1342 7552 -3277 -4513 5343 -1901 -4856 5768 126 -8136
2966 -8136 3991 5539 -7540 -1651 6208 -3897 -2952 5667 -3344 -4995 6975 657 -8315 3292
2980 3292 5363 -6228 -955 5318 -3861 -1296 7011 -3174 -4918 7738 1865 -7582 3179 5050
2994 5050 -5146 1430 5270 -4845 -168 8142 -3412 -5645 6850 1640 -6719 3022 2957 -5404
3008 -5404 2031 4470 -6992 -1530 7377 -4051 -6961 5229 560 -6327 2989 1142 -6965 2830
3022 2830 4672 -8012 -2347 7171 -2900 -5341 5097 -316 -4957 4949 926 -7435 3572 5929
3036 5929 -7051 -1874 7438 -2239 -3047 5322 -1197 -4573 6020 1357 -7457 3521 6409 -5852
3050 -5852 -1177 6201 -2905 -2185 5511 -2732 -4688 6947 1664 -7988 2741 5522 -5510 -643
3064 -643 4526 -4371 -1422 6551 -3617 -5800 6894 2112 -7179 2021 3985 -5300 624 4338 -5678
3079 -5678 -1354 7372 -3166 -6078 5950 1746 -6319 2422 2649 -5060 2341 4663 -6407 -1162
3093 -1162 8025 -2298 -5515 5525 1355 -4968 3915 1870 -6210 3666 5701 -6645 -1561 7481
3107 7481 -2063 -4473 5084 31 -4239 5103 937 -7091 2904 5260 -6731 -2537 5958 -2698 -3187
3122 -3187 4939 -2005 -4577 5958 1095 -7969 2711 6008 -5253 -1380 5094 -2970 -1756 5725
3136 5725 -2942 -5207 6354 1836 -7133 2268 4848 -4292 203 4171 -4512 -1353 6614 -3137 -5664
3151 -5664 6383 2107 -6441 2344 3487 -4646 1256 4155 -5557 -1030 7336 -2460 -5396 5704
3165 5704 1848 -5174 2716 2177 -5172 2299 4895 -6066 -1495 7556 -2362 -5148 4609 343 -4678
3180 -4678 3282 1052 -6620 2908 5339 -6690 -2308 6292 -2459 -4102 4371 -802 -4195 5192 1098
3195 1098 -6911 2848 6069 -4985 -2062 5679 -1948 -2012 5273 -1763 -4138 6229 2267 -6875 2538
3210 2538 5348 -4930 -804 4965 -3202 -1981 5909 -2401 -5332 6056 2107 -6692 1882 4437
3224 4437 -4307 178 4485 -4421 -1253 6827 -2464 -5698 5398 2120 -6035 2054 3047 -4618 1227
3239 1227 4265 -5954 -1870 7013 -2433 -5699 4895 1432 -4857 2765 1867 -5526 2222 5131 -5871
3254 -5871 -2200 7014 -1207 -4462 4829 376 -4220 4569 1474 -6325 2481 5992 -5393 -1594 6104
3269 6104 -1853 -3244 4514 -783 -4385 5289 1453 -6774 2334 5758 -4812 -1653 4800 -2502 -1790
3284 -1790 5145 -2256 -4757 5997 2228 -6813 1437 4830 -4637 -869 4270 -3744 -1699 5887 -2571
3299 -2571 -5422 5170 2209 -6750 1257 3676 -3900 276 4071 -4955 -1775 6695 -2188 -5991 4640
3314 4640 2115 -4917 2522 2616 -4369 1558 4733 -4877 -2100 6874 -1365 -4950 4115 1742 -4147
3329 -4147 3553 2163 -5459 2361 5457 -5420 -2755 5981 -1145 -3764 3989 -80 -4378 4314 1947
3344 1947 -6476 1760 5596 -4633 -2229 5319 -1899 -3067 4178 -1640 -4611 4870 1610 -6967 1333
3359 1333 5207 -4336 -2302 3794 -2775 -2531 4906 -2152 -5719 4877 2262 -6194 931 4463 -3686
3374 -3686 -333 3899 -3448 -1647 5875 -1496 -5082 5243 3080 -4787 1514 3683 -3566 927 4866
3389 4866 -4251 -1816 7148 -910 -5483 4155 1961 -4423 1617 2203 -4806 1469 4612 -4904 -2905
3404 -2905 6165 -1378 -4798 3432 559 -4037 2625 1538 -5663 2093 5358 -4838 -2975 5288 -1307
3419 -1307 -3573 3601 -241 -3873 4285 1757 -6062 1714 5293 -4097 -2209 4667 -1223 -2376 4693
3434 4693 -1054 -4277 4770 2568 -6167 1200 5240 -3518 -971 4227 -1998 -1502 4868 -1412 -4934
3449 -4934 4657 2469 -5557 1387 3892 -3828 -277 3675 -4295 -2120 5191 -1535 -5489 3873 1984
3464 1984 -4665 1157 2167 -3973 547 3849 -4778 -2664 5909 -925 -4961 3358 1567 -3949 1774
3479 1774 1748 -4547 2027 5008 -4104 -1990 5837 -410 -3726 3312 599 -3671 3636 2211 -5376
3494 -5376 1603 4987 -4080 -2566 4478 -1108 -3194 3414 -530 -3882 4226 1921 -6025 906 4826
3509 4826 -3978 -1985 3717 -2114 -2303 4246 -1361 -4492 4455 2240 -5687 247 4223 -3400 -780
3524 -780 3549 -2429 -1792 5139 -1561 -5166 3986 2460 -4832 780 3305 -3101 300 3802 -3705
3539 -3705 -1988 5714 -767 -5095 3611 2551 -4085 1421 2619 -3717 1243 4125 -4083 -2427 5440
3554 5440 -568 -4356 3043 1575 -3796 2562 1559 -4920 1218 4830 -4328 -2575 4931 -767 -3600
3569 -3600 2876 172 -3981 3455 1459 -5308 787 4422 -3576 -2627 3647 -1134 -3075 3583 -971
3584 -971 -4498 3521 2039 -5397 580 4791 -3559 -1656 3551 -2137 -1848 4717 -844 -4702 4307
3599 4307 2933 -4963 413 3936 -2479 -376 3782 -2821 -1459 5317 -1101 -5045 3712 2420 -4602
3614 -4602 475 2886 -3120 675 3821 -3292 -2091 5294 -320 -4629 2933 1998 -3663 1870 2176
3629 2176 -3817 917 4551 -3810 -2860 4705 -190 -4100 2525 959 -3544 2231 1570 -5330 587
3644 587 4654 -4194 -3154 4510 -595 -3400 2842 -231 -3658 3220 2040 -5302 609 4713 -2705
3659 -2705 -2042 4069 -1213 -2177 3866 -446 -3736 3552 2676 -5138 346 4606 -2414 -1505 3352 -1947
3675 -1947 -2027 4262 -979 -4656 3381 2716 -4782 99 3054 -2986 -816 3093 -3143 -2315 4651 -561
3691 -561 -4965 2678 2171 -4017 305 1951 -3566 117 4073 -3469 -2847 4718 -143 -4186 2396 1616
3707 1616 -3557 1283 1882 -4049 822 4955 -3384 -2812 4384 -324 -3461 2616 809 -2930 2888
3722 2888 2443 -4748 458 5293 -2721 -2443 3721 -417 -2450 3089 53 -3536 2899 2422 -5095 148
3738 148 4456 -2519 -2029 3294 -1019 -2198 3908 -741 -4455 3061 2537 -4695 -234 3574 -2327 -1198
3754 -1198 3033 -2377 -2138 4234 -343 -4617 2973 2788 -3838 73 3046 -2593 -201 3386 -3002
3769 -3002 -2386 5044 -137 -4187 2824 2441 -3326 608 2073 -3406 575 4036 -2919 -2778 4793 360
3785 360 -3968 2334 1507 -2908 1768 1845 -3831 445 4631 -2443 -3085 3927 93 -3177 1938 302
3801 302 -3500 2114 2436 -4500 162 4509 -2560 -2648 2728 -516 -2763 3027 -535 -4037 2950 2537
3817 2537 -4621 -185 3941 -2295 -1733 2991 -1308 -2416 3787 489 -4226 2764 3300 -3789 -214
3832 -214 3351 -1778 -592 3451 -2232 -1836 4663 -18 -4556 2194 2946 -3477 256 2463 -2420 -487
3848 -487 3659 -2829 -2651 4425 342 -4002 2068 1916 -3291 1121 1874 -4081 137 3761 -2895 -3148
3864 -3148 3954 381 -3871 1863 1135 -3120 2020 2099 -4495 -186 4326 -2493 -2526 3797 151 -2564
3880 -2564 2891 661 -3271 3055 2321 -4216 -229 4971 -1760 -2031 3352 -239 -2066 3193 175
3895 175 -4143 2761 2961 -4208 -600 3747 -1971 -1541 2494 -1549 -2376 3561 85 -4318 2320 3017
3911 3017 -3973 -444 3059 -2173 -696 3239 -2336 -2410 4407 254 -4408 1843 2485 -3274 107 2772
3927 2772 -2821 -138 3720 -2522 -2995 4217 617 -3902 1782 1870 -2798 1085 2046 -3803 48 4475
3943 4475 -2181 -2979 3637 588 -2809 2147 1235 -3160 2181 2461 -4249 -343 4489 -1980 -2927 3396
3959 3396 0 -2710 2114 501 -4019 2050 2593 -4658 -1063 3832 -1571 -2067 2550 -681 -2316
3974 -2316 3516 277 -4094 2018 3231 -3811 -438 3547 -1736 -1282 3169 -1323 -2436 3684 542
3989 542 -4209 1790 3185 -3355 -378 2627 -2182 -605 3426 -2220 -3014 3933 888 -3941 1746
4004 1746 2364 -2755 246 2632 -2902 -87 4020 -1971 -2922 3927 1001 -3572 1901 1705 -2748 1388
4020 1388 2327 -3616 -440 4133 -1829 -3159 3399 453 -3035 1498 645 -2732 1873 2614 -4166 -712
4036 -712 3824 -1660 -2907 2576 -47 -2225 2591 38 -3746 2329 2989 -3918 -913 3454 -1136
4051 -1136 -1639 2786 -876 -1799 3134 593 -3856 1947 3348 -3091 -485 3011 -1597 -649 2628 -1497
4067 -1497 -2491 4222 592 -4311 1444 3127 -2740 -276 2543 -2415 -792 3469 -1922 -3267 3648
4082 3648 950 -3878 965 1862 -2696 349 1650 -3473 -747 3940 -2079 -3320 3178 689 -3197
4097 -3197 1605 1379 -2882 1637 2439 -3330 -530 4141 -1372 -2830 2790 338 -2562 2133 950
4112 950 -2993 2110 2839 -3593 -770 4188 -1187 -2246 2768 -151 -2416 3307 542 -3825 2092
4127 2092 3121 -3232 -716 3299 -1284 -1734 2879 -1260 -2704 3338 290 -4516 1304 2650 -3795
4142 -3795 -851 2279 -2308 -1406 2894 -1687 -3166 3532 658 -3992 1448 2649 -2701 105 2571
4157 2571 -2230 -65 3989 -1316 -2755 3712 1217 -3293 1462 2228 -2307 1127 2320 -3346 -708
4172 -708 4141 -1503 -3133 2828 595 -2941 1480 1255 -2887 1253 2664 -3525 -883 3808 -1130
4187 -1130 -2616 2541 8 -2583 2498 666 -3624 1826 2825 -3885 -1321 3629 -1412 -2448 2312
4202 2312 -471 -2548 2748 168 -4119 1416 3290 -2979 -1149 2972 -1741 -1347 3048 -1218 -2618
4217 -2618 3420 1412 -3930 1558 3424 -2581 -277 2590 -1753 -891 3725 -1352 -2946 3765 1031
4232 1031 -4062 1143 2236 -2767 189 2394 -2575 -900 3683 -1641 -3214 3188 1168 -3393 1230
4247 1230 1565 -2745 1006 2303 -3507 -1000 3721 -1528 -3022 2686 401 -2758 1815 1267 -3314
4262 -3314 933 2896 -3500 -1342 3792 -1161 -2335 2374 127 -2596 2329 836 -3654 1399 3235
4277 3235 -2816 -1092 3452 -900 -1546 2510 -626 -2523 3085 932 -3909 1294 3347 -2673 -946
4292 -946 3116 -1472 -1245 3172 -1224 -3122 3437 1526 -3792 1051 2816 -2186 -701 2287 -2105
4307 -2105 -1175 3356 -1286 -3059 3021 1319 -3587 717 1964 -3157 -74 2092 -2904 -1140 3693
4322 3693 -1193 -3158 2731 1440 -3059 1338 1153 -2711 1175 2572 -2872 -1341 3791 -869 -3053
4337 -3053 2463 1112 -2333 1715 1094 -3162 1209 3221 -3407 -1506 3586 -1009 -2490 2346 33
4352 33 -2038 2480 901 -3673 1050 3116 -2710 -1752 2897 -980 -1777 2599 -1024 -2823 2663 1190
4368 1190 -3877 428 2784 -2725 -1370 2520 -1566 -1508 3088 -1051 -3226 2927 1402 -3645 495
4383 495 2860 -2084 -301 2326 -2054 -1212 3464 -743 -3118 2759 1518 -2792 976 2051 -2604
4398 -2604 440 2641 -2666 -1274 3705 -508 -2803 2522 1249 -2578 1287 1282 -2658 1150 2878 -2555
4414 -2555 -1451 3579 -795 -2713 2122 348 -2827 1339 1168 -3456 825 3216 -2797 -1592 3066
4429 3066 -916 -2288 2081 82 -2539 2499 1302 -3607 634 3460 -2397 -1599 2698 -1143 -1333
4444 -1333 2815 -542 -2809 3136 1669 -3453 408 3040 -2107 -592 2528 -1689 -1137 3360 -928
4459 -928 -3078 2313 1518 -3573 52 2017 -2176 -92 2714 -2053 -1286 3304 -865 -3281 1882 1507
4475 1507 -2939 750 1782 -2260 779 2583 -2269 -1449 3499 -275 -2835 2320 1063 -2036 1378
4490 1378 971 -2544 471 3002 -2801 -1648 3340 -237 -2418 1967 700 -2545 1613 1195 -3443
4505 -3443 450 3208 -2092 -1544 2924 -548 -1619 2729 -246 -2550 2628 1663 -3542 416 3272
4520 3272 -2089 -1176 2418 -934 -1485 2704 -801 -3130 2296 1625 -3492 125 2368 -2044 -999 2197
4536 2197 -1537 -1511 3187 -728 -3207 2307 1879 -3021 436 1932 -2011 -204 2491 -2035 -1385 3520
4552 3520 -651 -3217 2295 1588 -2592 501 1599 -2532 342 2691 -2309 -1873 3483 -277 -3079
4567 -3079 1905 908 -2154 1241 1381 -2881 791 3138 -2361 -1494 3222 91 -2045 2072 205 -2508
4583 -2508 1851 1018 -3428 188 2599 -2422 -1900 2463 -581 -1895 1840 -610 -2829 1973 1625 -3512
4599 -3512 159 3032 -1551 -1090 2417 -1079 -1291 2700 -271 -3216 2186 1848 -2927 103 2696 -1733
4615 -1733 -588 2227 -1390 -1151 3393 -108 -3046 1851 2103 -2387 332 1859 -2102 203 2633
4630 2633 -1942 -1677 3468 79 -2715 1627 1520 -2322 654 1639 -2303 8 2925 -2085 -1863 2813
4646 2813 -203 -2646 1567 537 -2424 1478 1440 -3401 347 3281 -2132 -2167 2563 -14 -1688 1889
4662 1889 187 -2350 1890 1502 -2961 168 2882 -1672 -1612 2504 -722 -1448 2263 44 -2651 2133
4678 2133 1782 -2928 -17 2670 -1602 -964 2220 -996 -1287 2777 -26 -2999 2006 1800 -2531 336
4694 336 1804 -1845 -290 2479 -1776 -1561 2913 -137 -3160 1555 1374 -2505 114 1536 -2037 31
4710 31 2351 -2295 -1775 3005 256 -3013 1603 1155 -1730 894 1556 -2069 259 2869 -1562 -1561 2927
4727 2927 229 -2183 1548 503 -2120 1627 1563 -2712 -203 3135 -1540 -1514 2188 -51 -1267 1767
4743 1767 141 -2328 1850 1816 -2689 82 2758 -1377 -1613 2317 -806 -1542 2490 56 -2354 2001
4759 2001 1716 -2672 -273 2028 -1552 -721 1757 -1305 -1325 2557 122 -2999 1736 1590 -2661 -177
4775 -177 1607 -1918 -48 2086 -1713 -1324 2623 42 -2768 1357 1286 -1926 673 1585 -2190 197
4791 197 2629 -1833 -1873 2696 298 -2234 1398 620 -1708 1062 1131 -2472 64 2823 -1738 -2011 2513
4808 2513 152 -1934 1799 392 -2128 1410 1483 -2619 -101 2642 -1545 -1539 2213 -365 -1551 1747
4824 1747 58 -2539 1437 1477 -2807 -139 2313 -1022 -1094 2040 -1133 -1462 2145 177 -2676 1647
4840 1647 1885 -2138 58 1767 -1187 -706 2043 -1368 -1173 2998 286 -2502 1473 1695 -2264 203
4856 203 1486 -1611 138 2246 -1549 -1586 2662 308 -2507 1226 1280 -1735 431 1470 -2244 167
4872 167 2471 -1544 -2102 2322 296 -2320 1333 390 -1885 1277 1198 -2679 -126 2552 -1442 -1561
4888 -1561 1939 45 -1721 1651 306 -2127 1765 1684 -2324 -250 2601 -998 -1550 2291 -202 -1456
4904 -1456 1908 -106 -2403 1386 2012 -2503 -208 2341 -1234 -961 2039 -508 -1526 2224 240
4919 240 -2564 1037 1795 -2080 -211 1513 -1256 -390 1702 -1369 -1618 2191 412 -2857 1295 1176
4935 1176 -1935 53 1176 -1794 -87 2461 -1196 -1833 2350 122 -2251 901 1007 -1526 785
4950 785 1443 -1735 140 2484 -1418 -1915 2204 154 -1717 1073 436 -1601 962 1511 -2401 -248
4966 -248 2622 -1029 -1483 2086 -16 -1479 1503 158 -1946 1356 1924 -2468 -181 2066 -1356 -1135
4982 -1135 1673 -515 -1280 1563 -35 -2627 1172 1266 -1987 -266 1727 -1009 -717 1800 -754 -1338
4998 -1338 1815 307 -2861 834 1588 -1806 -271 1514 -1172 -332 2106 -1665 -1499 2441 641 -2183
5014 -2183 1096 1393 -1478 417 1281 -1918 65 2130 -1295 -1407 2117 490 -1891 894 835 -1482
5030 -1482 657 1296 -2007 -289 2412 -1291 -1770 2003 198 -1601 911 471 -1758 1105 1255 -1812
5046 -1812 -326 2293 -1041 -1264 1438 -48 -1283 1479 119 -2407 1199 1729 -1922 -453 1803
5061 1803 -952 -1065 1266 -661 -1172 1888 187 -2169 1262 1522 -1775 -382 1793 -746 -322 1707
5077 1707 -1079 -1245 2237 204 -2322 1110 1400 -1557 315 1094 -1373 -201 2293 -1012 -1788 2231
5093 2231 422 -2144 665 943 -1224 470 948 -1595 -392 2201 -1338 -1491 2007 682 -1371 1236
5109 1236 293 -1213 1131 1077 -1888 -188 2200 -951 -1528 1880 70 -1129 1285 316 -1661 826
5125 826 1446 -2093 -46 2454 -648 -1168 1187 -183 -945 1402 231 -2087 980 1485 -1726 -364
5141 -364 1754 -749 -900 1614 -759 -1533 1692 436 -2057 996 1516 -1481 -586 1273 -1048 -474
5157 -474 1777 -937 -1434 2037 101 -2016 804 1213 -1488 -6 1227 -1368 -6 1804 -682 -1207
5173 -1207 1706 592 -1874 740 776 -1359 555 1120 -1550 35 2124 -1077 -1510 1785 170 -1314
5189 -1314 1211 634 -1549 1079 1420 -1900 -349 2126 -813 -1394 1450 260 -1432 1169 -314 -2162
5205 -2162 800 1585 -1899 -998 1943 -724 -1063 1169 -521 -1124 1611 705 -2038 1143 1420 -1864
5221 -1864 -330 1361 -938 -519 1513 -900 -1302 1702 690 -2180 1030 1062 -1488 -178 1221 -914
5237 -914 -490 1645 -1018 -1194 1875 483 -1615 515 1402 -1298 315 1246 -1713 -242 1961 -1156
5253 -1156 -1562 1817 795 -1580 874 655 -1054 235 1058 -1822 -468 1928 -883 -1274 1523 129
5269 129 -1311 893 392 -1232 578 1032 -1502 -652 1924 -482 -1350 1362 103 -905 1254 429
5285 429 -1703 827 1475 -1269 -530 2030 -648 -878 1248 -477 -1216 1329 246 -2080 675 1429
5301 1429 -1485 -300 1585 -807 -361 1449 -746 -1318 1733 585 -1900 781 1656 -1146 52 915
5317 915 -1177 57 1637 -1076 -1546 1504 330 -1817 302 1284 -1188 232 921 -1492 -422 1892
5333 1892 -711 -1648 1586 442 -1450 671 426 -1277 699 1245 -1796 -322 2498 -711 -1122 1419
5349 1419 301 -1054 930 386 -1663 864 1498 -1610 -445 1876 -236 -1244 1178 221 -1195 1165
5365 1165 280 -1780 468 1316 -1737 -621 1619 -530 -449 1361 -687 -1162 1637 581 -1928 589
5381 589 1351 -1315 -359 944 -784 -547 1539 -736 -1280 1615 515 -1802 765 1089 -1072 -101 1070
5398 1070 -1368 -223 1766 -805 -1407 1701 474 -1537 652 1005 -1173 295 1038 -1768 -418 1794
5414 1794 -324 -1332 1071 836 -1012 650 503 -962 793 1313 -1669 -444 1922 -322 -1093 1050
5430 1050 125 -1255 1052 379 -1768 370 1549 -1456 -495 1767 -344 -955 943 -391 -1266 1299
5446 1299 473 -1857 422 1594 -1451 -262 1287 -787 -525 1437 -550 -999 1692 497 -1809 432
5462 432 1104 -1069 -292 1154 -1218 -360 1501 -692 -1603 1277 581 -1536 402 1051 -1160 -46 979
5479 979 -1228 -245 1361 -724 -1411 1359 356 -1614 297 744 -1517 563 1204 -1407 -301 1633
5495 1633 -581 -1368 942 249 -908 738 714 -1240 659 1322 -1572 -595 1874 -209 -1283 1279
5511 1279 -279 -1058 1218 40 -1702 489 1364 -1377 -415 1276 -335 -666 1229 -797 -1089 1391
5527 1391 301 -1635 500 1176 -1200 -585 1291 -752 -798 1433 -1001 -994 1610 370 -1705 389 1250
5544 1250 -1446 -304 888 -840 -224 1587 -862 -1633 1562 717 -1456 491 770 -1046 363 714
5560 714 -1333 -640 1943 -720 -1434 1393 683 -1183 726 703 -1281 494 1101 -1388 -274 1361 -389
5577 -389 -1274 1034 383 -1146 1154 261 -1424 533 1298 -1171 -511 1399 -547 -836 1338 106 -1182
5594 -1182 1402 283 -1674 420 1330 -1067 -520 1358 -400 -699 1241 -273 -1232 1001 576 -1899
5610 -1899 388 1026 -1319 -518 1173 -744 -452 1289 -535 -1176 1268 618 -1350 454 1137 -954
5626 -954 -171 1458 -553 -228 1865 -564 -1431 1477 613 -1321 390 775 -1173 388 1105 -1022 -544
5643 -544 1887 -194 -1509 1294 343 -1316 579 578 -1410 414 1123 -1403 -859 1569 -417 -1134 733
5660 733 128 -1263 1120 239 -1462 714 1508 -1386 -941 1217 -408 -901 999 -137 -1388 1173
5676 1173 792 -1834 469 1396 -1122 -703 1630 -439 -745 1245 -328 -978 1509 978 -1453 300
5692 300 1565 -800 -398 1407 -1037 -449 1506 -533 -1468 1520 865 -1495 365 1055 -615 330 912
5709 912 -888 -390 1524 -646 -1036 1083 477 -1095 525 827 -1047 589 1097 -1252 -777 1650 -566
5726 -566 -1488 927 330 -1071 533 334 -1430 398 1342 -1078 -733 1787 -310 -1040 779 -71 -995
5743 -995 925 489 -1619 654 1425 -857 -395 1224 -53 -592 994 -507 -1291 1206 547 -1816 500
5760 500 1332 -1100 -441 986 -907 -701 960 -529 -1182 880 567 -1376 251 747 -1008 -98 1027
5777 1027 -1337 -596 1419 -347 -1423 1082 503 -1639 148 687 -887 205 934 -880 -262 1693
5793 1693 -452 -1507 1007 265 -1235 670 600 -1087 433 1495 -1097 -735 1548 -449 -1294 905
5809 905 204 -1414 877 610 -1673 584 1272 -1025 -900 1825 -190 -984 1151 -69 -996 846 413
5826 413 -1606 573 1393 -870 -586 1135 -335 -801 1550 -398 -1402 1168 759 -1594 29 1069
5842 1069 -752 -210 988 -644 -370 1462 -373 -1512 1169 783 -1553 97 1073 -887 -136 1066
5858 1066 -1120 -399 1470 17 -1222 985 470 -1043 857 749 -1252 89 1155 -872 -863 1276
5874 1276 -275 -1231 878 793 -1179 697 663 -1249 332 1195 -1116 -734 1353 -198 -1201 719 137
5891 137 -877 872 491 -1760 70 1410 -989 -1165 941 120 -835 1359 -318 -1379 1304 512
5907 512 -1626 -127 1348 -695 -662 997 -744 -611 1118 -36 -1103 1525 814 -1339 425 1128
5923 1128 -770 -187 1082 -679 -370 1074 -263 -1403 1139 675 -1327 213 821 -743 -81 857
5939 857 -1167 -806 1515 -88 -1500 975 498 -1230 250 463 -1086 376 921 -1359 -575 1646
5955 1646 -220 -1155 841 152 -1047 411 369 -1371 159 1551 -1069 -737 1610 -80 -784 976
5971 976 -291 -953 804 829 -1821 330 1428 -852 -687 1326 -277 -1025 825 -52 -1373 1365 838
5988 838 -1367 114 1132 -847 -509 1283 -302 -714 1277 -475 -1540 1153 809 -1769 247 1164
6004 1164 -778 -207 1192 -660 -759 1453 57 -1279 1051 984 -1489 225 774 -1077 22 1259
6020 1259 -1042 -721 1539 -209 -1366 783 620 -727 549 716 -1353 125 1221 -1323 -881 1484
6036 1484 -293 -1074 700 236 -795 434 503 -1323 433 1485 -912 -776 820 -64 -873 893 -440
6053 -440 -1049 980 690 -1758 203 1293 -814 -797 1051 -153 -523 1018 -134 -1009 881 723 -1442
6070 -1442 193 1076 -687 -322 835 -496 -350 1373 -260 -1151 970 874 -1378 161 1087 -838 82
6087 82 814 -1036 -569 1495 114 -1168 584 622 -1536 447 745 -1147 140 1239 -1014 -861 1191
6104 1191 -435 -1426 505 530 -1020 784 727 -1455 128 1161 -871 -896 1276 18 -758 752 154
6121 154 -1085 479 509 -1426 176 1457 -928 -827 987 -25 -547 995 -329 -1129 1177 609 -1411
6138 -1411 179 1412 -613 -406 818 -399 -442 1286 -370 -1200 1124 956 -1116 16 1034 -523
6154 -523 12 768 -670 -484 1173 23 -1386 443 977 -953 124 860 -681 -157 1053 -720 -926
6171 -926 1209 -354 -1388 418 559 -1009 593 778 -870 223 1363 -1139 -492 1189 -116 -960
6187 -960 543 180 -844 813 621 -973 51 1368 -665 -740 1128 126 -804 752 266 -948 793
6204 793 719 -1422 222 1252 -698 -612 1263 -312 -555 859 -32 -1027 545 623 -1183 -44 1187
6221 1187 -722 -803 869 -502 -627 1185 -117 -1459 741 648 -1447 -49 905 -629 -234 958 -1025
6238 -1025 -907 1180 -39 -1364 831 890 -971 186 807 -1170 -95 714 -929 -521 1108 -28
6254 -28 -1204 805 914 -863 618 663 -1078 -409 1005 -738 -581 1332 -304 -902 739 684 -1203
6271 -1203 603 399 -1054 290 1160 -728 -889 1004 -206 -720 683 197 -914 809 511 -1188
6287 -1188 -119 1147 -520 -540 718 -239 -525 1117 35 -1180 997 812 -1369 126 1111 -312
6303 -312 -445 1076 -337 -887 1049 34 -1075 659 751 -894 234 624 -604 -184 916 -567 -334
6320 -334 1298 -95 -1115 733 710 -1112 244 662 -633 -212 949 -765 -877 1060 -8 -1248
6336 -1248 443 660 -740 430 481 -1241 87 1330 -916 -636 895 115 -1141 591 210 -959
6352 -959 580 589 -1002 223 1204 -548 -612 787 115 -731 1041 -17 -1318 864 912 -1030 -32 1119
6370 1119 -667 -402 885 -228 -523 990 -23 -1045 895 843 -934 -126 777 -840 -401 686 -366
6387 -366 -888 1254 258 -1267 920 867 -1200 -168 640 -929 -45 678 -695 -412 1149 -92 -1166
6404 -1166 451 393 -1163 130 339 -885 290 1248 -459 -800 1033 309 -960 612 126 -756 623
6421 623 772 -774 277 1251 -550 -724 1045 -83 -698 740 69 -873 570 795 -1309 -231 1438
6438 1438 -562 -669 701 -154 -667 914 295 -1112 792 631 -1068 -495 941 -430 -529 800 -548
6455 -548 -407 1027 49 -1402 838 881 -1144 -220 742 -754 -52 733 -663 -758 1154 -109 -1314 883
6473 883 630 -877 63 840 -794 201 1130 -373 -534 1249 256 -1082 584 288 -880 425 238
6490 238 -876 147 1257 -564 -707 1019 44 -666 563 432 -990 351 459 -1244 -155 825 -540
6507 -540 -643 911 -75 -584 741 58 -857 690 816 -1189 21 1228 -285 -587 780 -99 -63 711
6525 711 99 -1004 489 485 -952 302 705 -447 -195 876 -493 -565 895 14 -974 626 638 -1076
6543 -1076 -124 868 -567 -215 1146 -731 -592 777 -242 -1229 448 492 -677 85 607 -538 45
6560 45 834 -724 -797 904 109 -1009 381 586 -891 31 477 -1371 110 993 -450 -874 940 -184
6578 -184 -729 500 264 -1016 753 500 -1229 -174 941 -523 -768 642 -177 -341 574 -11 -760
6595 -760 668 588 -924 -94 1117 -274 -391 489 -207 -277 539 107 -954 874 851 -982 -195 670 -628
6614 -628 -144 700 -487 -406 1017 179 -1300 658 820 -1083 -333 695 -950 -399 1062 -732 -585
6631 -585 1025 -6 -1317 365 242 -654 407 398 -800 208 931 -984 -832 815 -32 -826 432
6648 432 119 -620 286 573 -937 -171 1044 -538 -586 1126 81 -576 929 64 -572 539 607 -1280
6666 -1280 87 757 -168 -365 502 -409 -321 536 -294 -882 444 568 -997 -212 600 -551 -106 615 -112
6685 -112 -528 641 -141 -1273 401 751 -458 -89 553 -687 -84 712 -407 -310 968 165 -958 758
6703 758 510 -745 -66 227 -683 -231 759 -807 -581 1142 147 -815 713 290 -819 531 426 -791
6721 -791 -11 1054 -364 -582 711 319 -761 516 226 -541 633 421 -753 106 834 -440 -491 515
6739 515 214 -466 422 -10 -592 554 449 -794 208 1030 -423 -211 739 -309 -522 708 -206 -789
6757 -789 850 870 -707 -366 1115 -296 -316 838 -385 -724 808 -66 -826 528 484 -707 81 632
6775 632 -635 183 668 -670 -568 791 -247 -997 4 693 -558 37 318 -610 -21 831 -337 -604
6793 -604 691 178 -919 517 343 -542 420 625 -947 -17 956 -421 -708 1041 -229 -766 452
6810 452 447 -525 381 485 -959 155 1192 -355 -544 651 -172 -300 617 -56 -668 838 685 -823
6828 -823 -115 909 -461 -480 472 -237 -440 484 -205 -1060 664 368 -927 -245 715 -389 -246 543 -442
6847 -442 -317 843 -180 -1029 470 598 -527 -165 471 -632 -62 640 -536 -214 1024 9 -834
6864 -834 47 574 -808 150 651 -649 40 984 -614 -473 935 304 -886 275 157 -498 68 290
6882 290 -515 -178 793 -462 -1069 839 -118 -762 538 84 -579 442 364 -718 -100 596 -528 -433 746
6901 746 -185 -529 638 -33 -515 495 609 -684 -336 765 -475 -207 599 -292 -103 900 -64 -773
6919 -773 308 434 -682 -277 699 -294 -227 519 -521 -400 1000 370 -993 644 336 -517 179 510
6937 510 -688 81 1026 -472 -670 531 199 -793 262 217 -922 158 496 -780 -10 904 -172 -453
6955 -453 725 245 -733 517 -8 -449 685 550 -1090 -270 628 -251 -650 459 -26 -216 632 -235
6973 -235 -648 314 368 -579 -145 978 -377 -292 935 -170 -319 670 149 -732 454 440 -951 -131 770
6992 770 -395 -265 676 -380 -293 712 133 -1318 493 525 -783 62 230 -922 -144 804 -341 -636
7010 -636 769 57 -738 489 493 -640 189 456 -685 -118 630 -501 -648 829 223 -742 231 9 -750
7029 -750 336 435 -633 -187 967 -610 -691 612 -11 -585 407 -164 -612 834 309 -556 -164 1040
7047 1040 -122 -609 444 -78 -584 421 -227 -687 285 723 -779 -102 712 -505 -530 466 -418 -427 787
7066 787 -211 -619 576 652 -740 -326 471 -379 -49 610 -690 -277 940 -10 -958 627 506 -681
7084 -681 192 443 -549 -132 762 -470 -230 749 -242 -698 225 496 -785 36 329 -418 -65 884 -319
7103 -319 -549 794 -48 -619 375 223 -634 398 198 -872 66 978 -637 -421 622 -9 -792 647
7121 647 11 -676 103 359 -540 48 739 -226 -320 686 -118 -417 274 309 -908 411 499 -1077 -67
7140 -67 802 -313 10 566 -8 -248 804 45 -870 491 502 -855 -51 601 -291 -93 527 -267 -624
7159 -624 685 -5 -860 357 445 -598 298 451 -643 -113 615 -541 -515 838 -21 -673 291 449 -296
7178 -296 466 435 -848 -44 796 -473 -583 673 -73 -834 444 207 -670 143 296 -556 -111 780 -567
7197 -567 -488 575 -107 -398 379 -42 -718 367 488 -619 -70 508 -312 -292 595 -166 -438 361 -24 -687
7217 -687 314 611 -808 -4 815 -605 -176 666 -623 -313 1048 -149 -1116 479 469 -863 -26 683
7235 683 -491 73 550 -478 -335 522 16 -646 367 610 -463 -9 392 -609 32 730 -612 -376
7253 -376 778 213 -495 156 35 -535 251 507 -1122 346 623 -600 -445 670 249 -313 627 68
7271 68 -423 232 271 -874 130 630 -365 -410 451 76 -463 330 -167 -940 336 515 -958 -12 868 -215
7291 -215 -505 734 -469 -760 720 118 -747 519 899 -585 -138 516 -269 -264 490 -155 -417 854 156
7310 156 -996 482 936 -394 82 526 -637 -31 598 -632 -617 881 321 -614 97 736 -623 178
7328 178 358 -388 -210 629 -243 -631 486 329 -574 499 -100 -626 663 560 -548 -164 798 -450
7346 -450 -395 529 316 -494 588 61 -606 358 647 -881 -116 728 -630 -311 530 -254 -377 607 -105
7365 -105 -743 397 721 -914 -18 370 -501 -99 653 -438 -657 758 -75 -668 126 812 -615 141
7383 141 316 -307 -89 844 -550 -588 706 475 -541 208 313 -628 230 674 -749 5 701 -541 -500
7402 -500 498 -1 -616 95 84 -436 320 529 -758 100 448 -160 -584 654 155 -660 336 299 -653 310
7422 310 595 -568 -263 800 -366 -493 409 -307 -197 415 100 -649 681 678 -585 -228 786 -202 -374
7441 -374 400 -392 -614 817 -40 -780 290 448 -804 99 675 -309 -369 467 -496 -561 1014 -171 -918
7460 -918 258 662 -578 88 414 -305 -60 699 -555 -526 566 -108 -694 137 310 -729 172 404 -384
7479 -384 -127 790 -190 -536 798 159 -529 357 355 -456 472 348 -901 -100 813 -340 -499 962 33
7498 33 -560 573 -173 -637 632 570 -696 6 711 -445 -222 510 -118 -613 750 72 -890 239 841
7517 841 -860 -317 619 -645 -285 568 -204 -453 639 232 -630 170 535 -501 123 251 -384 47 559
7536 559 -340 -440 898 265 -660 286 537 -429 327 704 -356 -140 495 -437 -567 872 -42 -1005 15
7555 15 123 -625 208 457 -602 254 525 -484 -693 598 96 -366 430 -84 -901 318 372 -547 -366
7574 -366 881 -352 -669 374 -317 -484 154 -19 -901 438 421 -477 -259 827 -145 -307 421 -204 -429
7593 -429 573 73 -759 410 415 -796 -92 409 -244 -279 349 -441 -589 772 562 -497 500 326 -302
7612 -302 140 528 -312 2 535 -435 -204 532 306 -781 60 457 -643 -1 550 -416 -335 569 -254 -703
7632 -703 605 264 -527 95 508 -319 -115 819 -684 -241 701 -484 -456 873 111 -609 461 117 -521
7651 -521 334 651 -336 -284 891 -329 -410 646 119 -488 286 203 -718 320 473 -877 -187 474 -408
7670 -408 -510 397 62 -394 1081 -43 -708 352 929 -643 114 520 -261 -32 855 -213 -330 782
7688 782 64 -670 269 456 -309 -92 488 -213 -455 506 -324 -635 657 287 -625 230 145 -347 -100 327
7708 327 -555 -203 629 -248 -425 728 7 -662 399 190 -478 302 522 -352 6 485 -8 -464 661
7727 661 211 -479 294 348 -301 284 630 -539 -193 422 -630 -362 777 -190 -429 313 100 -668 140
7746 140 451 -506 -400 693 -151 -301 687 -266 -413 786 232 -612 456 600 -197 55 416 -34 -48
7765 -48 477 -89 -194 520 76 -691 191 490 -542 -22 532 -378 -231 582 -294 -474 889 87 -659 120
7785 120 165 -706 104 403 -590 -160 714 -272 -440 499 86 -725 205 365 -449 -56 440 -454 -234 446
7805 446 -168 -857 482 253 -365 404 255 -661 238 580 -827 -231 731 -167 -520 714 55 -578 362
7824 362 368 -528 269 480 -535 -57 707 -555 -193 419 -536 -443 216 -162 -794 112 640 -303 75 345
7844 345 -599 -288 339 -196 -700 374 298 -938 269 339 -410 -117 238 -492 -356 776 -425 -598 319
7863 319 56 -713 255 482 -443 296 561 -650 -225 861 266 -978 386 223 -275 303 350 -455 221
7882 221 538 -524 -135 763 -37 -534 498 243 -489 461 -1 -538 138 513 -545 -447 398 -223 -492
7901 -492 377 -113 -346 677 299 -846 69 291 -396 -239 424 -93 -178 501 -173 -350 535 37 -495 225
7921 225 469 -272 44 391 -225 -121 393 -70 -768 587 69 -582 12 399 -402 -17 571 -485 -129
7940 -129 632 -47 -731 381 237 -327 310 369 -454 143 701 -664 -213 655 -370 -500 449 138 -538
7959 -538 213 99 -875 342 703 -426 -295 438 -155 -343 541 -456 -536 447 372 -534 135 647 -291 -195
7979 -195 591 -82 11 647 50 -308 679 361 -425 390 445 -391 -267 514 -82 -161 402 -327 -428 754 282
8000 282 -468 254 876 -334 -49 693 -4 -329 605 -150 -486 511 302 -413 148 126 -460 5 436 -538
8020 -538 -430 762 -370 -979 327 33 -641 201 79 -615 148 403 -375 -101 596 -261 -298 493 196
8039 196 -380 257 12 -636 217 276 -503 -123 873 -82 -442 366 -91 -574 461 422 -487 -108 655 -761
8059 -761 -42 402 -454 -4 578 -307 -486 260 390 -511 -4 529 -318 -207 207 -246 -168 655 -256 -715
8079 -715 576 313 -347 257 154 -110 -41 512 -585 -136 684 -15 -539 505 623 -513 258 97 -712
8098 -712 108 643 -516 -159 1096 -237 -485 246 257 -295 232 153 -657 320 690 -689 -223 618 -157
8117 -157 -577 612 51 -518 645 91 -759 346 643 -698 -218 476 72 -691 305 -144 -484 445 271
8136 271 -555 202 692 -307 -417 370 -342 -217 526 -225 -559 356 -196 -614 163 493 -188 -279 322 -384
8156 -384 -146 566 -275 -501 644 643 -672 -56 422 -477 156 507 -427 -166 721 10 -694 458 194 -808
8176 -808 256 3 -619 299 501 -535 -441 713 -330 -431 -37 673 -508 362 288
8191B88
$$ Imaginary data points
##PAGE= N=2
##DATA TABLE= (X++(I..I)), XYDATA
0 0 0 0 0 0 0 0 -8 8 -8 8 -16 16 -16 24 -27 32 -40 45 -56 64 -73 85 -99 115 -131 150 -170 191 -217 246
30 246 -275 309 -345 387 -430 480 -534 591 -656 727 -806 892 -987 1093 -1213 1346 -1497
47 -1497 1671 -1868 2105 -2383 2722 -3141 3680 -4398 5403 -6916 9435 -14391 27775 -136754
61 -136754 -391009 -76188 -41604 -191589 -155670 -179056 -278054 -89318 -23902 -215923 -138199
72 -138199 48725 -101199 -123138 97974 53742 -56492 89979 82904 -23336 123822 138542
83 138542 -79528 28436 213633 15102 -95015 60232 19508 -44106 80317 -5431 -156130
94 -156130 21900 89658 -104379 -40946 102574 -46845 -72485 90950 19141 -39137 105888
105 105888 33579 -91990 96790 146313 -74824 -34680 104032 -9044 -22325 66274 -78443
116 -78443 -110081 94344 14261 -179417 -47650 19867 -124870 -59237 20865 -129527 -101218
127 -101218 47006 -72936 -115047 73227 20671 -112724 35877 82717 -48789 42696 115845
138 115845 -33129 25368 177011 29718 -32762 144744 91002 -43027 75295 81823 -53209
149 -53209 41183 92067 -78198 -39392 83687 -67874 -116970 48938 -11046 -121647 -1346
160 -1346 -10129 -123632 7161 61112 -114177 -63324 87697 -23179 -58512 79199 15503
171 15503 -51118 85916 48365 -82449 50467 110713 -58086 -27287 84906 -26203 -36914
182 -36914 81231 -23393 -94616 59752 31248 -104502 9461 68609 -60810 -9777 75849
193 75849 -43251 -23417 110860 4218 -61473 92947 61699 -62983 50366 89369 -48127
204 -48127 1641 72210 -53564 -32840 82973 -43327 -110511 40719 7229 -111610 -13853
215 -13853 6642 -102690 -17330 40510 -105850 -65747 82343 -23345 -84357 57087 29014
226 29014 -59563 48779 53924 -53285 45670 98697 -53119 -17921 117027 10664 -50218
237 -50218 59129 6301 -60969 58308 32328 -98700 4751 69713 -75554 -54816 56371
248 56371 -35465 -60541 47122 -22924 -78085 58225 36149 -88686 14424 75795 -54507
259 -54507 -24409 73563 -18423 -26818 74838 -11048 -64856 73065 44986 -84304 6552 60151
271 60151 -53068 -17038 53187 -47740 -33855 72203 -30467 -87508 58362 39496 -79505
282 -79505 6914 51421 -46385 5828 62359 -49983 -23235 94188 -7375 -69562 61536
293 61536 43170 -51616 30784 38984 -63797 13802 70282 -62550 -44287 74232 -18639 -75099
305 -75099 40087 9884 -68189 24504 18986 -85364 4359 64961 -64045 -42917 71233
316 71233 -12359 -52326 52163 8005 -52080 56021 39784 -73035 20436 86221 -37406
327 -37406 -25126 69023 -10368 -32790 60081 -5601 -60333 59646 38083 -84015 1311 66286
339 66286 -43673 -30037 44055 -36624 -37531 59763 -16972 -73084 50866 37626 -75457 -943
351 -943 50658 -41849 -8215 50890 -44015 -30302 78091 -6056 -70766 49898 40981 -62794
363 -62794 6407 44728 -40610 5151 55907 -48989 -33446 76119 -5386 -67308 40554
374 40554 27588 -54506 20161 34001 -55831 9600 64162 -53199 -42745 70625 -197 -56244
386 -56244 38359 16462 -49075 34809 33400 -65257 8408 69854 -44781 -40058 61214 -1954
398 -1954 -39832 45202 1808 -55916 43100 35295 -72267 96 64722 -39302 -35994 46669
410 46669 -16890 -35011 47297 -12843 -68484 41970 37671 -70474 -4823 56706 -32928 -22704
422 -22704 43738 -24090 -25145 61611 -6063 -62830 47780 46860 -52936 4550 49800 -30808
434 -30808 -5569 47237 -34817 -27521 69022 -2612 -68176 33895 37369 -48661 2350 29190
446 29190 -44841 -711 50544 -41512 -34198 64804 797 -58783 31809 27073 -41350 21399
458 21399 32554 -49295 6858 62426 -37113 -37816 57406 292 -50447 26629 7918 -46942
470 -46942 26909 24314 -66711 -5499 54868 -40380 -40789 44851 -7103 -37998 37628 5487 -43546
483 -43546 43139 40091 -54610 5786 67373 -17622 -16252 51735 -2509 -17135 55482 1658
495 1658 -51492 43259 41323 -58905 -9567 45075 -28418 -20360 31411 -32421 -34874 45654 -10996
508 -10996 -65146 28769 34361 -49136 -2340 36504 -28000 730 48608 -28304 -26641 62789
520 62789 9993 -47763 34659 36280 -36760 8808 30222 -38459 -1525 43436 -40322 -39696 48275
533 48275 -3408 -57101 17000 13309 -44330 9956 19271 -51305 1913 56261 -30451 -35011 50228
546 50228 8547 -31840 33102 13222 -35356 32672 32600 -50654 1089 55388 -31444 -40568 31483
559 31483 -11305 -38143 22326 -14200 -58844 23445 24511 -63958 -16775 40344 -26431 -21351
571 -21351 36506 -13820 -20221 56334 14558 -36914 44583 49373 -29648 16106 60667 -8321
583 -8321 74 48772 -8505 -13244 55033 -168 -54427 25633 29145 -46610 -8817 20258 -41419
596 -41419 -14625 31073 -39851 -43025 37945 -5274 -53366 20347 22576 -37485 8781 29721
608 29721 -30240 6730 48675 -28266 -27687 56408 14306 -36644 22121 14908 -30533 24675 25362
621 25362 -52964 -9021 48550 -22840 -33906 31792 -6397 -33186 30638 6493 -43392 23518
633 23518 33217 -39555 3837 53454 -18664 -20791 43762 2559 -21981 36771 2743 -42622
645 -42622 29616 32506 -48472 -11705 33005 -31462 -27248 24244 -28238 -41334 27936 -8917
657 -8917 -57872 16132 24653 -49230 -11440 31617 -22053 -7143 38267 -18534 -19316 59070 19311
670 19311 -37600 29038 41347 -14952 20838 38999 -23501 7946 59892 -8931 -26423 44681
682 44681 13324 -32953 23204 20641 -31539 12443 26135 -39169 -5729 44834 -25150 -40142
694 -40142 30399 3639 -34561 16404 3062 -42107 14785 26243 -47783 -17599 37071 -23745
706 -23745 -34908 26484 -5947 -35520 18956 221 -42253 19405 26411 -50615 -14619 46690
718 46690 -9362 -24146 23721 -6221 -15272 43415 6211 -45837 25872 45813 -27316 -5395
730 -5395 37277 -11962 -7157 36198 -14273 -27845 39585 6987 -48150 13958 30514 -35448
742 -35448 -13291 19170 -28707 -13719 27903 -30695 -41768 31705 4528 -48842 5031 15495
754 15495 -37043 -3103 21175 -33220 -11840 35635 -20807 -31639 37954 10585 -38984 11902
766 11902 21603 -20358 14112 23301 -33364 1834 54103 -10995 -34272 30957 16172 -19412
778 -19412 20336 9046 -29985 21747 34106 -35113 -11901 40748 -11438 -28032 23911 -279
790 -279 -24978 21405 2041 -40224 15658 28873 -41347 -19525 32340 -12489 -23184 20424
802 20424 -10927 -25977 28678 4607 -43167 12388 30095 -31499 -8725 32082 -13245 -12104
814 -12104 30871 -8259 -21381 37600 11964 -36640 19566 37458 -19844 90 30849 -11565
826 -11565 -269 37803 -12922 -25921 39315 16537 -35078 9604 22721 -23033 1255 17845
838 17845 -32723 -12293 33511 -19925 -39919 20595 5030 -35427 3920 4758 -34273 4455
850 4455 20524 -35923 -14585 35939 -10873 -29048 24521 7284 -23312 18519 12452 -26442
862 -26442 16662 31028 -27254 -6923 39774 -6346 -21662 24210 1905 -19984 24269 7586
874 7586 -34666 13966 30423 -30028 -13663 29709 -9858 -17555 22546 -7002 -21168 29983
886 29983 8111 -37873 12266 30379 -24714 -9501 23999 -14189 -9167 28178 -13899 -30178
898 -30178 28034 10042 -38241 3465 19091 -25854 -4106 19612 -24631 -11634 30660 -14559
910 -14559 -31393 26721 11049 -31255 9828 19421 -20614 7016 24794 -24160 -7185 38201
922 38201 -8093 -27583 26269 12364 -22967 13263 11122 -26917 9115 23800 -30869 -13537
934 -13537 33643 -9485 -28601 19445 3508 -22746 14249 5087 -31257 12560 28884 -28431
946 -28431 -12331 33909 -4185 -17558 22548 -866 -19174 25944 11509 -32460 11737 31731
958 31731 -22291 -10672 26272 -10284 -14534 22889 -8567 -25419 25392 9223 -36365 6764
970 6764 25049 -23840 -9169 20777 -17155 -11662 28281 -10270 -27833 26594 13056 -32195
982 -32195 6284 21289 -20646 9 21868 -20966 -8191 34134 -9167 -29528 24770 13470
994 13470 -27060 8020 15941 -21105 6934 24114 -24934 -10620 35438 -6511 -27843 21621
1006 21621 10285 -21288 13886 11653 -25887 9727 27234 -26741 -14410 32120 -4668 -23342
1018 -23342 18658 3401 -20800 17024 8014 -32124 7057 26586 -26037 -16105 26303 -6840
1030 -6840 -18826 18320 -4653 -24358 20327 9490 -34431 4913 27272 -20401 -11501 22691
1042 22691 -9554 -12107 23896 -6718 -24980 25353 15151 -30256 6097 26222 -16964 -4704
1054 -4704 21877 -14870 -10354 29422 -6183 -27933 23115 15158 -27637 3773 17420 -19968
1066 -19968 -332 20143 -22190 -12054 31962 -5860 -29383 19623 12645 -24002 6756 13340
1078 13340 -21794 5274 24907 -22856 -13343 32547 -2972 -26614 16570 7524 -21044 11559
1090 11559 9567 -27401 5695 26460 -24290 -17799 26296 -3694 -22001 14852 1132 -20038
1102 -20038 18149 11601 -29333 5669 29056 -17825 -12424 25744 -2255 -12289 22965 1321
1114 1321 -19299 23095 15491 -28042 4689 27508 -15309 -9202 20683 -9118 -11205 23284 -6576
1127 -6576 -28100 18875 14191 -29236 -561 19312 -16799 -5149 18188 -16445 -13217 26246
1139 26246 -5248 -27657 19294 15124 -24157 3186 16198 -17162 1382 20049 -21065 -13766
1151 -13766 29935 -2668 -27906 14132 11421 -20236 6279 10023 -23307 3700 24264 -20245
1163 -20245 -14021 28900 -45 -20800 17262 9006 -16271 14823 13628 -21940 8948 30822
1175 30822 -15353 -12942 26597 1290 -15464 16028 542 -19655 17128 12031 -29375 -153
1187 -153 22553 -19212 -15691 16671 -9971 -18013 15456 -5109 -25098 15726 10697 -29756 -910
1200 -910 21820 -14793 -9179 17262 -9753 -8794 25518 -2942 -24573 19589 17652 -22771 1239
1213 1239 18929 -12802 -860 19302 -15006 -11376 26600 -3288 -27328 15122 13821 -20914
1225 -20914 2850 12871 -17561 2518 21752 -20044 -14776 28040 225 -23419 14277 10808
1237 10808 -16950 9676 11551 -21921 4016 23819 -19353 -15091 25414 -945 -21175 12620
1249 12620 3480 -19366 11994 8841 -27562 1869 25294 -16633 -14227 21357 -1994 -14748
1261 -14748 17158 868 -18415 18623 13927 -24672 5070 27975 -12179 -10874 19646 -3892
1273 -3892 -9727 20126 -4244 -23659 18711 15551 -26438 -3459 17410 -14302 -7063 15031 -15406
1286 -15406 -13402 23149 -2787 -25539 15335 14074 -22171 1785 18323 -12330 285 20434
1298 20434 -12756 -8141 30113 1068 -23675 16033 15160 -16371 6035 13363 -18559 2376 22665
1311 22665 -17530 -15092 23690 -2870 -24265 12610 8041 -19784 5742 9016 -21982 3376
1323 3376 22148 -20909 -17483 23784 1004 -19295 11326 1257 -18626 14489 11233 -28669
1335 -28669 -2493 23022 -14523 -14101 17104 -6214 -15916 16596 -267 -22306 13382 12626 -24328
1348 -24328 1907 24769 -11142 -8215 20889 -3320 -7775 23911 1783 -20321 19518 19943 -17815
1361 -17815 2590 20484 -10901 -3109 19623 -11776 -13698 21201 -2069 -25560 12114 11164 -23767
1374 -23767 -2867 12045 -17124 -5045 15231 -17867 -14920 24324 269 -24978 11082 11499
1386 11499 -16329 6473 12633 -18306 2203 25621 -12798 -15036 22876 2414 -18868 12044
1398 12044 6304 -17304 9718 12122 -22401 -148 23847 -13775 -15645 19102 -581 -15164
1410 -15164 15331 3459 -18593 14343 15969 -21464 50 23316 -10626 -10542 18806 -3088 -12847
1423 -12847 16885 -157 -22214 12824 12938 -25862 -5293 18309 -12666 -11486 12434 -10747
1435 -10747 -13311 18764 -2905 -25511 11828 16236 -18839 -899 17002 -9600 -80 20087
1447 20087 -10232 -10542 26365 4828 -21102 12249 16539 -13322 3661 13102 -14925 -515 20343
1460 20343 -13858 -15820 20513 1488 -21563 8483 7855 -17545 4070 9859 -19235 -836 21719
1473 21719 -13310 -15204 20899 3247 -16771 10210 5214 -15705 10681 12364 -21332 -669
1485 -669 23474 -10989 -14834 16285 -1119 -14944 11976 840 -19112 12134 13493 -22598 -2762
1498 -2762 22019 -8582 -11561 14574 -3398 -9061 19682 1205 -20953 14243 18674 -18138 -2836
1511 -2836 17743 -8526 -4881 16423 -8050 -11737 19944 883 -23198 9817 13188 -18933 -2398
1524 -2398 13284 -12268 -3816 15816 -12349 -14286 20021 1778 -22429 8228 12621 -14664 2019
1537 2019 12056 -14154 -659 19528 -12712 -14405 20395 3246 -19191 8443 8611 -14200 5491
1550 5491 9968 -19194 -1620 21338 -11534 -15694 16999 2602 -14288 10113 3364 -16778 10574
1563 10574 13752 -20175 -1856 22210 -7822 -11596 16450 -452 -11975 14177 2227 -18390
1575 -18390 12085 14873 -19477 -2988 19338 -8137 -8957 13802 -5979 -11967 17174 1020 -21445
1588 -21445 10385 15180 -17966 -3290 14992 -10280 -5871 14287 -9421 -12330 19700 1665
1600 1665 -21875 9080 13537 -16028 -1320 12387 -12252 -1499 18108 -10781 -14196 20103
1612 20103 4186 -19469 7586 10581 -13338 4363 11565 -14766 -367 20738 -9911 -14880
1624 -14880 18648 4103 -16088 8924 7181 -13906 7855 12607 -17960 -2147 20874 -8701
1636 -8701 -14206 15591 1650 -13277 10915 3190 -17328 9206 13171 -20186 -4763 19120 -8492
1649 -8492 -13022 12792 -2926 -12401 12934 132 -20842 9547 14266 -19027 -4439 17350 -7198
1662 -7198 -7447 14187 -5922 -11324 18301 3251 -19755 10616 16920 -13582 -1380 15964 -7807
1675 -7807 -3246 16615 -8099 -12098 19733 4457 -19882 7062 12855 -13693 -796 10787 -13679
1688 -13679 -4037 16553 -10803 -15992 16792 3645 -18870 4959 7906 -13734 3067 10612 -15755
1701 -15755 -3015 19993 -8142 -15116 15039 3542 -14882 7154 5534 -14476 6773 12562
1713 12562 -17519 -4599 19095 -7377 -14233 12383 929 -12654 10790 3712 -16157 9125
1725 9125 15510 -16346 -4512 18917 -4640 -9335 13837 -555 -9080 15288 4183 -17832 9091
1738 9091 15938 -15155 -4874 15388 -6294 -7087 12898 -6562 -13155 15063 2694 -21615 4799
1751 4799 13219 -14033 -3779 11366 -9405 -4259 15035 -8042 -13882 16927 5791 -17668 6175
1764 6175 12465 -11112 1553 11844 -11629 -3059 17998 -6815 -14243 15147 5128 -15171 5283
1777 5283 7476 -12581 3360 10873 -15194 -4083 18905 -6017 -14125 12982 4525 -12267 7714
1790 7714 5458 -13059 7571 14451 -13792 -3888 19062 -3295 -11016 11995 1020 -10413 10398
1803 10398 3571 -16321 6720 13836 -15476 -6949 14534 -5588 -10013 9886 -4198 -11549 12724
1816 12724 3035 -18910 5082 13542 -13618 -5210 12497 -6632 -5582 12889 -5141 -12043 14862
1829 14862 4730 -18264 4431 12619 -10903 -2087 10361 -9389 -3254 15524 -7068 -14051 14139
1842 14139 5886 -15254 4711 9989 -9881 2785 11903 -10674 -2979 17884 -4592 -12650 14087
1855 14087 6277 -11981 6045 7179 -10905 4833 11246 -14984 -5543 17162 -5071 -14158 8786
1868 8786 1697 -11887 6182 2198 -16129 4044 11152 -15405 -6803 15140 -4349 -10740 9621
1881 9621 -224 -9814 10273 3394 -16315 6436 15271 -12053 -5668 13680 -3370 -5972 10982
1894 10982 -3605 -10913 13425 5303 -16496 4670 13309 -10719 -3774 11253 -6938 -5101 13502
1907 13502 -4761 -11662 14396 6210 -15723 3683 11708 -9306 -728 9962 -9434 -3035 15838
1920 15838 -5716 -13805 12021 5042 -14590 2832 6962 -11751 1351 9683 -12978 -4840 16291
1933 16291 -5182 -14564 10391 5038 -10752 5753 5820 -10941 6502 13425 -12779 -5515 17033
1946 17033 -1459 -10682 10035 2723 -8931 9106 3848 -14294 4535 12832 -13253 -7425 13384
1959 13384 -3356 -9613 8210 -2243 -10762 10026 3763 -16972 3464 13718 -10605 -5336 12359
1972 12359 -3409 -5690 11366 -2586 -10439 13292 5862 -16025 3977 13849 -8684 -3828 9733
1985 9733 -6388 -4237 12497 -5797 -13902 12645 7099 -14650 1366 8970 -9220 -510 9102
1998 9102 -10194 -4507 15223 -3696 -13672 11264 6890 -12371 2980 7208 -9534 2614 10466
2011 10466 -11938 -5552 16085 -2766 -13256 8396 3480 -10860 4603 4918 -12733 3219 11975
2024 11975 -11625 -6447 14280 -2297 -11230 8590 2970 -8480 7906 4657 -12779 5133 14042
2037 14042 -10922 -6765 12942 -974 -7443 8463 -1013 -9825 10150 5200 -15751 1311 11831
2050 11831 -9752 -6501 9467 -4295 -6493 9594 -3445 -11512 10585 5973 -14800 1458 11492
2063 11492 -6902 -2476 9614 -6032 -4424 13745 -1852 -12308 10272 7829 -11043 2922
2075 2922 9269 -7550 361 10318 -8319 -5091 14008 -2304 -12219 9498 6184 -10596 3172
2088 3172 5971 -9601 1571 10321 -10754 -6136 14019 -1705 -11836 7156 3194 -9548 5247
2101 5247 4230 -12076 2629 11999 -9856 -7281 12264 -658 -8867 6998 445 -8789 8373
2114 8373 5818 -12944 2303 13119 -7252 -5832 10479 -1875 -6055 9594 -469 -9328 9461
2127 9461 6930 -12457 1402 11537 -7012 -4392 8944 -4148 -5179 10671 -2094 -11751 9169
2140 9169 6943 -12778 -191 8968 -7115 -2027 8234 -6915 -5207 11954 -2243 -12583 8143
2153 8143 6646 -10728 915 6986 -7351 1045 9363 -9280 -5795 13470 -552 -12054 6678
2166 6678 5814 -7732 3771 5483 -9856 2114 11026 -9132 -7100 12647 46 -9862 6345
2179 6345 2417 -8128 5281 4041 -12218 1420 11428 -8715 -7946 10163 -902 -7470 6240
2192 6240 -470 -9252 7540 5280 -12808 1037 12033 -6623 -5764 9446 -1918 -5490 8418
2205 8418 -818 -9757 9155 6944 -12303 617 11048 -5472 -3733 7415 -4807 -4445 11104
2218 11104 -1909 -12160 7945 7470 -10980 -562 7213 -6578 -1251 7989 -7023 -5980 11959
2231 11959 -1008 -12052 6519 6189 -9578 828 5959 -8012 684 9681 -8020 -6769 12148
2244 12148 494 -10909 5778 4940 -7344 4188 5578 -9288 2125 12058 -7286 -6730 11705
2257 11705 969 -8323 6381 2851 -7530 6273 5429 -11529 365 11896 -7345 -7748 8717
2270 8717 -737 -7298 6294 -897 -10502 6372 5375 -13186 -1499 10368 -5974 -6275 7402 -2502
2284 -2502 -6155 8514 -1095 -11325 7342 8047 -10284 -320 10332 -4629 -2345 8846 -4033
2297 -4033 -5060 11599 550 -11001 7362 8618 -8422 179 7995 -5734 -779 9198 -6474
2310 -6474 -6284 11923 1265 -11035 5168 6200 -8260 1162 5290 -8569 -467 9679 -7373
2323 -7373 -8207 10451 341 -11207 3577 2699 -8856 2606 4500 -10845 -450 10687 -7351
2336 -7351 -8880 9276 431 -8563 5415 2197 -7958 6192 6740 -9985 193 12398 -4076
2349 -4076 -5879 9301 739 -4833 8698 1270 -8498 7766 8468 -10188 -1139 10811 -4033 -4564
2363 -4564 7735 -1949 -5386 8891 70 -11425 5389 7518 -9802 -1806 8142 -5215 -2996
2376 -2996 7414 -5107 -6654 9660 345 -11906 4872 7299 -8436 -1016 5954 -6491 -1456
2389 -1456 8477 -6075 -7469 10109 1643 -10615 4143 5872 -6939 1328 5721 -7695 3
2402 3 10898 -5259 -7189 10451 2785 -8079 4817 4129 -6692 4214 6146 -9287 29 11880
2416 11880 -4733 -7411 8640 1160 -6917 5240 1298 -8406 5413 6658 -10330 -1645 10360
2429 10360 -4450 -6397 6696 -1406 -6091 7006 682 -9499 5351 7417 -9629 -2440 8997
2442 8997 -4060 -4426 6745 -2704 -5418 8770 739 -10638 5167 7343 -8385 -2050 7138 -4612
2456 -4612 -1958 8169 -4348 -6152 9837 1445 -10616 4145 6723 -6523 609 6437 -5298
2469 -5298 -441 9430 -4881 -7110 9758 2653 -9411 3770 5084 -6189 2015 5568 -8042
2482 -8042 -1105 9984 -5282 -8003 8308 1429 -7674 4037 2471 -7449 3727 5758 -9961
2495 -9961 -1714 10528 -4127 -7029 7299 612 -6240 5535 1056 -8719 4823 7078 -9428
2508 -9428 -1693 9356 -3630 -5192 6496 -1960 -5835 7604 855 -9818 5106 8308 -8185
2521 -8185 -1815 8054 -3393 -3276 7003 -3039 -5392 9455 2127 -9932 4424 7751 -7245
2534 -7245 -969 6685 -4685 -1406 8032 -3975 -6645 9441 2241 -10110 3052 5587 -6310
2547 -6310 598 5143 -7092 -828 9547 -4841 -8152 7987 1880 -8621 3244 3973 -6772
2560 -6772 2578 5539 -8243 -1072 9974 -4409 -7302 7616 1894 -6326 4477 2463 -7358 4269
2574 4269 6494 -9182 -1902 9736 -3236 -6436 6532 162 -5486 6115 1324 -9072 4179
2587 4179 6912 -8848 -2671 8939 -2813 -4358 6606 -2273 -5496 7997 1356 -10289 3904
2600 3904 7892 -7270 -1927 7090 -4097 -2579 6980 -3542 -6447 8458 1980 -9980 3638
2613 3638 6855 -6812 -1132 5850 -5464 -1814 8026 -4876 -7648 8359 2743 -8938 2481
2626 2481 5178 -6117 1305 5802 -7030 -1660 9817 -3621 -7503 7984 2794 -7483 3102
2639 3102 3670 -6435 2812 6113 -8158 -1772 10237 -3233 -7668 6122 1418 -6058 4379 1440
2653 1440 -7920 3982 7165 -9114 -3443 9108 -2886 -6148 5614 -365 -5327 6415 1328
2666 1328 -9324 3896 7723 -8156 -3369 7833 -2700 -4093 6224 -2307 -6285 7562 1809
2679 1809 -10216 2580 7376 -6727 -1988 6593 -3502 -2163 7262 -3167 -6345 8677 2639
2692 2639 -9263 2933 7145 -5345 -256 5549 -4955 -1422 8944 -3463 -7469 7936 3613
2705 3613 -8222 2513 4869 -5805 1115 5304 -7186 -1982 9363 -3345 -8065 6772 2312
2718 2312 -7203 2550 2410 -7023 2436 5954 -7969 -2855 9467 -2227 -7237 5785 772 -5924
2732 -5924 4326 2133 -8258 3246 7534 -7382 -2618 8644 -1975 -5097 5649 -395 -5048
2745 -5048 6469 2215 -8452 3635 8026 -6262 -2696 7284 -2465 -3312 6743 -2101 -5749 7630
2759 7630 2908 -9431 2088 6698 -6212 -2178 5631 -4063 -2209 7232 -3394 -7640 7140 2777
2773 2777 -9389 1532 5276 -5320 -95 5303 -5890 -2219 8505 -2743 -7731 6648 3085
2786 3085 -7013 2891 4193 -5556 1463 5685 -6525 -2839 8870 -2565 -7275 6002 2422 -6106
2800 -6106 3304 3107 -6862 2856 6751 -7221 -3053 9053 -1312 -5853 5393 830 -5176 5066
2814 5066 2259 -8230 2777 7321 -6573 -3416 7162 -1871 -4951 5042 -2192 -6222 5723 1746
2828 1746 -9403 1834 7151 -6254 -3114 5925 -3174 -3203 6330 -2389 -6230 7105 3223 -8481
2842 -8481 2136 6685 -4723 -755 5988 -4350 -1531 8303 -2306 -7014 6974 3556 -7773
2855 -7773 1818 4538 -5554 313 5175 -5939 -2499 8192 -2799 -8025 5546 2521 -6926 2205
2869 2205 2961 -6419 2158 6014 -6971 -2841 8887 -1537 -6785 5383 1988 -5250 4054 2560
2883 2560 -6982 2815 7104 -7124 -3740 8072 -1514 -5739 5049 243 -5824 5236 2057 -8647
2897 -8647 2091 7086 -6305 -3617 6834 -2099 -3858 5466 -1579 -5728 6360 2872 -8823 1928
2911 1928 7164 -5337 -2374 5930 -3275 -2924 6676 -2479 -6780 6766 3339 -7868 1459 6341
2925 6341 -4625 -686 5249 -4858 -2176 8491 -1930 -6975 6730 3781 -6873 1917 4500
2938 4500 -5454 931 5904 -5702 -2425 8625 -1615 -7091 5269 2364 -6399 2147 2532 -6568
2952 -6568 1477 6208 -6677 -3853 7811 -1363 -6751 4509 1238 -5784 4189 2487 -7623 1675
2966 1675 7410 -6100 -4131 7069 -1031 -4952 5239 675 -5285 5813 3494 -8066 1757 7807
2980 7807 -4711 -3062 6732 -1548 -3124 6560 -646 -6106 6238 3606 -8216 604 6786 -4536
2994 -4536 -2363 5183 -3350 -2775 6551 -2105 -7897 5367 3552 -8040 -44 4743 -5148 -1418 4778
3009 4778 -5177 -3630 7572 -1840 -7936 4739 3638 -6620 1371 4172 -5282 841 6092 -5495
3023 -5495 -3322 8431 77 -6400 5347 3260 -5105 3218 3720 -6099 1946 7690 -4951 -3974 7987
3038 7987 -81 -5247 4655 1302 -5065 4312 3399 -7153 1711 7731 -4834 -4081 6431 -927 -4693
3053 -4693 4481 -145 -5783 4979 3883 -7907 515 6937 -4291 -3240 5140 -2128 -3548 5650
3067 5650 -1128 -6453 5534 3921 -7923 -5 5872 -3910 -1808 5217 -3268 -3015 6951 -914 -7396
3082 -7396 4960 4324 -6646 842 4887 -3954 104 5952 -4623 -2911 7951 -291 -7380 4557
3096 4557 3646 -5079 1857 3683 -5167 1236 6184 -5471 -3997 7374 -359 -6256 3443 2048 -5118
3111 -5118 2813 2578 -6823 797 6923 -4911 -4353 6548 -114 -5158 4257 845 -5308 4309 3224
3126 3224 -7080 833 7437 -3697 -3717 5975 -734 -3439 4652 -234 -5755 5011 4159 -7097 188
3141 188 6334 -4028 -2456 4862 -2263 -3170 6023 -772 -6517 4994 3997 -6723 -20 5410 -3447
3156 -3447 -1266 4976 -3609 -3058 7057 -620 -6739 4296 4117 -5751 703 4032 -4555 -233 5420
3171 5420 -4375 -3553 6714 -606 -6809 3438 2700 -5187 1740 3063 -5470 939 6021 -4697 -3946
3186 -3946 6634 406 -5339 4037 1997 -4601 3482 3465 -5977 1225 7026 -4152 -3736 6446 -212
3201 -212 -4140 4369 443 -5318 4458 3241 -7075 67 6562 -3869 -3630 5143 -1084 -3664 4707
3216 4707 -644 -5972 4285 3638 -7109 -132 5892 -3466 -2494 4554 -2444 -3844 6016 -753 -6772
3231 -6772 4225 4161 -5834 -57 4562 -4021 -1187 4818 -3632 -3207 6784 -403 -6372 4311 3877
3246 3877 -5288 729 3836 -4302 334 5529 -3897 -3940 6897 546 -5844 3660 2644 -4534 2555
3261 2555 3137 -5549 439 6507 -4453 -4305 6118 -133 -5082 3101 1385 -4848 3102 3113 -6407
3276 -6407 201 6799 -3892 -3971 5329 -831 -3942 4421 291 -5290 4031 3909 -6967 -712 5842
3291 5842 -3567 -3181 4832 -1534 -3380 5059 -402 -5919 3673 4073 -6450 -371 5632 -2722 -1662
3306 -1662 4847 -2458 -3255 6144 15 -6162 3778 4568 -5079 440 4350 -3203 -546 5811 -3378
3321 -3378 -3903 6384 357 -6187 2874 3258 -4591 1007 3088 -4686 -79 5937 -3981 -4317 6067
3336 6067 887 -5239 2867 2016 -4238 2122 3368 -5687 -101 6152 -3631 -4286 5165 69 -4844
3351 -4844 2965 746 -5333 2863 2972 -6240 -356 6253 -2658 -3933 4858 -425 -3330 4191 216
3366 216 -5118 3781 4233 -5651 -336 5920 -2435 -2136 4589 -1112 -2759 5372 170 -5799 3653 4391
3382 4391 -5300 -569 4567 -2699 -1500 4358 -2794 -3794 5596 -37 -6716 1970 3218 -4913 -332
3397 -332 3418 -4059 -752 4608 -3668 -4096 5890 799 -5722 2491 3082 -4012 1095 3330 -4626 -135
3413 -135 5712 -3279 -4069 5538 1318 -4645 2908 1920 -3760 2663 3271 -5370 -93 6290 -2562 -3897
3429 -3897 4654 631 -3769 3107 554 -4647 3388 3652 -5476 -606 6095 -2188 -3386 4160 -688
3444 -688 -3271 3708 -38 -5670 2919 3983 -5606 -995 4790 -2514 -2538 3728 -2115 -3222 4963 141
3460 141 -6257 2889 4041 -4762 -719 3948 -2778 -886 4462 -2612 -3274 5583 1060 -5661 2456
3475 2456 3818 -3559 628 3593 -3061 -86 4991 -3004 -3780 5595 819 -5338 1935 2550 -3837
3490 -3837 1123 2845 -4655 -269 5379 -2893 -4251 4419 716 -4467 2890 1275 -4195 2255 3067
3505 3067 -5225 -694 5544 -2430 -3591 4324 157 -3040 3347 546 -4864 2984 3290 -5230 -703
3520 -703 5444 -2099 -2499 3882 -1146 -2992 4260 343 -5248 3092 4291 -4648 -759 4462 -1916
3535 -1916 -1751 4147 -2334 -2756 4877 376 -5869 2562 4193 -4114 -470 3433 -2968 -788 4266
3550 4266 -2756 -3933 4651 631 -5480 1990 2880 -3592 543 2698 -4038 -283 4880 -2966 -4286
3565 -4286 5014 971 -4736 1784 1739 -3753 1352 2874 -4396 -426 5500 -2598 -3891 4010 711
3580 711 -3745 2664 840 -3735 2730 3415 -4823 -410 5549 -2000 -3092 3836 260 -2906 4080
3595 4080 744 -4550 3076 3979 -4725 -1047 4954 -1877 -2411 3623 -1273 -2634 4117 299 -5410
3610 -5410 2242 4079 -4345 -944 4032 -2168 -1445 3943 -2176 -3381 4692 888 -5386 2062 3478
3625 3478 -3652 -338 3074 -3069 -929 4249 -2773 -4213 4669 1214 -5049 1375 2625 -3751 405
3640 405 2638 -3873 -689 4897 -2423 -4053 4349 1549 -3757 2009 2061 -3474 1821 3593 -4146 -470
3656 -470 5748 -1532 -3327 3950 825 -2920 2729 761 -4105 1875 3764 -4919 -1138 4992 -1965
3671 -1965 -3430 2989 -577 -2920 3313 431 -5069 2118 3835 -4277 -1323 3862 -1991 -1887 3390
3686 3390 -1319 -3086 4605 1024 -4982 1657 3817 -3775 -887 3431 -2249 -1161 3910 -1779 -3150
3701 -3150 4544 1566 -4984 1482 3138 -3174 187 3004 -3067 -601 4585 -1856 -3644 4230 1569
3716 1569 -4149 1541 2320 -3044 1096 2976 -3802 -981 5108 -1879 -3899 3745 1261 -3423 1928
3731 1928 1562 -3868 1267 3072 -4469 -1579 4837 -1641 -3568 3253 453 -2833 2641 609 -4428
3746 -4428 1914 3630 -4093 -1551 4480 -877 -2627 2973 31 -2707 3501 1385 -4570 1868 3925
3761 3925 -3416 -1130 3696 -1390 -1596 3351 -1215 -3151 4045 1301 -4966 1235 3436 -3071 -892
3776 -892 2810 -2402 -986 3797 -1758 -3816 4264 1321 -4853 1258 2688 -2959 18 2740 -3525
3791 -3525 -1079 4598 -1747 -3887 3612 1523 -3912 963 1803 -2998 1089 3099 -3870 -961 5038
3806 5038 -1387 -3688 3172 1262 -2918 2411 1627 -3537 1944 4042 -3852 -1283 5263 -687 -2638
3821 -2638 3000 461 -2363 2873 1243 -4291 1631 4016 -3638 -1545 3941 -897 -2053 3123 -866
3836 -866 -2881 3474 1127 -5036 1504 4042 -2926 -1251 2935 -1993 -1604 3162 -1422 -3514 3556
3851 3556 1328 -4812 862 3045 -3073 -516 2779 -2375 -1161 4139 -1787 -3905 3877 1951 -4032
3866 -4032 640 2671 -2850 607 2924 -2968 -751 5005 -849 -3714 3420 1703 -3217 1615 1856
3881 1856 -2872 1173 3141 -3453 -1430 4811 -1203 -3494 2319 885 -3356 1939 992 -3849 1100
3896 1100 3732 -3674 -1911 4211 -1057 -2970 2319 76 -2756 3081 1206 -4370 889 3868 -3071
3911 -3071 -1835 3613 -1080 -2125 3091 -816 -3454 3902 1630 -4726 660 3523 -3043 -1316 3193
3926 3193 -1675 -1732 3533 -1554 -3985 3631 1756 -4506 945 3410 -2539 -332 2972 -2469 -1247
3941 -1247 4281 -1242 -3555 3392 2057 -3531 682 2013 -2726 358 2637 -3178 -1643 4452 -1353
3956 -1353 -3698 3056 1355 -3462 1234 1500 -3181 897 3398 -3343 -2005 4653 -102 -2997 2631
3971 2631 1003 -2965 2527 1341 -3953 1052 4168 -2940 -1708 3779 -486 -2556 2310 -229 -3174
3986 -3174 2719 1222 -4262 507 4129 -2930 -1685 3152 -1400 -1740 2800 -820 -3235 3361 1756
4001 1756 -4346 396 3494 -2650 -1217 3130 -1865 -1383 3582 -779 -3901 3210 2242 -3944 453
4016 453 2203 -2303 -328 2674 -2780 -1585 3947 -871 -4072 2409 1858 -3161 852 1910 -3188
4031 -3188 217 3205 -3066 -1670 4288 -398 -3614 2235 1272 -2530 1463 1583 -3307 888 3566
4046 3566 -3093 -1933 4145 -294 -2502 2490 575 -2594 2442 1649 -3892 789 3787 -2574 -2172
4061 -2172 3546 -243 -2361 2561 -428 -3347 2481 1580 -4387 277 3727 -2208 -2074 2823 -1521
4076 -1521 -1828 3026 -1068 -3634 3222 1682 -4371 40 3123 -2170 -987 2583 -1882 -1322 3818
4091 3818 -809 -3640 2879 2117 -3122 563 2348 -2327 69 3336 -2216 -1314 4090 -456 -3613
4106 -3613 2543 1725 -2916 1015 1866 -2607 705 3259 -2785 -1752 4174 -100 -3224 2251 944
4121 944 -2797 1954 1034 -3596 360 3138 -3256 -2571 3470 -589 -2990 2017 -103 -2938 2028 1335
4137 1335 -4109 324 3611 -2345 -2076 2965 -399 -1687 2781 -334 -3077 2912 2021 -3959 462
4152 462 3717 -1897 -752 2816 -1168 -1138 3219 -395 -3592 2908 2347 -3859 157 2592 -2275 -581
4168 -581 2547 -2422 -1489 3532 -1058 -3847 2546 1930 -3320 319 2586 -2412 228 2825 -2732 -1912
4184 -1912 3919 -342 -3708 2061 1500 -3059 882 1680 -3082 446 3400 -2558 -2044 3443 -177 -3192
4200 -3192 1913 747 -2533 1990 1735 -3566 676 3727 -2517 -2336 3159 -55 -2339 2652 86
4215 86 -2816 2586 2093 -3897 309 3100 -2399 -1857 3024 -821 -1622 3098 -614 -3329 2513 2101
4231 2101 -3867 -469 2902 -2008 -1139 2703 -1753 -1724 3627 -240 -3729 2186 2054 -3333 -46 2471
4247 2471 -2041 -306 2744 -1978 -1977 3653 -136 -3871 2186 1965 -2862 499 1983 -2709 -144 3369
4263 3369 -2385 -2261 3665 522 -3159 2066 1642 -2721 1810 1902 -3178 535 3652 -2324 -2177 3627
4279 3627 214 -2690 1898 696 -3210 1913 1698 -3625 79 3798 -2061 -2447 3047 -256 -2320
4294 -2320 2169 172 -3311 2108 2217 -3592 -74 3433 -2192 -1802 2497 -720 -2100 2658 -183
4309 -183 -3461 2258 2406 -3589 -420 3056 -1856 -940 2902 -1764 -1721 3293 99 -3430 2132 2292
4325 2292 -3050 223 2614 -2150 -545 3016 -1820 -2038 3784 -44 -3516 1703 2160 -2660 677
4340 677 2015 -2495 -178 3561 -2141 -2640 3367 191 -3007 1930 1308 -2647 1158 1974 -3217 -323
4356 -323 3372 -1908 -2522 3171 319 -2677 1619 219 -2718 1819 1943 -3813 -519 3801 -1599 -2166
4372 -2166 2768 -617 -2091 2450 384 -3212 2191 2400 -3407 -138 3451 -1320 -1484 2569 -699
4387 -699 -1856 2909 152 -3302 2290 2551 -3337 -676 2823 -1623 -829 2331 -1328 -1999 3530 382
4403 382 -3612 1729 2330 -2886 -94 2080 -2235 -546 3071 -1782 -2372 3377 478 -3469 1398 1632
4419 1632 -2534 1012 1982 -2813 -643 3249 -2069 -2471 2973 320 -2790 1373 885 -2386 1163 2010
4435 2010 -3270 -401 3620 -1343 -2429 2681 24 -2309 2092 538 -2834 1683 2512 -3204 -739
4450 -739 3220 -1529 -2105 2621 -219 -1806 2696 203 -3492 1909 2520 -3105 -755 2770 -1134 -1368
4466 -1368 2312 -1142 -2022 2836 170 -3670 1841 2681 -2799 -257 2272 -1635 -1108 2716 -1614 -2428
4482 -2428 3239 641 -3406 1257 2115 -2963 -45 1875 -2230 -231 3096 -1690 -2231 3093 643
4497 643 -3263 1454 1258 -2631 877 2141 -2688 -508 3588 -1585 -2555 2735 454 -2318 1385 948
4513 948 -2812 1595 2175 -3070 -365 3422 -1222 -2400 2145 31 -2074 1932 616 -2936 1931
4528 1931 2315 -3131 -761 2924 -1448 -2017 2263 -323 -1687 2721 447 -3578 1704 2392 -2869 -848
4544 -848 2918 -1350 -1232 2344 -993 -2141 2883 516 -3599 992 2398 -2449 -153 2573 -1660
4559 -1660 -1042 2806 -1447 -2360 2793 714 -3279 1110 2076 -2192 358 2023 -2459 -797 3103 -1783
4575 -1783 -2830 2840 827 -2786 888 1085 -2564 938 1729 -2768 -676 3565 -1118 -2838 2373
4590 2373 827 -2634 1677 1075 -2523 1468 2460 -2831 -772 3448 -972 -2174 2096 63 -2024
4605 -2024 2342 868 -2893 1602 2853 -2615 -935 3008 -1192 -1812 2077 -338 -2179 2480 616
4620 616 -3341 1075 2560 -2639 -838 2516 -1476 -994 2747 -1111 -2562 2601 461 -3623 887
4635 887 2084 -2495 -363 2114 -2043 -686 2802 -1378 -2602 2752 707 -3013 899 1639 -2250
4650 -2250 289 1890 -2419 -751 3479 -1053 -2591 2708 1216 -2240 1096 1143 -2203 819 2221
4665 2221 -2582 -1036 2983 -939 -2238 2159 273 -2209 1557 552 -2697 1018 2722 -2578 -1041
4680 -1041 3230 -560 -2044 1939 -112 -2012 1967 399 -3219 1167 2572 -2186 -1073 2050 -962
4695 -962 -1166 1977 -1028 -2128 2274 674 -3373 871 2416 -2284 -957 2036 -1061 -1217 2622 -1147
4711 -1147 -2204 2895 1211 -2848 998 2186 -1823 2 2131 -1536 -783 2922 -1164 -2340 2431
4726 2431 748 -2722 1029 1722 -2297 511 1638 -2410 -818 3477 -1137 -2436 2078 801 -2154
4741 -2154 1316 1000 -2148 858 2164 -2477 -887 3102 -797 -1994 1962 163 -2014 1568 751
4756 751 -3064 1113 2422 -2781 -892 2396 -921 -1457 1664 -229 -1736 1778 562 -2823 1065
4771 1065 2456 -2124 -869 2782 -981 -1084 1866 -518 -1825 2219 775 -2737 596 2388 -1413
4786 -1413 -577 1833 -1201 -792 2569 -1146 -2447 2387 1181 -2857 498 1583 -2015 12 1611
4801 1611 -2061 -762 2794 -1208 -2485 2365 913 -2260 968 719 -1872 531 2202 -2288 -725
4816 -725 3246 -467 -2518 1949 902 -1894 1228 759 -2294 999 2600 -2155 -786 2755 -424
4831 -424 -1680 1640 13 -1661 1910 1000 -2667 961 2412 -2108 -1148 2603 -643 -1503 1705 -311
4847 -311 -1726 2004 771 -2820 742 2339 -2291 -904 1919 -996 -939 1940 -815 -2126 2377 798
4863 798 -2717 113 2199 -1663 -220 1866 -1765 -788 2447 -917 -2256 2151 1328 -2284 767 1687
4879 1687 -1734 213 1998 -1670 -593 2885 -569 -2100 1882 903 -2162 851 1151 -1738 799
4894 799 2155 -2018 -735 2569 -700 -2211 1795 854 -1514 1204 616 -2290 1009 2309 -2050 -1416
4910 -1416 2248 -385 -1545 1806 -94 -1628 1413 671 -2462 830 2233 -1962 -1042 2057 -512
4925 -512 -1319 1859 -329 -1867 1826 907 -2602 639 2129 -1732 -691 1449 -661 -710 2080 -513
4941 -513 -1892 1755 1137 -2455 593 1813 -1224 211 1900 -1214 -363 2674 -532 -2276 2193 846
4957 846 -1958 222 1510 -1472 22 1715 -1932 -739 2823 -514 -2462 1419 603 -1887 773
4972 773 693 -1813 745 1928 -2022 -1557 2001 -490 -1741 1379 473 -1466 1475 893 -2205 326
4988 326 2173 -1679 -1028 2215 -681 -1515 1378 130 -1854 1720 983 -2830 750 2388 -1703 -726
5004 -726 2039 -669 -1238 1974 -368 -1973 1537 1044 -2289 333 2038 -1358 -781 1481 -835 -995
5020 -995 2027 -502 -2105 1475 1153 -2472 313 1484 -1612 -395 1547 -1565 -824 2082 -248 -1911
5036 -1911 1487 839 -1829 428 1101 -1519 317 1964 -1753 -817 2272 -191 -1811 1163 824 -1460
5052 -1460 636 536 -1817 547 1864 -1729 -1514 1875 -279 -1533 1142 179 -1504 1361 613 -2175
5068 -2175 260 1813 -1506 -1050 2100 -317 -1184 1583 -327 -1704 1390 809 -2061 377 1985 -1043
5084 -1043 -574 1550 -1022 -849 1702 -699 -1939 1791 971 -2178 81 1741 -1073 -413 1694 -1221
5100 -1221 -821 2077 -474 -1855 1493 1166 -1829 320 975 -875 -36 1625 -1321 -720 2247 -555
5116 -555 -1833 1286 965 -1550 811 733 -1739 422 1437 -1547 -538 2385 -438 -1624 1515 326
5132 326 -1625 1164 786 -2222 532 1991 -1605 -1092 1611 -387 -1189 970 75 -1797 1301 940
5148 940 -2274 478 2012 -1327 -921 1835 -376 -780 1683 -212 -1618 1725 981 -2101 105 1766
5164 1766 -1103 -712 1361 -971 -1150 2154 -364 -2064 1548 1079 -1844 402 1618 -1393 -121 1365
5180 1365 -1276 -889 1971 -613 -1920 1433 999 -1623 484 1035 -1274 60 1274 -1501 -1127 1878
5196 1878 -253 -1784 1164 546 -1719 565 694 -1701 175 1543 -1574 -1333 2257 -223 -1526 1150
5212 1150 197 -1512 1012 583 -1854 529 2352 -1435 -760 1687 -148 -1204 1283 -178 -1344 1109
5228 1109 1034 -1777 272 1994 -1168 -1179 1436 -412 -930 1629 -398 -1577 1652 1162 -1696 6
5244 6 1729 -1344 -313 1316 -926 -779 1558 -365 -1924 1264 668 -1948 -75 1107 -1251 -9
5260 -9 1144 -1293 -1361 1803 -348 -2046 1057 652 -946 627 850 -1169 367 1720 -1407 -741 2091
5277 2091 8 -1203 1320 426 -1002 602 797 -1472 470 2170 -1812 -1292 1749 -80 -1395 863
5293 863 229 -1160 1072 810 -1705 362 1847 -1486 -741 1457 -288 -1004 1245 -91 -1361 1312
5309 1312 1119 -2035 -33 1625 -1031 -1074 1397 -855 -893 1516 -698 -1520 1242 1018 -1801 197 1291
5326 1291 -1154 -632 1166 -1025 -654 1598 -182 -1779 1252 1175 -1316 135 987 -1228 178 1607
5342 1607 -1193 -777 1922 -95 -1446 1243 845 -1247 187 876 -1439 256 1631 -1525 -1508 1921
5358 1921 53 -1374 937 580 -1264 577 806 -1700 93 1658 -1181 -820 1329 -168 -1320 1185
5374 1185 -61 -1060 1166 708 -1735 5 1615 -865 -810 1247 -642 -849 1257 -112 -1465 1225
5390 1225 911 -1668 -358 1936 -857 -240 1192 -738 -416 1607 -616 -1963 1354 948 -1612 -21
5406 -21 1278 -1179 -256 1337 -1210 -978 1692 -184 -1872 906 898 -1578 292 862 -1083 -94 1321
5423 1321 -1167 -913 1767 -353 -1682 746 440 -1255 283 765 -1204 -27 1760 -1279 -1125 1537
5439 1537 364 -1083 884 155 -1123 731 902 -1577 142 1831 -796 -1116 1289 -91 -948 955
5455 955 62 -1252 1325 946 -1815 -19 1449 -1129 -786 1405 -308 -537 1308 -183 -1462 1153
5471 1153 754 -1694 -301 1438 -1049 -476 1078 -665 -671 1861 -541 -1536 1125 1028 -1303 121 1177
5488 1177 -1023 -67 1384 -939 -1304 1839 152 -1729 786 1168 -1357 306 655 -1222 -134 1504
5504 1504 -1033 -889 1576 143 -1318 861 508 -1012 648 766 -1335 280 1649 -1481 -742 1665
5520 1665 -55 -1329 878 13 -1120 692 914 -1755 227 1955 -1047 -1150 1289 -179 -753 802
5536 802 -296 -1500 1050 972 -2035 -342 1448 -712 -712 1302 -776 -579 1553 49 -1742 1155 1091
5553 1091 -1552 -62 1161 -752 -250 1402 -676 -506 1552 63 -1764 853 1178 -1171 -82 1163
5569 1163 -813 45 1491 -1114 -840 1795 26 -1556 974 664 -1411 391 1003 -1394 81 1604
5585 1604 -1162 -1230 1300 107 -1105 676 342 -1230 726 753 -1365 156 1440 -886 -1159 1428
5601 1428 199 -649 806 -200 -1283 1012 1056 -1857 -104 1737 -673 -937 1205 -43 -692 1372
5617 1372 -54 -1471 1010 1101 -1389 187 1484 -606 -575 1152 -423 -575 1403 -30 -1525 1121
5633 1121 1472 -1164 -293 1074 -1305 -264 1308 -700 -718 1448 160 -1646 842 953 -1486 429
5649 429 767 -1123 16 1099 -1068 -665 1457 349 -1440 531 682 -1124 243 722 -1176 -107
5665 -107 1522 -785 -1228 1155 326 -1356 719 444 -1430 607 1146 -1522 -137 1506 -791 -697 1298
5682 1298 61 -1193 1015 479 -1272 879 1245 -1496 -73 1459 -807 -693 1095 -582 -1172 1139
5698 1139 358 -1407 938 879 -1608 -169 1282 -966 -711 994 -518 -970 1283 42 -1676 707
5714 707 823 -995 -111 1103 -751 -7 1225 -815 -968 1626 66 -1487 868 780 -971 297 1060
5731 1060 -1081 -109 1736 -1020 -1147 1775 317 -1358 506 839 -967 209 773 -979 -227 1494
5747 1494 -951 -939 1258 110 -1098 814 115 -1249 875 780 -1609 41 1627 -647 -1219 1178
5763 1178 -220 -1020 1042 -219 -1227 894 1003 -1747 -369 1310 -824 -414 763 -419 -556 1356
5779 1356 358 -1527 1048 815 -1164 -2 956 -631 -416 1453 -603 -970 1819 373 -1566 860
5795 860 1052 -1045 140 1174 -661 -125 1469 -737 -1027 1259 338 -1366 877 508 -1135 200
5811 200 812 -1300 -106 1469 -869 -1155 1534 14 -1048 641 125 -1090 246 799 -1713 -291
5827 -291 1342 -722 -1088 1012 -74 -1279 1086 192 -1307 884 1001 -1250 -253 1638 -593 -607 1094
5844 1094 -425 -839 1148 250 -1704 835 1374 -1468 -467 1336 -875 -433 1089 -574 -896 1592
5860 1592 398 -1584 921 1075 -1218 -19 641 -800 -166 1216 -854 -851 1605 46 -1682 460
5876 460 1082 -1349 -326 925 -980 -156 1571 -744 -1030 1359 273 -1397 352 624 -913 595
5892 595 757 -1372 -449 1498 -736 -975 1330 360 -1141 568 469 -1308 859 835 -1425 -68 1797
5909 1797 -374 -705 1259 70 -645 1098 401 -1262 537 763 -1188 -363 1353 -661 -606 1003 -470
5926 -470 -908 1001 84 -1627 629 1275 -1119 -222 939 -684 -552 1235 -327 -1119 1286 202 -1609
5943 -1609 477 1169 -1288 -55 1093 -1034 -215 1662 -672 -1127 1243 -1 -1587 625 1070 -1046
5959 -1046 117 1112 -1014 28 1600 -601 -1174 1461 352 -1281 468 670 -1049 649 1238 -1172
5975 -1172 -23 1734 -650 -1069 998 183 -1206 814 297 -1196 636 1031 -1377 -22 1367 -506
5991 -506 -1010 846 -201 -1110 945 217 -1268 591 997 -1258 -502 1056 -703 -543 910 -509 -805
6008 -805 1333 133 -1503 344 1311 -1216 -343 1356 -853 -238 1297 -255 -980 1278 247 -1386
6024 -1386 508 1053 -780 -348 987 -850 -178 1286 -507 -986 1073 102 -1199 425 801 -1021
6040 -1021 -43 911 -1227 -234 1385 -767 -1080 1104 551 -1148 587 297 -1213 624 937 -915 -391
6057 -391 1635 -440 -1103 1057 152 -939 631 192 -1204 758 1119 -1283 17 1432 -209 -911
6073 -911 760 -107 -832 1177 441 -1242 529 1268 -792 -533 1297 -383 -579 807 -555 -848 1000
6090 1000 111 -1436 289 1300 -1336 -469 1063 -674 -293 1101 -601 -971 1035 325 -1693 651
6106 651 1054 -862 240 925 -1082 -357 1118 -543 -1286 1362 484 -988 554 455 -1082 201 843
6123 843 -1087 -411 1389 -322 -1239 1274 261 -1056 507 509 -1092 451 954 -1399 -611 1216 -505
6140 -505 -985 790 -19 -1128 763 267 -1265 343 1182 -1311 -41 1286 -588 -846 840 -317
6156 -317 -793 680 139 -1184 588 918 -961 -483 1026 -554 -729 1009 -226 -757 1385 220 -1236
6173 -1236 629 959 -841 -100 892 -539 -298 1385 -543 -1021 1082 468 -1515 260 963 -884 406
6190 406 1015 -853 -300 1378 -470 -1064 1123 713 -1560 570 400 -1063 246 886 -859 -272 1187
6207 1187 -464 -1156 918 136 -942 690 350 -1333 677 990 -1065 -192 1236 -146 -1043 636
6223 636 -107 -629 767 413 -1047 588 1265 -1052 -154 973 -508 -666 1170 -103 -789 976 199
6240 199 -1192 683 920 -1036 -32 980 -516 -599 1045 -542 -995 957 362 -1238 576 1148 -879
6257 -879 -20 931 -602 -186 1245 -163 -1286 1051 359 -1302 314 668 -967 75 1242 -702
6273 -702 -209 1145 -442 -1212 862 663 -1064 258 551 -1296 329 913 -1219 -358 1227 -87 -1030
6290 -1030 877 -34 -884 924 433 -1133 554 1106 -892 -436 1097 -273 -1018 986 -314 -835 773
6307 773 61 -1455 406 968 -1293 -21 1304 -278 -636 927 -348 -847 780 361 -1483 260
6323 260 886 -963 187 1036 -722 -278 874 -492 -656 1220 452 -1228 284 970 -894 -67 1083
6340 1083 -646 -93 1086 -381 -1167 861 464 -1104 461 440 -737 25 965 -948 -396 1323 -135
6357 -135 -998 823 717 -948 388 424 -869 421 938 -1160 -272 1175 -498 -789 595 55 -810
6374 -810 848 320 -1014 718 677 -1010 -487 1417 -463 -568 841 -380 -971 894 283 -1181 349
6391 349 1186 -1018 -424 725 -230 -354 1029 -94 -1261 1147 534 -1433 191 1141 -647 -227 973
6408 973 -504 91 1368 -250 -877 926 371 -1017 568 838 -618 -122 719 -1108 -404 880 -338
6425 -338 -774 882 397 -796 364 698 -944 162 1110 -1390 -490 1156 -413 -1074 612 288 -970
6442 -970 680 270 -906 278 1090 -1009 -412 1143 -524 -1144 831 199 -678 866 393 -1337 618
6459 618 1343 -858 -395 1074 -281 -409 785 -84 -759 892 329 -1078 580 814 -1169 -401 630
6476 630 -547 -245 580 -317 -1093 891 356 -1069 242 560 -984 -545 517 -589 -192 1431 -296
6493 -296 -709 883 512 -1226 169 622 -888 438 559 -704 20 919 -293 -947 768 197 -830
6510 -830 530 614 -659 406 790 -885 -437 1000 -404 -741 894 298 -671 678 486 -1114 461
6527 461 909 -989 -303 1185 161 -792 749 0 -408 431 373 -878 408 888 -993 -344 796 -327
6545 -327 -277 808 -249 -607 914 182 -1361 111 1053 -562 -160 836 -781 -361 728 -363 -803
6562 -803 982 372 -1091 513 444 -506 121 648 -536 -174 1217 -351 -721 821 611 -1201 196
6579 196 399 -501 210 610 -733 -317 1238 -362 -625 693 31 -823 422 159 -669 350 895 -1010
6597 -1010 -240 903 -452 -903 909 -9 -919 401 -121 -1001 199 720 -857 -321 708 -244 -393
6614 -393 646 -157 -569 692 171 -930 99 754 -514 -552 970 -393 -423 1024 -153 -1233 778
6631 778 331 -970 391 744 -617 -15 541 -241 -319 954 -230 -877 995 518 -890 39 783 -577
6649 -577 21 754 -1047 -47 1029 0 -789 855 133 -667 289 36 -873 252 754 -833 -30 1248
6667 1248 -234 -631 544 104 -871 518 418 -1017 526 835 -467 -363 1025 85 -603 743 135
6684 135 -819 785 368 -1054 139 941 -565 -83 844 -359 -496 757 -215 -618 846 108 -865 448
6702 448 1057 -707 -88 796 -382 -410 804 -272 -597 946 125 -1315 -70 731 -685 -48 609 -528
6720 -528 -392 673 -326 -608 498 292 -855 -7 698 -386 116 824 -611 -330 992 -197 -1032 709
6738 709 189 -631 524 338 -495 372 662 -762 -559 995 -499 -786 350 126 -420 669 21 -1044
6756 -1044 269 746 -860 32 916 -293 -792 601 -155 -626 918 6 -1018 198 886 -663 -238
6773 -238 800 -85 -499 642 -271 -801 534 429 -1146 313 644 -626 -284 808 -328 -155 830
6790 830 -580 -661 881 623 -1145 175 472 -429 300 835 -562 -51 1096 -411 -719 1006 505 -594
6808 -594 284 375 -652 -139 756 -851 -146 1047 -123 -731 526 279 -730 539 165 -767 301 830
6826 830 -1090 -214 1111 -15 -512 566 125 -648 518 66 -1177 262 829 -872 -213 883 29
6843 29 -431 646 -202 -568 609 266 -983 136 827 -762 -295 468 -607 -532 549 -571 -1012 655
6861 655 538 -852 171 742 -633 -177 816 -857 -140 812 -210 -678 786 439 -923 297 438
6878 438 -673 -15 566 -811 -21 750 -246 -900 641 60 -615 260 426 -597 248 452 -996 -192
6896 -192 802 -304 -928 556 149 -187 510 209 -873 518 717 -922 -327 909 -135 -658 285 84
6914 84 -606 561 546 -771 191 933 -508 -449 1076 -188 -362 643 -283 -589 684 271 -746 208
6932 208 736 -252 -48 402 -159 -15 546 -110 -766 815 95 -857 377 432 -621 -89 853 -480 -485 1252
6952 1252 -413 -904 552 106 -666 176 138 -570 56 606 -696 -227 1029 -43 -686 635 319 -509
6970 -509 510 61 -656 239 561 -938 -229 999 -559 -580 179 -72 -203 384 346 -711 286 804 -645
6989 -645 -97 783 -273 -321 517 -118 -648 340 241 -808 -49 999 -711 -352 548 -94 -231 528 -284
7008 -284 -274 753 322 -722 69 553 -566 -160 694 -212 -225 811 -532 -639 700 395 -774 -133
7026 -133 518 -451 -73 673 -388 -104 777 -84 -720 608 244 -760 125 357 -729 346 697 -757
7044 -757 29 588 -213 -747 554 219 -673 266 226 -729 398 317 -939 -570 759 -261 -630 368 133
7063 133 -683 656 157 -791 253 608 -500 -279 680 50 -436 559 144 -583 738 451 -631 249
7081 249 369 -230 -327 509 -275 -395 607 -282 -667 587 378 -739 92 442 -575 -44 459 -405 -426
7100 -426 911 -144 -856 630 358 -664 168 32 -587 261 286 -830 -489 841 -277 -466 407 317
7118 317 -982 187 393 -621 23 473 -613 -457 778 -7 -625 700 -31 -516 674 381 -825
7135 -825 350 676 -1150 -148 1027 -182 -506 671 95 -367 712 26 -807 234 523 -547 -185
7152 -185 634 -103 -244 294 -258 -647 446 -57 -837 391 523 -382 -163 370 -332 -254 486 -289 -579 775
7172 775 303 -967 239 527 -282 210 324 -494 -428 1302 -144 -1058 658 311 -1075 473 322 -337
7190 -337 203 556 -664 -45 958 21 -616 641 371 -682 393 330 -500 180 749 -537 -47 730
7208 730 -111 -591 614 -127 -794 650 -126 -920 259 431 -539 -520 637 -335 -529 498 -126 -749 818
7227 818 -146 -976 34 900 -762 -122 514 -248 -305 369 -230 -577 651 268 -643 57 558 -451 128
7246 128 609 -600 -131 637 -426 -709 706 468 -771 102 436 -548 -154 472 -702 -389 953 -478
7264 -478 -979 487 492 -813 92 306 -666 -241 414 -678 -168 863 -212 -607 267 104 -460 384 258
7283 258 -751 208 668 -555 -482 942 86 -832 562 -52 -558 678 183 -464 227 715 -499 -509 1016
7302 1016 -11 -511 734 -84 -663 693 331 -891 -97 582 -629 -150 785 -283 -93 628 -168 -534
7320 -534 214 475 -479 -27 483 -559 66 350 -484 -386 757 -308 -876 493 532 -493 -2 358 -608
7339 -608 218 656 -466 -276 635 -323 -635 588 328 -524 243 303 -595 463 576 -570 -509 645 -293
7358 -293 -401 560 88 -381 422 221 -721 377 644 -618 -175 998 -106 -210 247 -84 -748 677
7376 677 92 -1058 408 979 -626 -149 371 -202 -370 622 -86 -878 696 152 -671 308 694 -328
7394 -328 -292 191 -313 -550 393 -263 -776 701 285 -901 82 605 -824 31 607 -683 -201 560 35
7413 35 -640 541 347 -398 31 229 -701 126 783 -483 -94 561 -83 -536 348 277 -381 139 517 -352
7433 -352 22 518 -560 -265 562 68 -592 313 227 -641 418 369 -827 196 580 -541 -225 641 -440
7452 -440 -331 477 -31 -638 633 248 -900 312 781 -400 -101 240 -554 -42 525 -210 -669 789
7470 789 264 -718 -28 755 -441 -80 505 -176 -416 740 -433 -728 673 375 -836 22 568 -521
7488 -521 113 456 -893 -264 924 -217 -639 396 143 -680 246 458 -678 145 435 -695 -64 866
7506 866 -39 -767 370 191 -681 428 203 -687 167 614 -667 -356 397 -98 -607 883 211 -786 397
7525 397 353 -887 124 936 -400 -495 687 -452 -565 363 -268 -557 350 520 -643 216 527 -420 105
7544 105 589 -294 -49 394 -267 -870 584 394 -986 105 608 -567 -443 360 -674 -596 665 -492
7562 -492 -792 94 482 -728 72 496 -605 29 553 -457 -205 751 95 -369 664 229 -651 363
7580 363 430 -750 246 452 -831 -353 943 87 -977 429 237 -497 729 441 -556 24 551 -384
7598 -384 -511 769 -285 -534 529 -74 -617 470 195 -534 55 749 -661 -152 430 -263 -248 497 2
7617 2 -897 665 528 -1039 -51 463 -554 -62 424 -76 -396 788 -162 -864 657 229 -672 31 624
7636 624 -569 -221 513 -517 -466 735 -177 -253 613 657 -618 30 502 -417 -100 558 -836 -128 983
7655 983 -60 -227 560 175 -286 271 355 -764 138 705 -506 -460 683 -26 -525 417 -30 -395 447
7674 447 173 -700 93 622 -633 -429 510 -138 -35 683 -282 -726 233 626 -618 273 650 -369 -347
7693 -347 308 -628 -460 794 -265 -392 858 253 -887 -277 313 -515 -12 419 -118 -22 480 -107 -770
7712 -770 357 606 -540 -122 783 -558 -23 582 -361 -368 563 57 -787 394 307 -594 67 388 -431 171
7732 171 496 -708 -241 752 -100 -392 307 125 -671 373 324 -794 216 708 -496 -364 647 -9
7750 -9 -147 174 67 -360 310 386 -683 25 451 -225 -213 791 -147 -311 521 -84 -584 210 85 -707 67
7771 67 601 -470 -131 211 -334 -438 321 -170 -693 254 -118 -805 -269 405 -581 -49 637 -317 -324 610 122
7792 122 -397 375 636 -305 227 197 -508 175 557 -521 -301 553 221 -533 459 335 -537 119 384 -697
7812 -697 86 940 -303 -251 716 251 -501 428 455 -707 348 218 -573 90 493 -520 -404 178 -13
7831 -13 -885 240 -348 -708 706 412 -911 -179 545 -495 -307 524 -399 -95 591 -324 -603 78 485
7850 485 -821 14 329 -614 -193 339 -77 -379 466 -20 -653 367 621 -637 22 702 -441 293 617
7869 617 -396 -397 534 170 -945 202 474 -544 154 211 -303 309 641 -660 -227 544 -113 -516 114
7888 114 78 -646 199 227 -698 -32 770 -617 -371 612 -6 -479 232 272 -709 579 342 -678 70 897
$$ [...]
8191b38
##END NTUPLES=NMR FID
##END=
