##TITLE=1H_Pr 5-2-5-m
 CDCl3, 8 sc, 
 24.6.2019
##JCAMPDX= 6.0         $$ Bruker NMR JCAMP-DX V2.0
##DATA TYPE= NMR FID
##DATA CLASS= NTUPLES
##ORIGIN= UXNMR, Bruker Analytische Messtechnik GmbH
##OWNER= root
$$ XWIN-NMR		Version 3.5
$$ Mon Jun 24 14:38:38 2019 Russian Standard Time (UT+4h)  she@DPX200
##.OBSERVE FREQUENCY= 200.13155
##.OBSERVE NUCLEUS= ^1H
##.DELAY= (6, 6)
##.ACQUISITION MODE= SIMULTANEOUS
##.ACQUISITION SCHEME= undefined
##.AVERAGES= 8
##.DIGITISER RES= 18
##SPECTROMETER/DATA SYSTEM= spect
##.PULSE SEQUENCE= zg30
##.SOLVENT NAME= CDCl3
##.SHIFT REFERENCE= (INTERNAL, CDCl3, 0, 15.7039)
##AUDIT TRAIL= $$ (NUMBER, WHEN, WHO, WHERE, WHAT)
$$ ##TITLE= Audit trail, XWIN-NMR		Version 3.5
$$ ##JCAMPDX= 5.01
$$ ##ORIGIN= Bruker BioSpin GmbH
$$ ##OWNER= she
$$ F:/spectra/data/she/nmr/H-F/1/audita.txt
$$ ##AUDIT TRAIL=  $$ (NUMBER, WHEN, WHO, WHERE, WHAT)
(   1,<2019-06-24 14:37:23.28 +0400>,<she>,<DPX200>,
      <created by zg, POWCHK disabled, PULCHK disabled
       configuration hash MD5:
       00 E9 B6 7A A2 85 ED C7 34 08 36 98 17 FE 4E 26
       data hash MD5: 16K
       A3 8E CF B3 2F C7 C0 A0 11 84 3E CC 75 E8 32 53>)
$$ ##END=
$$ 
$$ hash MD5
$$ 52 D6 C4 66 93 AA 40 47 AF 8A D3 3E 1E 65 B5 1A
##$RELAX= 
##$RELAX= 
##$RELAX= 
##$RELAX= 
##$RELAX= 
##$RELAX= 
$$ Bruker specific parameters
$$ --------------------------
##$DU= <F:/spectra>
##$EXPNO= 1
##$NAME= <H-F>
##$PROCNO= 1
##$TYPE= <nmr>
##$USER= <she>
##$AMP= (0..31)
100 100 100 100 100 100 100 100 100 100 100 100 100 100 100 100 100 100 
100 100 100 100 100 100 100 100 100 100 100 100 100 100 
##$AQSEQ= 0
##$AQ_mod= 1
##$AUNM= <au_zg>
##$AUTOPOS= <>
##$BF1= 200.13
##$BF2= 200.13
##$BF3= 200.13
##$BF4= 200.13
##$BF5= 200.13
##$BF6= 200.13
##$BF7= 200.13
##$BF8= 200.13
##$BYTORDA= 1
##$CFDGTYP= 0
##$CFRGTYP= 5
##$CHEMSTR= <none>
##$CNST= (0..31)
1 1 145 1 1 1 1 1 1 1 1 1 1 1 1 1 1 1 1 1 1 1 1 1 1 1 1 1 1 1 1 1 
##$CPDPRG= <>
##$CPDPRG1= <>
##$CPDPRG2= <>
##$CPDPRG3= <>
##$CPDPRG4= <mlev>
##$CPDPRG5= <mlev>
##$CPDPRG6= <mlev>
##$CPDPRG7= <mlev>
##$CPDPRG8= <mlev>
##$CPDPRGB= <>
##$CPDPRGT= <>
##$D= (0..31)
0 1.2 0 0 0 0 0 0 0 0 0 0.03 0 0 0 0 0 0 0 0 0 0 0 0 0 0 0 0 0 0 0 0 
##$DATE= 1561372642
##$DBL= (0..7)
120 120 120 120 120 120 120 120 
##$DBP= (0..7)
150 150 150 150 150 150 150 150 
##$DBP07= 0
##$DBPNAM0= <>
##$DBPNAM1= <>
##$DBPNAM2= <>
##$DBPNAM3= <>
##$DBPNAM4= <>
##$DBPNAM5= <>
##$DBPNAM6= <>
##$DBPNAM7= <>
##$DBPOAL= (0..7)
0.5 0.5 0.5 0.5 0.5 0.5 0.5 0.5 
##$DBPOFFS= (0..7)
0 0 0 0 0 0 0 0 
##$DE= 6
##$DECBNUC= <off>
##$DECIM= 24
##$DECNUC= <off>
##$DECSTAT= 4
##$DIGMOD= 1
##$DIGTYP= 9
##$DL= (0..7)
0 120 120 120 120 120 120 120 
##$DP= (0..7)
150 150 150 150 150 150 150 150 
##$DP07= 0
##$DPNAME0= <>
##$DPNAME1= <>
##$DPNAME2= <>
##$DPNAME3= <>
##$DPNAME4= <>
##$DPNAME5= <>
##$DPNAME6= <>
##$DPNAME7= <>
##$DPOAL= (0..7)
0.5 0.5 0.5 0.5 0.5 0.5 0.5 0.5 
##$DPOFFS= (0..7)
0 0 0 0 0 0 0 0 
##$DQDMODE= 0
##$DR= 18
##$DS= 0
##$DSLIST= <SSSSSSSSSSSSSSS>
##$DSPFIRM= 0
$$ [...]
##$SUBNAM2= <"">
##$SUBNAM3= <"">
##$SUBNAM4= <"">
##$SUBNAM5= <"">
##$SUBNAM6= <"">
##$SUBNAM7= <"">
##$SUBNAM8= <"">
##$SUBNAM9= <"">
##$SW= 24.9336996594482
##$SWIBOX= (0..15)
0 0 2 0 0 0 0 0 0 0 0 0 0 0 0 0 
##$SW_h= 4990.01996007984
##$TD= 16384
##$TD0= 1
##$TE= 0
##$TE2= 300
##$TE3= 300
##$TEG= 300
##$TL= (0..7)
0 120 120 120 120 120 120 120 
##$TP= (0..7)
150 150 150 150 150 150 150 150 
##$TP07= 0
##$TPNAME0= <>
##$TPNAME1= <>
##$TPNAME2= <>
##$TPNAME3= <>
##$TPNAME4= <>
##$TPNAME5= <>
##$TPNAME6= <>
##$TPNAME7= <>
##$TPOAL= (0..7)
0.5 0.5 0.5 0.5 0.5 0.5 0.5 0.5 
##$TPOFFS= (0..7)
0 0 0 0 0 0 0 0 
##$TUNHIN= 0
##$TUNHOUT= 0
##$TUNXOUT= 0
##$USERA1= <user>
##$USERA2= <user>
##$USERA3= <user>
##$USERA4= <user>
##$USERA5= <user>
##$V9= 5
##$VALIST= <valist>
##$VCLIST= <CCCCCCCCCCCCCCC>
##$VD= 0
##$VDLIST= <DDDDDDDDDDDDDDD>
##$VPLIST= <PPPPPPPPPPPPPPP>
##$VTLIST= <TTTTTTTTTTTTTTT>
##$WBST= 1024
##$WBSW= 4
##$XGAIN= (0..3)
0 0 0 0 
##$XL= 0
##$YL= 0
##$YMAX_a= 213110
##$YMIN_a= -511785
##$ZGOPTNS= <>
##$ZL1= 120
##$ZL2= 120
##$ZL3= 120
##$ZL4= 120
##$ABSF1= 10
##$ABSF2= 0
##$ABSG= 5
##$ABSL= 3
##$ALPHA= 0
##$AQORDER= 0
##$ASSFAC= 0
##$ASSFACI= 0
##$ASSFACX= 0
##$ASSWID= 0
##$AUNMP= <proc_1d>
##$AZFE= 0.1
##$AZFW= 0.1
##$BCFW= 1
##$BC_mod= 2
##$BYTORDP= 1
##$COROFFS= 0
##$CY= 11.3945322036743
##$DATMOD= 1
##$DC= 2
##$DFILT= <>
##$DTYPP= 0
##$F1P= 18.9103706918063
##$F2P= -1.10871071338519
##$FCOR= 0.5
##$FTSIZE= 0
##$FT_mod= 4
##$GAMMA= 1
##$GB= 0.15
##$INTBC= 1
##$INTSCL= 1
##$ISEN= 128
##$LB= 0.24
##$LEV0= 0
##$LPBIN= 0
##$MAXI= 10000
##$MC2= 0
##$MEAN= 0
##$ME_mod= 0
##$MI= 1.114404
##$NCOEF= 0
##$NC_proc= 0
##$NLEV= 6
##$NOISF1= 3.799351
##$NOISF2= 2.8
##$NSP= 1
##$NTH_PI= 0
##$NZP= 0
##$OFFSET= 15.70392
##$PC= 1
##$PHC0= -8499.925
##$PHC1= 16.20097
##$PH_mod= 1
##$PKNL= yes
##$PPARMOD= 0
##$PSCAL= 0
##$PSIGN= 0
##$REVERSE= no
##$SF= 200.130013532006
##$SI= 16384
##$SIGF1= 3
##$SIGF2= 2
##$SINO= 400
##$SIOLD= 16384
##$SREGLST= <1H.CDCl3>
##$SSB= 0
##$STSI= 0
##$STSR= 0
##$SW_p= 3612.71676300578
##$SYMM= 0
##$S_DEV= 0
##$TDeff= 0
##$TDoff= 0
##$TI= <>
##$TILT= no
##$TM1= 0
##$TM2= 0
##$TOPLEV= 0
##$USERP1= <user>
##$USERP2= <user>
##$USERP3= <user>
##$USERP4= <user>
##$USERP5= <user>
##$WDW= 1
##$XDIM= 8192
##$YMAX_p= 0
##$YMIN_p= 0
$$ End of Bruker specific parameters
$$ ---------------------------------
##NTUPLES= NMR FID
##VAR_NAME=  TIME,          FID/REAL,        FID/IMAG
##SYMBOL=    X,             R,               I
##VAR_TYPE=  INDEPENDENT,   DEPENDENT,       DEPENDENT
##VAR_FORM=  AFFN,          ASDF,            ASDF
##VAR_DIM=   8192,          8192,            8192
##UNITS=     SECONDS,       ARBITRARY UNITS, ARBITRARY UNITS
##FACTOR=    0.0002004,     1,               1
##FIRST=     0,             0,               0
##LAST=      1.6414764,     0,               0
##MIN=       0,             -511785,         0
##MAX=       1.6414764,     213110,          0
$$ Real data points
##PAGE= N=1
##DATA TABLE= (X++(R..R)), XYDATA
$$ [...]
3120E886j0527N548L508j0635N458R685j3876k087J5136n875j0259J0995P99r314
$$ 5886 -4641 907 4415 -6220 -762 8923 -4953 -7040 8096 2221 -8038 2957 3756 -5558
3134e558P845K147j2099P052J0052j3845k144J3861o157o917J0049l205p398J1740
$$ -5558 2287 4434 -7665 -613 9439 -4406 -6550 7311 1154 -5763 4286 1081 -6317 5423
3148E423l51j4041Q820R606j3670j394J2373o714m598R476n061n980J2755k038
$$ 5423 5072 -8969 -149 9457 -4213 -5607 6766 52 -4546 4930 -131 -6111 6644 4606
3162D606j4133J0086Q108j2628N85R059q306j048J0994q737o543J4479j855j3655
$$ 4606 -9527 559 8667 -3961 -3376 5683 -2623 -3671 7323 -1414 -7957 6522 4667 -8988
3176h988R105O796j1234K126P068q776J627R435j0682m300J5501m018j2738R915
$$ -8988 117 6913 -4321 -2195 4873 -3903 -2276 7159 -3523 -7823 7678 3660 -9078 837
3190H37M407j0507N486M701j0736L305J0684j0632m677J3475m064q830R556J032
$$ 837 5244 -5263 223 4924 -5812 -2507 8177 -2455 -7132 6343 2279 -6551 3005 4037
3204D037r477P812L136j1963N163J0445j1985l806J3497m808p897R559j217q650
$$ 4037 -5440 2372 5508 -6455 -1292 9153 -2832 -6638 6859 2051 -5846 3713 2496 -6154
3218f154R585K172j2491N453R127j1048o12J0303p648m428J1309l932r170J1024
$$ -6154 3431 5603 -6888 -1435 7692 -3356 -3968 6335 -1313 -5741 5568 1636 -7534 3490
3232C490J497j2268O282P910j0825J96R368p899k443J0573o037p126J1367n3j1543
$$ 3490 4987 -7281 -999 6911 -3914 -3718 5650 -2249 -4692 5881 -156 -7282 4085 4032 -7511
3247g511Q218N348j1086K974Q889j0182j129J1151o434o849J1087j675r729R340
$$ -7511 707 6055 -5031 -2057 6832 -3350 -4479 6672 238 -6611 4476 2801 -6928 2412
3261B412L044j1354N578P318j0989Q79J0221p897m700J1397m020q330J0165J571
$$ 2412 5456 -5898 -320 6998 -3991 -3112 7109 -788 -5488 5909 1889 -6441 3724 5295
3275E295j1692O388O574j0542J261Q625p755k189J0427p166o008J1434k95j1883
$$ 5295 -6397 -9 6565 -3977 -2716 5909 -1846 -4035 6392 -774 -6782 4652 4357 -7526
3289g526P507N626j0432K499P904q640j069J0331p195o078J1989j670j0115P936
$$ -7526 -19 5607 -4825 -2326 5578 -3062 -4131 6200 -995 -7073 4916 3246 -6869 1067
3303A067L439r628M667N587r854K036J0529r360n562J2434j866r266P551J667
$$ 1067 4506 -5122 -455 5132 -4722 -2686 7843 -1517 -7079 5355 3489 -5777 1774 3441
3317C441q269O393M458j1668L645R495r090l737J0923l599p029Q668r48q854Q664
$$ 3441 -4828 1565 6023 -5645 -2000 7495 -1595 -5332 5591 1992 -5037 3631 2683 -6171 2493
3332B493L577j2378M066R971r666k984R287m377l909Q778m630p453J1380J467
$$ 2493 6070 -6308 -2242 7729 -1937 -4921 4366 -11 -3920 4858 228 -7225 4155 5622
3346E622j2898N022Q404q762j069Q228o127k527R602n650p371J1129J738j2037
$$ 5622 -7276 -2254 6150 -2612 -3681 4547 -1580 -4107 5495 -155 -7526 3603 5341 -6696
3360f696N082O741p761J029O022q038M24J0627p981p318J2383J073j1112M942
$$ -6696 -1614 5127 -2634 -1605 4417 -3621 -3197 7430 -551 -7869 4514 5587 -5525 -583
3374e83N176p656K947N614r390Q90J0431p856o230J1229o73r015O364K259p940
$$ -583 4593 -3063 -116 5498 -3892 -3002 7429 -427 -6657 4572 3899 -5116 1248 3507 -4433
3389d433O201M309j1756K195J1039p758n803R360j414o196O706o40p668P756L749
$$ -4433 1768 6077 -5679 -3484 7555 -203 -6006 3354 1940 -4256 2450 1810 -5858 1898 5647
3404E647j1780K965J0100q082m127R148l427m693Q117k686q153R377L325j1487
$$ 5647 -6133 -3168 6932 -1150 -5277 3871 444 -4249 3868 1182 -6971 2406 5731 -5756
3418e756K876Q428p203j283P164n866k243J0147n002q450J0191K751j1029L314
$$ -5756 -2880 5548 -1655 -2938 4226 -1640 -3883 6264 1262 -7188 3003 5754 -5275 -1961
3432a961P421p366N7O704p142j245R865n759p077R895J295r766N061M420q364
$$ -1961 5460 -1906 -1849 4855 -2287 -3532 6333 574 -6503 3392 4687 -5079 -18 4402 -3962
3447c962L324O146q733q75J0461n668o972R235J45p844N405K176p590M717N410
$$ -3962 -638 5508 -3225 -4100 6361 693 -6279 2956 3101 -4743 662 2838 -4752 -35 5375
3462E375r594N00R396o555m688R190k360p193Q030J221q856N376N523r294M85
$$ 5375 -4219 -3719 5677 -878 -5566 3624 1264 -5929 2101 3322 -5534 -158 5365 -3929 -3444
3477c444Q701o465l045Q146l716n088Q544q55q776P040M304r799K619P368p142
$$ -3444 5257 -1208 -4253 3893 177 -4911 3633 2778 -5998 1042 5346 -4453 -1834 5534 -1608
3492a608j650Q744n483m987Q941j100p854O792K709q851L844N924q379Q51Q032
$$ -1608 -3258 5486 3 -4984 3957 2857 -4997 1795 4504 -4347 -503 5421 -2958 -2107 5925
3507E925o690m010R399k912p003P296J350q037N195M241q600J607P530o650k464
$$ 5925 -765 -4775 4624 1712 -5291 2005 3355 -4682 513 4754 -3846 -2239 5291 -1359 -3823
3522c823Q485m268m867Q262j297q491P285L958r096J579P841p117j691P267m534
$$ -3823 4662 394 -4473 3789 2492 -5999 1286 5244 -3852 -2273 5568 -1549 -3240 4027 -507
3537e07l320Q092k344p822P999K844r169L163N957p135N07O415o205k519R232
$$ -507 -3827 4265 1921 -5901 2098 4942 -4227 -1064 4893 -2242 -1735 4680 -1525 -4044 5188
3552E188l531q185Q061L119q516L059M151o236J962N902p774j139R613m859o983
$$ 5188 1657 -6528 1533 4652 -3864 -805 3346 -2890 -928 4974 -2800 -3939 5674 815 -6168
3567f168Q466J172p672M573K776p207L345N548q446l17R266n143n369P146m77
$$ -6168 2298 3470 -4202 371 3147 -4060 -715 4833 -3613 -3930 5336 193 -5176 1970 1493
3582A493n609O110M91q060O051N234r837n41R702m676m555O592j651m487O810
$$ 1493 -4116 1994 2485 -5575 476 5710 -4127 -4668 5034 358 -4197 2395 744 -3743 3067
3597C067j057p902O883M669r279M69P493m869k256O341m498l338Q877k221r050
$$ 3067 2010 -5892 991 5660 -3619 -3150 4343 -526 -2782 3559 -939 -4277 4600 2379 -6671
3612f671O955N128q507O52N556m801o9N753o186k204R536l541q645P956L695q029
$$ -6671 284 5412 -3095 -2443 3113 -1688 -1757 3996 -2190 -4394 5142 1601 -7044 912 4607 -3422
3628c422J913M936o506J623O283p409k170R457k657p692O901J775o288M173K346
$$ -3422 -1509 3427 -3079 -1456 4827 -2582 -4752 4705 2048 -5644 1257 3032 -3256 917 3263
3643C263p350M151N678p935k221R309k979o516O956On617N309J505p713M259N974
$$ 3263 -4087 64 5742 -2193 -4414 4895 1916 -4600 2356 2362 -3255 2054 3559 -4154 105 6079
3659F079q175j505Q418l866l906O184k104n176P557N56q978M684N905p624r41
$$ 6079 -2096 -3601 4817 951 -2955 3229 1125 -4051 3506 4062 -4916 -232 5673 -1951 -2892
3674b892O758m421k168O270l622m450Q315q66q407N334M772p864J045N660n480
$$ -2892 3866 -555 -2723 3547 -75 -4525 3790 2924 -5483 -149 4623 -3241 -2196 3464 -2016
3689b016l44O389m908l944P955n83p755N462L135o469K107M452o357O27O648n733
$$ -2016 -2360 4029 -879 -4823 3132 2549 -5206 256 3391 -3078 -971 3481 -2876 -2249 4399 -1334
3705a334k999P976j340p171O444J944p160L614L926o666J228O599o299k280P456
$$ -1334 -4333 3643 2303 -4868 1576 3520 -3640 -26 3900 -2766 -1538 5061 -1238 -3518 3938
3720C938k978m964O585j20o476N293K975p901K039O262n922j845O677l673l811
$$ 3938 960 -4004 2581 2461 -4015 1278 4253 -3648 -1609 4653 -1269 -3114 3563 -110 -3921
3735c921P000j667o316O101K108p320K712N081o333n6O201n042k593P343k566
$$ -3921 3079 1412 -4904 1197 3305 -4015 -1303 3778 -2555 -2611 3590 -1452 -4045 3298 732
3750G32o120O534J451o774L780L749o323J598N485n899j479P221k993n550O684
$$ 732 -5388 1146 2597 -4177 -397 3352 -2971 -1373 4112 -1787 -3266 3955 962 -4588 2096
3765B096L94o410N139K226o862K524N942o553j609O905l186l734N752j323m839
$$ 2096 2490 -3920 1219 3445 -3417 -893 5049 -1504 -3113 3792 606 -3128 2624 1301 -3538
3780c538N950J262p784M109N051p054p04O499m095k327N823k787m795P443K68
$$ -3538 2412 3674 -4110 -1 5050 -2004 -2708 3791 -304 -2631 3192 405 -4390 3053 3321
3795C321p644L700M648o077J6N226m577p49N739m147m383Q197l78p835M458M215
$$ 3321 -4323 -623 4025 -2052 -2036 3190 -1387 -2136 3603 -544 -4927 3270 2892 -4943 -485 3730
3811C730o138R96M061m851P80N586n666k855P551q01o510M650K467n893K984L124
$$ 3730 -2408 -1412 2649 -2202 -1422 4164 -1502 -4357 3194 2393 -4117 533 3000 -2893 91 3215
3827C215o224J519O580o022l287P524j188n512M857M30m748M190K094p124K498
$$ 3215 -3009 -1490 5090 -932 -4219 3305 2117 -3395 1462 1892 -2856 1334 3428 -3696 -1198
3842a198O481o242k829O983k045m193M965j130m642N571J882p770K514N860n232
$$ -1198 5283 -959 -3788 3195 1150 -3043 1922 792 -3850 1721 3603 -4167 -1653 4207 -1025
3857a025k032N556k954k090N739l159m780P245J201q401L160N583n453p58M833
$$ -1025 -3057 2499 -455 -2545 3194 35 -4745 2500 3701 -4700 -1540 4043 -1410 -2168 2665
3872B665l775o63N578l702m690P000R73p277L289L909n085R39M089n596J38O860
$$ 2665 -1110 -1773 3805 103 -4587 2413 3386 -3891 -602 3307 -1778 -839 3250 -2346 -2208 4652
3888D652m656m568P428K66o535L730K286m885K086L271n840Q77O567m990l710
$$ 4652 -4 -4572 2856 3122 -3413 317 2603 -2282 -196 3075 -2765 -1888 4679 -311 -4021
3903d021O713r00n260M293J408n982M171L122o748O91O303m142l177N583j641
$$ -4021 2692 1792 -3468 825 2233 -3749 422 3544 -3204 -2513 3790 -352 -3529 2054 413
3918D13l889N874q37n399M457L131p297J709N892m786j789N238k494l334O154
$$ 413 -3476 2398 1561 -3838 619 3750 -3547 -1838 4054 -732 -2521 2717 223 -3111 3043
3933C043j694n568N446K589o949K261M217m906M1N174m629j675O339k348n358
$$ 3043 1349 -4219 1227 3816 -3133 -872 3345 -1561 -1520 3654 -975 -2650 3689 1341 -4017
3948d017O193J364o261K446L541m782O56M616n239j248O401k961m312N550O3n433
$$ -4017 2176 3540 -2721 -275 3266 -1516 -860 3756 -1483 -2731 3670 709 -3603 1947 2010 -3423
3964c423M031K382n946J977M887n514j290O031k778l486N320j104n071N304J476
$$ -3423 608 2990 -2956 -979 3908 -1606 -2896 3135 357 -3129 2191 1087 -3984 1320 2796
3979B796o090K967M019n670m17N508l409k591N614k266m476N910J272o681L162
$$ 2796 -3294 -327 3692 -1978 -2395 3113 -296 -2887 2727 461 -4015 1895 3167 -3514 -352
3994c52M085n708O40M480m408q65O071l924l579O151l3o342M215K967n589J395
$$ -352 3733 -1975 -1335 3145 -1263 -2128 3943 19 -3560 2591 2558 -3784 431 3398 -2191 -796
4010g96M260n037k33N770m381l066O150j092m876M076J477n357L301L364o339
$$ -796 3464 -1573 -1806 3964 -417 -3483 2667 1575 -3301 775 2252 -3105 196 3560 -2779
4025b779M12O167m278l329O029j148m133M713j79n094L983K888o346J184N947
$$ -2779 -2367 3800 -478 -3807 2222 1074 -3059 1654 1475 -3619 364 3252 -3094 -1910 4037
4040D037m913j630M831k054k988N301j268n506N146L126o793J030N056m254p80
$$ 4037 -876 -2506 2325 271 -2717 2584 1316 -4190 956 4082 -2711 -1681 3375 -879 -1659
4055a659M188l134j566N806k868m794N475K189o710K304M032n128N23M438m275
$$ -1659 2529 -605 -2171 3635 767 -4027 1448 3637 -3073 -769 3263 -1865 -1342 3096 -1179
4070a179j097N999k965n008N656J532n468K131K851m789J877L811n716j60O027
$$ -1179 -2276 3723 758 -4250 1406 2938 -2530 -399 2452 -2337 -460 3351 -2365 -2525 3502
4085C502l341m139N253P64m641L016J335m836K923L621n753l39O072l545k881
$$ 3502 161 -3978 1275 2039 -2602 414 1749 -3087 -164 3457 -2296 -2635 3437 -108 -2989
4100b989M945r22l686M669L3n658L754M115o373k24N743l126k165M189j944k724
$$ -2989 1956 1034 -2652 2017 2050 -3608 146 4261 -2112 -2336 3407 281 -1884 2305 361 -2363
4116b363M884r34n523M349L643o273L72M854m019n66M257l309k643O506j581n815
$$ -2363 2521 1587 -3936 413 4056 -2217 -1845 3009 -1010 -1576 2681 -628 -3271 3235 1654 -4161
4132d161M383L048n743J213L196l660O51L982m333j806O510j952n650N229J667
$$ -4161 222 3270 -2473 -1260 1936 -1724 -1073 2909 -1424 -3230 3280 1328 -4322 907 2574
4147B574n506K442K935m704J042M561m442j910N905j945m283M742M67m705L340
$$ 2574 -2932 -490 2445 -2259 -1217 3344 -1098 -3008 2897 952 -3331 1411 1878 -2827 513
4162E13K240n527K247M394n012j453N587k365l315M743n03m783M757Q86n459K576
$$ 513 2753 -2774 -527 3867 -1145 -2598 2989 624 -2691 2052 1549 -3234 1523 2409 -3050 -474
4178d74M189n006l76M480l132j837N005k400l350M705P29n671K857L681n290N22
$$ -474 3715 -1291 -1667 2813 -319 -2156 2849 449 -2901 1804 2533 -3138 -281 3400 -1890 -1368
4194a368L459l234r76M960k837l175N209l86n183L661K583m845J154L949m474
$$ -1368 2091 -1143 -2119 2841 4 -3171 2038 1652 -3531 130 2713 -2132 -978 2971 -1503
4209a503l27M834k779l188N091p24m382L953J095m657K680K842m904K35N348l712
$$ -1503 -1830 3004 225 -2963 2128 1404 -2978 975 2070 -2587 93 2935 -1969 -1734 3614 -98
4225i8k758N231j430l636M239L41m962L358K986n258N90M511l717j437M359k611
$$ -98 -2856 2375 945 -2691 1548 1889 -3073 285 3271 -1987 -1397 3114 -603 -2040 2319 -292
4241b92k322M824r29n053M395K414n542J114L952l627n28L799l340j518N378j748
$$ -292 -2614 2210 1281 -3772 623 3037 -2505 -1391 2561 -1066 -1594 2205 -1135 -2653 2725 977
4257I77m667M557J921n463J961L126m385P45L805l819j333N531k302l873M237
$$ 977 -3690 867 2788 -2675 -714 2412 -1973 -1228 2577 -1242 -2575 2956 654 -3219 1018
4272A018Q64m163K636J881m420J550L608m659n61N119j915l722M379k45m120L826
$$ 1018 1882 -2281 355 2236 -2184 -634 2974 -1685 -2246 2873 958 -2764 1615 1370 -2750 1076
4288A076J233n055K369L630m450r37M604k384k373M412j727l297M677R3n293L037
$$ 1076 2309 -2746 -377 3253 -1197 -2134 2470 86 -2287 2125 398 -2899 1778 1871 -3422 -385
4304c85L928n073l12M541l282j075L666k216k930N321m11m888K998L170n096P21
$$ -385 3543 -1530 -1842 2699 -583 -1658 2008 -208 -3138 2183 1772 -3116 -118 3052 -2044 -1323
4320a323L875l662L2L896l467k551N884p31n248L696K138m141J053K767l560M12
$$ -1323 2552 -1110 -1078 2818 -649 -3200 2684 1953 -3295 401 2539 -1602 -549 2218 -1342 -930
4336i30M199l815k042N259j584m253M192J007l904K395J716m674J248M444l899
$$ -930 3269 -546 -2588 2671 1087 -3166 1026 2033 -1871 524 2240 -2434 -1186 3258 -641
4351f41j825M897j818k976L801n85l645L721J484n195J979L965m314j130M331
$$ -641 -2466 2431 613 -2363 1438 853 -2792 929 2413 -2782 -803 3162 -1152 -2282 2049
4366B049k009k291M089j406l570M368J279n545K205L734m083l24L745l195q34
$$ 2049 40 -2251 1838 432 -3138 1230 2509 -3036 -831 2903 -1180 -1504 2241 -954 -1788
4381a788M225k259l016M600Q84n595K500L148m162L59L361l419j53M115l080k515
$$ -1788 2437 178 -2838 1762 2646 -2949 -449 2699 -1463 -1104 2257 -1162 -1315 2800 -280 -2795
4397b795M950K11n051K843K223m420J748K532l598m02M686l137k208M143m87l695
$$ -2795 2155 2366 -2685 158 2381 -2039 -291 2241 -1357 -1759 2927 -210 -2418 1725 1238 -2457
4413b457L154R67m305K603K540m525L83M063k752j944L856j301k762L523M20m298
$$ -2457 697 1664 -2641 -38 2502 -2023 -1640 2423 -329 -2273 1583 282 -2480 1043 1463 -2835
4429b835L289K365m939N87L961k976j075L586k207j968M159r96l908L509K132
$$ -2835 454 2819 -2120 -1533 2428 -548 -1623 1963 -244 -2212 1947 951 -2957 552 2684
4444B684m700J202L389l394j38L228k982j428M427j292l562L765J062m453K020
$$ 2684 -2016 -814 2575 -819 -957 2271 -711 -2139 2288 996 -2566 1199 2261 -2192 -172
4459a72K529m025J072L125l472j193M456j848l295M054ql620K558J918m499J511
$$ -172 2357 -1668 -596 2529 -943 -2136 2320 472 -2823 1231 1223 -2397 161 2079 -2420 -909
4475i09L479l585j365M292k004k188L778p98l355L261J353m603J977L538m122
$$ -909 2570 -1015 -2380 1912 -92 -2280 1498 700 -2655 606 1959 -2644 -667 2871 -1251
4490a251l03L612k671j160M066k006l290M759K98n102K588L185l827o2L035k193
$$ -1251 -1554 2058 -613 -1773 2293 287 -3003 1756 2054 -3048 -460 2725 -1102 -1164 1871 -322
4506c22j105L694k208k749M680O9m614K563K264l817Q00K913l370J2L967l326
$$ -322 -1427 2267 59 -2690 1990 2059 -2555 8 2272 -1545 -745 2168 -1202 -1190 2777 -549
4522e49k013M884r34l876K917J186l482J606K293m124O05L967k760k287L902n54
$$ -549 -2562 2322 1388 -2488 429 1615 -1867 -261 2032 -2092 -1487 2480 -280 -2567 1335 781
4538G81l211L496J77l791L080J706m226O96L774k891j463L638j492k343L359q32
$$ 781 -2430 1066 1243 -2548 532 2238 -1988 -1292 2482 -409 -1872 1766 274 -2069 1290 458
4554D58l062L282J637m582J389L433l442j3L047k183j677L946j460l580L808J591
$$ 458 -2604 678 2315 -2267 -878 2555 -887 -900 2147 -36 -1713 2233 773 -2807 1001 2592
4570B592m740J407L381l300m25K942k598j067M302k228l309M139O50m168J944
$$ 2592 -2148 -741 2640 -660 -1085 1857 -741 -1808 2494 266 -3043 1096 1746 -2422 -478
4585d78K332l154L70K913l198k35L695k170k753M021L4l712K430J404l340J721
$$ -478 1854 -1300 -930 1983 -1215 -1450 2245 75 -2678 1343 1377 -2335 95 1499 -1841 -120
4601a20K383l697jL835k329k206L605r42k418L374J00l657K296K492l970K12L263
$$ -120 2263 -1434 -1435 2400 71 -2135 1470 528 -1890 1484 1584 -2073 223 2715 -1255 -1043 2220
4618B220k347j270L172j285k671M033k56m201K907K255m376R25K807k343p16L012
$$ 2220 -127 -1397 1775 490 -2181 1852 1596 -2605 302 2557 -1819 -894 1913 -430 -1146 1866
4634A866k500j195L714q12l604L268J497m207R46L012k886Q3K671k692j192L848
$$ 1866 -634 -1829 1885 1073 -2531 737 2234 -1973 -1027 1985 -901 -818 1853 -839 -2031 1817
4650A817r92l362L216J045l822J807J950l293Q80K936k858j055L956j921k250
$$ 1817 825 -2537 679 1724 -2098 -291 1659 -1634 -754 2182 -676 -1731 2225 304 -1946
4665a946K971M43l407K472J441l714J192L017l193r19L481j522k053L157r41k424
$$ -1946 1025 1468 -1939 533 1974 -1740 -548 2469 -724 -1643 1838 316 -1737 1420 479 -1945
4681a945L051Q12l669J257K942l340m65L175k082j183L298j826k240L321M67l906
$$ -1945 1106 1918 -1751 -494 2448 -892 -1357 1818 -264 -1447 1851 25 -2215 1106 1573 -2333
4697b333J911K490l052P5K647k422p82L258k035k225L785k35l261K168J724k896
$$ -2333 -422 2068 -984 -909 1738 -684 -1466 1792 -243 -2468 1317 1082 -2179 -11 1713 -1183
4713a183N31K298k366n43L370k347j725L360l30l064K447J112l681K188J875l239
$$ -1183 -652 1646 -720 -1263 2107 -240 -1965 1395 1065 -1999 448 1560 -2121 67 1942 -1297
4729a297K96L177k483j795L398p91k326L094j40l375K543K194l770K13L274k382
$$ -1297 -1001 2176 -307 -2102 1296 505 -1821 1273 1133 -2242 301 2495 -1275 -1062 2212 -170
4745a70j101K455j068j822L319q60k972K712J484l415L52K968k634n99K820j943
$$ -170 -1271 1184 116 -1706 1613 753 -2219 493 1977 -1438 -1086 1882 -752 -1351 1469 -474
4761d74j255L284q71l234L171J334l361Q21K152k716L38K527k370o75L393j537
$$ -474 -1729 1555 684 -2550 621 1955 -1406 -585 1567 -1149 -811 1716 -654 -1329 2064 527
4777E27k745L513K87l261J729J254k547P45K201k610l29L397j787k151K721K92
$$ 527 -2218 1295 1582 -1679 50 1304 -1243 -498 1703 -907 -1236 2161 374 -1777 944 1236
4793A236k951K650K35k621J077K818l746k19L310k219j308K990o86k525K675N99
$$ 1236 -1715 935 1170 -1451 -374 2444 -1302 -1521 1789 -430 -1738 1252 566 -1959 716 1315
4809A315l451J956K221l437L4K941k194r46L211j692j465K944l03l373K126K159
$$ 1315 -2136 -180 2041 -1396 -1362 1579 -615 -1561 1650 -42 -1507 1437 1134 -2239 -113 2046
4825B046l259J87K634k325j08K430j923j153K977q44k414K263J302l193R98J883
$$ 2046 -1213 -1026 1608 -717 -825 1605 -318 -1471 1506 662 -1752 511 1813 -1380 -382 1501
4841A501k216J92K635k645j131L468j146k202K357O26k736J523J476k852O42K529
$$ 1501 -715 -523 2112 -533 -1664 1804 658 -1544 813 1439 -1297 226 1702 -1150 -508 2021
4857B021k705m96K297p05j888K419k71k497K364R02k846P76K387k542m95K440
$$ 2021 -684 -1180 1117 412 -1476 943 672 -1825 539 1441 -1405 -629 1758 -784 -1279 1161
4873A161j197j501K421o90k289K804Q13l244R34K893k670l83K127j326r67K819
$$ 1161 -36 -1537 884 194 -2095 709 1522 -1722 -788 2105 -565 -948 1179 -147 -1114 1705
4889A705j402k365L123M71l349J900J609k608M36J871j762r53L114j746j741L147
$$ 1705 303 -2062 1061 1532 -1817 83 1692 -916 -480 1391 -371 -1324 1790 44 -1697 1450
4905A450m1l532J918J662k513N21K367k995K93K797j538j781K406k38k530K358
$$ 1450 1409 -2123 -205 1457 -1056 -535 1832 -1163 -870 1927 389 -1392 1014 776 -1754 604
4921F04M21k590J401J921k792O6K768k174j163K659r55j594K203P0k356J467J956
$$ 604 1025 -1565 -164 1757 -1035 -969 1799 -375 -1538 1121 166 -1428 775 845 -1511 -44 1912
4938A912l035j10K995j943o86J828j197j128K646n94k608K344J366l108R50K233
$$ 1912 -1123 -1233 1762 -181 -867 961 -236 -1364 1282 688 -1920 424 1790 -1318 -368 1865
4954A865k159k17J800j693j257L298j017k592K693O83k610R38J414j917O19J447
$$ 1865 -294 -511 1289 -404 -1661 1637 620 -1972 721 1404 -1206 -268 1146 -771 -152 1295
4970A295j680r09K755j068j974K347J25k460J621J418k561M64K201k279p22K638
$$ 1295 -385 -1294 1461 393 -1581 766 891 -1569 52 1470 -1091 -627 1574 -705 -1427 1211
4986A211r89j807K475o24j729J866Q56k631R78K132k689q8K476j553p14J794n30
$$ 1211 222 -1585 890 266 -1463 403 1259 -1372 -394 1738 -951 -1039 1437 -116 -830 964 434
5003D34k056K708J77l021J627J957k550k99K338j587m76K208j713j250K842l89
$$ 434 -1622 1086 1263 -1758 -131 1826 -724 -1023 1315 -272 -748 1460 -253 -1503 1339 950
5019I50k670J585J763k615L41J799j668k02K029j675j205K964m40k484J848O09
$$ 950 -1720 -135 1628 -987 -646 1153 -515 -717 1312 -363 -1568 1396 956 -1528 320 929
5035I29k200R28J714k297J72K353k100r82K447n48k078K138K1k021J524J332k614
$$ 929 -1271 -343 1371 -926 -754 1599 -501 -1483 964 416 -1662 476 497 -1524 0 1332 -1282
5052a282O77K423k151q03K137o64j327K080m57k097K026J234k989O97K337j945
$$ -1282 -605 1818 -333 -1136 1001 337 -990 1090 633 -1464 562 1796 -1193 -496 1841 -104
5068a04r63K146r46r92K117j091j767K370N07l084J295K058j708p02J832j286
$$ -104 -1067 1079 133 -859 1258 167 -1600 770 1277 -1807 -512 1546 -162 -864 968 -318
5084c18m58K111j427j616K834K89k702R10J861k228K42J616j944k06K330j375
$$ -318 -776 1335 -92 -1708 1126 1415 -1287 -377 1484 -744 -502 1114 -830 -1036 1294 -81
5100h1j631K523J10k613J809J088k092Q06J515k180l3K250j843j206K496n29j785
$$ -81 -1712 811 921 -1692 117 1205 -887 -81 1434 -746 -779 1471 -372 -1578 918 389 -1396
5117a396J809M43k121J464J459k680K91K045j255j239K343j019j119J768n9k259
$$ -1396 413 856 -1265 199 1658 -1022 -731 1314 59 -1180 1163 144 -975 793 734 -1525
5133a525J817J109k155J30J742j523l03J483q96j120K315l51k463K006Q58k063
$$ -1525 292 1401 -754 -624 1118 -405 -708 775 -121 -1241 1074 723 -1740 266 1124 -939
5149i39M72J734j738l22J751j588l16K092q39j796K052M93k206R56J036j688M22
$$ -939 -467 1267 -471 -793 958 -630 -946 1146 307 -1489 563 1056 -1150 -194 842 -846 -424
5166d24J629j759p95K569r57j487K088j92j829J618O65k431R85K068k184m60K071
$$ -424 1205 -554 -1349 1220 263 -1224 864 672 -1157 461 1126 -1305 -320 1748 -436 -896 1175
5183A175q88j421K331q20j675J986O50k512R14J760j947n35K100j250j065K087
$$ 1175 287 -1134 1197 377 -1298 688 1338 -1174 -260 1500 -447 -982 1118 -132 -1197 890
5199H90p65j542K412M41l074J105J926k161K28J633j486j13J565j398j154K393
$$ 890 125 -1417 995 1436 -1638 -533 1393 -768 -540 1093 -393 -506 1059 -339 -1493 900
5215I00m69k127J629J187k050M05J394j433l52K067j102j461K524o59j771J547
$$ 900 431 -1696 -67 1120 -930 -525 869 -564 -916 1151 49 -1412 1112 453 -1318 229
5231B29J027k127R47J334k377J57K042j199j091K139r71j028J480%j752J262J229
$$ 229 1256 -871 76 1410 -967 -810 1232 33 -1058 1081 110 -918 562 562 -1190 72 1301
5248A301k025K66J521j442l26J491j002o95J784m56j760J819N88k351N63K036
$$ 1301 -724 -458 1063 -379 -705 786 -216 -911 873 417 -1343 476 1064 -1287 -724 1312
5264A312j683n41J742j177r27K445j133j626K145P21k550O93J801j762m6J587
$$ 1312 -371 -912 830 -347 -1274 1171 38 -1588 557 1278 -1272 -579 1222 -540 -586 1001
5280A001j457l10K328j302j329J713K14k098J390J200k281J070J065j823m20K159
$$ 1001 -456 -766 1562 260 -1069 644 858 -1240 150 1350 -931 139 1204 -619 -1039 1120
5296A120j022j399K257k57j713J432M81k045R92J243k073J82K017r15j362J649
$$ 1120 98 -1301 956 699 -1014 418 899 -1146 -154 1089 -984 -802 1215 300 -1062 587
5312E87n71j015J977n15j975J480J490k292n0J598q25o46J409j123r86K816p10
$$ 587 16 -999 978 463 -1512 -32 1458 -834 -884 714 -111 -757 652 -471 -1457 1359 649
5329F49k155J707J240k202K59J656j605j05J398j341m10K165n91k072J644J225
$$ 649 -1506 201 1441 -761 -502 1154 -451 -556 842 -499 -909 1256 665 -1407 237 1462
5345A462k391Q36J064j593K09J711j690p50K064m76j884K175M13k219J175P03
$$ 1462 -929 -93 971 -622 -413 1298 -392 -1142 922 446 -1438 737 1150 -1069 106 809
5361H09j528L10J418j398n79K090q91j547J937P8j616J463K76j851O42J743k277
$$ 809 -719 -409 1009 -389 -968 1122 231 -1316 621 699 -917 546 822 -1029 -387 1356 -921
5378i21K0J563o49j124J889o29j508J794N59k545J085J646j688k88J661j286j32
$$ -921 -901 662 13 -1111 778 149 -1359 435 994 -1551 -466 1180 -508 -796 865 -421 -553
5395e53J946j461j156J872L95k236J121J207j686r6J372j214J02J602j199r77
$$ -553 1393 -68 -1224 648 1043 -1193 -72 1135 -551 -647 725 -489 -387 1215 16 -961
5411i61K153j32k065J325O36j760P15J106j590L87J769j574j073J950n00j548
$$ -961 1192 1060 -1005 320 956 -804 -89 1017 -573 -186 1583 9 -1064 886 386 -1162
5427a162J538L11j904J635Q72j815k53J872j627k16J400l83j421J790l96j758
$$ -1162 376 687 -1217 418 1290 -525 -778 1094 -533 -749 651 268 -1153 637 241 -1517
5443a517J564J220k041J47J772j276p49J792j179m14J520n63j612K061O51k409
$$ -1517 47 1267 -774 -627 1145 -131 -880 912 -267 -681 839 276 -1336 725 1376 -1033
5459a033N82J524j320N1J109j379k74J816p11j858K167M23j857M50J430k016R32
$$ -1033 -451 1073 -247 -196 913 -466 -740 1076 365 -1493 674 1097 -760 -310 1120 -896 36
5476C6Q97j172m41J917j055j382J694J22j382R38Q19j891Q79J122j688m20J626
$$ 36 933 -239 -680 1237 182 -1200 494 616 -766 172 991 -900 -21 1101 -587 -1007 619
5493F19n37p39J208k25j533J567L43k033J543J188j989J31J516j332l29J549j082
$$ 619 82 -657 551 326 -1207 360 703 -1330 213 1401 -588 -457 1059 -273 -602 947 -135
5510a35q91J975l51j940J418J039j546k43J745j202m53J635j392l60J824o57j797
$$ -135 -1026 949 598 -1342 76 1115 -431 -674 1071 -131 -584 1051 -341 -701 1123 466 -1331
5527a331J424Q09j874O75J273j497J71J135j160o78K070k31k072J627M79j663
$$ -1331 93 902 -972 -297 976 -521 -350 785 -375 -1053 1017 786 -1286 341 820 -843
5543h43N82J049j367J93J543j729p05K075q01j121J587K89j468J037N63j609L72
$$ -843 -261 788 -579 -386 1157 -572 -1277 798 -3 -1124 463 752 -716 321 884 -725 -353
5560c53J500j638n42J933r97p52J671n57j227J395R38k189L54J706j653n0J296
$$ -353 1147 -491 -1033 900 -97 -849 822 265 -962 433 1371 -818 -464 1242 -411 -461 835
5577H35r56o06J772p53j368J677M14k211J017J416j784M6J282j066k57J431j179
$$ 835 -121 -727 1045 292 -1076 601 1015 -1196 -179 1237 -547 -501 781 -285 -542 889 -290
5594b90j006K026L8j628O21J245j862N39J217j288l67J880j527q01J789J94k011
$$ -290 -1296 730 768 -860 -239 1006 -856 -317 900 -388 -755 1125 -402 -1203 586 780 -1231
5611a231J373R54j788N21J291j925P0J850j177r66J745m08j178J514j94j389P99
$$ -1231 142 1096 -692 -171 1120 -805 -735 1115 -62 -1028 717 309 -869 645 451 -938 -139
5628a39J369j931K63J847j334j002J653p25r83J905l54j794J394P31j607L98J042
$$ -139 1230 -701 -438 1409 75 -927 726 1 -982 923 569 -1225 169 900 -707 -309 733
5645G33j012m87J376q33o49J812n44j715J984M8j639N89J150j160k31J661j385
$$ 733 -279 -766 610 -223 -872 940 396 -1319 665 713 -926 -337 813 -347 -578 1083 -302
5662c02m26J489p08j346J592N88j717P74R58j681L94J385j742q4J691q07r99J714
$$ -302 -728 761 53 -1293 299 887 -830 -56 902 -779 -385 1000 -742 -826 865 58 -941 773
5680G73Oj635J072N68j416L36J457j530m16J818j162n94J576q39q80J521Kj758
$$ 773 779 -856 216 784 -632 -296 1161 -369 -785 1033 -129 -723 853 14 -866 655 657 -1101
5698a101J075P97j341j01J445p10p70J632j102r79J790j88j185P13R23j340N1
$$ -1101 -26 771 -570 -671 774 64 -706 926 -176 -1155 635 447 -738 -25 898 -442 -391
5715c91Q48p01j35J115q65j059K140l99j600J166O84j219Q8R41j256L49J430j425
$$ -391 457 -244 -379 736 -129 -1188 952 553 -1047 119 803 -416 -328 613 -643 -294 1136 -289
5733b89p58K027q32j042J299N20j537N24J019j599J97J529j234p34J847o07j003
$$ -289 -1047 980 148 -894 405 925 -612 -88 931 -668 -471 1058 -176 -910 937 330 -673
5750f73J499l55j171J133M28j835M67J829j517m79J138n03o48J331o43j184J781
$$ -673 826 471 -700 433 861 -974 -507 1322 -195 -674 464 -39 -687 644 1 -1183 598
5767E98M6j951P97J717j300l52J244j224j43J343n13j179J259O68k008P13J342
$$ 598 644 -1307 -510 1207 -93 -445 799 -425 -568 775 262 -917 342 1010 -998 -285 1057
5784A057j722J68J118j101o2J470r40j247J838N7j601Q50J028j533Q64O95j665
$$ 1057 -665 -497 621 -480 -542 928 -12 -1259 579 636 -965 -115 913 -620 244 939 -726
5801g26R2J585j125n53J449r7j524J589l9j538Q59P25j455Q1J508j055m21J134
$$ -726 -634 951 -174 -727 722 625 -899 690 651 -887 -28 697 -758 -677 831 -224 -645 489
5819D89l81p76J343j95j499J040J059j768K01J404j285l50J449q85p03J285k4
$$ 489 108 -668 675 480 -1019 21 1080 -688 -487 917 -368 -718 731 -154 -857 428 404
5836D04j720J402O18j635P83Q63j181J53R81j011m98J739p40j126J241L59j422
$$ 404 -1316 86 704 -931 -148 715 -466 -313 668 -343 -841 898 158 -968 273 632 -790
5853g90K60J036j028J74R85j183o0J385p39j180J772J13j484R63P73j722N30J275
$$ -790 -530 506 -522 -348 637 -546 -606 779 40 -1140 632 745 -739 224 997 -725 -195 1080
5871A080j506l20J659q49p55J274m88p76J319J49j739N61J183j115l5J148o41
$$ 1080 -426 -746 913 64 -691 583 95 -681 638 787 -952 -391 792 -323 -358 790 149
5888A49o98J138m61j382J702N8j469J051P45j121j1J091j161J9R58n60q83J343
$$ 149 -549 589 128 -1254 448 506 -963 88 833 -288 -299 792 -369 -350 608 48 -835 508
5906E08J90j564J001P92j125j92J060r75k13J572j267m57J532k53j587J294L67
$$ 508 698 -866 135 927 -198 -390 670 -305 -518 1054 -213 -670 862 609 -978 316 683
5923F83j352L87J040j156J71J042r32o70J309l48r94J316Jj248Q32N44j462O22
$$ 683 -669 -282 758 -398 -227 815 -117 -787 522 174 -820 496 497 -751 81 625 -837 -215
5941b15Q02q25m43J673p66r23J092j32j062R65R04j987K59J672r24n52J022p00
$$ -215 587 -238 -681 992 226 -697 395 263 -799 166 1070 -917 -658 1014 90 -462 560 -140
5959a40n45J089j40j342J543M38j372K51J165j210l3R50r41l09J330p21j111J659
$$ -140 -685 404 264 -1078 465 903 -469 -218 947 -263 -296 654 -287 -596 734 13 -1098 561
5977E61L60j579R96M80j494N90M85j027J5J424j047o97J414N8j595J037P44j204
$$ 561 921 -658 338 818 -676 -86 399 -628 -613 811 -236 -933 481 539 -1056 -19 725 -479
5995d79N03N20j260L33J292r89q06J408j52j106J345J97j903J235P49j382j27
$$ -479 24 544 -716 -383 909 -80 -886 522 370 -736 609 806 -1097 138 887 -495 -622
6012f22J127n79n21J339q14n61J260k93j251J346M07j226K53R79j011j71R43o86
$$ -622 505 -74 -595 744 -70 -631 629 336 -915 431 838 -388 -135 844 -167 -338 605 -81
6030h1n29J412o28j043J280M17j293L31Q63r49P9J102j122k92J349p23r10J138
$$ -81 -610 802 174 -869 411 828 -465 -134 729 -220 -141 961 -161 -453 896 173 -737 401
6048D01K57j470O39N51r42M44N98p09l85J408o79j157J776P7j440R19L42j485
$$ 401 658 -812 -173 378 -564 -120 478 -231 -616 792 113 -1044 732 809 -631 288 630 -855
6066h55O92J040j435k44J435m01r39J608n25r37R52L84j312J77J065o44o31J219
$$ -855 -163 877 -558 -802 633 232 -707 901 376 -561 391 775 -537 -360 705 61 -570 649
6084F49p05l29J054o53j46L67K11j053M85Q26j154L29R79j083m8J106p06r42J409
$$ 649 -56 -385 669 16 -130 237 448 -605 -120 706 -448 -119 860 -223 -271 835 129 -813 596
6103E96j43j567J396L51j407N38Q56o74l26J118r78k53J125j81j281Q22O24j173
$$ 596 453 -1114 282 633 -774 -236 620 -54 -380 738 -240 -493 632 451 -830 -8 616 -557
6121e57O34P10j303K25J194r63n90J332m46p95J255j92j265R35M80j069K87J153
$$ -557 77 787 -516 -291 903 -60 -650 682 236 -559 696 504 -761 174 654 -415 -128 1025
6139A025j064l35J101r87l38J376m29j152J054P73j833N54R88q74P7M57n95m08
$$ 1025 -39 -374 727 -260 -598 778 349 -803 251 1024 -809 -255 733 -141 -64 393 -202 -610
6157f10J462o58j047J025M70j231P19L77q90J25N78q61M46O76k30j323J690j36
$$ -610 852 194 -853 172 642 -589 130 507 -383 -258 320 -541 -95 581 351 -972 718 582
6175E82j250N19P34j110O89P39j018l17J115p66m90J169m23q88R57J57j010N86
$$ 582 -668 -149 585 -525 164 903 -115 -432 683 -83 -573 596 173 -715 242 399 -611 -25
6193b5R68j227k69J083q42j85J046k91j073J561p01r10P47P78j338K65R19o36
$$ -25 943 -284 -553 530 -312 -497 549 258 -815 746 45 -865 -118 660 -678 -413 506 -130
6211a30k53P64k21q13J236k85j286J101M39r37j09J062o81k25P05l42p67J673
$$ -130 -383 381 160 -653 583 298 -988 113 552 -385 -494 568 -113 -338 367 25 -742 931
6229I31o06j099Q69M17j002N69P12j293L83J036j322k82J531l54j195R87K73r79
$$ 931 325 -774 95 512 -490 79 791 -502 -119 917 -405 -687 844 490 -705 282 555 -424
6247d24N36M96j251O39M26q33j45J191n72p69J204j45r73O29N98j113M88O87j051
$$ -424 112 608 -643 -4 422 -411 -556 635 63 -706 498 353 -620 9 607 -506 -18 669 -382
6266c82j34R58m76m87Q94l74q03J177j37j007Q4J428r68J96P57q87o2O36l48n22
$$ -382 -516 442 -34 -521 373 -1 -804 373 236 -771 -687 741 -227 -31 726 -161 -223 413 65 -457
6286d57J053j60j404P29Q84r63R9P94r32Q1J069o65n79J179k69j140N23N90q60
$$ -457 596 436 -968 -239 645 -318 -219 575 -357 -276 793 128 -451 728 459 -681 -158 432 -428
6305d28N34L62q89m8J033p23n38J272m68q03J119K15j306P51N98o67o15R42k88
$$ -428 106 468 -421 -469 564 -159 -697 575 107 -696 423 638 -668 83 681 14 -601 341 53
6324E3l31O45l42p44J241o9q22L60N16j303O14R56j093qR60n59o54R22j38j082
$$ 53 -278 367 25 -719 522 453 -369 -9 507 -796 -182 774 -319 -327 633 74 -580 342 204 -878
6344h78J148L25j207Q60J93r10N1O49l61k79J269r74n56Q61L56j258P67J87n77
$$ -878 270 595 -612 248 441 -469 -418 231 -130 -409 860 -114 -670 191 547 -711 56 243 -334
6363c34K06Q32r28J4Q47m70n26P99kj086R25J63j047M71P28p90p9R31o85n98J060
$$ -334 -128 704 -224 -210 637 167 -359 440 438 -648 277 440 -607 -136 592 -198 -277 654 -31 -629 431
6384D31l73r49J116J97j372R13N85q47n3O58n27l39J091k79q54Q48J94j216N58
$$ 431 58 -891 225 422 -950 -37 548 -299 -352 306 -221 -560 531 252 -602 246 440 -776 -218
6403b18O57r89M35O31q73pR20o64p42J583j94j229P52P16j012Q7N08n58L98L04
$$ -218 439 -550 -115 516 -357 -364 556 -108 -850 733 539 -690 62 778 -234 -147 361 -197 201 505
6423E05k94j010J355n5j098N90L79o81K49M25q62L04P21r37j46J070m18o00M63
$$ 505 211 -799 556 501 -597 -7 372 -309 -60 365 -497 -193 528 -409 -555 515 97 -503 -40
6442d0M78j100Q14O85j614M50J113j022l55J224l78j070J208j01n25L88M19j159
$$ -40 438 -662 152 837 -777 -327 786 -236 -591 633 255 -815 393 292 -233 155 574 -585
6460e85O55L14m13m57O30j75j21O55n56m45P41K92j027L41P52p84p5M60n79P4
$$ -585 70 384 -29 -486 144 -31 -152 503 -53 -498 243 535 -492 -151 601 -183 -258 202 -377 -303
6480c03P62o15o56J293Jr00N21M03j048O24K55n63j0P76m79o44J065r3p91N99
$$ -303 459 -156 -812 481 482 -418 103 506 -542 82 337 -226 -236 540 61 -583 482 389 -402 197
6500A97J45r19O79N78r51l30J014o32M5O76n44m06O57L4j023P63N24p09r9J085
$$ 197 342 -577 102 680 -271 -601 413 -219 -174 502 -42 -448 209 243 -780 -17 507 -202 -301 784
6520G84p81n46Q51j97n62O55K0j081Q92M83j089M91R49r07J4N52q43l58J368q43
$$ 784 3 -543 308 111 -451 204 224 -857 35 518 -571 -80 869 -38 -24 528 -315 -673 695 -148
6540a48m60N41O13r20J65Q56r18J96M24n36k60P00n5r56R95p6o65L13N12n74J12
$$ -148 -608 -67 546 -374 -209 647 -271 -75 349 -187 -447 253 198 -758 237 161 -504 -191 321 -253 -141
6561a41O43p57l76J116p02l60R61j9q87P63K97q40K38N90q84j08Q45o44R4O01
$$ -141 502 -255 -631 485 -217 -577 384 365 -522 241 538 -302 -64 526 -358 -466 379 -265 -171 430
6581D30l42m02P03j5p52L22O42j062N2N94k16k41Q62n99p62J298k27q06M79M42
$$ 430 88 -314 389 374 -378 -56 586 -476 -424 170 -46 -287 575 -24 -786 512 285 -521 -42 400
6601D00j111M91M58o50L43O19m01o81J253o65q61J105L92j130L38O84p82J11P51
$$ 400 -711 -220 238 -412 -69 550 149 -532 721 56 -805 300 692 -438 -100 584 -198 -87 664
6620F64q79l68J049m53p52J236r6j018O54M06o86o2Q36q21k63R42q3o63R53m11
$$ 664 -215 -583 466 13 -739 497 401 -617 37 443 -243 -305 531 -290 -553 389 306 -357 596 185
6640A85o86O87M86j126L65N07l49p95R10l22j46P16m96l66M88K67r76M42N40q58
$$ 185 -501 186 672 -454 -89 418 69 -726 184 -138 -284 432 -64 -430 58 325 -651 -209 331 -527
6660e27K43P53o59k25R95m19o71O53M31r37N43N5n38jO73o05k02J260j044n10
$$ -527 -284 469 -190 -415 580 161 -510 143 574 -363 180 235 -303 -304 369 -236 -438 822 -222 -732
6680g32J141R3r67O08N68r40J36N17n15l79J259p45n01N95N3o50O08J77p15L94
$$ -732 409 502 -465 143 711 -229 -93 424 -91 -470 789 44 -457 138 191 -459 149 326 -389 5
6700EN42j025R1J102r22j8N71k45q03J169l83p76P61L76r27J28P97o27M4M37k02
$$ 5 547 -478 -387 715 -207 -225 346 101 -702 467 84 -692 69 445 -482 -354 443 -184 -140 297 95
6721I5o71Q65q0j054J120K30r77K50O30p20J80N53p85R7P56m31j002J069K75q75
$$ 95 -576 289 209 -845 275 505 -472 -222 408 -312 -132 421 -364 -267 489 58 -944 125 400 -475
6741d75L10N09n26P2P56j018J20R97p17m20O34N04j146L24M74m65k88P70n21J30
$$ -475 -165 344 -182 -110 646 -372 -252 745 28 -392 242 746 -400 -76 398 -67 -355 415 -106 24
6761B4P31n73o64L98N88j086Q89n5o90M58N03q66j37J011n95o96J173n89k70R77
$$ 24 755 182 -482 -84 504 -582 307 252 -438 20 523 -343 -480 531 -64 -760 413 -176 -446 531
6781E31o14o09P02K60p17M43L67m68k09N67m10l55R78j52o54M19L90p06L30on65
$$ 531 -83 -692 10 270 -447 -4 363 -105 -314 253 -157 -512 466 314 -340 79 469 -237 93 87 -478
6802d78N21K86n17n68J166p2j050J073M00j045K79K27o12J03R11r70k8Q04j70
$$ -478 43 329 -188 -756 410 338 -712 361 761 -284 -5 222 -390 -287 624 -346 -374 430 260
6821B60n84O46K22j043N82J75m07o8P51r87j13P71k35n24O60j24p25P67M03q21
$$ 260 -324 322 544 -499 83 258 -149 -217 534 -453 -566 205 -30 -554 106 -18 -743 24 427 -394
6841c94M16M32n92J24K82m81j87R10l55r94Q17O10j175O34M43p04KO19o22k22
$$ -394 22 454 -138 -14 268 -213 -400 510 155 -839 -22 588 -587 47 490 -214 -212 407 -215 -437
6861d37R45o14m50P11Q4q58N85M40m81J23K12o40K15N75m09n34O82K63p10K93
$$ -437 508 -106 -556 155 239 -619 -34 406 -75 48 260 -380 -165 410 1 -533 149 412 -298 -5
6881eM97r71M94O53r47r1R47o49k86N06r6n81J071m66o40M58O89r91M28K76m10
$$ -5 492 -479 15 668 -279 -370 577 -72 -358 148 52 -529 542 76 -564 -106 583 -408 20 296 -114
6902a14j64P39m82l05P37n9r51N96M84r14J86P75m62p8L39o58k9O59n13l54M54
$$ -114 -278 461 -21 -326 411 352 -599 -3 481 -433 -247 528 66 -12 327 -331 -360 299 -214 -568 -114
6923a14P29r15j5N95q21Q75Q3n37l44P72l11n42M90N61j010N88K02j095J077M39
$$ -114 615 -300 -315 280 -541 334 417 -120 -464 308 -3 -545 -55 506 -504 84 286 -809 268 707
6943G07j079k07J410r31l28P23j33l88K69J70q42O00P26q41JP49n54m27N67o0
$$ 707 -372 -579 831 -100 -428 295 162 -226 43 213 -629 -29 697 -144 -143 606 52 -375 192 132
6963A32o50Q25pr08N75O75r46m07J254p12J53L23l34o06J137l28j007O61Q61q68
$$ 132 -518 307 300 -608 -33 642 -304 -711 543 -169 -16 307 -27 -633 504 176 -831 -170 691 -177
6983a77o1P16p66L09L49k37p00J080j00j073N26O39q61K67M74o94K81O05o34l75
$$ -177 -238 478 -288 21 370 133 -567 513 413 -660 -134 505 -356 -89 385 -309 -28 577 -57 -432
7003d32Q50j98o21N17R3n83K75M62p29J66R19o24n55R17l89l96P91n32n13O72
$$ -432 418 220 -401 116 209 -374 -99 363 -366 -200 719 95 -460 457 68 -328 463 -69 -582 90
7023I0J15n99L54Q25r31m6P59n13l70R49o53l59M83K26r72N73O09p38J64J57m12
$$ 90 205 -394 -40 785 -146 -192 567 54 -316 633 -20 -379 104 330 -642 -69 540 -198 -34 123 -289
7044b89J36O47n78m59O86K94p49K67K92n83L03Q18q13n31R90n28n55J167k43p31
$$ -289 -153 494 -84 -543 143 437 -312 -45 247 -336 -33 785 -28 -559 431 -97 -652 515 272 -459
7064d59O40K70r83L36N70o42K22M71k94m86N15l0n66P51k29n83O73L24n96J05
$$ -459 181 451 -532 -196 374 -268 -46 425 131 -355 160 130 -436 315 86 -497 176 500 -96 9
7084IL86l59n43J216n62p80Q93M2p32O54K33p00L86J50n27M4K44j22k89R63n54
$$ 9 395 36 -507 709 147 -633 260 302 -430 224 457 -243 143 293 -234 -190 54 -68 -357 606 52
7105E2p67P23M56r00O6M30l77K38P21p98j25N71n8p07N01L08q25O58L05o48p3
$$ 52 -715 8 464 -436 -370 60 -317 -79 642 -156 -281 290 232 -475 26 334 -491 167 472 -176 -249
7126b49O51n12l01Q51j71o73Q49K0n94N44j11p82N20N06p06l65P67p1o06O95l29
$$ -249 402 -110 -411 440 269 -404 445 465 -129 415 304 -478 42 548 -158 -523 244 173 -433 262 -67
7147f7l01Q28m00m90L07J018r58r4Q54o53m99R25o85M3N76j16r22P81M54r09K38
$$ -67 -368 460 60 -430 -123 895 -63 -157 697 44 -455 470 -215 -172 404 288 -634 147 601 -308 -70
7168g0O09j005k8J053o66l33P33j36p98O98K06m43J96L67q23J13Q17o57j35P11
$$ -70 539 -466 -494 559 -107 -440 293 157 -641 57 263 -180 16 383 -440 -327 490 -167 -302 409
7188D09k47k23K97J12n87L18K06o53J09P70p88q6O61m16l76P11L9o69P22J97p02
$$ 409 162 -61 236 348 -239 79 285 -368 -259 511 -277 -363 298 -118 -494 217 256 -413 309 506 -196
7209a96J7O19m54o04J051m19m12P67l47l68M98K95p71J68O75p08J87K74o49K94
$$ -196 -179 440 -14 -618 433 14 -398 369 22 -346 152 447 -324 -156 519 -189 -2 272 -377 -83
7229h3M41k32p15J008o8p97L51O14q70K57L73n16p3J023m67r06J180l71k81M1
$$ -83 358 126 -589 419 351 -446 -95 519 -351 -94 279 -237 -310 713 246 -660 520 149 -132 -91
7249i1L77m50L59K46o68p9R01n61m54P42j18p67N88L30r94O50M22p36K74N84n93
$$ -91 286 -164 195 441 -227 -306 595 34 -420 322 204 -563 25 355 -639 11 433 -303 -29 555 -38
7270c8n23J007m15l36N33n1o50L74N14o32r6P28n92k92N30k11j46M51Pq02P15
$$ -38 -561 446 31 -305 228 177 -473 -99 415 -217 -313 415 -177 -469 61 -150 -296 155 162 -640 75
7291G5K53j003M79N50m69j72P31q65P2P69k35p85P08L78q00M71K35p28K86M24
$$ 75 328 -675 -196 354 -115 -287 444 -421 -349 420 185 -600 108 486 -314 157 392 -336 -50 374
7311C74n26j95O94k84l86J135n71p44M44M88n82J67O07n99l85Q33n87k15R12j01
$$ 374 -152 -347 347 63 -323 812 241 -503 -59 429 -153 14 621 22 -363 470 -117 -332 580 479
7331D79r13L25L53o78K50N06p78L04K54k52k84J009k10r27O16N24j369P25M40
$$ 479 -434 -109 244 -434 -184 322 -456 -152 102 -150 -434 575 365 -562 54 578 -791 -66 374
7350C74m65o0N89o77OO56l35o64J008j19n76M67K31p79K25K99k76p3N72n69k20
$$ 374 -91 -151 438 -239 -233 423 88 -576 432 313 -263 204 435 -344 -119 180 -96 -169 403 -166 -386
7371c86R62n60l41P22k93k30K30J84o68L12O12p76j36P84j55o98P68k20n31N17
$$ -386 576 16 -325 397 104 -126 104 288 -380 -68 544 -232 -368 416 261 -437 331 111 -420 97
7391I7L49j059P18K35m29m30R27m09j17M47Oj043P61Q0n34J97O81o85l1O52m19
$$ 97 446 -613 105 340 -89 -519 408 -1 -118 329 335 -708 53 133 -401 -204 477 -208 -239 413 -6
7412fj32N26r26J26P49J02q35M32L33n19K93K72l15n18Q36l97l98R81k20p14N02
$$ -6 -138 388 -538 -412 337 439 -396 36 369 -150 143 415 100 -418 418 21 -377 604 384 -330 172
7433A72j68k55K19L19o33M62M71o14l68Q56j78p11N76M1n40L03M52q83K28O82
$$ 172 4 -251 -32 287 -346 116 587 -27 -395 461 283 -428 148 189 -351 -48 404 -479 -251 431
7453D31l47m63N41On06J81M88n87K80L35p77K14N30o00o7P19n41l31J003k95p64
$$ 431 84 -379 162 168 -338 -157 331 -256 24 359 -418 -204 326 -274 -341 378 -163 -494 509 214 -550
7474e50P71J56o01J72L99l49O7J97m53j93Q40k76m90L94K87r30K76Q61o78L5P89
$$ -550 221 377 -224 -52 347 -2 65 262 -191 -384 456 180 -310 84 371 -559 -283 578 -100 -65 724
7495G24j024j20P32m59m14P63K47q81M47M85q54M17L47p18J13N65k64j87M72m68
$$ 724 -300 -420 312 -147 -561 202 449 -432 15 500 -354 63 410 -308 -195 370 106 -81 391 -77
7515g7k89P66l65p15M44Q25p62k33O19k28l23O63j98n90P46%p09M65L82n75p4
$$ -77 -366 400 35 -680 -236 589 -173 -406 213 -15 -338 325 127 -463 283 283 -426 39 421 -154 -228
7536b28N52m31n4M49l03l79Q05k02q03N43L05k67k06N75o07p6Q18l99o42J001
$$ -228 324 -107 -161 288 -15 -394 411 209 -594 -51 254 -13 -219 356 -251 -327 491 92 -550 451
7556D51l07p80Q26K87j048O23J50o45K46P35p19l57Q47m01j82K65N28p93N9L12
$$ 451 144 -636 190 477 -571 52 202 -443 -197 538 -181 -538 309 -92 -274 -9 519 -274 -215 97
7576I7l72k7J088p32m48Q71m44k30O95o29m52N88K40m43L8O93j031N43L04l73
$$ 97 -275 -302 786 54 -394 477 33 -197 498 -131 -583 5 245 -198 -160 533 -498 45 349 -24
7596b4m9L11j26n85Q56m7p37J82P31p48L03K22n90M1O60k63p71R44J04r21M39
$$ -24 -73 238 112 -473 383 336 -401 -219 512 -236 67 289 -301 -260 400 137 -634 310 414 -507 -68
7617f8M32m92M71L6n64o6N39n54k27P64l2o11N53n6k79o2N07n88J58O69o06l27
$$ -68 364 -128 343 379 -185 -251 288 -266 -493 271 239 -372 181 125 -154 -216 291 -297 -139 530 -76 -403
7639d03Q16q5m72K07J80m04j2M46n19l27J048m32k59M19k76j71O59k91p06M78
$$ -403 413 328 -144 63 243 -161 -173 273 -246 -573 475 43 -216 203 -73 -244 415 124 -582 -104
7659a04P83j020M2Q50o94J19M49l10j60J13N6q53O67N76p18m1M43m91J41L19m00
$$ -104 679 -341 -299 551 -143 -24 425 115 -45 68 124 -729 -62 514 -204 -245 198 -293 -152 167 -233
7680b33j2O88k02n59K85M8j41LK57l84l3M32m89j18O42k10k71M78j36n17L79N3
$$ -233 -245 443 241 -318 -33 15 -126 -123 134 -250 -283 149 -340 -458 184 -26 -297 181 45 -472 -93 -40
7702d0n0K57k17j67P7Q02p39o77J175k54p46P74L8o89N87K47n14j68L58p6q4L11
$$ -40 -90 167 -50 -217 -140 662 -77 -754 421 167 -579 195 233 -456 131 378 -136 -304 54 -22 -106 205
7724B05j74m45P56K13j368P42M29m65n8N98n35JM23m79k09O91k31m67M64N55r98
$$ 205 31 -414 342 555 -813 -71 358 -107 -165 433 -102 -101 322 -157 -366 325 94 -373 91 646 -352
7745c52K06L92n81N28L19n58l09P69j69m82O16r4o28L39K62m49k69O38j41m71
$$ -352 -146 246 -335 193 512 -46 -355 414 245 -237 379 285 -343 -4 258 -191 -460 178 37 -434
7765d34R37k97n93M67J35o39P06j13p33L33O77m36k61L12K06o73O19j50n33M50
$$ -434 503 206 -387 80 215 -424 282 169 -564 -231 446 10 -251 61 267 -406 213 63 -470 -20
7785b0M01r35M69N39p83J75M99m66J58L59k72n35L06N02p95K89N80o15j03O71
$$ -20 381 -554 -85 454 -329 -154 345 -121 37 396 124 -411 -105 397 -398 -109 471 -144 -247 424
7805D24o68l1Q33n79l43M15J55l01J49K45n63RM26n30NO77j08r77J137k73n63
$$ 424 -244 -275 558 -21 -364 51 206 -95 54 299 -264 -255 171 -359 -354 323 215 -762 375 102 -461
7826d61M94l7p14P23N40p64Q9O31n92l27O55k01n03P74K6o35O71j01n01o0M97
$$ -461 33 -4 -718 5 545 -219 -130 501 -91 -418 237 36 -467 307 333 -302 369 268 -233 -293 204
7847B04l77m79O35ll27M46l43n2M35J26o31J69K74l61J20J34m7l95P65k67m09
$$ 204 -173 -652 -17 -20 -347 99 -244 -296 139 265 -366 -197 77 -284 -164 -30 -77 -472 293 26 -383
7868c83P1P49o47J43K52m44R4N67o29j30N04J07n75L13K58o24K24L40p01N26J3
$$ -383 -312 437 -210 -67 185 -259 -165 402 -227 -357 147 254 -321 -8 250 -374 -150 190 -511 15 28
7889B8l77r9N43k62n60J194o17k25M59J44o57K37P46p09N2N00o06j55N52k17n12
$$ 28 -349 -448 95 -167 -727 467 -150 -375 84 228 -429 -192 554 -155 -103 397 -209 -364 188 -29 -541
7910e41Q20j62m74K32N07n05J78J73m48L4Q03n42q80J127l52m18N75K88n26k09
$$ -541 279 117 -357 -125 382 -123 55 228 -220 -186 617 75 -805 322 -30 -448 127 415 -111 -320
7930c20N14k02o9P99o22n88N23m8l45K44N46l99n0M05o56O6O39m63l38N65J25
$$ -320 194 -8 -77 722 100 -488 35 -13 -358 -114 432 33 -17 388 -268 -202 437 -26 -364 201 326
7951C26p18M10N6o33L32N67p03k13J198n94j80N85o18j23O89k84m29M38J28n65
$$ 326 -392 18 74 -559 -227 340 -363 -576 622 28 -152 433 -185 -308 381 97 -332 106 234 -331
7971c31L95J25k77l15O28l16j67N28j12o73N59J55l33K78j26l82o1O06l66Q0L7
$$ -331 64 189 -88 -403 225 -91 -258 270 158 -515 44 199 -134 144 18 -364 -425 181 -185 -105 -68
7992f8L90q60Q76j60l50K48J70k66j46O31n39k66O04j92m64O05l11l30M40K92
$$ -68 322 -538 338 178 -172 76 246 -20 -166 465 -74 -340 264 72 -392 213 -98 -428 12 304
8012C04q27N09J39l72O6N80n53o2P24p08k77N70L1l79J24M76p46L63L71n08qL89
$$ 304 -523 -14 125 -247 -181 399 -154 -216 508 -200 -477 93 124 -255 -131 345 -401 -38 333 -175 -183 206
8034B06m2n03N30%p09P70k98k87L63K44j01l66M45k76n56Q74j4o05L20L55m96
$$ 206 164 -339 191 191 -518 252 -46 -333 30 274 173 -193 252 -24 -580 294 280 -325 -5 350 -146
8055a46J32J49l08N2M77n63j13P41o38M3N13J65m81J59O7n91L88L28o62K97L99
$$ -146 -14 135 -173 -121 356 -207 -320 421 -217 -174 339 504 23 182 249 -342 46 374 -288 9 408
8076D08l90l48M82j06l06K69L62n51L83M89r03R9P53n72m70P91k81m22N06Ro57
$$ 408 18 -330 152 46 -260 9 371 -180 203 692 -211 -112 641 69 -401 390 109 -313 193 202 -455
8097d55N46O53r35R3O52p20l28O50j8l68N27Pp20O78Q1m57R5N35m76k47M71j31
$$ -455 91 744 -191 -98 554 -166 -494 156 138 -230 297 304 -416 262 343 -114 -19 516 40 -207 264 133
8119A33k55N08k19p04M25L45o37J36P01n47R5M16l20m60P21l01k55L01J29m04
$$ 133 -122 386 167 -537 -112 233 -404 -268 433 -114 -19 397 77 -383 338 37 -218 83 212 -192
8139a92Q6N36o49J05Q48q59k01O91l96m01N44Q6o01N11k08q2J73K20j97m41P74
$$ -192 -106 430 -219 -114 734 -125 -326 365 -31 -432 112 198 -403 108 -100 -182 -9 211 14 -427 347
8160C47m06k87N18l27k92N95J65l51o5L85m07k18M98q2k43M16k32k73M48p7k71
$$ 347 -59 -346 172 -155 -447 148 313 -38 -103 282 -125 -343 155 73 -170 246 14 -259 189 112 -159
8181a59K66kk76j07N01l73o9P08l42p32
$$ -159 107 105 -171 -278 223 -150 -219 489 147 -585
8191e85
$$ Imaginary data points
##PAGE= N=2
##DATA TABLE= (X++(I..I)), XYDATA
0@%%%%qQqJ6j6J7k5L2m0M9n7P2q8J04j21J42j67J93k22K57k96L40l89M38m94N61
$$ 0 0 0 0 0 -8 0 -8 8 -8 9 -16 16 -24 25 -32 40 -48 56 -65 77 -90 103 -119 138 -158 182 -207 231 -263 298
30B98o33P10p95Q89r91J105j231J365j512J676j857K057k278K521k794L102l448
$$ 298 -335 375 -420 469 -522 583 -648 717 -795 881 -976 1081 -1197 1324 -1470 1632 -1816
47a816L841m291M819n448O202p125Q296r835J1949j5048K0033k9332N2303k04646
$$ -1816 2025 -2266 2553 -2895 3307 -3818 4478 -5357 6592 -8456 11577 -17755 34548 -170098
61a70098l41687M83709K12384j64310q6163o6664m9426K15179K9569j86302R3253
$$ -170098 -511785 -28076 184308 19998 -66165 -132829 -182255 32924 62493 -123809 -30556
72c0556Q9576k67206J9368L21784n9417k11707Q1532K3374j3924J50042r5209
$$ -30556 59020 -208186 -188818 132966 73549 -138158 -56626 -33252 -47176 102866 7657
83G657k39444K10690K18107k45924j08781J91952l303k3076R9199j31716j05935
$$ 7657 -231787 -21097 197010 -48914 -157695 34257 30954 7878 107077 -24639 -130574
94a30574K05845P840j79520J37217J02450k02549J9264J63294j13720k6365J46081
$$ -130574 75271 83111 -96409 40808 143258 -59291 -40027 123267 9547 -16818 129263
105A29263j35176j10620K24660J8341k03512Q4271J05865j08597K2619K3412j44850
$$ 129263 -5913 -116533 108127 126468 -77044 7227 113092 4495 27114 50526 -94324
116i4324J13170J90337k38880j58092K69344O1332j83516N8159M3859j19512O4614
$$ -94324 18846 209183 -29697 -187789 81555 142887 -40629 17530 61389 -58123 6491
127F491M7969j37331R8530J48800k22170r0121K58377M676j76153O2175J7221
$$ 6491 54460 -82871 15659 164459 -57711 -147832 110545 115221 -60932 1243 18464
138A8464p6478J23220O025j86625J25738J74981k22499r1532K28535j8478j44033
$$ 18464 -58014 65206 71231 -115394 10344 185325 -37174 -128706 99829 81351 -62682
149f2682Q7295M228q1080J13613p91j47305J31492J07072k19590j8013K01463
$$ -62682 24613 28841 -52239 61374 60583 -86722 44770 151842 -67748 -85761 115702
160A15702r2790j02326J61243j6110j33891J03399K5313j21204J04332O5849j87075
$$ 115702 22912 -79414 81829 65719 -68172 35227 60540 -60664 43668 109517 -77558
171g7558J4779J53178j00448k7042J56774j03713j46304J57548N4235j20323O6710
$$ -77558 -62779 90399 -10049 -37091 119683 15970 -130334 27214 81449 -38874 27836
182B7836P936j65415R7338J71885j48496p4347J34853o3736p2106J47017k3661
$$ 27836 35772 -129643 -32305 139580 -8916 -83263 51590 -12146 -84252 62765 39104
193C9104j41789R7211M8056j10326Q7214O2238j84785K7422J94817j12574j19999
$$ 39104 -102685 -5474 42582 -67744 19470 81708 -103077 -75655 119162 6588 -113411
204a13411J38913q872r9927J25181K6166j48562N3306P2148j00365O3998R1973
$$ -113411 25502 16630 -83297 41884 68050 -80512 -27206 44942 -55423 8575 100548
215A00548j80831l4217K11198m5628j35729J21570J7109j37234P7152O7910j07728
$$ 100548 -80283 -114500 96698 51070 -84659 36911 54020 -83214 -6062 61848 -45880
226d5880N0936O9493j51696J9770J83897j05058j27925J46862K2692j20157O4324
$$ -45880 5056 74549 -77147 -57377 126520 21462 -106463 40399 63091 -57066 7258
237G258K4963q6633J00231M4657j86632M1226J96083j20097j26497J46703J9343
$$ 7258 32221 -54412 45819 90476 -96156 -54930 141153 21056 -105441 41262 60605
248F0605j06198N9750J3024o5737R9859P900j69559P9243J58573j51729q2971
$$ 60605 -45593 14157 27181 -38556 61303 69203 -100356 -21113 137460 -14269 -97240
259i7240J65735j2593j03253Q0355l859q1762J08146K3806j57932N4795J23335
$$ -97240 68495 55902 -47351 33004 29145 -52617 55529 79335 -78597 -23802 99533
270I9533j16166k9659J22829o7644o5550J15082l5075r5562J25279K0311j62520
$$ 99533 -16633 -46292 76537 8893 -56657 58425 23350 -72212 53067 73378 -89142
281h9142N5612J16339r6130o664Q5659j04833k9692J52261n1111j22119J10556
$$ -89142 -33530 82809 -13321 -19985 65674 -39159 -68851 83410 32299 -89820 20736
292B0736L6142j14824N3113N5633r4166M6765O7986j44962M934J85911q3102j50923
$$ 20736 56878 -57946 -4833 50800 -43366 3399 71385 -73577 -68643 117268 34166 -116757
304a16757J24518O4632j01273K4961K2548o6350P8175L9642j55285L4623J72039
$$ -116757 7761 72393 -28880 -3919 18629 -47721 30454 70096 -85189 -50566 121473
315A21473j09994j19877J45289L5576j10390L7397J5009o3777R2759L3477j61458
$$ 121473 11479 -108398 36891 72467 -37923 -526 14483 -49294 43465 76942 -84516
326h4516L4059J60415r7783r5045J16886J312p7618O4809r265p2362J00796K2624
$$ -84516 -50457 109958 12175 -82870 34016 35328 -42290 22519 13254 -59108 41688 64312
338F4312j54878N2763J40289j11948o7818J19219k5429p2322Q5426r273q2535
$$ 64312 -90566 -37803 102486 -9462 -77280 41939 16510 -55812 29614 20341 -62194
349f2194Q5191K3870j16963N5430Q4455j10043o806J10780p7331n4738J25344
$$ -62194 22997 46867 -70096 -14666 69789 -40254 -47060 63720 -13611 -68349 56995
360E6995k5712j10218R0621M3512j03403L7400N8706q7068K5069Q1651j01820
$$ 56995 31283 -78935 11686 55198 -48205 -10805 47901 -39167 -14098 67553 -34267
371c4267k3769J35164n0575j05603J01090L0711r8067M8001L8746q9779N0410
$$ -34267 -58036 77128 26553 -79050 22040 52751 -45316 2685 41431 -48348 2062
382B062P6009j22967j6243J41242n4200j01376R4554K2758p9863N1641J3896q0528
$$ 2062 78071 -44896 -61139 80103 25903 -75473 19081 41839 -38024 13617 27513 -53015
394e3015O8016N0903j29082J8089J34406q9014q5418J20880O706r6647N6687K7369
$$ -53015 15001 65904 -63178 -45089 89317 303 -85115 35765 42471 -54176 2511 29880
406B9880p2497N2649L1699j02954M1601R7574j06341m2188J29521l0292r3888
$$ 29880 -42617 10032 41731 -61223 -19622 77952 -28389 -70577 58944 28652 -65236
417f5236Q0578J9588p9251N7614K9325r6386M7315Q1828j06884k1956J20462m5595
$$ -65236 15342 34930 -44321 13293 42618 -53768 -6453 75375 -31509 -53465 66997 21402
429B1402p9841Q3599Q802o8736N8625P672q5041O9474N9538j21904L622J23809
$$ 21402 -58439 25160 33962 -34774 23851 31523 -53518 15956 75494 -46410 -42788 81021
441H1021o7579p5471R5889K189p2873N7481Q312p3718O2613L8309j04717K5793
$$ 81021 13442 -62029 33860 36049 -36824 20657 28969 -44749 17864 56173 -48544 -22751
453b2751R3559q4926l5888J03920l8585p2833Q9876O462r4613O0495M9954r0081
$$ -22751 70808 -14118 -50006 53914 15329 -57504 32372 38834 -55779 4716 54670 -35411
465c5411J8040O6283p3800j191Q8245o9591n4766J09990p775r7189O4565L9574
$$ -35411 -17371 48912 -24888 -26079 62166 -7425 -62191 47799 40024 -57165 7400 46974
477D6974q2070L3296N0293q2579J8936Q7420q9483m5460J25311j3500j06521N5933
$$ 46974 -35096 -1800 48493 -34086 -15150 72270 -17213 -62673 62638 49138 -57383 -1450
489a450M6105n4595K6264O778p3839O5714P5371j26125l4684J41999k2801j07683
$$ -1450 44655 -9940 16324 23102 -50737 14977 90348 -35777 -70461 71538 48737 -58946
501e8946O0671L7865n6698L0907N978o7265O1956N5060j16691q963J26027m3291
$$ -58946 1725 39590 -17108 13799 19777 -47488 14468 69528 -47163 -56126 69901 26610
513B6610q5652O6417J2573m7507N5232p848q7757O9406O9761j06532j5241R7456
$$ 26610 -59042 7375 19948 -27559 27673 19825 -67932 1474 71235 -35297 -50538 46918
525D6918m3903m8565P2925j7009n4272O4937k645p5367O6923M4019j00986J0962
$$ 46918 3015 -45550 27375 10366 -43906 21031 18386 -56981 9942 53961 -47025 -36063
537c6063Q5560n9065k5019P6577m8616n3371J00167O647j00803L9812N3761n6417
$$ -36063 49497 -9568 -34587 41990 -6626 -59997 40170 46817 -53986 -14174 39587 -16830
549a6830J6886L2874p3542K2334Q8228q0472n5828J11143l520r9142N2461M8715
$$ -16830 56 32930 -40612 -18278 69950 -10522 -66350 44793 41273 -57869 -5408 43307
561D3307o3991J5124K7273o2713L8565P2054r8426m3722J19861m233r1481M0843
$$ 43307 -20684 -5560 21713 -41000 -2435 69619 -28807 -72529 47332 43099 -48382 -7539
573g539K4328m4611M5886J0503q6555M5625P9210r5707l3299J10330k2756q1245
$$ -7539 16789 -27822 18064 28567 -57988 -12363 66847 -28860 -62159 48171 25415 -55830
585e5830N5935K2793m7540L7138J398o7980N8971N6895j00829j2477J01649l8556
$$ -55830 105 22898 -24642 12496 13894 -54086 4885 61780 -39049 -51526 50123 11567
597A1567n8372O8320o950n8765O2880J7192q1585L4015N3605o6349M633O2605
$$ 11567 -46805 21515 14565 -44200 18680 35872 -45713 -11698 41907 -24442 -19809 42796
609D2796o1027k3463Q7541l0276o9198O7805J6113p0143M2971L5383p5647J7761
$$ 42796 -18231 -41694 45847 15571 -53627 14178 30291 -39852 3119 38502 -37145 -19384
621a9384O4462o3358j4143P8755m7726n9182Q4809J6662p6169K7086K4334m7470
$$ -19384 45078 -18280 -32423 46332 -1394 -60576 24233 40895 -35274 -8188 16146 -31324
633c1324M4608L4452r3625O003R7960n2594n7476P9608j962o9562N0818K7432
$$ -31324 13284 47736 -45889 -39886 58074 5480 -51996 27612 25650 -43912 6906 34338
645C4338o1157K5825K8281o3693K9440O8151q0317l6427R4305j2476o4371N3394
$$ 34338 -26819 -994 27287 -36406 -6966 61185 -19132 -55559 38746 26270 -38101 15293
657A5293L479o6013N2163M1208p6054P567N4171n5313k762P6793n2533o0729P8964
$$ 15293 18772 -47241 4922 46130 -29924 -22357 31814 -23499 -26261 50532 -2001 -62730 16234
670A6234J4592o5403L3905J7991n8465L8780M4765p6146k41P4307n4223l8927
$$ 16234 30826 -34577 -672 17319 -41146 -2366 42399 -33747 -33988 40319 -13904 -52831
682e2831Q8640r091q4551M1423M2464l8457J8232K936o6588M5593P7401q0302
$$ -52831 35809 26718 -57833 -16410 26054 -12403 5829 8765 -57823 -12230 65171 -15131
694a5131m4450Q7858j0857o0805N6079J6942o2001K8052K4598n2933L5940M8953
$$ -15131 -59581 28277 17420 -43385 12694 29636 -32365 -4313 20285 -32648 3292 52245
706E2245q1810j8155R2605k1804n9027M6748m83m1671N5960Q034q0898L5944O4699
$$ 52245 -29565 -47720 44885 23081 -35946 10802 10319 -31352 24608 32642 -48256 -12312 52387
719E2387o5520j6419O3331l9110l1923O8533j6053n8886N6440J5472o8357L2750
$$ 52387 -13133 -29552 33779 -5331 -37254 31279 15226 -43660 12780 28252 -40105 -7355
731g355M4198n9367L845M8191n5360p262Q0076m1782o6736P5346K3438p7283K1210
$$ -7355 36843 -22524 -18679 29512 -25848 -33110 46966 5184 -61552 13794 37232 -40051 -18841
744a8841M4080m0148Q162K1775n7119K2813Q0315o6493o4530Q7041K2590p2467
$$ -18841 25239 -14909 -6747 15028 -42091 -19278 61037 -5456 -69986 17055 39645 -32822
756c2822K1861K9392l9036K7060K2318o6896K1879P7339o2907n1130Q1435Q850
$$ -32822 -10961 18431 -20605 6455 28773 -38123 -16244 61095 -1812 -52942 28493 37343
768C7343o4875K6623K1047l0343L5972L392p7135L7984Q3771o8459n3151P0676
$$ 37343 -27532 -909 20138 -10205 25767 29159 -47976 -9992 73779 5320 -47831 22845
780B2845l51m3566M3936J169n2411L9161K0792o1722K6609N2741o3723j7702O7125
$$ 22845 22494 -21072 22864 24033 -28378 10783 31575 -30147 -3538 49203 -14520 -32222 34903
793C4903k7256l6267N7018j3261n6190N6560K2574p5558J7390N8125m1218r654
$$ 34903 7647 -28620 28398 15137 -41053 15507 38081 -37477 -20087 38038 -3180 -12834
805a2834L5626m6808p287P9632k8792p1353N4251K6605n6976K7398L5951n3313
$$ -12834 22792 -24016 -31303 48329 19537 -51816 2435 29040 -27936 -538 35413 -17900
817a7900N984M1127n0225Q90P7721m5821o9880O8951L4518n6897J0000J7876l6063
$$ -17900 -11916 29211 -21014 -20124 57597 11776 -58104 10847 45365 -11532 -1532 16344 -19719
830a9719L3309K8662p3911M140Q2465m2136n5518O4838P255o0416L3203K7947
$$ -19719 13590 42252 -31659 -27519 54946 12810 -42708 22130 29385 -31031 2172 30119
842C0119m3982J7109J8548n7285K2898P0091n6301m7035O2928l006m2752M5864
$$ 30119 -13863 3246 21794 -35491 -12593 57498 1197 -45838 17090 14084 -28668 17196
854A7196N407n9562L1678L3775n4343J4029N1762n4228k3508O4622k0159m3094
$$ 17196 22603 -36959 -5281 28494 -25849 -11820 39942 -14286 -37794 26828 6669 -36425
866c6425N2364M380n3866L3563K3978n1635K1913M1182n6170m719O1230l9740
$$ -36425 15939 20319 -33547 16 23994 -27641 -5728 35454 -20716 -25435 35795 -3945
878c945l6718P0205n83o3884L2306K6754m3715K1879K8054n3409R252N1563m9540
$$ -3945 -40663 29542 28959 -34925 -2619 24135 -19580 2299 30353 -23056 -13804 37759 -11781
891a1781k1297P2698j8353o0748M5860J8001n0985K9423L0907n5502P770M5421
$$ -11781 -33078 39620 21267 -39481 6379 24380 -26605 2818 33725 -21777 -14007 31414
903C1414m5680r478O3209l1632m8920N4308O860n0639L7362K3645n7207J5477
$$ 31414 -14266 -23744 39465 7833 -41087 13221 20081 -30558 6804 30449 -26758 -11281
915a1281M0289m8371P35N8690m2539l9001O3098k296n4487M1571K5823n2667J0376
$$ -11281 29008 -19363 -18628 40062 -2477 -41478 21620 19324 -35163 6408 32231 -20436 -10060
928a0060K7575l7059J8307M2679n9611k0849P6008j7058n9536M9516K4843n5351
$$ -10060 17515 -19544 -1237 41442 -18169 -39018 36990 19932 -39604 9912 34755 -20596
940b0596J2025K6670l4440K0647L3470n9319q286O9673k7610n0015N2718J2327
$$ -20596 -8571 18099 -16341 4306 37776 -21543 -29829 39844 12234 -37781 14937 27264
952B7264n0590K4350J6554m3474K9716L6856o2554q010O3771l0264l8367N4120
$$ 27264 -23326 1024 17578 -25896 3820 40676 -21878 -29888 33883 3619 -34748 19372
964A9372j76m8160L1644J1902m2577L4553K8916o3199J617N7331l5977k2179N5253
$$ 19372 19196 -28964 2680 14582 -27995 6558 35474 -27725 -26108 31223 -4754 -26933 28320
977B8320k0938m5726N1604J1110n5736K9077L4731n0612J877M0125l4948j760
$$ 28320 7382 -38344 13260 24370 -31366 -2289 32442 -18170 -16293 23832 -11116 -12876
989a2876M9611m0616l4512O6709j553o4238L7331L7366m9864K026L0926l4851
$$ -12876 36735 -3881 -38393 28316 26763 -37475 -144 37222 -12642 -10616 20310 -14541
1001a4541J0462M7115n0891l1099O8589n124n7951L7335K6301m5197J1237K1202
$$ -14541 -4079 43036 -7855 -38954 29635 24511 -33440 3895 30196 -15001 -3764 17438
1013A7438l8928K2298M2727o1402k3697P4108j0723n7220L8791K0934m3080J5995
$$ 17438 -21490 808 43535 -17867 -41564 32544 21821 -35399 3392 24326 -18754 -2759
1025b759J6818l8739K5744L5703n9807j1861O6798k2192m2841M6724L039m6589
$$ -2759 14059 -24680 1064 36767 -23040 -34901 31897 9705 -33136 13588 16627 -29962
1037b9962L2727J9472m8567K1270L8317n0174p649N2542k7354k5415M8475j4514
$$ -29962 2765 22237 -26330 -5060 33257 -16917 -24566 27976 622 -24793 23682 9168
1049I168m2993M6901J3071n4540K4507L6850m7772j16M2468l6705j1735N4737
$$ 9168 -33825 13076 26147 -28393 -3886 32964 -14808 -14924 27544 -9161 -20896 33841
1061C3841k6469m5688N2267J3625n3107K3092K8417m2082Q809L0611m1672L405
$$ 33841 7372 -38316 13951 27576 -25531 -2439 25978 -16104 -7295 23316 -18356 -14951
1073a4951N3672m2177l9763O4518N972n8338K6631K7668m0094J1481K4770m1293
$$ -14951 38721 -3456 -43219 21299 27271 -31067 -4436 23232 -16862 -5381 19389 -21904
1085b1904J0388M8427m5933k8369O1531o684m9048L7552J5712m5416K2076K6449
$$ -21904 -11516 36911 -9022 -37391 24140 17456 -31592 5960 21672 -23744 -1668 24781
1097B4781m5154J0786M4231m4120j9359N6484j5641m0540M3247O385m5637K7830
$$ 24781 -20373 -9587 34644 -9476 -28835 27649 12008 -28532 14715 21100 -24537 3293
1109C293K3559m4941J3834L5902m3883n718N1692l0867l2330N4576j279n3409
$$ 3293 26852 -18089 -4255 31647 -12236 -17954 33738 2871 -29459 25117 23838 -29571
1121b9571L1694K6089m2789J2014K7545m0112M977M2097l9597j9011N8437j6957
$$ -29571 2123 28212 -14577 -2563 24982 -15130 -10153 31944 -7653 -26664 31773 14816
1133A4816n1517M3916K1348m8197J5343K6299l9048J0613L7047m4764j1391N8079
$$ 14816 -36701 7215 28563 -19634 -4291 22008 -17040 -6427 30620 -14144 -25535 32544
1145C2544k1401m4763M4421R925m2714K6580J8309m5384J7325L7526m6286n926
$$ 32544 11143 -33620 10801 20726 -21988 4592 22901 -22483 -5158 32368 -13918 -19844
1157a9844N2414k9204l4072N0662q93m4840L2678J7194m5692J8835L2069m3361
$$ -19844 32570 3366 -30706 19956 19063 -25777 6901 24095 -21597 -2762 29307 -14054
1169a4054L65M3119l4411j7530N0977j9431m3451M8621J5032n4612J6573L3624
$$ -14054 -13689 29430 -4981 -22511 28466 9035 -34416 14205 29237 -25375 -8802 24822
1181B4822l6242K849L0707l6763m492M9249l0080l6811N3601N019n4084K5105
$$ 24822 -11420 -8571 22136 -14627 -19119 30130 50 -36761 16840 21859 -32225 -7120
1193g120K9944l8244O500K5834l7049N466M7359m0025l2819N9085L537n1350K3974
$$ -7120 22824 -15420 -8920 16914 -20135 -14669 32690 -7335 -40154 18931 22468 -28882 -4908
1206d908K1022l3122J8114J8856m4739J1258M7655m1599k4937N5945q450m5425
$$ -4908 16114 -17008 1106 19962 -24777 -13519 34136 -7463 -32400 23545 15095 -30330
1218c0330L6266J4316l9590K0582K0203m2956J4153M0893m2678j6166N0061j7325
$$ -30330 5936 20252 -19338 1244 21447 -21509 -7356 33537 -9141 -25307 24754 7429
1230G429l1406M1947l750m4276L6921K3691n1664Q152L9389l4106o988L9259k9227
$$ 7429 -23977 17970 14220 -30056 6865 30556 -21108 -12956 26433 -7673 -14661 24598 -4629
1243d629k0897M9208j2011m3770M0587J6904n1474J5461L6140l5303k556L0962
$$ -4629 -25526 23682 11671 -32099 8488 25392 -26082 -10621 25519 -9784 -12340 18622
1255A8622l3863n318N4247k7271m9904M9007K4204m7263R068K1638k9791J4812
$$ 18622 -15241 -20559 33688 6417 -43487 5520 29724 -17539 -8471 13167 -16624 -1812
1267a812K8202m4025l772N2340k8247l6915N1851O480n1127K1687K6015l2327
$$ -1812 26390 -17635 -21407 30933 2686 -34229 17622 24102 -27025 -5338 20677 -11650
1279a1650J2076K0573m3542O959N1940l3090l4891M5012J037l5071L1282P330
$$ -11650 426 20999 -22543 -15584 36356 3266 -31625 13387 14424 -20647 10635 17965
1291A7965m4134K3784L0660m3434J110M0909l3644j8726M8208j2885l7018L6404
$$ 17965 -26169 -2385 28275 -15159 -14049 26860 -6784 -25510 22698 9813 -27205 9199
1303I199M561m0553K9134K4009m7833M857L8443k9694p777L7370k9990k3746N4722
$$ 9199 13760 -26793 2341 26350 -21483 -16626 21817 -7877 -15654 21716 -8274 -32020 22702
1316B2702l604n3679K9129K9121l8805O197K6547l2729L275L6928l4551j7307
$$ 22702 19098 -34581 -5452 23669 -15136 -8939 17608 -15121 -11846 25082 -9469 -26776
1328b6776N2757j4137m7409M0056K1910m4486J0688K4767l2726J0032L3040m1057
$$ -26776 25981 11844 -35565 4491 26401 -18085 -7397 17370 -15356 -5324 27716 -13341
1340a3341j3315N4144j6123m2111L7792J1499l8179K0384J7306l8703J4859L2934
$$ -13341 -26656 27488 11365 -30746 7046 18545 -19634 750 18056 -20647 -5788 27146
1352B7146m1834p406M8519k3400l2622M2840J613m0221K7476J6471m0274J5887
$$ 27146 -14688 -22094 26425 3025 -29597 13243 14856 -25365 2111 18582 -21692 -5805
1364e805K9608l8781k627M0298k6248j8752M1965j4894l5692M3022J2561n0378
$$ -5805 23803 -14978 -17605 22693 -3555 -22307 19658 4764 -30928 12094 24655 -25723
1376b5723J5098L3290l1747M9K9027l2041o536M5573k2160l4521M3515N427m4489
$$ -25723 -10625 22665 -9082 -9033 19994 -12047 -18583 26990 4830 -29691 13824 19251 -25238
1389b5238K5511K5150l9261M249K9318l0625J405M0221l5954k9130N4334M723
$$ -25238 273 25423 -13838 -9589 19729 -10896 -9491 30730 -5224 -34354 19980 24703
1401B4703m7655J9717J8356l1204J7813K1339m1704L012M1516l0952j8734M6297
$$ 24703 -22952 -3235 15121 -16083 1730 23069 -18635 -15623 25893 -5059 -23793 22504
1413B2504j3896m1044L7847J6339l9821J4281K0284l6464J1231L7626l6782j7630
$$ 22504 8608 -32436 5411 21750 -18071 -3790 16494 -19970 -8739 28887 -7895 -25525
1425b5525M2180j2229k4982L6857m949m2934L2969K6724m2074L044K9911l0230
$$ -25525 16655 4426 -20556 16301 11352 -31582 1387 28111 -13963 -10919 18992 -11238
1437a1238j232L9485k7883k5231M2942l275l7710L2175J5808m3674J1778L1053
$$ -11238 -12470 27015 -868 -26099 16843 13568 -24142 8033 23841 -19833 -8055 22998
1449B2998k9327l53K7974l2458q774N0404j7700m4946L7308J8589l9005J2216
$$ 22998 -6329 -6682 21292 -11166 -19940 30464 12764 -32182 5126 23715 -15290 -3074
1461c074K1211l2324P915K9042l3749o262M3240k4283l2599M4005O752m1942J9362
$$ -3074 18137 -14187 -6272 22770 -10979 -17241 25999 1716 -30883 13122 19874 -22068 -2706
1474b706J8359l3399J4748K6992m0078m364M3921k1897k5459L7995n378l4028
$$ -2706 15653 -17746 -2998 23994 -16084 -20448 23473 1576 -23883 14112 8734 -25294
1486b5294L1846J2309l9970J6815K6292l6932K223L7200k8659j7164M1775j3903
$$ -25294 6552 18861 -21109 -4294 21998 -14934 -12711 24489 -4170 -21334 20441 6538
1498F538l1391L7873O219m2499K1005K6597l5497K562K8600k8212m030L7327k5536
$$ 6538 -24853 13020 19239 -23260 -2255 24342 -11155 -8593 20007 -8205 -12235 25092 -444
1511d44k5590M5388k24m5154K5669K4263l6114M533K5337k8374J879L3993l1288
$$ -444 -26034 19354 19130 -26024 -355 23908 -12206 -7673 17664 -10710 -8831 25162 -6126
1524f126k0649M6429n414m0096K8154J5716l5791J3771K1945l3166N593L2871
$$ -6126 -26775 19654 14240 -25856 2298 18014 -17777 -4006 17939 -15227 -9634 23237
1536B3237l3027j4392M5553j1732l5874L0853J0552l3975J9571J7493l6574J0123
$$ 23237 -9790 -24182 21371 9639 -26235 4618 15170 -18805 766 18259 -18315 -8192
1548h192L2189l1822j0062L8166j8502k4170L8925k159l8979K7015J9832l7755
$$ -8192 23997 -7825 -17887 20279 1777 -22393 16532 14373 -24606 2409 22241 -15514
1560a5514R847K7789l1716l744L4788k2347j6407L7605j4105l3941L7972J4264
$$ -15514 -5667 22122 -9594 -13338 21450 -897 -17304 20301 6196 -27745 10227 24491
1572B4491m3474J1212K7185k8899J920K7782k9595q672M1466j8764l2891L8042
$$ 24491 -18983 -7771 19414 -9485 -7565 20217 -9378 -18050 23416 4652 -28239 9803
1584I803Q879l9412J6822K0561l0412P463K5084l2201k159M0264k5232k8706M1279
$$ 9803 18682 -20730 -3908 16653 -13759 -6296 18788 -13413 -15572 24692 -540 -29246 12033
1597A2033M417l6997K0882J4471l2352J4053K4305l3149p65L5054k5257j8526
$$ 12033 16450 -20547 335 14806 -17546 -3493 20812 -12337 -13102 21952 -3305 -21831
1609b1831L9676p269l2336K9178Q417l5670J8904K4487l5640L83L2833k4248j2306
$$ -21831 17845 10576 -21760 7418 15835 -19835 -931 23556 -12084 -11701 21132 -3116 -15422
1622a5422L4241j4846k4807L5055P62l8762K3960K3089l5068K565K6640k5739
$$ -15422 18819 3973 -20834 14221 14983 -23779 181 23270 -11798 -9233 17407 -8332
1634h332l929L3215k3368k0210M0022m701l9971K7779K1319l4187N121K0457k6000
$$ -8332 -12261 20954 -2414 -22624 17398 12697 -27274 505 21824 -12363 -7242 13215 -12785
1647a2785M707L0264k9953j4907M2207j0599l5568L1368J4389l5140J2008J9376
$$ -12785 -8078 22186 -7767 -22674 19533 8934 -26634 4734 19123 -16017 -4009 15367
1659A5367k9587Q074K9221l1072j0543L9156j5083k8267L3579M839l2769K0180
$$ 15367 -14220 -6146 23075 -7997 -18540 20616 5533 -22734 10845 15684 -17085 3095
1671C095J4052l3810J2661K9520l2409q362L5045j7647k0350L3920m254l1576
$$ 3095 17147 -16663 -4002 25518 -6891 -15253 19792 2145 -18205 15715 11461 -20115
1683b0115K7062J0724l6142J4054K7538l0860m586K8916k1364j0461L4512j4477
$$ -20115 6947 17671 -18471 -4417 23121 -7739 -12325 16591 -4773 -15234 19278 4801
1695D801k9499L3798Q460l8979J5550K5622k8349q07K2275k2393l251L4266k1298
$$ 4801 -24698 9100 17560 -21419 -5869 19753 -8596 -9403 12872 -9521 -12772 21494 196
1708A96k6096L7585L339l7257J9578K0540k9125N057K0497k6321J360L4023k4626
$$ 196 -25900 11685 15024 -22233 -2655 17885 -11240 -6183 14314 -12007 -10647 23376 -1250
1721a250k1881L7315j744l2656K2981J4051k9468J1315J7944l0761N718L3199
$$ -1250 -23131 14184 12440 -20216 2765 16816 -12652 -1337 16607 -14154 -8436 24763
1733B4763k6687j7941L5693p303k7480K7894O359l2049J7393J7213l2764O476
$$ 24763 -1924 -19865 15828 8525 -18955 8939 15298 -16751 642 17855 -14909 -8433
1745h433L0401k5756j1396L0007j4957j8303L3129l300l4372K3816J7579l4334
$$ -8433 21968 -3788 -15184 14823 -134 -18437 14692 11392 -22980 836 18415 -15919
1757a5919O876K6966k4434n967K6748j9343j2955L5823r802l2661K8441J3683
$$ -15919 -9043 17923 -6511 -12478 14270 -5073 -18028 17795 7993 -24668 3773 17456
1769A7456l3731R922K3483k5031J68K3432k4321p358L7767j4032l1510K9601J0510
$$ 17456 -16275 -6353 17130 -7901 -7733 15699 -8622 -15980 21787 7755 -23755 5846 16356
1782A6356l0880J3267J7883k6342N189K1708k6702k611L5083j8729k6169L1488
$$ 16356 -14524 -1257 16626 -9716 -4527 17181 -9521 -12132 22951 4222 -21947 9541
1794I541M156k9298J8542J3257k9637J0043K2289k8539k743L1768j8165j8296
$$ 9541 13697 -15601 2941 16198 -13439 -3396 18893 -9646 -12389 19379 1214 -17082
1806a7082K9061n975k5167K6885P984l3397J3403K1667k8605M52K8510k0766j2709
$$ -17082 11979 6004 -19163 7722 15706 -17691 -4288 17379 -11226 -10774 17736 -3030 -15739
1819a5739K8666j1617k0851L1347J992l4656J7574K0846k7578K674K2718k2468
$$ -15739 12927 1310 -19541 11806 13798 -20858 -3284 17562 -10016 -7342 15376 -7092
1831g092l121K7792j8937j8885L5380j047l4006J9867J7110k7895O275K0727k3258
$$ -7092 -10213 17579 -1358 -20243 15137 14090 -19916 -49 17061 -10834 -4559 16168 -7090
1844g090m30K5453k2788j2502L6022o995l1977K2378J2527k6386J2081J5913k8134
$$ -7090 -7520 17933 -4855 -17357 18665 11670 -20307 2071 14598 -11788 293 16206 -11928
1857a1928L454K7641k3309j1700L0670q962k3770K4559L357k7353J8700J4312
$$ -11928 -8474 19167 -4142 -15842 14828 5866 -17904 6655 10012 -17341 1359 15671
1869A5671k9652N692K4781k3975o800K9963j3863j9599K6745k560k5522K4340
$$ 15671 -13981 -8289 16492 -7483 -14283 15680 1817 -17782 8963 6403 -19119 5221
1881E221J1989l3185O800K4625k0638l464K2678j8261r964L0162j0319k6368K8299
$$ 5221 17210 -15975 -9175 15450 -5188 -8652 14026 -4235 -14199 15963 5644 -20724 7575
1894G575R782l2487J0320K1280k3190L49K1557k0288n872K8608j5692k2123L1045
$$ 7575 17357 -15130 -4810 16470 -6720 -6371 15186 -5102 -10974 17634 1942 -20181 10864
1907A0864N450l2080J3270J5634k2663Q067J8127k6733l109L1492j6469k0603
$$ 10864 16314 -15766 -2496 13138 -9525 -1458 16669 -10064 -13173 18319 1850 -18753
1919a8753K8449J94k6564J8181J0466k5367J0922J7760k6782O34K7972j9610j5089
$$ -18753 9696 9890 -16674 1507 11973 -13394 -2472 15288 -11494 -10860 17112 -2498 -17587
1932a7587K8760n230k2099K1662M509k7273J7017J8814k9262n69K5716j6407q530
$$ -17587 11173 5943 -16156 5506 10015 -17258 -241 18573 -10689 -11258 14458 -1949 -10479
1945a0479K3695j2556j6357K7446r83k8743J9914J6726k9332K749K3236j8374
$$ -10479 13216 660 -15697 11749 10766 -17977 1937 18663 -10669 -7920 15316 -3058
1957c058n295K2724j5716j2801K9112o322k8380K2784J4983k7813L644J7821j8577
$$ -3058 -8353 14371 -1345 -14146 14966 8644 -19736 3048 18031 -9782 -6138 11683 -6894
1970f894K786K0354k2775r764L2398q117k7334K2874R573k5615J0040J4739k2320
$$ -6894 -4108 16246 -6529 -16293 16105 7988 -19346 3528 13101 -12514 -2474 12265 -10055
1983a0055M307K1016k2777n880K9106j2405k2010K5242L877k4226J4875J0009
$$ -10055 -5748 15268 -7509 -13389 15717 3312 -18698 6544 10421 -13805 1070 11079
1995A1079k4927J0764K1948k5957p160K7944j1022j5260K2276m861k0689K2633
$$ 11079 -13848 -3084 18864 -7093 -14253 13691 2669 -12591 9685 4824 -15865 6768
2007F768P145k7826J1151J9829k4419k042K4609j5474j1217K3592r035j7928K5442
$$ 6768 13913 -13913 -2762 17067 -7352 -9394 15215 -259 -11476 12116 3081 -14847 10595
2020A0595K107k9775J3919K0783k2946j936J7867j6232k250K4026j6637j8128
$$ 10595 12702 -17073 -3154 17629 -5317 -7253 10614 -5618 -7868 16158 -479 -18607
2032a8607K8629J714k7785J5883J3890k4117L990J8120j7729j651K1249j7801
$$ -18607 10022 11736 -16049 -166 13724 -10393 -6403 11717 -6012 -7663 13586 -4215
2044d215j2526K9273l651k6277J7669J0714k1600R808J3394k3713K735K5156j8735
$$ -4215 -16741 12532 8881 -17396 273 10987 -10613 -805 12589 -11124 -8389 16767 -1968
2057a968j2643K5883o092j9434K0749L978k3424J2955J3588k3269M558K1308k0090
$$ -1968 -14611 11272 5180 -14254 6495 10473 -12951 4 13592 -9677 -5119 16189 -3901
2070c901p874K4779r681j5703K2245k270k3166J9763J2056k7492M310K1289j7569
$$ -3901 -11775 13004 3323 -12380 9865 7595 -15571 4192 16248 -11244 -6934 14355 -3214
2083c214m776J9732j4282r636K4701p079k2655K1943Q353k6575Q743J7791k0267
$$ -3214 -7990 11742 -2540 -12176 12525 5446 -17209 4734 13087 -13488 -4745 13046 -7221
2096g221oJ9969j7606p591K5557j0007k0246K2641N223k4008J1234J3585k0444
$$ -7221 -7227 12742 -4864 -12455 13102 3095 -17151 5490 10713 -13295 -2061 11524 -8920
2109h920M557J7573k0023m318K6192j2576j8454K2888K459k1319J4691Q453k2994
$$ -8920 -4363 13210 -6813 -11131 15061 2485 -15969 6919 9378 -11941 2750 11203 -11791
2122a1791Q902J8842k1490l975K2584j2588j1312K1766n487j9370K0145N744k4949
$$ -11791 -2889 15953 -5537 -9512 13072 484 -10828 10938 5451 -13919 6226 11970 -12979
2135a2979J1325J7184k2751k034K1874j2971r093J9296r488j4498K3699R78k6717
$$ -12979 -1654 15530 -7221 -9255 12619 -352 -9445 9851 363 -14135 9564 10542 -16175
2148a6175J3791J5999k1258J791J6465j6838k771K2036j3664j4577K4490j374
$$ -16175 -2384 13615 -7643 -5852 10613 -6225 -8996 13040 -624 -15201 9289 7915
2160G915k3721J5809J2564k1499L994J4561j7008K308J9797j8367j1646K6847
$$ 7915 -15806 3 12567 -8932 -4938 9623 -7385 -5077 14720 -3647 -15293 11554
2172A1554l067k2142J6251P213k0033J0432J2745k1809K563K0818j6605r622K3486
$$ 11554 8487 -13655 2596 9809 -10224 208 12953 -8856 -6293 14525 -2080 -11702 11784
2185A1784o897j7104J8026K143j9102J4490R300k4581O428K2001j8908q763K0348
$$ 11784 4887 -12217 5809 7952 -11150 3340 12640 -11941 -5513 16488 -2420 -11183 9165
2198I165p704j1767J9137m216j9334J8616Q620k4685O862J8343j7959l892J8471
$$ 9165 1461 -10306 8831 4615 -14719 3897 12517 -12168 -5306 13037 -4922 -8814 9657
2211I657j1826q263K0941q628j8454K2662O618k5829P098J7511j6158p40J5391
$$ 9657 -2169 -10432 10509 1881 -16573 6089 12707 -13122 -6024 11487 -4671 -5411 9980
2224I980j5147l420K1854j1578j6919K2801L631k3451J1492J2466j8273L788J4690
$$ 9980 -5167 -8587 13267 1689 -15230 7571 11202 -12249 -757 11709 -6564 -2776 11914
2237A1914j8028j691K3298j3608j5832K1918J163j9626J3470O570j9344R283J3997
$$ 11914 -6114 -7805 15493 1885 -13947 7971 9134 -10492 2978 9548 -9796 -513 13484
2250A3484k1278k52K1992j4390j2206K1599l640j7143J6669K994k0355J2777J2520
$$ 13484 -7794 -8046 13946 -444 -12650 8949 5309 -11834 4835 7829 -12526 251 12771
2263A2771k2078N86K0663j3455q610J8611q416j2491K0796j216k2044J5148J3067
$$ 12771 -9307 -8721 11942 -1513 -10123 8488 72 -12419 8377 7161 -14883 265 13332
2276A3332k2426K163J8508j4656m653J7621j0738r657K1156m858k0274J7834R193
$$ 13332 -9094 -6931 11577 -3079 -7732 9889 -849 -10506 10650 5792 -14482 3352 12545
2289A2545k1553N844J4656j6520M43J7399j5092q590K2551n387j9122J6675O467
$$ 12545 -9008 -3164 11492 -5028 -4585 12814 -2278 -10868 11683 6296 -12826 3849 10316
2302A0316j9508Q637J1588j8167L148J6758j6997n742K1494q543j6013J8798J382
$$ 10316 -9192 -555 11033 -7134 -3986 12772 -4225 -9967 11527 2984 -13029 5769 7151
2315G151j9132J3162R164k0936N743J6962j7301m833J9396r423j1020J7961l809
$$ 7151 -11981 1181 10345 -10591 -4848 12114 -5187 -10020 9376 -47 -11067 6894 3085
2328C085j6698J7980N551k2931Q566J6863j8147k748J7850j1561p236J8935p544
$$ 3085 -13613 4367 9918 -13013 -4447 12416 -5731 -8479 9371 -2190 -9426 9509 1965
2341A965j5137J8895M119k1839R948J3601j7629J538J4942j5033l552K0807j1368
$$ 1965 -13172 5723 9842 -11997 -2049 11552 -6077 -4539 10403 -4630 -8182 12625 1257
2354A257j5067K1297K470k0958J0764J0219j7213N028J3435j6995j689K0098j2435
$$ 1257 -13810 7487 9957 -11001 -237 9982 -7231 -2203 11232 -5763 -7452 12646 211
2367B11j2705K0727j666j7656J3583N515j8661R932J2715k0132p16K0890j2065
$$ 211 -12494 8233 6567 -11089 2494 8009 -10652 -720 11995 -8137 -8853 12037 -28
2380b8j1116J7782l584j3185J5240N04j8083J3947J0722k1831J761K0370j3839
$$ -28 -11144 6638 3054 -10131 5109 5613 -12470 1477 12199 -9632 -7871 12499 -1340
2393a340p871J7514p623j0415J8369k845j9543J5957J1006k1134K099J6067j2471
$$ -1340 -9211 8303 680 -9735 8634 5789 -13754 2203 13209 -7925 -5826 10241 -2230
2406b230k558J4759j2226p226K0965o363j9376J8339Q684k1558M706J4437j4011
$$ -2230 -4788 9971 -2255 -9481 11484 5121 -14255 4084 12768 -8790 -4084 10353 -3658
2419c658L21J3266j4322m917K1886q769j7392J7346N535j8450Q239R395j6543
$$ -3658 -3337 9929 -4393 -9310 12576 3807 -13585 3761 9296 -9154 -915 8480 -8063
2432h063N305J4771j8159n062K2560q639j5810J6684L026j6214J0503N558j6847
$$ -8063 -2758 12013 -6146 -11208 11352 2713 -13097 3587 6613 -9601 902 6460 -10387
2445a0387R263J3844k0244k805K1468r259j2204J6007l034j3469J5901L024k0332
$$ -10387 -1124 12720 -7524 -10329 11139 1880 -10324 5683 2649 -10820 5081 8105 -12227
2458a2227J0585J4515j9178k264J8248r300q126J4391o651j0246J8347j029k0620
$$ -12227 -1642 12873 -6305 -8569 9679 379 -7747 6644 -7 -10253 8094 7065 -13555
2471a3555J3402J3213k0369j1J6488j1178m833J5461j0180r989J9794j876j9657
$$ -13555 -153 13060 -7309 -7320 9168 -2010 -6843 8618 -1562 -11551 8243 6367 -13290
2484a3290J3683R599j8313L934J2804j3985k81J5757j3481q663K1526l492j8947
$$ -13290 393 9992 -8321 -4387 8417 -5568 -5849 9908 -3573 -12236 9290 5798 -13149
2497a3149J4358P346j7358O808J0558j5784K807J5647j5183o628K0507n910j4760
$$ -13149 1209 8555 -8803 -1995 8563 -7221 -4414 11233 -3950 -10578 9929 4019 -10741
2510a0741J5389J906j6640J2211Q483j8683M117J6115j4955n681J8141p104j1497
$$ -10741 4648 6554 -10086 2125 10608 -8075 -3958 12157 -2798 -8479 9662 2558 -8939
2523h939J5946j867j5185J4237N520j9075P130J4699j7496k493J7562r526q544
$$ -8939 7007 5140 -10045 4192 9712 -9363 -2233 12466 -5030 -7523 10039 513 -8031
2536h031J6195n619j4600J6883M634j8941O865J1744j5438J202J5289j3698n478
$$ -8031 8164 2545 -12055 4828 9462 -9479 -2614 9130 -6308 -5106 10183 -3515 -8993
2549h993J8340q016j3044J7210J620j8382J1156R706j7425L247J4559j3937l201
$$ -8993 9347 1331 -11713 5497 7117 -11265 -109 9597 -7828 -4581 9978 -3959 -7160
2562g160J6979r594j0768J6614n68j4764J2446M320j8187R442J4195j7703k805
$$ -7160 9819 225 -10543 6071 5503 -9261 3185 7505 -10682 -1240 12955 -4748 -7553
2575g553J7103r190q531J6185m241j3974J5379K458j7384R440J1581j7598Q34
$$ -7553 9550 360 -8171 8014 3773 -10201 5178 7636 -9748 -308 11273 -6325 -5491
2588e491J5631j2301n407J6242q182j0871J7650p39j9836J2523J2086j7188J150
$$ -5491 10140 -2161 -7568 8674 492 -10379 7271 6532 -13304 -781 11305 -5883 -4733
2601d733J2167j2464o46J5895j1716r849J8873k623j7385J3964P630j7702N314
$$ -4733 7434 -5030 -5676 10219 -1497 -11346 7527 4904 -12481 1483 9113 -8589 -3275
2614c275J1640j4830J008J6178j3564p877J9284l797j5616J2662M988j4087R304
$$ -3275 8365 -6465 -5457 10721 -2843 -10720 8564 4767 -10849 1813 6801 -7286 2018
2627B018N834j7090N361J7445j5344p940J7886m575j2346J4042R74j4793J1385
$$ 2018 7852 -9238 -3877 13568 -1776 -9716 8170 3595 -8751 5291 6265 -8528 2857
2640B857N500j7315O409J5160j5969n565J7372o547r376J3881m897j1785J6655
$$ 2857 8357 -8958 -2549 12611 -3358 -8923 8449 1902 -7474 6407 1510 -10275 6380
2653F380K947k1356P820J6373j5138m182J3477q198m810J5155q007j1454J7293
$$ 6380 9327 -12029 -4209 12164 -2974 -7156 6321 -1877 -6687 8468 461 -10993 6300
2666F300J110j9278J0261J2394j5999j88J3017j1547j190J5699j1198j1650J9437
$$ 6300 7410 -11868 -1607 10787 -5212 -5400 7617 -3930 -5120 10579 -619 -12269 7168
2679G168J083j8596R195R880j3575L699R005j4563K077J6723j2489j0644J8949
$$ 7168 8251 -10345 -1150 8730 -4845 -1146 7859 -6704 -4627 12096 -393 -11037 7912
2692G912j653j6331J2243N755j4822P310Q347j6001K750J6728j3608q822J7132
$$ 7912 6259 -10072 2171 7926 -6896 414 8761 -7240 -4490 12238 -1370 -10192 6940
2705F940l160j2097J2192P35j4277J1996P131j9441M323J7203j3051p965J5714
$$ 6940 3780 -8317 3875 4610 -9667 2329 9460 -9981 -5658 11545 -1506 -9471 6243
2718F243m875r383J3388k314j3450J3283N383j8186O271J4592j4250m323J5283
$$ 6243 1368 -8015 5373 3059 -10391 2892 8275 -9911 -3640 10952 -3298 -7621 7662
2731G662q344o773J5548n690j3612J5962M634j8657O303J2614j3246l97J2169
$$ 7662 -682 -7455 8093 2403 -11209 4753 9387 -9270 -2967 9647 -3599 -3996 8173
2744H173j1328l344J6516q149j2285J6450J471j7084R838R572j5488J959J2582
$$ 8173 -3155 -6499 10017 1868 -10417 6033 7504 -9580 258 9830 -5658 -3699 8883
2757H883j2787k035J6051r595j0831J5874p1j4246J0481M808j5221P399J1141
$$ 8883 -3904 -5939 10112 517 -10314 5560 5489 -8757 1724 6532 -8689 -1290 9851
2770I851j6061q34J6210r972q681J5975l784j3087J3462L580j5358P622R589j5259
$$ 9851 -6210 -7044 9166 -806 -9487 6488 2704 -10383 3079 6659 -8699 -1077 8512 -6747
2784f747J946J4034j1591n329J5305o486j0980J5937J53j6286J0162R426j5394
$$ -6747 -4801 9233 -2358 -7687 7618 1132 -9848 6089 6242 -10044 118 9544 -5850
2797e850K608J2209j2352k453J5209q600r732J5388j356j3951J2117M468j5599
$$ -5850 -3242 8967 -3385 -5838 9371 771 -8961 6427 5071 -8880 3237 7705 -7894
2810g894O797J0991j5203k99J5597j0382q506J5250k276j2437J1425K372j4123
$$ -7894 -1097 9894 -5309 -5608 9989 -393 -8899 6351 4075 -8362 3063 5435 -8688
2823h688J0088P645j6571K497J4935j1883o125J5175n508r966J3477p14j4487
$$ -8688 1400 9045 -7526 -5029 9906 -1977 -8102 7073 1565 -8401 5076 4362 -10125
2836a0125J2205P184j7408L521J4232j1534l824J2284p628n396J4719n499j3638
$$ -10125 2080 9264 -8144 -4623 9609 -1925 -5749 6535 -1093 -6489 8230 2731 -10907
2849a0907J4949N591j7811N010J2581j2460j268J2315r979m286J5099o938j2578
$$ -10907 4042 9633 -8178 -3168 9413 -3047 -4315 8000 -1979 -6265 8834 1896 -10682
2862a0682J5190L883j6328O018R407j2199K751J0312j3675k337J8025q148j3273
$$ -10682 4508 8391 -7937 -1919 7488 -4711 -1960 8352 -5323 -7660 10365 2217 -11056
2875a1056J4681L150j4237P002O008j2287N991R103j4886q9J6807r972j0639J4309
$$ -11056 3625 6775 -7462 -460 5548 -6739 -748 8355 -6531 -6620 10187 215 -10424 3885
2889C885K34j1294J0033J588j3832R792R876j6710r90J6727q199q476J2034k713
$$ 3885 4119 -7175 2858 4446 -9386 406 10282 -6428 -7418 9309 1110 -7366 4668 1955
2903A955q126J2161j960j3889J2345Q582j8181J375J5690r619o054J1935o023
$$ 1955 -6171 5990 4030 -9859 2486 11068 -7113 -5738 9952 333 -5721 6214 191
2916A91o344J4244l649j5044J2954P977j6198K001J1665j0252j208J1111j0415
$$ 191 -6153 8091 4442 -10602 2352 10329 -5869 -3868 7797 -2455 -3663 7448 -2967
2929b967m183J6154n751j5357J3961P406j5715L442Q949j0131J431J0672j2034
$$ -2967 -7150 9004 3253 -12104 1857 9263 -6452 -3010 5939 -4192 -2761 7911 -4123
2942d123l583J6556o265j3084J3527L286j3439O899O508j2752M710J1650j4403
$$ -4123 -7706 8850 2585 -10499 3028 6314 -7125 -226 6282 -6470 -1760 9890 -4513
2955d513l451J6791n390j2028J2245J071j0865R124K692j3335P947J0519j5442
$$ -4513 -7964 8827 3437 -8591 3654 4725 -6140 2984 5676 -7659 288 10807 -4635
2968d635j792J5851p306r100J2819k244r999J1080J446j4285Q870R764j5021p74
$$ -4635 -6427 9424 2118 -6982 5837 3593 -6406 4674 6120 -8165 705 10469 -4552 -5326
2982e326J3219q397m965J2199o494q375J4014p45j5310J0132Q568j4829J254J2065
$$ -5326 7893 -504 -5469 6730 236 -8139 5875 5130 -10180 -48 8520 -6309 -5055 7010
2996G010j0049l278J2446p397p269J4038k375j3354J1031N292j3684M967R449
$$ 7010 -3039 -6317 6129 -1268 -8537 5501 3126 -10228 803 6095 -7589 -2622 6827
3009F827j2391k47J3624r484p248J5241l107j1973J1006L582j3149O838Q371j3265
$$ 6827 -5564 -5811 7813 -1671 -8919 6322 3215 -8758 2248 5830 -7319 -481 7890 -5375
3023e375J713J2125j0671m010J3604n262r647J2711L10j3433R413O999j4016K679
$$ -5375 -3662 8463 -2208 -6218 7386 2124 -7523 5188 5498 -7935 1478 8477 -5539 -2860
3037b860J1487j0398l204J2112o909p178J3433l074j2493J1299N405j4322M356
$$ -2860 8627 -1771 -4975 7137 228 -6950 6483 3409 -9084 2215 7620 -6702 -2346
3050b346R970j1923l20J2105r013o254J3931k989j1737J0497L623j2198O068O753
$$ -2346 7624 -4299 -4619 7486 -1527 -7781 6150 3161 -8576 1921 5544 -6654 -586 6167
3064F167j2226L080J1031j1444m029J5117n428j0964J1461K243j1622Q101M596
$$ 6167 -6059 -2979 8052 -3392 -7421 7696 2268 -8696 2765 5008 -6614 1487 6083
3077F083j3002N275J1238j2325l714J3729n583p978J1099k169r337J1207J950
$$ 6083 -6919 -1644 9594 -2731 -6445 7284 1701 -6277 4822 2653 -6684 4523 6473
3090F473j4939P407J1409j3855k445J3025n924n949R981m426p257J2382k97j4818
$$ 6473 -8466 -1059 10350 -3505 -5950 7075 1151 -4798 5183 757 -6500 5882 5585 -9233
3104i233Q617R787j3379n33J0993q102k656J0945p681p019J4442p72j4749Q454
$$ -9233 -616 9171 -4208 -4741 6252 -1850 -4506 6439 -1242 -8261 6181 5409 -9340 -886
3118h86Q277j1674J194Q270r354P81J1085j0134o066J4938j937j3676R219O375
$$ -886 7391 -4283 -3089 5181 -4173 -3392 7693 -2441 -8507 6431 4494 -9182 37 6412
3132F412j1418L767O794j1283K655J1703j1002n980J4664k244j0954Q427K454
$$ 6412 -5006 -1239 5555 -5728 -3073 8630 -2372 -8352 6312 4068 -6886 1541 3995
3145C995r918P789M031j3316M605J2434j1927n857J3999k925r342R013l41q578
$$ 3995 -5923 1866 5897 -7419 -2814 9620 -2307 -8164 5835 2910 -6432 2581 2240 -6338
3159f338R380K618j4171N907J2102j2093m069J1912n063n346J0161m446q624J2105
$$ -6338 3042 5660 -8511 -2604 9498 -2595 -6664 5248 185 -5161 5000 554 -8070 4035
3173D035K381j4785N747J0899j1025j861R798o122k982R831o373p466J3831L09
$$ 4035 6416 -8369 -2622 8277 -2748 -4609 5189 -933 -3915 5916 -457 -7923 5908 6217
3187F217j4846P800Q790j1217P01Q196q490j063J2076p518q376J2772Q6j2005
$$ 6217 -8629 -829 7961 -3256 -2555 5641 -2849 -3912 8164 646 -7730 5042 5128 -6877
3201f877P772N206j0581L535P135j0293O02J1837r209p266J3616r68j1471Q013
$$ -6877 895 6101 -4480 -945 6190 -4103 -3501 8336 -873 -8139 5477 4509 -6962 1051
3215A051L381r722N732N897j2071J726J1781q935n049J1084l453q155J0222Oj0602
$$ 1051 4432 -5290 442 6339 -5732 -4006 7775 -1160 -6209 4875 1422 -6733 3489 3495 -7107
3230g107P756N770j2121K609J0628r465l791J0839m376o267J0041k103r582R579
$$ -7107 649 6419 -5702 -3093 7535 -1930 -5721 5118 742 -5525 4516 2413 -7169 2410
3244B410L768j2739M570R340j0177j109J0726p180n538J1615k780r622R407K568
$$ 2410 6178 -6561 -1991 7349 -2828 -3937 6789 -391 -5929 5686 2906 -6716 2691 5259
3258E259j1132N708O957j0732J170R544q666l440J1305m767q054J0340P04j0936
$$ 5259 -5873 -165 6792 -3940 -2770 6774 -1892 -5332 5973 1206 -6848 3492 4196 -6740
3272f740P621N109j1441K547R584r502k271J0138m955n832R762k341r235R854
$$ -6740 881 5990 -5451 -2904 6680 -2822 -5093 5045 90 -5742 4020 1679 -7556 2298
3286B298L246j2429M797R036j0157j231R980o512m586J0552l403q396J0196J903
$$ 2298 5544 -6885 -2088 6948 -3209 -4440 5540 -972 -5558 4994 1591 -6805 3391 5294
3300E294j1447N390O923r430O28Q834q398j989J1028o126q390J1807J510j1199
$$ 5294 -6153 -763 6160 -3270 -2642 6192 -2206 -4195 6833 707 -7683 4124 5634 -5565
3314e565N097N774q706K518O967r824m56J1323o945o905J0868m07r302O548L297
$$ -5565 -468 5306 -3400 -882 6085 -3739 -4195 7128 183 -6722 4146 3739 -5563 985 4282
3329D282r534N101O366j1029j03J2099p277o733R973q53o713O251P6q676Q604
$$ 4282 -5252 -151 6215 -4814 -4917 7182 -95 -6828 3145 2292 -4421 1830 1906 -6770 1834
3344A834M963j2898J404J1727p457n140R382l007n643Q743j593q941Q840M830
$$ 1834 6797 -6101 -4697 7030 -427 -5567 3815 808 -4835 3908 2315 -6626 2214 7044
3358G044j2458J925R864o893l033P403m478l344R949m317r836J1168M532j2752
$$ 7044 -5414 -3489 6375 -518 -3551 3852 -626 -3970 5979 1662 -8174 2994 7526 -5226
3372e226K149Q200o489q14P017o940k263J0736n258q456J0532K387j1160M341
$$ -5226 -3077 5123 -1366 -2180 4837 -2103 -4366 6370 1112 -7344 3188 5575 -5585 -1244
3386a244N724p906K191O486r121j456J2087n318q766R201K058q516M634L286p924
$$ -1244 4480 -3426 -1235 5251 -3870 -5326 6761 1443 -7323 1878 3936 -4580 54 3340 -4584
3401d584M568O100j0616n94J2096o118o993Q797J58p364O577J381q785O064O316
$$ -4584 -16 6084 -4532 -5126 6970 852 -6141 2656 2814 -4550 2027 3408 -5377 687 7003
3416G003j0844n09J0548n182n460P605k208n415Q662j333r547P905N958j1747
$$ 7003 -3841 -4350 6198 1016 -4444 3161 953 -4462 4200 2867 -6680 1225 7183 -4564
3430d564Q16R874n982l849P885m256m502Q929j807r482Q303M494j0481K410P351
$$ -4564 -3748 6126 144 -3705 4180 -76 -4578 4351 2544 -6938 1365 5859 -4622 -2212 5139
3445E139p162r44P560o569l564J0035k378r144Q373L495r443L097N941p548R95
$$ 5139 -2023 -2967 4593 -1976 -5540 4495 2117 -7027 1346 4841 -4602 -1505 4436 -3112 -2117
3460b117P006o976k856J0354l899p616Q531J244q792N348M800q652J838P800p970
$$ -2117 4889 -2087 -4943 5411 1512 -6104 2427 3671 -5121 227 5027 -3625 -1787 6013 -1957
3475a957j917R044l670o334P911l83p612O841K913r556L766P555r124r63Q592
$$ -1957 -3874 5170 1500 -4834 3077 2694 -4918 1923 4836 -4720 -954 6601 -2523 -3486 5106
3490E106m936m584Q336k221p206P793J969r140M246N563q329O55Q192o697l086
$$ 5106 170 -4414 3922 1701 -5505 2288 4257 -4883 -637 4926 -3403 -2748 5444 -1253 -4339
3505d339R051l667p049Q642J127r014M971M745q419K107O873p439j572Q673m523
$$ -4339 4712 1045 -6004 2638 3765 -5249 -278 4467 -3952 -1845 5028 -2411 -3983 4690 167
3520A67n659Q521n00p427O753K065r096M450O726q598j332R120m696n100P653
$$ 167 -5492 3029 2529 -4898 1855 3920 -5176 -726 6000 -2598 -3930 5190 494 -4606 3047
3535C047j351n964P342K93q748N532O012r467J07Q411n860k818P429l872m665
$$ 3047 1696 -4268 3074 3367 -5381 151 6163 -3304 -3197 5214 -646 -3464 3965 93 -4572
3550d572Q303p91q852O009N180q299J4P009n403j293O790n445l443R259j945r057
$$ -4572 3731 2940 -5912 97 5277 -3022 -3008 4001 -1402 -2695 4095 -1350 -4793 4466 2521 -6536
3566f536P296M206q776J921N839o536L97P263o752l276R610k099p995O475K769
$$ -6536 760 4966 -3810 -1889 3950 -2586 -2189 5074 -1678 -4954 4656 2557 -5438 1037 3806
3581C806p070L814L215p841L176P588q548l114J0009k493p217O291J439o105M474
$$ 3806 -3264 550 3765 -4076 -900 6688 -1860 -4974 5035 2542 -4675 1616 3055 -3050 1424
3596A424J962q036L650P530q747k493R154l056n399O495j464n023P048O56r737
$$ 1424 3386 -4650 -1000 6530 -2217 -4710 4444 1388 -4011 2484 1020 -4003 3045 3701 -6036
3611f036M604P560p936k094P611l438l139N838l163m156Q003p7r624N489O735
$$ -6036 -1432 6128 -1808 -3902 3709 271 -2868 2970 -193 -4349 3654 3577 -6047 -558 6177
3626F177q289j014P123m714j490O479m410m808R049l20r006N001N147o765Q96
$$ 6177 -2112 -3126 3997 -717 -2207 4272 -138 -4946 4103 3783 -5223 -222 4925 -1840 -944
3641i44M723n863M40P244o107m515R270n30q784N510L683o612K295L660o841J488
$$ -944 3779 -2084 -1644 5600 -507 -5022 4248 3718 -5066 444 4127 -2485 -190 3470 -3371 -1883
3657a883P400o906l642Q480j540o487N658P99n761M408K997q448K565P557o799
$$ -1883 5517 -1389 -5031 3449 1909 -4578 1080 1879 -3882 526 3523 -4925 -2360 5197 -1602
3672a602l274P616j889m824N570n25n814O167J660q361L428O743p155j866P367
$$ -1602 -4876 2740 851 -3973 1597 1072 -4742 1425 3085 -5276 -1848 4895 -2260 -4126 3241
3687C241l419l487O597k158n577P258J570q585L644N913o552p40O231m578k051
$$ 3241 -178 -3665 2932 774 -4803 2455 4025 -4560 -916 4997 -1555 -2295 3936 -642 -2693
3702b693O872l428n322P406J008q567M758M758p653J526N622n819j287P070l813
$$ -2693 4179 751 -4571 2835 3843 -4724 34 4792 -2861 -1335 4287 -1532 -2819 4251 438
3717D38m868P315l54o918N200K532p429L140N407p078r69P867m403m197O986j104
$$ 438 -4430 2885 2531 -4387 813 3345 -4084 -944 4463 -2615 -3584 4283 -120 -4317 2669 1565
3733A565n883N684J699p394M075M309o893L16O532m938k344O676k748n082P086
$$ 1565 -4318 1366 3065 -4329 -254 4055 -2838 -2522 4010 -928 -3272 3404 656 -4426 2660
3748B660K48p194M337M357o850P69N552m942j281O384l662l984P373j093o852
$$ 2660 2908 -4286 51 4408 -2442 -1673 3879 -1063 -2344 4040 378 -3606 3767 2674 -4178
3763d178N306K713p185K723M759o092o7P149m932m290P062p69n745M718J268n915
$$ -4178 1128 3841 -3344 -621 4138 -1954 -2021 5128 196 -4094 2968 2199 -3546 1172 2440 -3475
3779c475L902L144o791J242O886n790l357P305j943n154N505M3n744N072K782
$$ -3475 427 3571 -3220 -1978 4908 -882 -4239 3066 1123 -4031 1474 1517 -4227 845 3627
3794C627p975J937O756n494k215O218k838l192N737j797n258O408J875q326K973
$$ 3627 -4348 -2411 4345 -1149 -3364 2854 16 -3176 2561 764 -4494 1914 3789 -4537 -1564
3809a564O392o163j508N526l153j869N845l152n177O752J875p659K890M930n762
$$ -1564 4828 -1335 -2843 2683 -470 -2339 3506 354 -4823 1929 3804 -3855 -965 3965 -1797
3824a797L39N159n364j181P327m135n092O818P82o621L129L332m970J949L887
$$ -1797 -1458 3701 -1663 -2844 4483 348 -4744 2074 2856 -3765 -636 2696 -2274 -325 3562
3839C562o321j2P612m783m992P228j50n785M402J263n645M068L690p314k9P692
$$ 3562 -2759 -2771 4841 58 -4934 2294 2144 -3641 761 2024 -3621 447 4137 -3177 -3206 4486
3855D486m423l941N931o95m246M681k29n668N199L391p994R55P330m542l583N763
$$ 4486 63 -3878 2053 1358 -2888 1793 1564 -4104 1095 4486 -3508 -2553 4777 235 -3348 2415
3871B415j722l066N141j410n587N568L006p759J361O122m732j227M605l241k356
$$ 2415 693 -2373 2768 1358 -4229 1339 4345 -3414 -2053 4069 -663 -1890 2715 -526 -2882
3886b882O452k241o115O053K565p347J924M936m803l10M653m311j429O612l003
$$ -2882 3570 1329 -4786 1267 3832 -3515 -1591 3345 -1458 -1768 2885 -1426 -2855 3757 754
$$ [...]
8191B10
##END NTUPLES=NMR FID
##END=
