##TITLE=1H_Pr 5-2-5-d
 DMSO, 8 sc, 
 3.7.2019
##JCAMPDX= 6.0         $$ Bruker NMR JCAMP-DX V2.0
##DATA TYPE= NMR FID
##DATA CLASS= NTUPLES
##ORIGIN= UXNMR, Bruker Analytische Messtechnik GmbH
##OWNER= root
$$ XWIN-NMR		Version 3.5
$$ Wed Jul  3 15:44:08 2019 Russian Standard Time (UT+4h)  she@DPX200
##.OBSERVE FREQUENCY= 200.13155
##.OBSERVE NUCLEUS= ^1H
##.DELAY= (6, 6)
##.ACQUISITION MODE= SIMULTANEOUS
##.ACQUISITION SCHEME= undefined
##.AVERAGES= 8
##.DIGITISER RES= 18
##SPECTROMETER/DATA SYSTEM= spect
##.PULSE SEQUENCE= zg30
##.SOLVENT NAME= DMSO
##.SHIFT REFERENCE= (INTERNAL, DMSO, 0, 15.7039)
##AUDIT TRAIL= $$ (NUMBER, WHEN, WHO, WHERE, WHAT)
$$ ##TITLE= Audit trail, XWIN-NMR		Version 3.5
$$ ##JCAMPDX= 5.01
$$ ##ORIGIN= Bruker BioSpin GmbH
$$ ##OWNER= she
$$ F:/spectra/data/she/nmr/H-F/1/audita.txt
$$ ##AUDIT TRAIL=  $$ (NUMBER, WHEN, WHO, WHERE, WHAT)
(   1,<2019-07-03 15:43:01.93 +0400>,<she>,<DPX200>,
      <created by zg, POWCHK disabled, PULCHK disabled
       configuration hash MD5:
       00 E9 B6 7A A2 85 ED C7 34 08 36 98 17 FE 4E 26
       data hash MD5: 16K
       DC 06 0B 20 E7 FE 7D 60 DD 0B 2B C8 FA 62 01 DB>)
$$ ##END=
$$ 
$$ hash MD5
$$ 2D 30 42 8C 4E 39 FC B9 EA 1E 81 A6 35 AE 1D E5
##$RELAX= 
##$RELAX= 
##$RELAX= 
##$RELAX= 
##$RELAX= 
##$RELAX= 
$$ Bruker specific parameters
$$ --------------------------
##$DU= <F:/spectra>
##$EXPNO= 1
##$NAME= <H-F>
##$PROCNO= 1
##$TYPE= <nmr>
##$USER= <she>
##$AMP= (0..31)
100 100 100 100 100 100 100 100 100 100 100 100 100 100 100 100 100 100 
100 100 100 100 100 100 100 100 100 100 100 100 100 100 
##$AQSEQ= 0
##$AQ_mod= 1
##$AUNM= <au_zg>
##$AUTOPOS= <>
##$BF1= 200.13
##$BF2= 200.13
##$BF3= 200.13
##$BF4= 200.13
##$BF5= 200.13
##$BF6= 200.13
##$BF7= 200.13
##$BF8= 200.13
##$BYTORDA= 1
##$CFDGTYP= 0
##$CFRGTYP= 5
##$CHEMSTR= <none>
##$CNST= (0..31)
1 1 145 1 1 1 1 1 1 1 1 1 1 1 1 1 1 1 1 1 1 1 1 1 1 1 1 1 1 1 1 1 
##$CPDPRG= <>
##$CPDPRG1= <>
##$CPDPRG2= <>
##$CPDPRG3= <>
##$CPDPRG4= <mlev>
##$CPDPRG5= <mlev>
##$CPDPRG6= <mlev>
##$CPDPRG7= <mlev>
##$CPDPRG8= <mlev>
##$CPDPRGB= <>
##$CPDPRGT= <>
##$D= (0..31)
0 1.2 0 0 0 0 0 0 0 0 0 0.03 0 0 0 0 0 0 0 0 0 0 0 0 0 0 0 0 0 0 0 0 
##$DATE= 1562154181
##$DBL= (0..7)
120 120 120 120 120 120 120 120 
##$DBP= (0..7)
150 150 150 150 150 150 150 150 
##$DBP07= 0
##$DBPNAM0= <>
##$DBPNAM1= <>
##$DBPNAM2= <>
##$DBPNAM3= <>
##$DBPNAM4= <>
##$DBPNAM5= <>
##$DBPNAM6= <>
##$DBPNAM7= <>
##$DBPOAL= (0..7)
0.5 0.5 0.5 0.5 0.5 0.5 0.5 0.5 
##$DBPOFFS= (0..7)
0 0 0 0 0 0 0 0 
##$DE= 6
##$DECBNUC= <off>
##$DECIM= 24
##$DECNUC= <off>
##$DECSTAT= 4
##$DIGMOD= 1
##$DIGTYP= 9
##$DL= (0..7)
0 120 120 120 120 120 120 120 
##$DP= (0..7)
150 150 150 150 150 150 150 150 
##$DP07= 0
##$DPNAME0= <>
##$DPNAME1= <>
##$DPNAME2= <>
##$DPNAME3= <>
##$DPNAME4= <>
##$DPNAME5= <>
##$DPNAME6= <>
##$DPNAME7= <>
##$DPOAL= (0..7)
0.5 0.5 0.5 0.5 0.5 0.5 0.5 0.5 
##$DPOFFS= (0..7)
0 0 0 0 0 0 0 0 
##$DQDMODE= 0
##$DR= 18
##$DS= 0
##$DSLIST= <SSSSSSSSSSSSSSS>
##$DSPFIRM= 0
$$ [...]
##$SUBNAM2= <"">
##$SUBNAM3= <"">
##$SUBNAM4= <"">
##$SUBNAM5= <"">
##$SUBNAM6= <"">
##$SUBNAM7= <"">
##$SUBNAM8= <"">
##$SUBNAM9= <"">
##$SW= 24.9336996594482
##$SWIBOX= (0..15)
0 0 2 0 0 0 0 0 0 0 0 0 0 0 0 0 
##$SW_h= 4990.01996007984
##$TD= 16384
##$TD0= 1
##$TE= 0
##$TE2= 300
##$TE3= 300
##$TEG= 300
##$TL= (0..7)
0 120 120 120 120 120 120 120 
##$TP= (0..7)
150 150 150 150 150 150 150 150 
##$TP07= 0
##$TPNAME0= <>
##$TPNAME1= <>
##$TPNAME2= <>
##$TPNAME3= <>
##$TPNAME4= <>
##$TPNAME5= <>
##$TPNAME6= <>
##$TPNAME7= <>
##$TPOAL= (0..7)
0.5 0.5 0.5 0.5 0.5 0.5 0.5 0.5 
##$TPOFFS= (0..7)
0 0 0 0 0 0 0 0 
##$TUNHIN= 0
##$TUNHOUT= 0
##$TUNXOUT= 0
##$USERA1= <user>
##$USERA2= <user>
##$USERA3= <user>
##$USERA4= <user>
##$USERA5= <user>
##$V9= 5
##$VALIST= <valist>
##$VCLIST= <CCCCCCCCCCCCCCC>
##$VD= 0
##$VDLIST= <DDDDDDDDDDDDDDD>
##$VPLIST= <PPPPPPPPPPPPPPP>
##$VTLIST= <TTTTTTTTTTTTTTT>
##$WBST= 1024
##$WBSW= 4
##$XGAIN= (0..3)
0 0 0 0 
##$XL= 0
##$YL= 0
##$YMAX_a= 72352
##$YMIN_a= -95919
##$ZGOPTNS= <>
##$ZL1= 120
##$ZL2= 120
##$ZL3= 120
##$ZL4= 120
##$ABSF1= 10
##$ABSF2= 0
##$ABSG= 5
##$ABSL= 3
##$ALPHA= 0
##$AQORDER= 0
##$ASSFAC= 0
##$ASSFACI= 0
##$ASSFACX= 0
##$ASSWID= 0
##$AUNMP= <proc_1d>
##$AZFE= 0.1
##$AZFW= 0.1
##$BCFW= 1
##$BC_mod= 2
##$BYTORDP= 1
##$COROFFS= 0
##$CY= 11.3945322036743
##$DATMOD= 1
##$DC= 2
##$DFILT= <>
##$DTYPP= 0
##$F1P= 18.9103706918063
##$F2P= -1.10871071338519
##$FCOR= 0.5
##$FTSIZE= 0
##$FT_mod= 4
##$GAMMA= 1
##$GB= 0.15
##$INTBC= 1
##$INTSCL= 1
##$ISEN= 128
##$LB= 0.24
##$LEV0= 0
##$LPBIN= 0
##$MAXI= 10000
##$MC2= 0
##$MEAN= 0
##$ME_mod= 0
##$MI= 1.114404
##$NCOEF= 0
##$NC_proc= 0
##$NLEV= 6
##$NOISF1= 3.799351
##$NOISF2= 2.8
##$NSP= 1
##$NTH_PI= 0
##$NZP= 0
##$OFFSET= 15.70392
##$PC= 1
##$PHC0= -8506.433
##$PHC1= 19.60097
##$PH_mod= 1
##$PKNL= yes
##$PPARMOD= 0
##$PSCAL= 0
##$PSIGN= 0
##$REVERSE= no
##$SF= 200.130013532006
##$SI= 16384
##$SIGF1= 3
##$SIGF2= 2
##$SINO= 400
##$SIOLD= 16384
##$SREGLST= <1H.CDCl3>
##$SSB= 0
##$STSI= 0
##$STSR= 0
##$SW_p= 3612.71676300578
##$SYMM= 0
##$S_DEV= 0
##$TDeff= 0
##$TDoff= 0
##$TI= <>
##$TILT= no
##$TM1= 0
##$TM2= 0
##$TOPLEV= 0
##$USERP1= <user>
##$USERP2= <user>
##$USERP3= <user>
##$USERP4= <user>
##$USERP5= <user>
##$WDW= 1
##$XDIM= 8192
##$YMAX_p= 0
##$YMIN_p= 0
$$ End of Bruker specific parameters
$$ ---------------------------------
##NTUPLES= NMR FID
##VAR_NAME=  TIME,          FID/REAL,        FID/IMAG
##SYMBOL=    X,             R,               I
##VAR_TYPE=  INDEPENDENT,   DEPENDENT,       DEPENDENT
##VAR_FORM=  AFFN,          ASDF,            ASDF
##VAR_DIM=   8192,          8192,            8192
##UNITS=     SECONDS,       ARBITRARY UNITS, ARBITRARY UNITS
##FACTOR=    0.0002004,     1,               1
##FIRST=     0,             0,               0
##LAST=      1.6414764,     0,               0
##MIN=       0,             -95919,          0
##MAX=       1.6414764,     72352,           0
$$ Real data points
##PAGE= N=1
##DATA TABLE= (X++(R..R)), XYDATA
0@%%%%%%%%%%Qj6J6j6J6k3L1l2M0m8N6o5P3q8J02j16J33j51J69j92K16k41K72
$$ 0 0 0 0 0 0 0 0 0 0 0 8 -8 8 -8 8 -15 16 -16 24 -24 32 -33 40 -48 54 -62 71 -80 89 -103 113 -128 144
33A44l05L41l81M24m71N25n82O44p15P91q76R71j074J192j327J479j656J863k106
$$ 144 -161 180 -201 223 -248 277 -305 339 -376 415 -461 510 -564 628 -699 780 -876 987 -1119
52a119K403k774L245l876M769o134Q510j3852M9990k3451q8526K9972O8954M4241
$$ -1119 1284 -1490 1755 -2121 2648 -3486 5024 -8828 41162 17711 -70815 -40843 28111 72352
66G2352l5349n5808l0583K7368M7850K6363k9949m8996j8510L3986M2768R972
$$ 72352 37003 -18805 -49388 -22020 25830 52193 22244 -26752 -45262 -11276 31492 41464
78D1464l3029l7999q050L4179M0547K450m3563l8089J2153M7759K4542k3089m0860
$$ 41464 8435 -29564 -37614 -3435 37112 39562 -4001 -42090 -29937 17822 42364 19275 -21585
91b1585j4109K2855L5538J2121k4923l6912o625L3323L3528o528l4250j9854J2280
$$ -21585 -35694 -12839 22699 34820 9897 -27015 -33640 -317 33211 26683 -7567 -27421 -15141
104a5141K4574J3071n749j9342j8305K202K5562K1665j0075l2477j6712J8467
$$ -15141 9433 22504 16755 -2587 -20892 -18690 6872 28537 18462 -14015 -30727 -12260
116a2260L0800Q330k2461k8763l020K7737K6104o949l0872j5343J7406K4914L272
$$ -12260 18540 26870 4409 -24354 -27374 363 26467 19518 -11354 -26697 -9291 15623 18895
129A8895j4834j2699j373O296J0900R573m851j8998j1232J3064K1535L217j7896
$$ 18895 4061 -8638 -10011 -3715 7185 16758 11907 -7091 -18323 -5259 16276 19493 1597
142A597j7390L27J6329J5902j176k0180j6929Q288K4592R136j7162j9178K094
$$ 1597 -15793 -15466 863 16765 15589 -4591 -21520 -13232 11360 20496 3334 -15844 -13750
155a3750J5999R187l711r167p012K43Q333Q665j555j0452n754L300O413M538R45
$$ -13750 2249 11436 7725 -1442 -8454 -8211 122 8787 7232 -3220 -8974 -5674 739 5277 6222
170F222n864j0472j676J4991J3705q204k0629m311J8017J4592o133j5448n582
$$ 6222 358 -10114 -11790 3201 16906 8702 -11927 -16238 1779 16371 10238 -5210 -10792
183a0792P220R428L436m980r217l557O097P250n59m559k779r69j270L746P964
$$ -10792 -3572 5856 9292 4312 -4905 -8462 -2365 4885 4326 -233 -3012 -3981 -5251 -1505 6459
198F459O96j1893q402R345J4294m78j3400o862O344R309K520m495p551l377N655
$$ 6459 7155 -4738 -13140 -3795 10499 10021 -3379 -10241 -3897 5412 7932 3437 -4114 -7491 -1836
213a836Q889L92j0110n946N977O957j394m518L06J253k600o73N819L381n173o972
$$ -1836 7053 7445 -2665 -8611 -2634 4323 2929 -1589 -1283 -30 -2630 -3303 2516 5897 724 -6248
229f248J612P186L429k541n827l576K305Q127M073p954r975L070J2027J833r964
$$ -6248 -4636 2550 5979 3438 -2389 -5965 -3660 4467 8540 586 -9389 -6319 5708 7541 -2423
244b423n107O444N318l500l693L042K530l014k470K694L613q47k988j923P15K731
$$ -2423 -7530 -1086 4232 732 -2961 81 2611 -403 -2873 -179 3434 2587 -401 -2324 -1609 1122
260A122L867j655p293k804P225P274m293r605m61P909L532m029l826J199J570
$$ 1122 4989 3334 -3959 -6763 462 7736 3443 -6162 -6623 1286 4818 789 -3037 -1838 -268
275b68Q0P50Q77j375j760J313J954j404j189K548Q00m085k312N221M640m942p141
$$ -268 -188 562 1439 64 -1696 -383 1571 167 -1022 1526 2326 -1759 -4071 1150 5790 848 -6293
292f293K281Q118J133p001l471L862L931j31k225k072m93K375L065j164m307J44
$$ -6293 -4012 4106 5239 -1762 -5233 -1371 2560 2429 204 -1868 -2361 14 3079 1915 -2392 -2248
308b248M533O66n094j188N942J953o606m089O009N890l705o811Q46N565J356k651
$$ -2248 2285 2951 -2143 -3331 2611 4564 -2042 -6131 -122 5768 2063 -4748 -3902 1663 3019 368
324C68j582j81M1J930K134j783m089Q92M961M47n344j074M796J381l995k040L695
$$ 368 -1214 -1395 -1354 576 2710 927 -3162 -2270 2691 3138 -2206 -3280 1516 2897 -1098 -3138 557
341E57K018l193k336K342J979r20j148J27j005p9L376J684m464m042M234O117
$$ 557 2575 -618 -2954 -612 1367 447 -701 -574 -1579 -1658 1718 3402 -1062 -5104 -870 5247
357E247k415p027M7O900J349n419k035L782K437k639k378J531J562l09n93m15
$$ 5247 2832 -4195 -4148 2752 4101 -1318 -3353 429 2866 227 -2151 -620 942 633 40 -375
373c75r84J043K463o69l909o65M669K514m814l867L516N017k066m867P24L652
$$ -375 -1359 -316 2147 1478 -2431 -3096 1573 4087 -727 -4594 -1078 3939 1873 -2994 -2270 1382
389A382M63k685p9J435o06q10J022M92j344o49K425N32l305r64L924K013m093
$$ 1382 1845 -840 -919 516 -90 -900 122 614 -730 -1379 1046 1578 -1727 -2691 1233 3246 -847
406h47k941L229L901k046l663M87K835L65j370k90l11k30J178J677j961k851J845
$$ -847 -3788 -559 3342 1296 -2367 -1880 955 1320 -50 -340 -651 -881 297 1974 13 -2838 -993
423i93L872j272m584K28N183N98n378j557N055K676l915l446K571L322j116k119
$$ -993 2879 1607 -2977 -2749 2434 3032 -2346 -3903 1152 3828 -87 -3533 -962 2360 1244 -875
439h75O8P51L26N20L53j803j325K284K096k213k917J670L589j335l784N54L843
$$ -875 -807 -56 270 790 1143 -660 -1985 299 2395 182 -2735 -1065 2524 1189 -2595 -2041 1802
456A802l08k952j74K451K2j368K86J138q91j252K001J211k594j872K967K585k797
$$ 1802 1494 -1458 -1632 819 841 -527 -241 897 6 -1246 755 1966 -628 -2500 467 3052 255
473B55l589K459L931j364l852K74L333L08k533l73J335M21k94J58l53j107R75
$$ 255 -3334 -875 3056 1692 -2160 -1886 1447 1755 -778 -1151 184 605 311 469 116 -991 -16
490a6K126j142k994M55M269J46m456j603M662K282l949k987K952L099k022k564
$$ -16 2110 968 -2026 -1571 2698 2844 -1612 -3215 1447 3729 -220 -3207 -255 2844 822 -1742
506a742J201J856q47q30R19L76j641M51K122q18k376M02L270o39l297k65L309
$$ -1742 -541 1315 468 -362 557 933 -708 -257 1865 1047 -1329 -927 2343 1704 -1593 -1858 1451
523A451M71k961q61K016Q56j429k11R76n43q94J163J705j808k107K168K801k236
$$ 1451 1922 -1039 -1900 116 972 -457 -668 308 -235 -1129 34 1739 -69 -2176 -8 2793 557
540E57l040J708L403o90m145K42L787M98l215j183K272J337j656p81P98R7j20
$$ 557 -2483 -775 2628 1938 -2207 -1965 1822 2320 -895 -2078 194 1531 -125 -906 -108 -11 -131
557a31O43k50j550n4K337Q72k711j757K793K435k572k664K132K630j536k928J421
$$ -131 512 262 -1288 -1342 995 1867 -844 -2601 192 2627 55 -2609 -477 2153 617 -2311 -890
574h90K653j354j787Q62J748j336j040J489J140j943j167K313J413k336j605K517
$$ -890 1763 409 -1378 -516 1232 -104 -1144 345 1485 -458 -1625 688 2101 -235 -1840 677
590F77J825k502j846J928J708j407j714J146O96p12m04R08k35j569J051K261j440
$$ 677 2502 0 -1846 82 1790 383 -1331 -185 511 -201 -605 303 68 -1501 -450 1811 371
607C71k731R52L713o33l896j02M185O62l809j199L426J405k404j549J799J215
$$ 371 -2360 -1408 2305 1672 -2224 -2326 1859 2521 -1288 -2487 939 2344 -60 -1609 190 1405
623A405j239q15Q42J67q48O55J000j006j362J409J686j471k220J437K413j115
$$ 1405 166 -649 193 360 -488 167 1167 161 -1201 208 1894 423 -1797 -360 2053 938
639I38k198Q08J750o08j660N63J438r35j710J710J429j638j979J733K205j602
$$ 938 -1260 -452 1298 690 -970 -407 1031 96 -1614 96 1525 -113 -2092 -359 1846 244
655B44k345J626K579j139k588P45K527m51k069L91J769l96j181J22P94l61k17
$$ 244 -2101 -475 2104 965 -1623 -878 1649 1198 -871 -480 1289 893 -288 -166 628 267 50
672E0P04j85j517L75J842L6k858k40L080O82k907j370K908J571k613j849K322
$$ 50 754 569 -948 -573 1269 1305 -1553 -1793 1287 1969 -938 -2308 600 2171 -442 -2291 31
689C1J658j602j734J477J159j151q97J352M41j350k59J718o4j911J82J897M5j935
$$ 31 1689 87 -1647 -170 989 -162 -1059 293 734 -616 -875 843 779 -1132 -950 947 992 -943
707i43j82J956L18j503j09J175j52j021N60J358j474j384J155K078j380k362J101
$$ -943 -1125 831 1149 -354 -463 712 560 -461 99 1457 -17 -1401 -246 1832 452 -1910 -809
724h09K617q93k655L62K837m76k329O8K132J4j584OJ561j28j189M37Q18n87n90
$$ -809 1808 915 -1740 -1378 1459 983 -1346 -1278 854 868 -716 -710 851 723 -466 -29 789 202 -388
743c88Q55N92j244p27J653Q95j877j149J861J339j772j610J785J331j536j293
$$ -388 467 1059 -185 -912 741 1636 -241 -1390 471 1810 38 -1572 213 1544 8 -1285
759a285J351J318j601j041J595R63j912j155J848J136j643j202J577R97j192j155
$$ -1285 66 1384 -217 -1258 337 1300 -612 -1767 81 1217 -426 -1628 -51 946 -246 -1401
775a401J388R16j273m81R92O86j037m64J295l0j294O24J367o09j919N31K392n97
$$ -1401 -13 903 -370 -851 141 827 -210 -674 621 591 -703 -79 1288 679 -1240 -709 1683 1086
793A086k593M93K567Qk742j66K376L11k217o32K176N39j897l08J286K73j392J50
$$ 1086 -1507 -1014 1553 1561 -1181 -1347 1029 1340 -877 -1509 667 1206 -691 -999 287 560 -832 -682
811f82J218m26q93L50J128o35j086Q63J139r40j161R73J360q63j459J002J446
$$ -682 536 110 -783 -433 695 60 -1026 -163 976 36 -1125 -152 1208 345 -1114 -112 1334
828A334j233j316J541J398j607j682J521K049j721j822J017J833r82j742N78J833
$$ 1334 101 -1215 326 1724 117 -1565 -44 2005 284 -1538 -521 1312 330 -1412 -834 999
844I99m94j539M24J294o06j063Q61O58r06n22J198L77j084m38J744J97k046k48
$$ 999 505 -1034 -610 684 78 -985 -124 534 -372 -894 304 681 -403 -841 903 1100 -946 -1194
862a194J849R10k232q85K367P96k410p70K353O91k042q59J746J062j937p22J820
$$ -1194 655 1565 -667 -1552 815 1611 -799 -1569 784 1475 -567 -1426 320 1382 -555 -1277 543
879E43O59j842o73J531O65j277n84J318J50j101n4J335k81j050J18J456n82j258
$$ 543 1202 -640 -1313 218 883 -394 -978 340 490 -611 -665 670 389 -661 -543 913 331 -927
897i27P87J335j085j366J134J658r19k102P70K233q96k046N07K022k40j844J36
$$ -927 -140 1195 110 -1256 -122 1536 617 -1485 -715 1518 622 -1424 -917 1105 865 -979 -843
914h43J809l60j381J79J288m69q87L08J058m44j034N38J146r74r16J008P61j097
$$ -843 966 606 -775 -596 692 223 -664 -356 702 258 -776 -238 908 -66 -982 26 787 -310
932c10o56J383M48j197o86J397P78j519r51J660R81j405j304J639J036j489j294
$$ -310 -966 417 865 -332 -1018 379 1157 -362 -1313 347 1328 -77 -1381 258 1294 -195 -1489
949a489J549J384j414j266R76J391q95r53L99Q94n47n88Q51J2o99j85J080m9j163
$$ -1489 60 1444 30 -1236 -260 1131 236 -717 -318 576 29 -559 292 304 -395 -580 500 451 -712
968g12J76J472k43j761M22J914l59j825n0J953j36j893L15J525J61j897K74J532
$$ -712 -536 936 693 -1068 -646 1268 909 -916 -966 987 851 -1042 -727 798 959 -938 -664 868
986H68J07j955J45J613J24j489o9J112K23j157K40P01j49p51K47P71n01p23O60
$$ 868 975 -980 -835 778 902 -587 -656 456 679 -478 -238 463 314 -437 -190 581 80 -643 17
1005A7P56j008p91R91J100j292r09J270J195j411j181J236J559j192j798J200
$$ 17 773 -235 -1026 -35 1065 -227 -1136 134 1329 -82 -1263 -27 1532 340 -1458 -258
1021b58J662p53j784P28J508p92j011N06J010o85q23P41M53o29p03Q93M89q08
$$ -258 1404 651 -1133 -405 1103 311 -700 -194 816 131 -692 49 502 -127 -830 63 552 -256
1039b56m10R67L32j222k67J496L79j630k60J748n3j744J19J759N2j498n70J978
$$ -256 -666 301 633 -589 -856 640 1019 -611 -871 877 824 -920 -801 958 1010 -488 -1058 920
1057I20M35j826p75J692P46j717n42J400O21j398k73R75K36r27J57O82M6j037
$$ 920 1355 -471 -1246 446 1192 -525 -1067 333 954 -444 -717 258 494 -433 -276 406 452 -585
1075e85N87N97m97j177J010J073j026j278R16J562r60j652J018J716r96j739Q93
$$ -585 2 599 102 -1075 -65 1008 -18 -1296 -380 1182 222 -1430 -412 1304 308 -1431 -538
1092e38J792o05j718M13J760n16j468N06J199j28j500L14J198k93r75L08R06p71
$$ -538 1254 649 -1069 -656 1104 588 -880 -374 825 697 -803 -489 709 416 -559 -251 655 -116
1110a16o54O81N68o59p08J130N33j257l74J451M86j451p04J594R28j712j183J858
$$ -116 -770 -89 479 -180 -888 242 775 -482 -856 595 1081 -370 -1074 520 1448 -264 -1447 411
1128D11J123j908j185J729J091j372j001Q46J307j098j033J099P18r17n40P88
$$ 411 1534 -374 -1559 170 1261 -111 -1112 -266 1041 -57 -1090 9 727 -190 -730 58
1144E8O14j005k31J056l3q53j80J335l47r90J80J143j90j646N32J376m3j890L25
$$ 58 672 -333 -564 492 459 -394 -574 761 414 -576 -396 747 557 -1089 -557 819 776 -1114 -789
1163g89J704j34j668j2J871k8k006K88J538K13j591k7J228R3j193m1R35l0q74
$$ -789 915 781 -887 -899 972 944 -1062 -774 764 977 -614 -641 587 680 -513 -554 381 351 -523
1182e23m9Q51l28n59Q06L79p72q28J234P67r22j111J356Q95j078r20Q01J142r18
$$ -523 -572 279 -49 -608 198 577 -195 -1023 211 978 56 -1055 301 1196 118 -802 -1 1141 223
1201B23j417J089J206q16j314R58J106q28j199P29R53l78j063N09J083p03p94
$$ 223 -1194 -105 1101 285 -1029 -71 1035 207 -992 -263 690 312 -751 -242 841 138 -656
1218f56N32Q17p65n14Q99K95q10j75R98N0j251Q0J212j1j526n0J629K15j786k48
$$ -656 -124 693 -72 -586 313 608 -202 -377 621 671 -580 -500 712 701 -825 -875 754 969 -817 -1065
1238a065J782N70j679o32J636N28j102p44J010P13j357k33R31K77q01m95R91q5
$$ -1065 717 1287 -392 -1024 612 1140 38 -706 304 1017 -340 -573 358 635 -166 -661 330 245
1256B45j027K76J081m41j034O67P70l20j056O34J018o50q72P19R16p61j293J036
$$ 245 -782 -506 575 134 -900 -233 537 217 -839 -205 813 163 -709 10 926 165 -1128 -92
1274i2J229p83j595J046J366n23j665N19J533m78j587M50J304l41p96O4O12j2
$$ -92 1137 354 -1241 -195 1171 648 -1017 -498 1035 557 -1030 -580 724 383 -413 -349 263 251
1292B51n19K68M40n98n12R86K43j080k34J100L55j450l87J508N59j391q58J428
$$ 251 -268 0 440 -158 -670 316 559 -521 -755 345 700 -750 -1137 371 930 -461 -1319 109
1310A09R32j582n90J426N55j160l66Q26R08j035o42R89N22q39p51R21O49r33o31
$$ 109 1041 -541 -1131 295 850 -310 -676 150 1058 23 -619 370 892 53 -698 223 872 -61 -692
1329f92J002N5p39k37J032k34p13J48Q88l72q42L08J121m39j388P08J475m67j713
$$ -692 310 365 -374 -611 421 187 -526 -378 510 138 -704 -396 725 286 -1102 -394 1081 614 -1099
1348a099L60J881k28j661MJ500R3j487J01R37K42q76p2O65L4p17J17Q83o00o93
$$ -1099 -739 1142 914 -747 -743 757 850 -637 -536 401 643 -233 -305 360 394 -323 -206 677 77 -616
1368f16O76P69m28j124Q24P60p94q40P58J015j141q04R47Q62r72j084R84J143
$$ -616 60 829 401 -723 101 861 67 -773 -15 1000 -141 -945 2 864 -108 -1192 -208 935
1386I35j253q65J180Q96j030p91Q62J329q95j113O18J029n49j031P31P00n06r06
$$ 935 -318 -1183 -3 893 -137 -928 -66 1263 368 -745 -127 902 353 -678 53 753 247 -659
1404f59R69K89p92j35N35J60r44J77J144j56j360Q0J723l10j282k68J413N46j699
$$ -659 310 599 -193 -328 207 367 -577 -400 744 588 -772 -692 1031 721 -561 -829 584 1130 -569
1423e69n30J747K1j084m53J112M20r17k59R58J62j115Q1P25J00q03M9J017k39
$$ -569 -1099 648 669 -415 -868 244 664 -253 -512 446 608 -507 -426 299 399 -404 -355 662 423
1442D23p40P7P45k65p05M05Q54p62p86O30R06o31j048P41Q12p24r56N01J469o75
$$ 423 -317 -240 505 240 -465 -60 794 32 -754 -124 782 151 -897 -156 656 -68 -1024 -523 946 271
1462B71j438P08J266k32j353K54J159k49q65%Q38Q3o71J91L47n37j55Q13K52r68
$$ 271 -1167 -459 807 575 -778 -524 635 386 -479 -479 359 442 -229 -38 309 -228 -383 430 682 -286
1482b86l98J127J98p69n76Q41N05q44o17J264L67j047o75J105N65j003o41J231
$$ -286 -684 443 641 -128 -704 137 642 -202 -819 445 812 -235 -910 195 760 -243 -884 347
1500C47L85r07o62R11P29j117m26Q48N66p58m57P92J66p21k5O11L9o42J3P50j87
$$ 347 732 -175 -837 74 803 -314 -740 108 674 -84 -541 251 417 -304 -329 282 321 -321 -308 442 255
1521B55r25O00P36m94j018N94J353q15j293P09J238m70j371L08J371k68j180p8
$$ 255 -670 -70 666 172 -846 -252 1101 286 -1007 -298 940 470 -901 -593 778 510 -670 -748
1539g48J191or97n1R36L2q98M39N81k77o72O09L22k75p65M85N65n41l75N93L34
$$ -748 443 437 -560 -611 325 357 -541 -102 479 202 -470 139 461 186 -579 -94 471 -70 -445 148 482
1560D82p55m40J042K91r23n30J126Q04j282p22R38R61r68r65Q46R83j004n42O08
$$ 482 -273 -713 329 620 -303 -833 293 1097 -185 -907 31 992 24 -941 -95 888 -116 -658 -50
1579e0P84p21p16M69P44o50j74L72L81o27k44Q83n2o61r0J055l62j109K24J322
$$ -50 734 13 -703 -234 510 -140 -314 58 439 -188 -432 451 399 -262 -352 703 341 -768 -544 778
1599G78r8j327R8J239Q2j540K36J006Mj015oJ168p6j111o8R46K41q96l04J077
$$ 778 680 -647 -549 690 772 -768 -532 474 478 -537 -543 625 549 -562 -630 316 557 -339 -643 434
1619D34K75j212J62N87J28p23J28O60m04l35M67J81l37n59M60O67p86o46N97J028
$$ 434 709 -503 -341 246 374 -349 -221 439 35 -300 167 348 11 -548 -88 579 -207 -853 -256 772
1639G72q54q66O39J193q12j093R48Q63n86j038N56P07j49p03J79Q02l78o49K95
$$ 772 -82 -948 -309 884 72 -1021 -73 790 204 -834 -278 429 280 -423 -244 558 180 -469 -174
1658a74P47o07m43N47N56p27l41N08L66p23k65P46N51j124k31J077J76j082k58
$$ -174 573 -34 -477 70 626 -101 -442 66 432 -291 -556 190 741 -383 -614 463 639 -443 -701
1677g01R92N19j259l03J074N28j103o29R19P24r08q28J156L52m96p94J056K20
$$ -701 291 810 -449 -752 322 850 -253 -882 37 761 -147 -975 181 533 37 -757 299 519
1695E19n64l07N67L1o09K91O54m34o47L03R17m11p35N3R80k84j062L25J162m80
$$ 519 -45 -352 215 246 -363 -72 582 148 -499 -196 721 310 -425 -372 608 324 -738 -413 749 269
1715B69q12L36P14j84j260L80J105j66r74K03J016k68o97J38O70j46p10J91O45
$$ 269 -543 -207 507 323 -937 -557 548 382 -592 -389 627 359 -338 -200 470 324 -386 -195 450
1734D50l75l91Q1L64j56m06O46K09o73l70J030K55r05n16J010N79j106m71R32
$$ 450 75 -316 -235 129 -27 -433 213 422 -251 -621 409 664 -241 -757 253 832 -274 -745 187
1753A87N80p74q46R77P27r32o63P27P46q19n53N82M49l07o51P82J72m86m21P59
$$ 187 767 -7 -853 124 851 -81 -744 -17 729 -90 -643 -61 388 81 -570 212 384 -102 -523 236
1773B36J73m82j69O34n4p33L61N97k57q60K42P93l27r32K36J074O5j436K45J040
$$ 236 409 -73 -242 392 338 -395 -34 563 306 -554 -312 481 154 -778 -542 532 597 -839 -594 446
1793D46j04q53p8J149j8j113R3Q99J50r95J29P75j00o53Q3O25m75l77M91K33m65
$$ 446 342 -511 -589 560 542 -571 -478 421 571 -424 -295 480 380 -273 -190 435 -40 -417 74 307 -158
1814a58m11O20M94n95o08J008K35o89m78O20O34o86p21N13J015p22q54P37N59
$$ -158 -569 51 545 -50 -658 350 585 -104 -582 38 672 -14 -735 -222 793 71 -783 -46 513
1833E13k89q64M59P83m85p31L57O61k42o38K22N33m31q6L21K87m65q1O24k34o71
$$ 513 224 -640 -181 602 117 -614 -257 404 162 -476 -254 279 -152 -238 83 370 -95 -176 448 214 -457
1854d57J14Q85m2r75q7J221K8j272j07J161K01q93o54J274J12p27n37Q63M02o07
$$ -457 -343 542 500 -475 -562 659 687 -585 -692 469 670 -223 -877 397 509 -218 -755 108 510 -97
1874i7m13O94L06p00n6N11J33p82J69P95l35n67K38N55l24o34M12P17m98p28M57
$$ -97 -510 184 490 -210 -266 245 378 -404 -235 560 225 -342 -104 451 127 -507 -95 622 124 -604 -147
1895a47P36m92q90O37Q67m35r96M44R62m65j092N89R00j94r66J35O67n3m00o6
$$ -147 589 97 -793 -156 711 276 -720 -276 686 221 -871 -282 618 424 -542 -407 260 207 -193 -259
1915b59M89j04o08N41J08l31k03O69J95q49K5P59J0n33l22P45K91q52l86Q47N17
$$ -259 230 126 -482 59 167 -164 -367 302 497 -352 -327 432 442 -91 -413 332 623 -229 -615 232 749
1936G49p72q19J018N52q32o38Q96N90r68l18N99O65r42m35N07N46n75k66N39k
$$ 749 -23 -842 176 728 -104 -742 154 744 -224 -542 57 722 -220 -655 -148 398 -177 -443 96 94
1956I4j88k57M28L18p11J39N78k93q77N94P38l64p25N4J219k71j215K75J111j10
$$ 94 -94 -351 77 395 -316 -177 401 108 -769 -175 563 199 -526 -472 747 476 -739 -464 647 537
1976E37r70j59J172k02q24l0P76Q9q12j68O93K52p11J48M54j99n02L02M56m27
$$ 537 -433 -592 580 378 -446 -476 300 389 -423 -591 102 354 -357 -209 245 46 -456 -154 302 -125
1996a25k80N89J90l24l60M43L29o11m64P06N48q50k78P64M84q88m97O49O23n41
$$ -125 -405 184 374 50 -310 133 462 -149 -613 93 641 -209 -487 277 761 -127 -624 25 648 107
2016A07r53Q75P22n69q86N09N73k95l49K05L96l72j97J67L49m93n6O38l23m33
$$ 107 -846 29 751 182 -704 -195 378 83 -266 -61 335 -37 -234 -67 282 -211 -267 371 48 -385
2036c85J2Q34l82n12l6Q85k13n75j84P82M28j019k42J031K15j081pP25K98q18
$$ -385 -373 461 79 -433 -469 416 203 -372 -556 226 654 -365 -607 424 639 -442 -449 276 574 -244
2056b44n4P14Op20j46O37J12m13k66N37N5n01M4N31n4p05L58M61l24n37M56O70
$$ -244 -298 416 422 -298 -444 193 305 -108 -374 163 218 -283 -239 292 238 -467 -109 352 28 -509 -53 617
2078F17r41n07R37O27o01r48P51P68l63q98K29R04j30r94J30R69m61l65K77J47
$$ 617 -324 -831 106 733 132 -816 -65 703 340 -558 -329 575 445 -549 -419 550 89 -276 1 148
2098A48o4l63M12J46n13k8L81K24n52j00O64l3n40k41O98K26m39n18P09K13p59
$$ 148 84 -279 133 279 -234 -262 119 343 -209 -309 355 322 -218 -459 239 465 26 -492 217 430 -329
2119c29j74P72K94q18l43R58L56r05l97O90N10o56o10P88M98n92l90O21L6l27
$$ -329 -503 269 563 -255 -598 360 716 -189 -586 104 614 -42 -652 136 634 42 -348 273 309 -18
2139a8r7K38m5k36O9N67n80l30K58Q89p37n69M05Q26j61r34P0Q98L8j080R6R22
$$ -18 -115 123 78 -158 -89 478 -102 -432 -174 715 -22 -591 -186 640 479 -455 -385 513 551 -529 -433 489
2161D89j50q67J66Q36j83n51n5N44m2n76rQ29l05l39O3N00k05m92L18L58l37k97
$$ 489 339 -528 -362 474 291 -260 -315 229 187 -389 -398 431 126 -213 -150 350 145 -347 -29 329 -8 -305
2183c05M19J78m25q8L65K80p17k55O63N36r32k46O79N94q37o50P94O13o87o23
$$ -305 114 292 -133 -221 144 424 -293 -548 115 651 -281 -527 152 746 -91 -741 53 666 -21 -644
2203f44N08N63j48o72J39O11l52oP0L6k30j08N11j58j94j54N56o4o89J63O43k5
$$ -644 -136 427 279 -393 -254 357 5 -1 69 105 -125 -233 278 120 -74 -228 328 264 -425 -262 381 356
2225C56p33k83J066o9o17k70Q76J1n96nL53K96o65j72Q24K07j000J32N68K02q38
$$ 356 -377 -660 406 337 -280 -550 326 337 -259 -264 89 385 -280 -452 372 579 -421 -289 279 481 -357
2246c57J3N92Pn48m6M50n4k17pM14l36k88M38M79o32m97P68L62m70p69M22R75
$$ -357 -344 248 255 -293 -339 111 57 -160 -167 247 -89 -377 61 540 -92 -589 179 541 71 -698 -276 699
2268F99n47q41L51Q96l74q71K61Q84n0n91j9K85O6k07p1K87q8l99M80Q9l40j83
$$ 699 152 -689 -338 558 184 -687 -426 458 408 -183 -202 83 149 -58 -129 158 70 -329 151 240 -100 -283
2290b83P54j22n60m21N72M62o10l77M00N95m00l25M15K80n13j57M86J35n72k97
$$ -283 471 349 -211 -632 -60 402 -208 -585 -185 410 10 -315 100 380 -133 -290 196 331 -241 -538
2310e38R35K3p04k22O80K40l08o05M84N68o81k32L68J11j89k7L13k18j06K10K23
$$ -538 397 420 -284 -506 174 414 106 -499 -15 553 -128 -360 8 119 -70 -97 216 -2 -108 102 325
2331C25m10m35N29M54l40p65M56J011n69q47J62J003j49j063J83P21L0n68j52
$$ 325 -85 -520 9 463 123 -642 -186 825 256 -591 -429 574 425 -638 -455 266 296 -272 -424
2350d24M62N3j75l0N08l64l94M62L38l54o39P26J70m35k54M40J25j73l76L11K18
$$ -424 38 91 -84 -114 394 30 -364 98 436 82 -557 169 339 -96 -350 90 215 42 -334 -23 195
2371A95k62j72M87J75p06j17P26j5p16j28P27M99j060l62O69P72n44q52M47O11
$$ 195 -67 -239 248 423 -283 -400 326 311 -405 -533 194 693 -367 -729 -60 712 168 -684 -237 374
2391C74M1o15L9K81k37N5k5K22n81L65M74k53n30J60Q19m02o86J41P05K55q96
$$ 374 415 -200 -161 120 -117 -62 -87 135 -446 -81 393 140 -390 -230 589 187 -499 -358 347 602 -294
2412b94k81R19P7o34j16N13J00n96J7N95m5m81J39O23k64p72L81M39J2q21N9Q39
$$ -294 -575 344 421 -213 -329 184 284 -312 -295 300 255 -226 -87 536 272 -500 -119 320 332 -489 -430 409
2434D09q3o25K7L39J71k93NJ65l23K6K91L21n53k91O26L21p66l97O24O10m21q71
$$ 409 326 -299 -272 67 238 -55 -50 115 -208 -182 109 430 -123 -414 212 533 -233 -630 -6 604 183 -688
2456f88J92J084k50p43nP82j37n25R6L88j85k08J78J25m02L4N43r7n60j38Q34
$$ -688 -496 588 338 -405 -410 372 235 -290 -194 194 9 -199 -21 104 -298 -264 279 182 -378 -516 318
2477C18K96r59k02P39M43n10l47J69M73l47l64J55L17l88J26L21P7o82nQ03J09
$$ 318 614 -345 -547 192 635 125 -222 -53 420 73 -291 -136 181 -207 -81 240 317 -365 -370 433 542
2498E42r29k67J159q0o91l74P46L13j62o31K64J97q9J11P5k19l77P05M42r25m40
$$ 542 -387 -654 505 425 -266 -640 106 419 257 -374 -110 87 -2 109 184 -35 -412 293 735 -190 -630
2519f30N65R95q88q65O71P91l66r36P5J016J71p87k55O10L2l90l8L61j72j48K94
$$ -630 -65 930 42 -823 -152 639 273 -663 -588 428 599 -188 -443 167 199 -191 -229 132 -40 -188 106
2540A06J59l50k49O36J65n80n04N55M66m03l10K06K84j55k23L01p3n4j70M48N
$$ 106 265 -85 -334 302 467 -113 -617 -62 404 1 -309 -103 181 26 -197 104 31 -23 -193 255 260
2561B60m86l59P99L60r63r4R27l3n15p04P88O13n62m02J26M40k7j76J45k04PL67
$$ 260 -226 -585 214 574 -389 -483 444 411 -104 -808 -20 593 31 -371 -245 195 168 -8 137 -67 -60 307
2583C07j60k32l72N02N48n10p78N75P38r5q09l10J041Lp05l16O08K73m59J13J44
$$ 307 147 -85 -457 45 593 83 -695 -120 618 523 -286 -596 445 448 -257 -573 35 308 -151 -38 106
2604A06q4l46M05J00j86m14K87P65l72p80M52N84k65o26q6O94J50o21J02J7J47
$$ 106 22 -324 81 181 -5 -419 -132 633 261 -519 -67 517 252 -374 -460 234 384 -237 -135 -118 29
2625B9J62Kn5p46K46P70j01o42l65J037M85j125n54O93Q78o19n58J57O88L8n64
$$ 29 191 193 138 -608 -362 408 307 -335 -700 337 822 -303 -857 -164 714 95 -463 -306 382 420 -144
2646a44m8J06L99k73j57N3J11N9J26j64l98N1P08O8j125K42N24L59l19n02K64
$$ -144 -192 -86 313 40 -117 -64 47 106 232 68 -330 -279 429 497 -628 -386 138 497 178 -324 -60
2667f0M30k63j86J57pl03J63M10k39l97J21M37J61r97K96P79J58j191j33Q64L47
$$ -60 370 107 -79 78 71 -232 -69 341 102 -295 -174 263 424 -573 -277 502 660 -531 -664 200 547
2688E47n65n16N26J18k0j75j79K10j5K34J49m35l76R17K55q44m46M85Q64l54j042
$$ 547 -18 -534 -8 110 90 -85 -264 -54 -69 165 314 -121 -497 420 675 -169 -615 -130 734 380 -662
2709f62L28R94l17o47N2O34k7l42o9K10k06j43K68K33l17j93M46k0j72m78L93
$$ -662 -334 660 343 -304 -252 382 355 13 -56 154 -52 -195 73 306 -11 -204 242 222 50 -428 -35
2730c5M11k06m75J39L93n3n09M42j09P8j31J35l9k82J3N85q4o55O7N72L97p42
$$ -35 376 170 -305 -166 227 174 -335 107 -2 76 -55 80 41 -241 -228 357 273 -382 -315 257 654 -88
2752h8n18Q18O06p45p98O26N38j72l69j02J63J86j38J4j2l31L16M16m69m47L81
$$ -88 -606 212 818 73 -725 -99 439 267 -102 -204 -41 145 7 21 9 -322 -6 410 -59 -506 -125
2773a25O74l85p36J76P56o9m40q5L75K54o76j0L84o2k47j32L45jk58L53K06k00
$$ -125 549 164 -572 -396 360 291 -149 -234 141 395 -281 -291 93 31 -216 -348 -3 -4 -262 91 297 97
2795I7o61M44O57l19n74J03L92J03k17k18K06lJ33l9r1j24j90N71k1o93l7P48
$$ 97 -564 -120 537 218 -356 -253 139 242 25 -193 13 10 143 104 13 -111 -301 270 249 -444 -481 267
2817B67J20o18l61N91N51n91m24L50P14j67o49j10O10Nl36j24K07j48J19J08j90
$$ 267 387 -231 -592 -1 550 -41 -465 -115 599 432 -217 -327 283 288 -48 -172 35 -113 6 114 -76
2838g6l33K33N73m21k51K4L70J21n01l1L36K30j52m02M36J3j41l9J85j47m59L92
$$ -76 -409 -176 397 -24 -275 -251 119 240 -261 -292 44 274 122 -280 156 169 28 -11 174 27 -432 -40
2860d0M51l07m49J95N68l6p08j33O52J58l74j83L30Q1k9l73J84M6R7j9Qm29N8
$$ -40 411 104 -345 -150 418 382 -326 -459 193 351 -23 -206 124 205 176 -197 -13 33 130 111 119 -310 -252
2883b52O36l1n27m20P08M79o50m03M25M92k12p95L7Q00P4n14j27M44nk12J4K01
$$ -252 384 353 -174 -594 114 593 -57 -460 -35 457 245 -550 -513 287 361 -153 -280 164 159 -53 -39 162
2905A62l28N9L73P2n29L9L41K67l90l91L89K36j58m63L90L1q0o2J80o8j67n1N34
$$ 162 -166 -107 266 338 -191 -152 189 456 66 -325 64 300 142 -321 69 100 20 -42 138 70 -97 -148 386
2928C86k98l95q4Q80P7q26j32N63L45o38m37M59M85k74l89J51M67k04k50p4J22
$$ 386 88 -307 -391 489 566 -260 -392 171 516 -122 -559 -100 385 111 -278 -127 340 136 -114 -188 -66
2949f6q3K44L8j84k49M43K18j25n06Q1O89l32q11J58N91L59p10j75P97k03m87
$$ -66 -149 95 133 -51 -300 143 361 236 -270 -189 500 168 -643 -485 106 465 -245 -420 377 174 -313
2970c13L4K37K11l81K4M41l13l31L83N10l06p16J63O15J1m76m7N09j46m80L16
$$ -313 -279 -42 169 -212 -188 253 -60 -391 -8 502 196 -520 -357 258 269 -207 -254 255 109 -371 -55
2991e5K99l41o4N68j61m55j81O61p9n70P5N85L11p11n67O36O05m27o01L06M56
$$ -55 244 -97 -161 407 246 -209 -390 271 192 -378 -303 282 593 -118 -685 -49 556 129 -472 -166 290
3012B90p5o71J79L44R4l19J22LpoK06k96k72M63J38pn54J38N63j15m76R7M00L4
$$ 290 215 -456 -277 67 161 -158 -36 -33 -40 -46 160 -136 -408 55 193 186 -368 -230 333 218 -258 -161 239 273
3036B73j99l64M34N1l48Q1L24j25l62R7N21j14n61q7M93J23m49k70O11L32n27
$$ 273 74 -290 144 195 -153 -72 252 127 -235 -138 383 269 -292 -379 114 237 -212 -482 129 461 -66
3057f6k49L46J29j3j35J4J4j57J83l0j42j44M32R4l77n41P08N28p22k82J89O85
$$ -66 -315 31 160 147 12 26 40 -117 66 36 -106 -250 182 276 -101 -642 66 594 -128 -410 -221 464
3079D64j37n87Q8N80j44m11J10N8J13j94k0L09n18L5J48K58k91r3K90K03k56k65
$$ 464 327 -260 -172 408 264 -147 -37 21 134 -60 -80 229 -289 -254 -106 152 -139 -232 58 261 5 -260
3101b60L68m7K6j18J39K00l13j20L70ok63k69O76r3m66j16M45P9m56j68M49N08
$$ -260 108 61 87 -31 108 308 -5 -125 245 239 -24 -293 383 290 -176 -292 153 232 -224 -392 57 565
3123E65m75l98L60L46n14q3K5M16k12r5J11j30p1L88J94p02l23M20M18k98k93
$$ 565 90 -308 52 398 -116 -199 -174 242 30 -65 46 -84 -155 233 427 -275 -598 -178 240 -58 -351
3144c51J44N22l7o59L9O17j17k58r4N03Qm34N7M53j12m09K80K94n66k13L06K20
$$ -351 -207 315 278 -381 -342 275 158 -100 -194 309 317 -117 -60 393 281 -128 152 446 -120 -333 -27 193
3166A93l27k05L71J33j17j51j23K87P8l5l8n7k3j67O26j52n79l1N17j5n37r7M87
$$ 193 -134 -339 32 165 48 -103 -226 61 139 104 66 9 -14 -181 445 293 -286 -317 200 185 -352 -449 38
3189C8M43m41o61M64N05n43l53M65L78r7k80J4K95k38PJ29K3k45n7K73L7l31K2
$$ 38 481 40 -621 -157 348 -195 -548 -83 295 198 -82 -68 227 -11 -4 125 148 -97 -154 119 156 -175 -153
3212a53M37p4m11mM55j54l99N7M03k4l25O2M56j30l95J31L98k68m21J75N76p0
$$ -153 284 210 -201 -205 250 96 -303 -246 157 133 -192 -130 326 196 -199 -68 330 62 -359 -184 392 322
3234C22n41j67O53j11m18J5M07L6m15J05J08o9l3J61L9q4k8M58l03k26k27L72
$$ 322 -219 -386 267 156 -262 -247 160 196 -219 -114 -6 -75 -108 53 92 8 -20 438 135 -91 -318 54
3256E4M52o42j40K83L22k33m85L78L99j19n79L8L15j42Jj5K78j82j03J31J10j85
$$ 54 506 -136 -276 7 329 96 -389 -11 388 269 -310 -272 43 -99 -98 -113 165 -17 -120 11 121 -64
3278f4k29L42K25k00l07J72K06k9k96K21p0k8j42K94m8j21j92M30J00m87j88N55
$$ -64 -293 49 274 74 -233 -61 145 116 -180 41 -29 -57 -199 95 47 -74 -266 164 264 -223 -411 144
3300A44R8m76m9N90P0n60k56M25L30l47k35K98K05j23k36J61j26k2J54Q4j90j34
$$ 144 242 -234 -283 307 377 -183 -439 -14 316 -31 -266 32 237 114 -122 39 -87 -109 45 129 -61 -195
3322a95J78K83l25j74Q7L91j97l60J19N74o4n19LM34r6l82J89J67r4l15L86Rk
$$ -195 -17 266 -59 -233 -146 245 48 -312 -193 381 317 -202 -199 235 139 -243 -54 113 19 -296 90 99 97
3345I7k66J88K32q1l44K8J43j6k40J69N7R9R1M9o3j98k09M45J7k48j73L69r5j72
$$ 97 -169 19 251 170 -174 -146 -3 -19 -259 -90 -33 66 157 206 143 -55 -264 181 198 -50 -223 146 51 -121
3369a21l04M63K31m07k18M23M02m49l61K35L39k16l24J7N16l08j05K85Lm2l4R
$$ -121 -425 38 269 -138 -356 67 469 20 -341 -106 233 17 -307 -290 226 -82 -187 98 101 59 25 34
3391C4J36k61J62J63j55k85K62R6k06j48R3L42k52j97J01M67j38m36L5M38K3n40
$$ 34 170 -91 71 234 79 -206 56 152 -54 -202 -109 233 -19 -216 -115 352 214 -222 -187 251 274 -266
3413b66L2M20Mn74J28L94Rk22j0K63l8p6j43K57j48k07L17L8k77K83k8o9j90M7
$$ -266 -234 186 190 -384 -256 138 147 -75 -85 178 140 64 -79 178 30 -177 140 178 -99 184 156 87 -103 -56
3437e6P2K97m29n7K83K57n45q2N1M69p5n61M15L15l48k82L51N6M1k15m4M09l69
$$ -56 16 313 -116 -173 110 367 -178 -260 -209 260 185 -376 39 354 6 -276 75 131 172 -43 -87 322 -47
3460d7j30K06R5j15j04N8K33l55m4K97j41q4M2L16j01l00J59J51K6n32J71L25
$$ -47 -177 29 124 9 -95 -37 196 -159 -203 94 -47 -131 -89 227 126 -174 -15 136 162 -370 -199 126
3482A26K53n42j5M27J44o38l9N94J3l47k14L69K4l42n7M23j69j09j05K13n1j05
$$ 126 379 -163 -178 249 393 -245 -284 310 323 -24 -238 131 155 -187 -244 179 10 -99 -204 9 -42 -147
3504a47O5L27k89N0q5K79j40m17L23L08k72k38J13K87M5m42J78K47j17l71K70
$$ -147 -82 245 -44 6 -79 200 60 -357 -34 274 2 -236 -123 164 209 -233 -55 192 75 -296 -26
3525b6K54P2n24J44M62k33m10K13J22P9l47J89K57j49l5k29P9j92J92K35O4j55
$$ -26 228 300 -224 -80 382 149 -261 -48 74 153 -194 -5 252 103 68 -161 -82 -274 -82 153 217 62
3547F2k24K59J12m6n28N37jj10l37L22L61n25j4P5L43l72OP1K22l52q1J64K24
$$ 62 -162 97 209 163 -365 172 171 61 -276 46 407 -118 -132 -57 286 -86 -80 -9 213 -139 -220 -56 168
3570A68j39j94J62J83m84K13K51j96j47J19O8M7k72J56L44k32k67M9N72j75n33
$$ 168 29 -165 -3 180 -304 -91 160 -36 -183 -64 4 51 -221 -65 279 47 -220 -171 401 226 -307
3591c07K69L06k07k01j84M72J06m20r4K49l2j63r2L59j4k29N7K71k31J04l5K3
$$ -307 -38 268 61 -140 -324 148 254 -166 -260 -11 -43 -206 -298 61 47 -182 -125 146 -85 19 -16 7
3613Gj36R5J55J2l09o6M59jk77n7J63J41l06PJ30K03k03m26M17K12k29k81L76
$$ 7 -129 -34 121 133 -176 -242 217 216 -61 -118 45 186 -120 -113 17 220 17 -409 8 220 -9 -290 86
3636H6L62n34jR4K51r4l66J16L57k82k03J95J30j15j54K39k7k72J01K93k23j09
$$ 86 448 -86 -87 7 258 164 -202 -86 271 -11 -214 -19 111 -4 -158 81 54 -218 -117 176 -47 -156
3658a56R6J05J43l13nJ00J18l47K28K73l70J24l01L20J63l43m9M37j06l02J00
$$ -156 -60 45 188 -125 -130 -30 88 -259 -31 242 -128 -4 -305 15 178 -165 -214 223 117 -185 -85
3679h5K99L3l51L8J9P3j82Q3K4J1R3r8J28k42j36K09N33n49M8J25J27k55l46M91
$$ -85 214 247 -104 -66 -47 26 -156 -73 -49 -38 55 -43 85 -157 -293 -84 449 -100 -52 73 200 -55 -401 90
3703I0J3J14p24M84K28j29k23J19L12k92J12k93M55m01j36O2K17k1o1J33j17Q
$$ 90 103 217 -507 -23 205 76 -147 -28 284 -8 104 -189 266 -135 -271 -209 8 -13 -74 59 -58 -50
3725e0o6J79j1k57o8L99Q7j76k77M39j31k98P4K75m0k04p5K77K14n12J33J75l9
$$ -50 -116 63 52 -205 -273 126 213 37 -240 199 68 -230 -156 119 79 -125 -200 77 291 -221 -88 87 48
3748D8j28k70K41K80l87M31k03R4o1l0j01P1j9J42R5p5j24j89L17J4k84j52O10
$$ 48 -80 -350 -109 171 -216 215 12 106 45 15 -86 -15 -34 108 203 128 4 -185 132 146 -138 -290 320
3771C20k21k13j13L55k07q5J63J92p8m28K20K26k69j22J74K55j91j87Q9K67J4
$$ 320 99 -114 -227 128 -79 -164 -1 191 113 -315 -95 131 -138 -260 -86 169 -22 -209 -120 147 161
3792A61l59Q1K61k97P6K51j33j24k78L06J27j62q7L15J76l40q2J86O9l76J70J5
$$ 161 -198 -117 144 -153 -77 174 41 -83 -361 -55 72 -90 -177 138 314 -26 -108 78 147 -229 -59 -44
3814d4J85q9k95N3K64m0l19R2L60j10l14K14K56r2l09K88Jo6r3j30R5J57k42K28
$$ -44 141 52 -243 -190 74 34 -285 -193 167 57 -257 -43 213 121 -188 100 101 35 -58 -188 -93 64 -178 50
3838E0M7k80J14J58J6k63o4L94J8k96RJ90J44m73P5L50j10j83k71L74K95m19p9
$$ 50 97 -183 -69 89 105 -158 -222 172 190 -106 -97 93 237 -236 -161 189 79 -104 -375 -1 294 -125 -204
3861b04K63m7K8j47J17m1r7K83k72J09k10J47J20L2l11N16l14j00J72NM6j68l08
$$ -204 59 12 40 -107 10 -31 -128 155 -117 -8 -218 -71 49 81 -230 286 -28 -128 44 49 95 -73 -381
3884c81M56K37k36k86L01K05l72k03J46L62k88k17J96J26l7k55J06L50k17j96
$$ -381 75 312 76 -210 91 296 -76 -279 -133 229 -59 -276 -80 46 9 -246 -140 210 -7 -203
3904b03L3J56K33j93L1J18k85O2J13o3j81J95J59k21l4%L29j06l72K1J81J47j68
$$ -203 -170 -14 219 26 57 175 -110 -48 65 2 -179 16 175 -46 -80 -80 249 143 -229 -208 -27 120 -48
3927d8l13M92Kj61k40L06J71j55l00L23jj18L0M6l1l5J12p3j78J06N7J25n7k50
$$ -48 -361 131 133 -28 -268 38 209 54 -246 77 76 -42 -12 34 3 -32 80 7 -171 -65 -8 117 60 -190
3951a90LL12j11j69K94k2K8j33nL49l45k09J04L36r0l43K27K23j21m03J51K56
$$ -190 -187 125 14 -155 139 117 145 12 7 356 11 -198 -94 242 152 -191 36 259 138 -265 -114 142
3973A42J01k40j08K47n2k26m9M10l02j7J80Nm5r2J7N2o3k2K94J48o35OK18J5J2
$$ 142 243 3 -105 142 90 -136 -185 225 -77 -94 86 91 46 -46 -29 23 -40 -62 232 380 -255 -249 -31 -16 -4
3998dk38L97R8j63l67K10K94j29k86Q9K87k80j81J57J14O9o0j29K03Pj09J55m3
$$ -4 -242 155 253 90 -277 -67 227 98 -188 -99 188 -92 -273 -116 -2 67 7 -122 81 88 -21 134 91
4021I1j77J29jJ43l18J6J87J05l78O3L20k7k58j02L60m0m63L50K67k21l6j20Q3
$$ 91 -86 43 42 185 -133 -117 70 175 -203 -140 180 153 -105 -207 153 113 -350 0 267 46 10 -110 -27
4044b7J6J33l94L04J11m6l72K48M5j50J50P1j5j95P1K65l53o8J81J18n4m58M05
$$ -27 -11 122 -272 32 143 97 -275 -27 18 -132 18 89 74 -121 -50 215 -138 -206 -25 93 39 -419 -14
4067a4M33n05q6J31K90k53k50J13L65m86N0m7M58k26j03J05J59N8j81j25L72j75
$$ -14 419 -86 -172 -41 249 -4 -254 -141 224 -262 -212 -259 199 -27 -130 -25 134 192 11 -114 258 83
4089H3k64L06p5q1j17L46r3j10j92K41k09q9J63L05k23l66K28O08l57j99p2J56
$$ 83 -181 125 50 -31 -148 198 105 -5 -197 44 -165 -254 -91 214 -9 -375 -147 461 104 -95 -167 -11
4111a1L08l84k63M22Jl24K08J48m2m1j11J77r8O0J56k02Q6R4K0k06Jj77K98p0
$$ -11 297 -87 -350 72 73 -251 -43 105 63 22 -89 88 -10 50 206 4 90 184 204 -2 -1 -178 120 50
4135E0Kj44Q9K74k90r9J18J64j23k05L70mR1n34J26M27k33m92N08J07l04L2J93
$$ 50 52 -92 -3 271 -19 -118 0 164 41 -164 206 202 293 -241 -115 312 79 -413 95 202 -102 -70 123
4158A23j10M0j1RM0qj70m8L54j20m0j24J24j41q4K35K6j51j51J32L07l45J40K0
$$ 123 13 53 42 51 91 83 -87 -135 219 99 59 -65 59 -82 -166 69 95 -56 -207 -75 232 -113 27 47
4182D7J24k18OJ08J86k22j08Q6J25r6j49J86k1q8J4N4o3n2q8K34L9k08L2m4M4
$$ 47 171 -47 -41 67 253 31 -77 9 134 38 -111 75 54 -34 -20 34 -29 -81 -169 65 104 -104 -72 -116 -72
4207g2m6n0K48p0j32K94M6k79m9j03M52q9k24M6J10J53l45M8K19k39k9J34J23
$$ -72 -118 -168 80 10 -122 172 218 -61 -110 -213 239 150 -74 -28 82 235 -110 -62 157 -82 -111 23 146
4230A46K22k68j22J22M1j99L4Q7p2M0o0R9j49n1Q1K48m52PL14J70k47j04J75m6
$$ 146 368 100 -22 100 141 -58 -24 63 -9 31 -29 70 -79 -130 -49 199 -253 -246 68 238 -9 -113 62 16
4254A6O8j62J46J27k14j81R2L49k97r7J47L20j76k55K7K59l40Q5J32J12l5k26
$$ 16 84 -78 68 195 -19 -200 -108 241 -56 -153 -6 314 138 -117 -90 169 -171 -86 46 158 123 -103
4276a03P0P2L0j06L1j0j06n8J45m4nM4J03Q1l50j38M70N4j69P4L0j44l0k48K98
$$ -103 -33 39 69 -37 -6 -16 -122 -180 -35 -79 -84 -40 63 144 -206 -344 126 180 11 85 115 -29 -59 -307 -9
4301iK6k31K9K84r3k53L96j01J39k86o2K58o1n3LJ58j81j45K14J52l06k44M38
$$ -9 17 -214 -185 99 6 -247 149 48 187 -99 -161 97 36 -17 -14 144 -37 -182 32 184 -122 -366 72
4324G2K6j18j50J38K38j34j99J20K12l37O6L6O1j02k9J6K38O5k39j88L24j97J39
$$ 72 98 -20 -170 -32 206 72 -127 -7 205 -132 -66 -30 31 -71 -100 -84 154 219 -20 -208 116 -81 58
4347E8k13J52o6Q7K4o9o7J33o4J79k88R8O4J69k35m6L43o3l12n6L77n7k47l34
$$ 58 -155 -3 -69 18 42 -27 -94 39 -25 154 -134 -36 28 197 -38 -84 259 196 -116 -172 205 148 -99 -433
4371d33P43k86m6k96L29K18p6k21J23k5q4J45N2r6k3nk6N7p5K4J34j0k20J22M1
$$ -433 310 24 -22 -318 11 229 153 -68 55 30 -54 91 143 47 24 19 -7 50 -25 -1 133 123 -97 25 66
4396F6J18m11K52J27k18j30L67J10k95k31J39J27p0L6l23L80Q9j39j13J34M0k23
$$ 66 184 -227 25 152 -66 -196 171 281 -14 -245 -106 21 -49 -13 -336 44 133 -6 -119 15 55 -168
4418a68K31L7j85K52j09k13J35jJ5n1j18M8K08J22l29pJ66J60k17j15J43J37k53
$$ -168 63 100 -85 167 58 -155 -20 -21 -6 -57 -175 -127 81 203 -126 -133 33 193 -24 -139 4 141 -112
4441a12K5K31o9j89N3J16J13j67k15J43Q7m0k6L9O5N1j26k0R1k21J44K11j18j53
$$ -112 -87 144 75 -114 -61 55 168 1 -214 -71 16 -24 -50 -11 54 105 -21 -41 50 -171 -27 184 66 -87
4465h7J40k5M7j77J26j93L01l88K22K75m16J07k21M28N7l42K95j09n9j71K6J74
$$ -87 53 28 75 -102 24 -169 132 -256 -34 241 -175 -68 -289 139 196 -146 149 40 -19 -190 -164 10
4487A0J79j98J6J34j36n7N9o0J22kl46M48j87j3J09OM2j68K59j28j3K5j15J72
$$ 10 189 -9 7 141 5 -52 7 -53 69 67 -279 169 -18 -31 78 84 126 -42 217 89 76 101 -14 158
4511A58j65j56J39K17m28N8Q6L17k47j35J76L00k44j35L7K41K4m43M44Lj35l09
$$ 158 -7 -163 -24 193 -235 -177 -91 226 -21 -156 20 320 76 -59 -22 219 243 -200 244 247 112 -197
4533a97K75N5l79L9K09J12j82k1K68k28j42K1J85J46j33k62O62k63k87k4J33J61
$$ -197 78 133 -246 -207 2 114 -68 -89 179 -49 -191 -170 15 161 28 -234 428 165 -122 -146 -13 148
4555A48j55j55J10l4J76n2p7J66k89JK03N6j78J02P4o3N0j2k03J93j08R7R8j07
$$ 148 -7 -162 -52 -86 90 38 -39 127 -162 -161 42 98 -80 22 96 33 83 71 -132 61 -47 50 148 41
4579D1j43M25l98J75l06J55K17r1k6N6J11j00k24J97J14j62j76J7K71k19N3k63
$$ 41 -102 323 -75 100 -206 -51 166 75 49 105 216 116 -108 89 203 41 -135 -118 153 -66 -13 -276
4601b76L21K9Lj79J45n7m5O5J02l03K67l9N6k41oJ70K80l13K4K5Q3j36k1K06J93
$$ -276 45 74 77 -102 43 -14 -59 6 108 -195 72 33 89 -152 -158 12 292 -21 3 28 111 -25 -46 160 353
4626C53k53l31K82P3l33R3J48M3nl29L92j26O5j11M3oj88J22O6LR4l55K41L3j60
$$ 353 100 -231 51 124 -209 -116 32 75 70 -259 133 7 72 -39 4 -2 -190 -68 -2 1 95 -260 -19 14 -146
4651a46J33M9P2k35K04j22J15j53J43J42j17k75m4K95J60k98k28M35j67j87K45
$$ -146 -13 36 108 -127 77 -45 70 -83 60 202 85 -190 -234 61 221 -77 -305 130 -37 -224 21
4672B1QKk16J87P9o8j43K69n6j75J57m6J50k64J26J28j05k29J13J66K41l78M7
$$ 21 29 31 -185 2 81 13 -130 139 83 -92 65 19 169 -95 31 159 54 -175 -62 104 345 -33 14
4695A4J36QO1l22J69j4K0k85p6L02j85J67OJ19k6k83Q1J70J15l5k30J75k7N7q9
$$ 14 150 158 219 -103 66 52 72 -213 -289 13 -172 -5 1 120 94 -189 -108 62 177 142 -88 87 60 117 28
4720B8J14M3j54J18l28o1K27J40j35p2L7L29k37r5j28L43j93Mq9K89K37n34J63
$$ 28 142 185 31 149 -179 -240 -13 127 -8 -80 -43 286 49 -46 -174 169 -24 -20 -109 180 417 -117 46
4743D6M8m5o5J23k33P1L4J25%J5j22p7J62L1l01J16K44k93K56m66K64oo7Q8J61
$$ 46 94 49 -16 107 -126 -55 -21 104 104 119 -3 -80 82 113 -188 -72 172 -121 135 -331 -67 -73 -140 -52 109
4768A09m0k30J73J93j51j39J00J95j10k08J60K2j94j46qL26J77m35J93j37K3o8
$$ 109 69 -161 12 205 54 -85 15 210 100 -108 52 74 -120 -266 -274 52 229 -206 -13 -150 -127 -195
4790a95J26K27j96m7%J94r0q2J6J10k48J01K14J00k50l2j53L22k04p6K45o3o1
$$ -195 -69 158 -38 -85 -85 109 19 -63 -47 63 -185 -84 130 230 -20 -52 -205 117 -87 -163 82 19 -42
4813d2J33mL6j65O2j30L02j25k8J9LNj96J88j91J28oK18l20rj14L97n5j02j99
$$ -42 91 87 123 -42 20 -110 192 67 39 58 61 66 -130 58 -133 -5 -11 207 -113 -122 -236 161 106 4 -195
4838a95K44p2k02K40M2PL2j45J96M8l61J94O9n9j55jJ70l0k59L00n5n2j4j3m1
$$ -195 49 -23 -225 15 57 64 96 -49 147 195 -166 28 97 38 -117 -118 52 22 -237 63 8 -44 -58 -71 -112
4863a12J60k08K38j1r9l3J57m2k34l7K58K19l88J4J33J09j40k66K30K98l82k0
$$ -112 48 -160 78 67 -32 -65 92 50 -184 -221 37 256 -132 -118 15 124 -16 -282 -52 246 -136 -156
4885a56l6M03k96K4j3J78J8j55J10q2Orl8J29j47M7N9n3R7j58O7M0r2q3K50j53
$$ -156 -192 211 -85 -61 -74 104 122 -33 77 -5 1 -8 -46 83 -64 -17 42 -11 86 -72 -5 35 -57 -140 110 -43
4911d3j79J06L44k36m7p5K12J00j81P4O6n5k81O3K6N3J06k95K43K8K7k75J30J50
$$ -43 -222 -116 228 -8 -55 -130 82 182 1 75 141 86 -195 -132 -106 -53 53 -242 1 29 56 -219 -89 61
4935F1m0j01Q9J04o0j15j00j13L36M7J39k99o6P3N0q8n1L55N6l05n2l3K84k60
$$ 61 21 -80 9 113 53 -62 -162 -275 61 108 247 -52 -118 -45 5 -83 -134 221 277 -28 -80 -113 171 -89
4959h9j82K96oq1o6R2J60k60j2J08R9M4k18J11p2L7n3j04J82P8j40M8rj06J7K19
$$ -89 -271 25 19 -62 -128 -36 124 -136 -148 -40 59 103 -115 -4 -76 -39 -92 -196 -14 64 -76 -28 -37 -143 -126 93
4985I3m1j40j48K19o1m5QK91p6o0m31K71J36kj69K8K0Q2Qj6J32k49jL66j67J22
$$ 93 52 -88 -236 -17 -78 -123 -115 176 100 40 -391 -120 16 14 -155 -127 -107 -25 -17 -33 99 -150 -151 215 48 170
5011A70j79o4K7J99k65K24k1j1p5P4j50N1J99j06j21L7n5J26l2k23P0M02j21k40
$$ 170 -9 -73 -46 153 -112 112 91 80 5 79 -71 -20 179 73 -48 -11 -66 60 28 -195 -125 277 156 -84
5035h4l3L38k27j94J10J79q7j44p4L95j31j43q4K44k26J61K9J43j38j52O1K75
$$ -84 -117 221 -6 -200 -90 89 2 -142 -216 179 48 -95 -179 65 -161 0 29 172 34 -118 -57 218
5057B18j30j20J08P0j12j93K29P4p8k66J16J43j66J6J79P7Ml76K1K67l2j66R5
$$ 218 88 -32 76 146 34 -159 70 144 66 -200 -84 59 -107 -91 88 165 169 -207 -186 81 49 -117 -22
5080b2J34j51O3r8J16k41J14J10M9j29k46L53L6l26J93M47k58k35m7K43N1l03
$$ -22 112 -39 24 -74 42 -199 -85 25 74 -55 -301 52 88 -238 -45 402 144 -91 -138 105 156 -147
5102a47j53J87L6N6n2R0J59k86j40K44j60L5J18L4KR3j06n7NJ0No0j00J90J12
$$ -147 -300 -113 -77 -21 -73 17 176 -110 -250 -6 -166 -131 -13 21 23 116 10 -47 -42 -32 -27 -87 -187 3 115
5127A15j58R2l08L29O2j94k64K02K79r5j87J97%j83J48lO1J36j83m7j04J19p2
$$ 115 -43 49 -259 70 132 -62 -326 -124 155 60 -127 70 70 -113 35 32 93 229 46 -1 -105 14 -58
5150e8j00K75J32k86k0K19r3R3k24j34J70R4q2k9q7R8L3K6j66J3K19k91mQ9O5
$$ -58 -158 117 249 -37 -57 162 69 162 -62 -196 -26 68 -14 -43 -130 -32 1 27 -139 -126 93 -198 -202 -113 -48
5175d8M4oJ24j86k9J31k43J86J6ml4Q3K3j49J12R4j3k25j5M80j92k09n8%k4J94
$$ -48 -4 -10 114 -72 -101 30 -213 -27 -11 -15 -49 34 57 -92 20 114 101 -124 -139 341 149 -60 -118 -118 -142 52
5201E2p4l9O9J79l11J25o9L3KK93k15l40L36J70j19j34j27J89l5qj4K6Q6q5j35
$$ 52 -22 -61 8 187 -124 1 -68 -35 -33 260 45 -295 41 211 92 -42 -169 20 -15 -23 -37 -11 75 -10 -145
5226a45K97j89oK17j59L0j61J12k1j63J01J66n8r4m3M4K36q7j46J57M2k20Q2l3
$$ -145 152 -37 -43 174 15 45 -116 -4 -25 -188 -87 79 21 -73 -116 -72 164 77 -69 88 130 -90 -8 -41
5250d1O8N2l65L40J6j27q8J13K15k05K0J51j04Pj59R6j07J27j06J44p6j4k3M3
$$ -41 27 79 -286 54 70 -57 -145 -32 183 -22 -2 149 45 52 -107 -11 -118 9 -97 47 -29 -43 -66 -23
5274b3J32r0RM7j03j17M1J22P9l88K78J16l7l48J3Q9mN9jK85k17R1j61J04Q0p4
$$ -23 109 19 28 75 -28 -145 -104 18 97 -291 -13 103 66 -282 -269 -180 -184 -125 -126 159 -58 33 -128 -24 56 -18
5300a8O3j0j21l9q0J80j88J26J73K4k32J6J45R4m19K89q2K94k13J56k9k34K2j02
$$ -18 45 35 -86 -125 -205 -25 -213 -87 86 110 -122 -106 39 133 -286 3 -79 215 2 158 129 -105 -83 -185
5324a85K97j08Pk06J73J66j82k08L77P9R4n37K77J1j47K57j77j82K94k72K95k78
$$ -185 112 4 11 -195 -22 144 -38 -246 131 210 304 -233 44 55 -92 165 -12 -194 100 -172 123 -155
5346a55K08Q4NMl12L5J03K58k17j18N2k9lQ2M9K32m01J75j1O0r0j4PN8j40L6j5
$$ -155 53 137 142 146 -166 -131 -28 230 13 -105 -53 -82 -85 -3 46 278 -123 52 41 101 11 -3 4 62 -78 -42 -57
5373e7K11j46o2J69o3j07K6J75k09n1K2K41k35J8J53J27l59p4K75j53k0J5K66
$$ -57 154 8 -54 115 52 -55 -29 146 -63 -114 -92 149 -86 -68 85 212 -147 -221 54 -99 -119 -104 162
5396A62j04j14j95N4K87p9j21J5J64O8j16Lj34K02m9j7J94j54o2Q2j06j9j5k9
$$ 162 58 -56 -251 -197 90 11 -110 -95 69 137 21 24 -110 92 43 26 220 66 4 86 -20 -39 -54 -83
5420h3J49k19N0p0K21j32K4j23K07j17o8K27J39k69J51M4j1q5r6J96k2j06L3j15
$$ -83 66 -153 -103 -173 48 -84 -60 -183 24 -93 -161 66 205 -64 87 131 120 35 -61 135 113 7 40 -75
5444g5Q9L0r4J71k10J45L3j83L60k96m7J08n9J60o8k05J37k37L83K6j36l12L13
$$ -75 14 44 -50 121 -89 56 89 -94 266 -30 -77 31 -28 132 64 -141 -4 -241 142 168 32 -280 33
5467C3j08oj19J47J01M9j26j35K91m1k10J74j29N9k06L12r0P6%k00L03j64N9r9
$$ 33 -75 -81 -200 -53 48 97 -29 -164 127 86 -124 50 -79 -20 -226 86 -4 72 72 -128 175 11 70 -29
5491b9K01j94J51q8r2K2q7K40j68j04j87L60l7M3q2L2P7J9J60L4j40j96n2N8M5
$$ -29 172 -22 129 41 -51 -29 -116 124 -44 -148 -335 25 -12 31 -51 -19 58 77 237 271 131 -65 -117 -59 -14
5516a4Lk17K52J03j41q1J76j70K96j33K2o7pO9l5q7O5J6L7J75j29r7K65k11k26
$$ -14 -11 -228 24 127 -14 -95 81 -89 207 74 96 29 22 91 56 -31 34 50 87 262 133 36 301 90 -136
5541a36L00k95J43k03L5p7M13l07P9N0kj83n5J45J95p7k16K66k08L6K08j23N1
$$ -136 164 -131 12 -191 -156 -233 180 -127 -48 2 0 -183 -238 -93 102 25 -191 75 -133 -97 111 -12 39
5564C9p6K9O0j6L3k00J62k09L06K4k93L9R3N9J4K1k00J90K8k7jj04L82k56p2j38
$$ 39 -37 -8 52 36 69 -131 31 -178 128 152 -141 -102 -9 50 64 85 -115 75 103 76 75 -29 353 97 25 -113
5590a13K77k27K31k37RK34l19JR2n4J23j00J78k3N0Q5k91j7J3oL11m31J19Q3N1
$$ -113 164 -63 168 -69 -60 174 -145 -144 -52 -106 17 -83 95 72 122 207 -84 -101 -88 -94 217 -214 -95 -12 39
5615C9Jm4J22m4k55J83Q7r7j64J00j02J18J3J12j1R4r1j92L98l14J39k87K36J02
$$ 39 40 -4 118 74 -181 2 89 -8 -172 -72 -174 -56 -43 69 58 152 61 -131 267 -47 92 -195 41 143
5639A43k33J09J47j85P5j44Q7k5R4J29j01r9j56K57j7l54K33l6K61k83L1R5On9
$$ 143 -90 19 166 -19 56 -88 -1 -26 68 197 96 -3 -159 98 81 -273 -40 -76 185 -98 -67 28 34 -25
5663b5L4P6j00L6l6L0M9r5n1K14j13n3J6j76L82M7k67J52j75J27k59K06N2k13
$$ -25 9 85 -15 21 -15 15 64 -31 -82 132 19 -34 -18 -194 188 235 -32 120 -55 72 -187 19 71 -142
5687a42K87k95K88k39k3K93k5j10q4m5R0p9J42j43P5k0k3K47Oj50oj25Q7K13l03
$$ -142 145 -150 138 -101 -124 169 144 34 -50 -95 -5 -84 58 -85 -10 -30 -53 194 200 50 44 -81 6 219 -84
5712h4P4K5q4n2K8m5J75J7J49k45J4p5L20k87l8J75j20J97k01J27j16J25q9j58
$$ -84 -10 15 -69 -121 -93 -138 37 54 203 -42 -28 -103 217 -70 -108 67 -53 144 -57 70 -46 79 -10 -168
5736a68L21j07l5j03M5O1k8O9j26R2N2r3J27q3j00K47l87J73r7O9P1k19L49k63
$$ -168 153 46 11 -92 -47 14 -14 55 -71 21 73 -20 107 24 -76 171 -216 -43 -140 -71 0 -219 130 -133
5760a33J75j4j19K12o7J76j37L6Jj1k60Q1K47k06j32J0J79l0n7K02j28j57K72
$$ -133 42 28 -91 121 54 230 93 129 130 119 -141 -60 187 -19 -151 -141 38 8 -49 153 25 -132 140
5783A40K7k37R5k5n9J8K0k9K42o9k20J35J13k42n1l8K04N0p3j83K87k96r5J42
$$ 140 167 -70 25 0 -59 -41 -21 -50 192 123 -97 38 151 -91 -142 -180 24 74 1 -182 105 -191 -286 -144
5807a44K24L1K5k46K59p8j46o8J09J42k3k40K04m9O5o7J69j30J41r2k69J29p8
$$ -144 80 111 136 -110 149 71 -75 -143 -34 108 85 -155 49 0 65 -2 167 37 178 86 -183 -54 -132
5830a32J62J30l33J9K82k33K6J8J14l6q0m7O2K17j28j19n3K84k68J25j65J35J85
$$ -132 30 160 -173 -154 128 -105 -79 -61 53 17 -63 -110 -48 169 41 -78 -131 153 -115 10 -155 -20 165
5853A65q9j21J29J23k81J38o3j8j69L07q9j49J2J43j27K6R9O3j66JRK17k60K9
$$ 165 76 -45 84 207 -74 64 1 -17 -186 121 32 -117 -105 38 -89 -63 36 99 -67 -66 -57 160 -100 -71
5877g1J74j49J50j99K2L2J44j73o8J35K55j53o5o6o7L5m1K19k53J38n8K03j33
$$ -71 103 -46 104 -95 -73 -41 103 -70 -138 -3 252 99 34 -32 -99 -64 -105 114 -139 -1 -59 144 11
5900A1j1P0j6R7l53K17j47J03r3O4O8K6m4N1j01J66j09R1J84m23J15oL9p0m1J0
$$ 11 0 70 54 151 -202 15 -132 -29 -122 -58 10 36 -8 43 -58 108 -1 90 274 -149 -34 -40 -1 -71 -112 -102
5926a02O7J14l3j8m6L7Q3j08M5j86J73j14Q2j76K5J98p4L2j39J92Qj85J5R8J30
$$ -102 -35 79 46 28 -18 19 102 -6 39 -147 26 -88 -6 -182 -157 41 -33 -1 -140 52 60 -125 -110 -12 118
5951A18k44J60m8o0n1N2PJ79j42m2M8o4J65k38N6J24j46K3J05J43j07j18M3J74
$$ 118 -126 34 -14 -74 -125 -73 -66 113 -29 -71 -23 -87 78 -160 -104 20 -126 -103 2 145 38 -80 -37 137
5975A37j99L5J34q9j00k3Q3J5o4P5J58J2j58K9k37L82l93J92J07p7j13J08J49
$$ 137 -62 -27 107 18 -82 -105 -22 -7 -71 4 162 174 16 45 -192 190 -203 -11 96 19 -94 14 163
5998A63n5k55q4K70p3J09K6K4q9r9o9P2p9O9J12m8j42J06P7l0j67P8J81O8j39
$$ 163 108 -147 -231 39 -34 75 101 125 36 -63 -132 -60 -139 -70 42 -6 -148 -42 35 5 -162 -84 97 165 26
6023B6j65J50n2J94j55J61j88ol4O0qj09J04j04O9P1j6K0K3p7J58LRj75j49K53
$$ 26 -139 11 -41 153 -2 159 -29 -35 -69 -9 -17 -126 -22 -126 -57 14 -2 18 41 -36 122 125 134 -41 -190 63
6049F3n1r3J07j14L13j83q4k5J12J17L1k01q1J51k97J61J32j63RK92k37L5j00
$$ 63 12 -81 26 -88 225 42 -42 -67 45 162 193 -8 -89 62 -235 -74 58 -105 -96 196 -41 -6 -106
6072a06K9M7L0k28K99K6k2Qj31K06j52O1Q1j49N8R2j91K53r9r1l0J12n3j6K02
$$ -106 -77 -30 0 -228 71 97 75 83 -48 158 6 67 148 -1 57 149 -42 211 112 21 -9 103 50 34 236
6097B36q3j45j77K92l72J64j13K02Q7q2Rl6R7j39K75j44k05rJ85l6o7r1R2m9j19
$$ 236 153 8 -169 123 -249 -85 -198 4 91 9 18 -18 79 -60 215 71 -134 -143 42 6 -61 -152 -60 -109 -228
6122b28Q0L97l69j1p0J56P6o3J1J66q7r3n5Q8o3J03q6l5L00k62m7k4R9O1o9j7
$$ -228 -148 249 -120 -131 -201 -45 31 -32 -21 145 58 -35 -90 -2 -65 38 -48 -83 217 -45 -92 -116 -17 44 -25 -42
6148d2J89j35q6J63p4j9j18J61N7j86J24o5J01k74L89l27J34k22J69K4L11l50
$$ -42 147 12 -74 89 15 -4 -122 39 96 -90 34 -31 70 -204 185 -142 -8 -230 -61 -37 274 -76
6170g6oJ86j04lk9L5J36r4l7J38q6R4j74K03j86P6p3M4l6j68K72o7j36R2m2J61
$$ -76 -82 104 0 -3 -32 3 139 45 8 146 60 154 -20 183 -3 73 0 44 8 -160 112 45 -91 1 -41 120
6196A20j11r1P4J34r1j09p5K01j58j59K94j8n9n6J11j10Q8q3p4J3J86j20J54j25
$$ 120 9 -82 -8 126 35 -74 -149 52 -106 -265 29 11 -48 -104 7 -103 -15 -98 -172 -159 27 -93 61 -64
6220f4Q0Kp1J35n1k22R8J29j90K67p2j71P6J10O6k59r4J79M4L9q2J7J9J51l02
$$ -64 16 18 -53 82 31 -191 -93 36 -154 113 41 -130 -54 56 122 -137 -231 -52 -8 31 -51 -34 -15 136 -166
6245a66J78J50r0p2jJ35j11K6q5NN5K5K0LJ91k41l33K22J08j69J65j32L4J68j1
$$ -166 12 162 72 0 -1 134 23 49 -36 -31 24 49 69 72 263 22 -311 -89 19 -150 15 -117 -83 85 74
6270G4Q1j41k25l2J53J79j11J75j60r9R2QJ82k0k72J26Q4q7j7j05K08m1k55K51
$$ 74 155 14 -211 -243 -90 89 -22 153 -7 -106 -14 -6 176 156 -116 10 94 7 -10 -115 93 52 -203 48
6294D8j22j2m2J63r9K4j11R4K9P2k1j2j27K1K88j83L0n9q8J78k8j2r7J29j52R6
$$ 48 -74 -86 -128 35 -64 -40 -151 -57 -28 44 23 11 -116 -95 193 10 40 -19 -107 71 43 31 -66 63 -89 7
6320GM0j17LK3j71P0M1m7K35l8J05j64R2j32J71J49k76j18p2L14o0K8K00j64p6
$$ 7 47 -70 -67 -44 -215 -145 -104 -151 84 46 151 -13 79 -53 118 267 -9 -127 -199 115 55 83 283 119 43
6345D3j50N4M2n8K3J08j87oK17K4j11J79j51j04R1n4K59k14j39P1j5J1Q2j88M44
$$ 43 -107 -53 -11 -69 -46 62 -125 -131 86 110 -1 178 27 -77 14 -40 219 5 -134 -63 -78 -67 15 -173 271
6370B71k82j15K79l06Q9J0M5O0k7k28L41l3l10K99P3n6j73p8J49J35k67J19q5
$$ 271 -11 -126 153 -153 -64 -54 -9 51 24 -204 137 104 -206 93 166 110 -63 -141 8 143 -124 -5 -90
6393i0J02P8m6j31P1P4j44M2J03o6P7j88J38K4l7J97k99P4n3R4q9kO8J13k06L09
$$ -90 12 90 44 -87 -16 58 -86 -44 59 -7 70 -118 20 44 7 204 -95 -21 -74 20 -69 -71 -3 110 -96 213
6419B13m27K69m0O1k90K21J30j97J58k7j28O2J28j11j6nm9L9K34l13l1J72Pk3
$$ 213 -214 55 15 76 -214 7 137 -60 98 71 -57 5 133 22 6 1 -48 -9 225 -88 -119 53 60 37
6443C7J3O3j81k4J39q4o4J44o7OR1l9J61j93j85K26j3r0K8j13J6K24k42M9J80
$$ 37 50 113 -68 -92 47 -37 -101 43 -24 -18 73 34 195 2 -183 43 30 -60 -32 -145 -129 95 -147 -98 82
6468H2k00K75j69j73K49P8l3k93K40j2K3j58J8j07J42Q3j55j02K68J40k67PnK68
$$ 82 -118 157 -12 -185 64 142 109 -184 56 44 67 -91 -73 -180 -38 45 -110 -212 56 196 -71 -64 -69 199
6492A99r5k45K53j04k6J77k63L01k17J15l5N7J8j0p4j41J45o1k99N22k76r4N6
$$ 199 104 -141 112 8 -18 159 -104 197 -20 95 60 117 135 125 51 -90 55 -6 -305 217 -59 -153 -97
6515i7L28m9k41O1J5K1M7k28l1K22K5j04n8J61j12k3K38O2k70R5j70R7N4j21K04
$$ -97 231 182 -59 2 17 38 85 -143 -174 48 73 -31 -89 72 -40 -63 175 237 -33 62 -108 -11 43 -78 126
6540A26N0j63J54j13k12M7q7QL9K57o4j78Q3m8J55J18l19j0J15L9j19J25J42j30
$$ 126 176 13 167 54 -158 -111 -198 -190 -151 106 42 -136 -53 -101 54 172 -147 -157 -42 -3 -122 3 145 15
6564A5O9j80J24L3J7j4j4J30k07n7K75p4l36q7L58j5j72o3K15JN4o9j2j04M7j11
$$ 15 84 -96 28 61 78 64 50 180 -27 -84 191 117 -219 -306 52 37 -135 -198 17 18 72 3 -9 -113 -66 -177
6590a77L60j56j11N1P6j56K12p5j89J6J00J41o7k10O2K49n9J05p4o5PMj30O0J35
$$ -177 183 27 -84 -33 43 -113 99 24 -165 -149 -49 92 25 -185 -123 126 67 172 98 33 40 44 -86 -26 109
6615A09J01j62j35J96p1n4L2j36J09R6l3J07p2j56P7K2k9K3K47k57m3Q8k21J49
$$ 109 210 48 -87 109 38 -16 16 -120 -11 85 52 159 87 -69 8 30 1 24 271 14 -29 59 -162 -13
6639a3J29k7j12J32n0q5M6n6p1jJ93J91k38m2j16J16n9P6qR8J8l07K64j85J4L1
$$ -13 116 89 -23 109 59 -26 20 -36 -107 -108 85 276 38 -4 -120 -4 -63 13 5 103 121 -186 78 -107 -93 -62
6665f2k3P8R4P0j91k3M8J02N6k04q0K28j21J39j48p4J74k4k0m8m6J06N1j52J86
$$ -62 -85 -7 87 157 -34 -57 -9 93 149 -55 -135 93 -28 111 -37 -111 63 39 19 -29 -75 31 82 -70 116
6690A16n0j24j21K52j20j8P1J32j14M5R3k35Q3n8n7J12m7R2j33K31p0j14K0Q2
$$ 116 66 -58 -179 73 -47 -65 6 138 24 69 162 -73 10 -48 -105 7 -40 52 -81 150 80 -34 -14 68
6714F8k32R9m7J41k77J79J25J72j77k51K13l5K13j88J02k20O0q9j7K06p2O2j44
$$ 68 -164 -65 -112 29 -248 -69 56 228 51 -200 13 -22 191 3 105 -115 -55 -144 -161 45 -27 35 -109
6737a09J82K4k39J98q9Qpp8J68j64k28L05j18L82k86M3J27q0j3rq0j0J27J90o
$$ -109 73 97 -142 56 -33 -25 -32 -110 58 -106 -334 -29 -147 235 -51 -8 119 39 26 17 -63 -73 54 244 238
6762B38l17n5J58Q9k74L39k44O9j37J28J01k64J98M1p1OM2m0k4j11K8N5P8rP2
$$ 238 -79 -134 24 113 -161 178 -66 3 -134 -6 95 -169 29 70 -1 5 47 7 -17 -128 -100 -45 33 24 96
6787I6o8J69j84J1L7J1j40K5M4rnk6k2J70Q4l22R7N3J8J57k92K04J16j83j36K08
$$ 96 28 197 13 24 61 72 -68 -43 1 -8 -13 -39 -61 109 193 -129 -32 21 39 196 -96 108 224 41 -95 113
6813A13p3j22N7K1J5n5J25o1m3N6l0J08k20K26n1L8j94j69K60K20k45J03Mn1p8
$$ 113 40 -82 -25 -4 11 -44 81 20 -23 33 3 111 -109 117 66 104 -90 -259 1 221 -24 79 83 32 -46
6838d6P1K5j92J71j82j0J90j5q1J20k83J90Q0m7l6o7J47q4M1o6J06J9m8pJ13l8
$$ -46 25 50 -142 29 -153 -163 27 12 -69 51 -232 -42 38 -9 -45 -112 35 -49 -8 -74 32 51 3 -4 109 71
6864G1j10j29J79J38jj17j02Q3J10r4j27J68pK4j05k0J93j27P7q9J81k4j44p3
$$ 71 -39 -168 11 149 148 31 -71 12 122 28 -99 69 62 86 -19 -39 154 27 104 15 196 172 28 -45
6888d5j78J67Q2m7r2P3N3r6Q5r5J10K5Q7j72O1L1jj77l7K18m5k8J43mj03R5l7
$$ -45 -223 -56 26 -21 -113 -40 13 -83 2 -93 17 42 129 -43 18 49 48 -129 -166 52 7 -21 122 118 15 110 73
6915G3l7k04K83j78QJ04k00J68j16r7L82k74K13r8k9J31l4l35K05np3J00j0p5
$$ 73 36 -168 115 -63 -55 49 -151 17 -99 -196 186 -88 125 27 -2 129 95 -240 -35 -40 -113 -13 -23 -98
6939i8j8J03LJ33l17J37L4j21K03K9Nj6j21N5LO6K0kj32J34K7k53N3K40l28O8
$$ -98 -116 -13 -10 123 -194 -57 -23 -144 59 88 93 77 -44 11 14 80 100 98 -34 100 127 -126 -73 167 -161 -93
6965i3Q5l6p8O4P3m6O4p6J94j94O9k40K61K5o8J6K5J29p8k77J73J01k26M8M5J01
$$ -93 -8 -44 -122 -58 15 -31 33 -43 151 -43 26 -214 47 72 4 20 45 174 96 -181 -8 93 -133 -85 -40 61
6991F1o2RL7L5j66M8P8k1p7Q1pJ18j97o2J77j42RN9O1k24J01J09P3j25Q7r8l7
$$ 61 -1 8 45 80 -86 -38 40 19 -58 23 16 134 -63 -125 52 -90 -81 -22 39 -185 -84 25 98 -27 60 -38 -75
7018g5J05n4M0p5J06l7Q7k40K51j98p2L53k73J31J02k22J15j22K24J98m19lJ84
$$ -75 30 -24 16 -59 47 10 97 -143 108 -90 -162 191 -82 49 151 -71 44 -78 146 344 -75 -78 106
7041A06l80K11K9jJ05j10J33k97K78l9j70J71R3j32Ok4L6K7j06pJ76q9R1k43K4
$$ 106 -274 -63 -34 -35 70 -40 93 -204 74 35 -135 36 129 -3 3 -21 15 42 -64 -71 105 16 107 -136 -112
7066a12J23o0J13N1J45k80n4j48J03L16j62l36J28J14J67J6j16j8j36L3K50j46
$$ -112 11 -49 64 115 260 -20 -74 -222 -119 197 35 -301 -173 -59 108 124 8 -10 -146 -113 137 -9
7088iJ3P6P5l11J33M7k1j55K49K07k11j10j1j09P2r1k8K00J65j04o0j10O9J00
$$ -9 4 80 155 -156 -23 24 3 -152 97 304 93 -17 -28 -137 -65 -156 -184 16 181 77 17 -93 -24 76
7112G6p1O3j8n5l2p0K44l12L54r9j06K2J28n4n2j50K03Kj21O5J99j61Or8L2Q4
$$ 76 5 68 50 -5 -37 -107 137 -175 179 80 -26 -4 124 70 18 -132 71 73 -48 17 216 55 61 -37 -5 79
7138G9r6P6m2j24J69j52J31Lk14P1J52K3m7j14n3K88j68lP3Q7k14P9N9o6J07m3
$$ 79 -17 59 17 -107 62 -90 41 44 -170 -99 53 76 29 -85 -138 150 -18 -21 52 139 -75 4 63 -3 104 61
7164F1L4qk49L82j06p4j22J14k0o9k5J4Q5l4P1j05q7M8P9j01N0J86r0J0r4r4R5
$$ 61 95 87 -162 220 114 40 -82 32 12 -57 -82 -68 17 -17 54 -51 -138 -90 -11 -112 -62 124 34 44 -50 -144 -49
7191d9J68j97J95j72O6J22j25k4P6n0O4o5L6q2M2M2k8M0p8J21j61M5J1J20j50
$$ -49 119 -78 117 -55 11 133 8 -16 60 10 74 9 45 -37 5 47 19 59 -19 102 -59 -14 -3 117 -33
7216c3J06j04M2l3j84Q4mK14k6k22J62P5M7k07m1J61j1j73K14N7k08J16j3J21
$$ -33 73 -31 11 -22 -206 -122 -126 88 62 -160 2 77 124 -83 -124 37 26 -147 67 124 -84 32 19 140
7240A40R2j66j72RJ09M6j78j7J38r7J81qj69p0J30K3J2p8K20k27K87n6k38J04
$$ 140 232 66 -106 -97 12 58 -120 -137 1 -96 85 77 -92 -162 -32 -9 3 -75 145 -82 205 149 -89 15
7264A5j66J99J69k44p2J01q9J10J79k30Q2j12j11O8R4j05J69k72J47J10R5j84
$$ 15 -151 48 217 -27 -99 2 -87 23 202 -28 54 -58 -169 -101 -7 -112 57 -215 -68 42 137 -47
7286d7L3J65j35j01J50m4Rj20J49j26j9P9O6j28k14K97k13L24o2K8j00N2j17J99
$$ -47 -14 151 16 -85 65 21 30 -90 59 -67 -86 -7 59 -69 -283 14 -199 125 63 91 -9 43 -74 125
7310A25j24m0j41K2K86l59J98n8K45j62R8q9j5JJ05j04K26r8k51K37n6P9j87k9
$$ 125 1 -39 -180 -158 128 -231 -33 -91 154 -8 90 1 -14 -13 92 -12 214 116 -135 102 46 125 -62 -91
7334i1L0J63r2l5Q5j96O8j4J92j28k4J63k99L5k8J60n0J88k22J0J42R8k80J40
$$ -91 -61 102 10 -25 60 -136 -68 -82 110 -18 -42 121 -178 -143 -171 -11 -61 127 -95 -85 57 155 -125 15
7358A5P6k69J20J75j46P9N1p4Q5l32J04J50o6J1K1jp4LK00j70k0q7J89m1n0j6
$$ 15 91 -178 -58 117 -29 50 101 27 112 -220 -116 34 -32 -21 0 -1 -75 -72 128 -42 -62 -149 40 -1 -51 -67
7384f7J9J14M4r8o6J04k1j05J39K05l15J98l0k37j01J91Q6n8q5J24qk2Q5j75J56
$$ -67 -48 66 110 12 -54 50 29 -76 63 268 -47 151 121 -116 -217 -26 60 2 -83 41 33 11 96 -79 77
7409G7jm6k00J83JK14l02M6J8j30J24j18J08j3J21p7k5O9L9m5O9J23k28OP3k2
$$ 77 76 30 -170 13 14 228 -74 -28 -10 -140 -16 -134 -26 -39 82 5 -20 49 88 43 112 235 7 13 86 64
7435F4j59k2K3R3J81k08m7J22k38J14K77k34n7k44K90q2N6R0R7j5j38M9J3m3p4
$$ 64 -95 -117 -94 -1 180 -28 -75 47 -191 -77 200 -34 -91 -335 -45 -127 -71 19 116 101 -37 12 25 -18 -92
7460i2J66j43j35n1K84j7J7J12k31L0l2O7J32j73N9pK4r5O7q0Q0K0J57j41m6R8
$$ -92 74 -69 -204 -255 29 12 29 141 -90 -60 -92 -25 107 -66 -7 -14 10 -85 -18 -98 -18 2 159 18 -28 70
7486G0l49K99q8LJ17j42L1J85k17J52Pr6o5K32l10R3l0O4o7J96j08j27M8J25J24
$$ 70 -279 20 -68 -65 52 -90 -59 126 -91 61 68 -28 -93 139 -171 -78 -108 -44 -111 85 -23 -150 -102 23 147
7511A47q1N4J3j55q9J40J15k54L1P1J41j6j25q6N6k0j70J74K6oJ43O8j19j39J45
$$ 147 66 120 133 -22 -111 29 144 -110 -79 -8 133 117 -8 -94 -38 -58 -228 -54 -28 -34 109 177 58 -81 64
7536F4p0j20L18j63R8q4k48L57q6k5k9q3P6l8k0j8n6L21k97j0J35l7J4j4Q5q7
$$ 64 -6 -126 192 29 127 43 -205 152 66 41 12 -71 5 -33 -53 -71 -127 194 -103 -113 22 -15 -1 -15 70 -17
7562a7LR9k84K6O6J88k5j59k0P9J15j84m5R3k32K27J1j1O5m1j01O6K11q7R5m8
$$ -17 -14 85 -199 -173 -107 81 56 -103 -123 -44 71 -113 -158 -65 -297 -70 -59 -70 -5 -46 -147 -81 130 43 138 90
7588I0O8k49J8J91l4j52n6m6K06k18J66l0J67p6k9l6J48l21K00N3o0J31j21j5
$$ 90 158 -91 -73 118 84 -68 -124 -170 36 -182 -16 -46 121 45 16 -20 128 -193 7 60 0 131 10 -5
7612ej36j31K30J6o0J58j10K58l46J89j34N0O6q4l5K31l02N8q6R1J86j45K05j06
$$ -5 -141 -272 -42 -26 -86 72 -38 220 -126 63 -71 -21 45 -39 -74 157 -145 -87 -173 -82 104 -41 164 58
7636E8k73L76j98J21J1k80K23n7R0J8k81K74j24Rj09K20lj11K1L0k5l8kN2J8j06
$$ 58 -215 161 -37 84 95 -185 38 -19 71 89 -192 82 -42 -33 -142 78 75 -36 -15 15 -10 -48 -50 2 20 -86
7662h6J78J4j32j11L64k06r1J76j3Mk01J09O3n0o6J38J13o0k05n1J42j6J25l54
$$ -86 92 106 -26 -137 227 21 -70 106 93 97 -104 5 68 18 -48 90 203 143 -62 -113 29 13 138 -216
7686b16J99j00K39j7j10J3J41m9j63Q5j55K09J26k66J00K2P1j05L8k8N7j33NR6
$$ -216 -17 -117 122 105 -5 8 149 100 -63 22 -133 76 202 -64 36 58 129 24 62 34 91 -42 -37 59
7710E9j77J6Q5J04j65J19j78K05j1j46J01m4J70k53J96j05J52j47l9J06j05Q3
$$ 59 -118 -102 -17 87 -78 41 -137 68 57 -89 12 -32 138 -115 81 -24 128 -19 -58 48 -57 26
7732B6j53J40P3J63l17J4P8k2Q9j32Q0J03k15J69j3j87O8J77r6k8r5n8J82r8j53
$$ 26 -127 13 86 249 -68 -54 24 2 91 -41 39 142 -73 96 83 -104 -36 141 45 17 -78 -136 46 -52 -205
7757b05J87J06j03R7L4m6j35M7J23j22j8n9NJ4O7q9J44j52J5jJ30K4Q5jj18rj9
$$ -205 -18 88 -15 82 116 70 -65 -18 105 -17 -35 -94 -89 -75 -8 -97 47 -105 -90 -91 39 63 148 147 29 20 1
7784ARjj07Q7j29L19l43j5M8JJ00l11L01K3P5k80K33K7Pj11j01K14L7J4n6j40
$$ 1 10 9 -98 -11 -140 179 -164 -179 -131 -130 -30 -341 -40 -17 58 -222 11 38 45 -66 -167 47 84 98 42 -98
7810i8N8Q6q4J39j57%r9J06o0O5P2K8j91K65j12p8q8K46o9P1j21p3J70l0j83J72
$$ -98 -40 46 -38 101 -56 -56 -155 -49 -109 -44 28 56 -135 130 18 -60 -148 98 29 100 -21 -94 76 46 -137 35
7836C5j39K7Q5r3J54k90K64j17J05k14l9L56k77J50L9N8j43J3P4j08P6k40J48
$$ 35 -104 -77 8 -85 69 -221 43 -74 31 -183 -222 134 -143 7 46 104 -39 -26 48 -60 16 -224 -76
7859g6J55P3Mm64L00J54l72L78j88P1J79l31L28l65L7J36Qr0M1J36j13Q8j62J00
$$ -76 79 152 156 -308 -8 146 -226 152 -36 35 214 -117 211 -154 -117 19 27 -63 -22 114 1 89 -73 27
7883B7k81K61j9OJ8q2m1J06K11j72q1k2Q7M1k72J25m1K05j99K06l9L8J8j31J26
$$ 27 -254 7 -12 -6 12 -70 -111 -5 206 34 -47 -69 18 59 -213 -88 -129 76 -123 83 44 82 100 -31 95
7908I5k72K8J95l1j44J16j19J65j1j39L49j20j54q1J90J29j96m7K14J1j81q0J73
$$ 95 -177 -149 46 15 -129 -13 -132 33 22 -117 232 112 -42 -123 67 196 0 -47 167 178 -3 -83 90
7931I0J9q7r3L7K12j00j05J09K1p3j41K89k86K75j82J9K29j23j8j32K51j49k31
$$ 90 109 22 -71 -34 178 78 -27 82 103 30 -111 178 -108 167 -15 4 233 110 92 -40 211 62 -169
7954a69L80r7j83J8P5j68K43j29M2K12j79k15R5J35j5j12J33p4J22j02K3R9k42
$$ -169 211 114 -69 -51 24 -144 99 -30 12 224 45 -170 -75 60 45 -67 66 -8 114 12 35 134 -108
7977a08K0J56Q5o4j30R5r4J51l5k65K01J41j06J08K6j48R7j62K71l20K4J44Jj21
$$ -108 -88 68 153 89 -41 54 -40 111 76 -189 12 153 47 155 181 33 130 -32 239 -81 -57 87 88 -33
8001c3k8J50j71J06r3J30j09J95j84L1m1j44J70O2o7L1j11j2J77L9j42j0J30j54
$$ -33 -61 89 -82 24 -69 61 -48 147 -37 -6 -47 -191 -21 41 -26 5 -106 -118 59 98 -44 -54 76 -78
8025g8K38q8j85j02L62l19J9j03J90L6J02j74J15m0J07q3L4j48J04J60r5j22k8
$$ -78 160 72 -113 -215 147 -172 -153 -256 -66 -30 72 -102 13 -27 80 -3 31 -117 -13 147 52 -70 -98
8048i8J4O9J4rr4N2J29l6j02m6j6K75p4q8j3K4j74lJ69l3O6j0O0o1j53K12m8L3
$$ -98 -84 -15 -1 -10 -104 -52 77 41 -61 -107 -123 152 78 -10 -23 1 -173 -176 -7 -40 26 16 76 15 -138 74 26 59
8076E9j26N3N7P2j36n8P9k4j0r7L01k61J27N8j47J19j70j7J1J06P1j82Lr3J19
$$ 59 -67 -14 43 115 -21 -79 0 -24 -34 -131 170 -91 36 94 -53 66 -104 -121 -110 -4 67 -115 -112 -205 -86
8101h6K30k92K18n5m4j58J9K49j15Q1R5j11m1m8J25o2J84k02Q5j93Q9p3J24j3
$$ -86 144 -148 70 15 -29 -187 -168 81 -34 47 142 31 -10 -58 67 5 189 -13 72 -121 -32 -105 19 6
8125FrL7m9j0J47r3K6j62J6QK26j91q0J05mm7j35J74j28K82n2n5j4o2Kj07J56
$$ 6 -3 34 -15 -25 122 29 55 -107 -91 -83 143 -48 -128 -23 -27 -74 -209 -35 -163 119 67 12 -2 -64 -62 -169 -13
8152a3J01p0J15m8j50J35j61L6K3l2O8j3j35L07n2m6j02J90Jl64J28J77m9O0j36
$$ -13 88 18 133 85 -65 70 -91 -55 -32 -64 4 -9 -144 163 111 65 -37 153 154 -210 -82 95 46 106 -30
8177c0Roj01l2j21L22J29j65o2J87j99J59l7L1
$$ -30 -21 -27 -128 -160 -281 41 170 5 -57 130 -69 90 53 84
8191H4
$$ Imaginary data points
##PAGE= N=2
##DATA TABLE= (X++(I..I)), XYDATA
0@%%%%%%%%%%%%qJ6j6J6j6J6k4L2l2L7m5N0n8O6p4Q6r8J10j24J40j56J76j98K20
$$ 0 0 0 0 0 0 0 0 0 0 0 0 0 -8 8 -8 8 -8 8 -16 16 -16 21 -24 26 -32 34 -40 46 -52 58 -66 74 -82 94 -104 116
36A16k44K71l02L35l70M09m54N03n56O15o84P62q51R55j077J222j400J626j918
$$ 116 -128 143 -159 176 -194 215 -239 264 -292 323 -361 401 -450 505 -572 650 -750 876 -1042
55a042K316k895L816n518R690l8542o3744O3582P7382J6345o0084n3563j270M8379
$$ -1042 1274 -1621 2195 -3323 6367 -32175 -95919 -32337 45045 61390 1306 -52257 -53527 -5148
69e148M4225J829m4985m1231N337M7480L4180j2041m3146k6760J3244M1551K6619
$$ -5148 39077 40906 -4079 -45310 -39973 7507 41687 29646 -13500 -40260 -27016 14535 41154
82D1154j7916m7323k2279L0188M7533P116l8899l7174M540L5534K8613n972l3592
$$ 41154 23238 -24085 -46364 -16176 31357 38473 -426 -37600 -33060 2474 31087 25115 -8477
95h477k7116J0417L9311K2530k1306l7390q472K5593K5598J546j7546j9530o939
$$ -8477 -35593 -25176 14135 36665 15359 -22031 -30503 -4910 20688 22234 4688 -14842 -21781
108b1781J2901K4682J0356k0404k9998l002K7719K6461n429k9334k0403J0860
$$ -21781 -8880 15802 26158 5754 -24244 -27246 473 26934 21505 -7829 -28232 -17372
120a7372L1287J5878j8402l1134n134K5793K2686o831k1688j0081O611J1013P856
$$ -17372 13915 29793 11391 -19743 -24877 916 23602 16771 -4917 -14998 -8387 2626 10482
133A0482J182r979j5824k971J7922J7773n632k1745j1578J0081J9045Q889r993
$$ 10482 11664 1685 -14139 -17110 812 18585 12953 -8792 -20370 -10289 8756 17645 7652
146G652j9679q494J5830K2826L82k2499j5658R872J8946M585j0534j0717k521
$$ 7652 -12027 -20521 -4691 18135 18517 -3982 -19640 -9768 9178 13763 3229 -7488 -10009
159a0009M948Q954M696n659j0670k638P769P466J034l382o186n844L342J3875
$$ -10009 -5061 3893 8589 2930 -7740 -10378 -2609 4857 5891 2509 -3677 -9521 -6179 7696
173G696P849j2457j8414K421K0886J0003j2471j6845r3J1869Q548j820q090p618
$$ 7696 15545 3088 -15326 -12905 7981 17984 5513 -11332 -11425 444 8992 7172 -918 -8536
187h536P46Q311O288l164o667j864J767J832L419M641k207j0554l988J1507J1893
$$ -8536 -7790 521 6809 3645 -3022 -4886 -3119 -1287 2132 6773 4566 -5988 -9976 1531 13424
202A3424n064j4865l532J0437R001j879p967n580P91O925O675k941j0259l672
$$ 13424 8360 -6505 -10037 400 9401 7522 -445 -6025 -5234 1691 8366 5425 -4834 -8506
216h506Q506O936l311o317M18K890j235m44M445J637o293n404M096P179J187n531
$$ -8506 0 6936 3625 -2692 -2274 616 -619 -1063 3382 5019 -1274 -6678 -2582 4597 5784 253
232B53n122p97M358O544Q18q692p239N894J1601m66j1305l729Q399N765m737m407
$$ 253 -4869 -5666 -1308 5236 6054 -2638 -9877 -3983 7618 7152 -4153 -7882 517 6282 1545 -2862
248b862K830L349k805k571K687L297j769l647q59J728K798J599k833n807o51P772
$$ -2862 -32 3317 512 -2059 628 3925 2156 -1491 -2350 -622 2176 3775 942 -4865 -5516 2256
264B256N358o129q863J865R237K274o081l916K592L004l80m57N60j676j556J709
$$ 2256 7614 1485 -7378 -5513 3724 5998 -83 -3999 -1407 1597 1217 760 1320 -356 -1912 -203
280b03K034j228j591J418J114l182j533M865L448n405o142M026P711m57p795k377
$$ -203 1831 603 -988 430 1544 -1638 -3171 1694 5142 -263 -6405 -2379 5332 4875 -2920 -5297
296e297N442L949j776l324j121O01K823J613j945l732M58M378N07m967p24N180
$$ -5297 145 4094 2318 -1006 -2127 -1526 1297 2910 965 -2767 -2309 2069 2576 -2391 -3115 2065
312B065J660o281k951O389N117m726o741K382O565M61m356j522J314Q88J044J231
$$ 2065 3725 -2556 -5507 882 5999 1273 -5468 -3086 3479 3940 -416 -1938 -624 264 1308 2539
328B539k418l113J373M836m39n088q08M940J340m781j488L872K191l681k114K915
$$ 2539 121 -2992 -1619 3217 2778 -2310 -3118 1822 3162 -1619 -3107 765 2956 -725 -2839 76
344G6K223j723j521K65J73Q8K326O98m101k847M534N136l368o855J278P151N44
$$ 76 2299 576 -945 -680 -507 -419 1907 2605 -1496 -4343 191 5327 1959 -4896 -3618 3533 4077
361D077o099k195N108K132l145k233J851J998o69j266j49Q7Q43J406q28l037j38
$$ 4077 -2022 -4217 891 3023 -122 -2355 -504 1494 825 -441 -590 -503 340 1746 918 -2119 -2257
378b257M438J587m799l314M248M768l064n377J487M422J41l221n51K137n5j212
$$ -2257 2181 3768 -1031 -4345 -97 4671 1607 -3770 -2283 2139 2280 -941 -1492 645 590 -622
394f22O00P40j263n59K081N79k768q99L719J441m125k366L480L679k774l729J205
$$ -622 -22 718 -545 -1104 977 1556 -1212 -2111 1608 3049 -1076 -3442 38 3717 943 -2786 -1581
411a581L478j9k203o26M59L60O72R51j780k122J635L686j543m701J057N198P4
$$ -1581 1897 1878 -325 -951 -492 -132 540 1491 -289 -2411 -776 2910 1367 -3334 -2277 2921 2995
428B995n443r56N185J998m555k680L405L307j992k910N95J632J48j2l37j375o59
$$ 2995 -2448 -3404 1781 3779 -776 -3456 -51 3256 1264 -1646 -1051 581 729 717 380 -995 -1654
445a654K372J656k430k639K183L098j568l403P40L996n18l253K3K563L14k313
$$ -1654 718 2374 -56 -2695 -512 2586 1018 -2385 -1645 2351 1833 -1420 -1397 1166 1480 -833
461h33J69J391p14j019J381J020k290j419L039J952k910l198K507L814j523l940
$$ -833 -664 727 13 -1006 375 1395 -895 -2314 725 2677 -233 -3431 -924 2890 1367 -2573
477b573P81L674K26l043l17J703M86p88j36J04n00O10J453j040k744P28L727M
$$ -2573 -1792 1882 2108 -935 -1252 451 937 149 13 117 -383 227 1680 640 -2104 -1376 2351 2355
495B355m524q23M508J893m198k715L493L111k529k649J463K062p52j234P73M97
$$ 2355 -2169 -2992 1516 3409 -789 -3504 -11 3100 571 -2078 -615 1447 695 -539 234 731
511G31j337K68J554n12k181N83K752m57l253M2L315L92l099n81K249R33j687n43
$$ 731 -606 -338 1216 704 -1477 -894 1858 1401 -1852 -1810 1505 1897 -1202 -1783 466 1399 -288 -831
529h31J521m50r65J201J090j581j640K131K035k009k942J608L683j415m037P30
$$ -831 690 240 -725 476 1566 -15 -1655 476 2511 502 -2440 -832 2851 1436 -2601 -1871
545a871L858P5l471p68K667J122j965r64J164O35n15M17k06r11m7J758O92k624
$$ -1871 1987 2062 -1409 -2177 490 1612 -353 -1317 -153 482 -33 384 178 -733 -780 978 1670 -954
563i54r29K561J888k794k193K366K425j789k868J590K816j370k239J194J747j027
$$ -954 -1883 678 2566 -228 -2421 -55 2370 581 -2287 -697 2119 749 -1490 -296 1451 424
579D24j230J242J262j988q31J978J230k461j499K230J944k650j936J877K004j820
$$ 424 -806 436 1698 -290 -1121 857 2087 -374 -1873 357 2301 -349 -2285 -408 1596 -224
595b24j751J354J145r07n29P04Q4j208J028J760j178k519J446L249r78l534K44
$$ -224 -1975 -621 524 -383 -912 -208 -124 -1332 -304 1456 278 -2241 -795 2454 1476 -2058 -1814
612a814M368K5m211q18L721J576l080j767K469R26j289r31J126M61j053K32J016
$$ -1814 2554 2579 -1632 -2450 1271 2847 -233 -2000 469 1395 106 -825 301 762 -291 -59 957
629I57j069j045J217J497j477j880J534K151j311k505R20K384o77j885N10J572
$$ 957 -112 -1157 60 1557 80 -1800 -266 1885 574 -1931 -1011 1373 696 -1189 -679 893
645H93r40j188J274J451j867j428K055J945j750k270J881K258j111k521R05K268
$$ 893 -47 -1235 39 1490 -377 -1805 250 2195 445 -1825 56 2314 1203 -1318 -413 1855
661A855p29k011K09J758k26j609L56O06j92m88L52J51r30J60J696j73k372P3K910
$$ 1855 1126 -885 -676 1082 856 -753 -397 209 17 -471 -119 32 -898 -738 958 785 -1587 -1514 1396
680A396L89k974r54K886J683k826j792K484J856j742j913J512J868j715r69J049
$$ 1396 1785 -1189 -2143 743 2426 -400 -2192 292 2148 406 -1507 5 1873 158 -811 238
696B38Q36j451m9J414J67j714l2J836Nk125k59K083L96j896l57J359J23j167M64
$$ 238 1074 -377 -426 988 1155 -559 -591 1245 1250 -875 -1134 949 1345 -551 -908 451 574 -593 -129
715a29P77p96j592J561J874j415k326J101K774r07k760P66K793l76k437J84K202
$$ -129 648 -148 -1740 -179 1695 280 -2046 -945 1829 922 -1838 -1072 1721 1345 -1092 -908 1294
732A294M6j924j64J684k23j205L6Q99m21p02Q53N09j383m58J589N22j839p92K106
$$ 1294 1340 -584 -748 936 713 -492 -456 443 22 -680 173 682 -701 -1159 430 952 -887 -1679 427
751D27J100k078j482J678J812j832j520J548J401j268j325J620J079j648j087
$$ 427 1527 -551 -2033 -355 1457 -375 -1895 -347 1054 -214 -1539 81 1160 -488 -1575
766a575J628J279j528j434J831J071j619j095J574R41j520o62J273N64j014m31
$$ -1575 53 1332 -196 -1630 201 1272 -347 -1442 132 1073 -447 -1109 164 728 -286 -717
782g17J118K06j393J14J435m42j588P10K020j031k064K58K805m22k418pK560Q4
$$ -717 401 607 -786 -672 763 321 -1267 -557 1463 432 -1632 -1374 1431 1009 -1409 -1416 1144 1228
800A228k312l05K123M04j935k13J571L73j513o4J167q7j213L34J196o02j143Q61
$$ 1228 -1084 -1389 734 1138 -797 -1010 561 934 -579 -643 524 437 -776 -442 754 152 -991 -130
818a30J003q71j207R93J410j054j283Q79J395j083j285J209J300j316j658J634
$$ -130 873 2 -1205 -212 1198 144 -1139 -260 1135 52 -1233 -24 1276 -40 -1698 -64
834f4J530j189k014Q93K382j014k092R41J777p83j437N55J351o82j021P31P88
$$ -64 1466 277 -1737 -844 1538 524 -1568 -627 1150 367 -1070 -515 836 154 -867 -136 652
851F52o66q17J000N00j141m62J415M42j661k68J872M24k188n44K458M94k122p68
$$ 652 -14 -831 169 669 -472 -934 481 923 -738 -1006 866 1290 -898 -1442 1016 1510 -612 -1380
869a380K066Q76k083j012K129P82j851p43J579Q43j650q34J700M94j429m28J207
$$ -1380 686 1562 -521 -1533 596 1378 -473 -1216 363 1206 -444 -1278 422 916 -513 -941 266
886B66M49j199n0J112l60j040K42J428n53j322M67J680p79j519Q19J830r93k002
$$ 266 715 -484 -534 578 218 -822 -580 848 295 -1027 -560 1120 341 -1178 -359 1471 478 -1524
904a524J149J841p08k276N68K262l95k357M93J874lj854K0J553J05j519K39J279
$$ -1524 -375 1466 758 -1518 -950 1312 917 -1440 -947 927 924 -930 -910 643 748 -771 -532 747
922G47n78r59O66P39n74r96J032P32r26m90O84M90j053n35J507Q15j778r47J681
$$ 747 169 -790 -124 615 41 -955 77 809 -117 -607 77 567 -486 -1021 486 1301 -477 -1424 257
941B57J200j651j273J610J051j251j434J514J437j474j238R57J445r56j189Q62
$$ 257 1457 -194 -1467 143 1194 -57 -1491 23 1460 -14 -1252 -295 1150 194 -995 -133
957a33Q71p66p79R88L22o19k46J010k36j001P4J283k92j449K78J777j53k085K80
$$ -133 738 -28 -807 181 503 -116 -362 648 412 -589 -515 768 476 -973 -695 1082 929 -1156 -876
976h76J972j86j828nJ889r0j732j12J878Q2j833j90J728L50j910J71J379M6j043
$$ -876 1096 910 -918 -923 966 876 -856 -968 910 992 -841 -1031 697 1047 -863 -692 687 733 -310
995c10j98P97K81j291L38R42n07p72P18O56q94o50J199O21j117r62J296J186j484
$$ -310 -508 289 570 -721 -383 559 52 -720 -2 654 -240 -890 309 930 -187 -1149 147 1333 -151
1014a51j233J404J587j517j478J139J554j058j666R41J614p22j372P05J031l08
$$ -151 -1384 20 1607 90 -1388 -249 1305 247 -1419 -478 1136 414 -958 -253 778 470
1030D70j214N67P72o97p41Q19O78p40o09J132L17j325mJ288J86j531k48J556K58
$$ 470 -744 -177 595 -102 -843 -24 654 -86 -695 437 754 -571 -575 713 899 -632 -880 676 934
1049I34j598m52J959M17k191l33K009N25j949o03J865N43j729n74J521O02j284
$$ 934 -664 -1116 843 1260 -931 -1264 745 1270 -679 -1282 583 1126 -603 -1177 344 946 -338
1066c38m18J294K21r21l40Q82J59j052M77N61k33r94P48R04p30j470J143J386
$$ -338 -756 538 759 -162 -502 380 539 -513 -36 525 292 -702 46 950 220 -1250 -107 1279
1084A279j119j336R17J577r65j556O45J874p26j660N64J495n63j509N74J305l23
$$ 1279 160 -1176 -259 1318 353 -1203 -558 1316 590 -1070 -506 989 426 -1083 -509 796 473
1101D73j257J2J471l26r03K81R10l24q00M71N81o53n45R22M86j213l13J179P73
$$ 473 -784 -772 699 373 -530 -249 661 337 -463 8 589 -64 -609 313 799 -414 -727 452 1225
1120A225j584p96J269J321j801q36J498J043j448j544J671J298j386j016R98J187
$$ 1225 -359 -1155 114 1435 -366 -1202 296 1339 -109 -1653 18 1316 -70 -1086 -88 1099
1136A099j116p62R99M98o02p24Q44K98m89n61J057R6j013j8J025n8j254K86J087
$$ 1099 -17 -779 220 718 116 -608 236 534 45 -516 541 637 -376 -394 631 573 -681 -395 692
1155F92r3j365J70J532j91j739K59J765p0j947J63J821j07j849J13J635M5j573
$$ 692 599 -766 -596 936 745 -994 -735 1030 960 -987 -824 997 890 -959 -846 789 834 -739
1173g39j95J479Q9j329j03R68R0p77L04Q99m53q71O86P12n45q38Q57O98j056p66
$$ -739 -934 545 634 -695 -798 170 260 -517 -213 686 233 -638 48 760 215 -623 234 932 -124 -890
1193h90J046J082j125j153R29J098q27j348R77J148r86j097P04J377q05j212R16
$$ -890 156 1238 113 -1040 -111 987 160 -1188 -211 937 -49 -1146 -442 935 130 -1082 -166
1210a66J013n95j190P09Q64l95p81M63N48n08n73M64P04r20j03Q08K76j057J1
$$ -166 847 252 -938 -229 635 240 -541 -78 470 -38 -611 -147 557 -363 -466 342 618 -439 -428
1229d28J103K5j526J53J475K95j905JJ566M18j656o56J756L43j316p39J165Q99
$$ -428 675 700 -826 -673 802 1097 -808 -807 759 1177 -479 -1135 621 964 -352 -1091 74 973
1247I73j309n18R35L22p39k51J033l08q18P7R17j61p83K87J088m51q65O75P00
$$ 973 -336 -854 81 403 -336 -587 446 138 -680 -603 314 153 -630 -343 745 294 -571 104 804
1266H04m67j090R10J056r94j076P86J336j226j202O83J545o86j309N45J244j84
$$ 804 337 -753 157 1213 219 -857 -71 1265 39 -1163 -480 1065 379 -930 -385 859 675
1283F75j572L56J219o9j108J02R54l96o39L15M91l96o08Q99M41j207l66J137O48
$$ 675 -897 -541 678 609 -499 -397 557 161 -478 -163 328 -68 -676 223 664 -543 -909 228 876
1302H76j443m08J325P31j496n32J470O40j363q50J322J008j433p01J363M66j208
$$ 876 -567 -975 350 1081 -415 -947 523 1163 -200 -1050 272 1280 -153 -854 509 975 -233
1319b33n46R80N13j169k63J100L33j006n84J283O6p38l08P40K53q47J14O80j80
$$ -233 -779 201 714 -455 -718 382 715 -291 -875 408 474 -264 -572 168 421 -426 -312 368 188
1338A88p65N47Q08l18j560Q36J424p32j735O20J801k86j788K48J655k94j443j62
$$ 188 -577 -30 778 460 -1100 -264 1160 428 -1307 -687 1114 828 -960 -712 943 649 -794 -956
1356i56J238L47j154J05R68k61p70K80O89o45m22N38N60o86n06M89Q36q32r09
$$ -956 282 629 -525 -420 548 287 -483 -203 486 -159 -581 -43 517 -169 -675 -186 650 -182 -1091
1375a091J115N93q09q94J018J067j141p95J003R50j066p27R87R25j143q24P03
$$ -1091 24 617 -192 -1086 -68 999 -142 -937 66 1016 -50 -777 210 1135 -8 -832 -129
1392a29J341q73j200P24J114q38j042P78P05n97m91K80O59p01j39O99R4j039L7
$$ -129 1212 339 -861 -137 977 139 -903 -125 580 -17 -508 -228 431 -270 -409 290 384 -655 -618
1411f18J225p6j269L4J451J35j658j52J641K29j606m54J781K97j475m77J340M80
$$ -618 607 531 -738 -704 747 882 -776 -928 713 942 -664 -1118 663 960 -515 -992 348 828
1429H28j158k67Q22N99r63k19Q24j7r49J68R45j80r34J10Q82k95o65K21Q14m90
$$ 828 -330 -597 225 824 -139 -358 466 449 -500 -332 613 433 -501 -391 491 196 -469 -248 566 76
1449G6q72Q27O89q82q04P02R92p81r92P31J344o11j363N79J435n91j376L97J292
$$ 76 -796 31 720 -162 -966 -264 728 -53 -1045 -314 1030 419 -944 -365 1070 479 -897 -500 792
1468G92k77j015M3J042k05p02J67M78n71k20M85M89n89o00R66K42q54l65J076
$$ 792 515 -500 -457 585 380 -322 -155 323 -248 -468 17 506 -83 -683 283 525 -329 -694 382
1487C82K49j057n14J179L82j076n61J256M14q91n14R05P23j306n35J263M15r68
$$ 382 631 -426 -940 239 621 -455 -1016 240 654 -237 -751 154 877 -429 -964 299 714 -254
1505b54n28R53M87p64o26R50K50p02j43O25J98o74J62L54k16p54P06O78n92p77
$$ -254 -782 171 658 -106 -732 218 468 -234 -377 248 446 -228 -66 288 72 -682 24 702 110 -667
1525f67N08Q88m68j258L57J495l90j280K16J350k43j204J97J051Q2j158m8J125
$$ -667 -159 729 261 -997 -640 855 465 -815 -599 751 508 -696 -499 552 634 -524 -572 553
1543E53j01r44K48O85k79o73L21O17m28m36L22M69l81n11O68M02o95m56Q70L74
$$ 553 452 -492 -244 441 162 -511 -190 427 -1 -437 -115 354 -27 -538 130 532 -163 -619 251 625
1563F25r53m90J135P15j156q29J234N67q28j229J276P83p49j066J033P84q89p00
$$ 625 -328 -818 317 1032 -124 -953 281 848 20 -1209 67 850 101 -965 68 852 -37 -737
1581g37N56Q19n86l54L61M58o92j40O11R2o57P4O21q8q92K74R46k32r34M7J105
$$ -737 -181 638 52 -302 59 517 -175 -315 296 388 -269 -195 426 338 -554 -280 666 434 -500 -453 652
1602F52j65j226j2J383K4j401j19J336L39j315k88J158K31q90k81R83L40r84p1
$$ 652 487 -739 -751 632 656 -745 -864 472 811 -504 -792 366 597 -293 -574 409 749 -235 -306
1621c06P34P2q94J62N48j51n90L80O12n28o14N87Q35p65j026J001P36p24r92Q36
$$ -306 428 500 -394 -232 316 165 -425 -45 567 39 -575 12 847 82 -944 57 793 69 -923 -87
1641h7Q97o32j033P10J105q64r36Q39Q64m73j100K58J173o18n81J10Q64l92n40
$$ -87 810 178 -855 -145 960 96 -840 -1 863 390 -710 -452 721 103 -478 -368 496 104 -436
1660d36L93M98n91l07M69J63m21j63Q71p1p86j83R72K64j085l54J215K91j296
$$ -436 -43 455 -136 -443 26 189 -232 -395 476 405 -381 -564 408 672 -413 -767 448 739 -557
1679e57j89J142M76j277m91J032O51j111m12Q70N60q37n60P53N36q89k5N89J43
$$ -557 -746 396 872 -405 -896 136 787 -324 -736 134 694 -143 -703 50 586 -303 -328 261 404
1698D04p74o2O87j62o52M47P19l46p97M72P48n80p29L28J182p46r61L94J171l13
$$ 404 -370 -432 255 93 -559 -112 607 261 -536 -64 684 104 -625 -297 885 139 -822 -428 743 430
1718D30j189M47J128j83j287L73J040m75q30J90P59M7q02J50N27k69k95K64K35
$$ 430 -759 -312 816 633 -654 -281 759 284 -546 -356 403 450 -352 -202 325 56 -239 25 260
1737B60k92l25L47L57q62J6P16K28p24m23J132L48q54p73J022O18j124m41P22
$$ 260 -32 -357 -10 347 -515 -499 217 445 -279 -702 430 778 -76 -849 173 791 -333 -774 -52
1756e2Q52q20o41M81Q07o00p44P66M58n91m56O06J57m54M8N35J21n96j27N73k09
$$ -52 800 -20 -661 -180 627 27 -717 49 507 -84 -540 66 223 -231 -183 352 473 -123 -250 323 114
1777A14n56J23O33k18o24K60R80l52j098K28J332m99j299M75J175j24j079P2Q98
$$ 114 -442 -319 314 96 -528 -268 712 360 -738 -510 822 323 -976 -501 674 550 -529 -457 441
1796D41K19j074n9P89N9o15j00O50j52l83k63Q48m09k27J96M10l93n21P92L92
$$ 441 660 -414 -473 316 375 -240 -340 310 158 -225 -488 360 -49 -276 -80 330 -63 -584 208 600
1816F00o54o86Q61P11q54n86M38Q47o89q82P56Q15o11j030P68R95o01r05N17R91
$$ 600 -54 -740 121 832 -22 -608 -170 677 -12 -894 -138 677 66 -964 -196 799 198 -707 -190 801
1836H01n35r12N13P52m71m26K34N81m79j53L11P2m61j15N19j6p51K03O46j1j124
$$ 801 266 -646 -133 619 148 -278 -44 537 58 -95 216 288 -173 -288 231 215 -536 -333 313 302 -822
1857h22L28R91m3j075L5J082J93j223j67J075L97j101k54R84K91r36m8N45K86
$$ -822 -494 497 454 -621 -586 496 689 -534 -701 374 771 -330 -584 400 691 -245 -293 252 538
1876E38p34j13N50J8n48o8P73k35m32J51N09k38n32M61L55m45n54N08P95q65m53
$$ 538 -196 -309 241 259 -289 -357 416 181 -251 -100 409 171 -361 100 455 10 -544 -36 759 -106 -559
1897e59O61P05m78j174N94J113m81j116J20J140j31q93R1Q63r7p89J16P04k69
$$ -559 102 807 329 -845 -251 862 381 -735 -615 525 394 -499 -408 455 358 -431 -315 389 120
1916A20l31J39L35j12k79J89K32n77k00O27L01o15k67P35L68o97m91P74N34r70
$$ 120 -211 -72 263 151 -128 61 293 -284 -484 143 444 -171 -438 297 665 -32 -523 251 785 -185
1936a85o55J100M69j049n59J040N51r11n39R37O51q78n16M81M11k76l83L73K58
$$ -185 -840 260 729 -320 -879 161 712 -199 -738 199 850 -28 -544 -63 348 72 -311 62 320
1955C20n38QL31K32q53L48N59o9o82J53P52l52p27J84J037l37q81J71J072k91
$$ 320 -218 -210 121 353 -500 -152 407 338 -344 -191 561 209 -518 -334 703 366 -515 -344 728 437
1975D37r32o7R99kq85j28Q90R0p04NM98K78p28j57O72j94l99L54L25l79k89K85
$$ 437 -495 -562 437 435 -450 -578 312 402 -302 -297 201 479 -249 -406 266 72 -327 27 352 -27 -316 -31
1997c1L90m06k91N00K35o00l35Q05M25q61m62P39M96o37n66M87Q23q11n23L69
$$ -31 359 -47 -338 162 397 -203 -538 267 692 -169 -631 108 604 -33 -599 -112 711 -100 -623 -254
2017b54J144q97o88J60R58l12n36K13N30j94l01K39K00k63k85N01o3m66o2J039
$$ -254 890 -7 -695 -535 423 111 -425 -212 318 124 -177 62 262 -1 -286 215 152 -314 -376 663
2037F63k13r69J67P05K40j077M8J088j84q42k52J172J84j029k22N78L47p96j53
$$ 663 450 -519 -352 353 593 -484 -436 652 468 -374 -626 546 730 -299 -521 57 404 -392 -545
2056e45R22M6o81m8P45q5n00k11M26J42n59J60N22k16m23J94M86m41j97N68L16
$$ -545 377 423 -258 -306 439 354 -146 -357 69 211 -348 -188 334 118 -305 -111 375 -66 -263 305 621
2077F21n99n38M29P11n66n57M05P92l80j181N38Q59k02q02Q6Q13k31o26K32M99
$$ 621 22 -516 -87 624 58 -499 -94 698 318 -863 -325 534 332 -470 -384 429 198 -428 -196 303
2097C03j14o21L21K04k43n5J83M25m70k01N36K54p04j01M59K12p70K5N35L07o71
$$ 303 189 -432 -111 93 -150 -205 -22 403 -67 -268 268 522 -182 -283 176 388 -382 -357 178 485 -186
2118a86m11R40n3n59k84O72M81p34m34Q89K72o24p26P42O92o32m11L18L71l14
$$ -186 -597 343 290 -269 -553 119 600 -134 -568 321 593 -31 -757 -15 677 45 -366 -48 323 9
2138Ik24K66J69m73P7N56l29n02N74M11n52l17K34Q44m06j084M08J162m37j116
$$ 9 -215 51 220 -253 -176 380 51 -451 123 534 -18 -335 -101 743 337 -747 -339 823 386 -730
2158g30L74J110n27p17R3O76P0p66O0P53k32n32K75L12P6o31M01M13m60j78J23
$$ -730 -356 754 227 -490 -397 279 349 -417 -357 396 164 -368 -93 219 295 -336 65 478 18 -160 -37
2179c7M03m10k02J33M92m00l05N37J73o91k58R05J47o25m29O67N82q24m91M60
$$ -37 366 -44 -246 -113 379 -21 -326 211 384 -307 -565 340 487 -138 -567 100 682 -142 -633 -173
2199a73R53p10o49M36O28j79q90M10M66j99m06M36j52k2j24L54j52o52K75O68
$$ -173 780 70 -579 -143 485 306 -584 -174 292 93 -313 123 -29 -51 -175 179 27 -625 -350 318
2219C18Q2o81j67R34p8o82k01Q22j2o66j46J019j04p38j50P13L1o32j58O88J71
$$ 318 400 -281 -448 486 408 -274 -475 347 335 -331 -477 542 438 -300 -450 263 294 -338 -496 192 363
2240C63q12k71Q84j5m96j26O38J47o68J31N38j40m71L82K42k73l63N89J9n95j98
$$ 363 -449 -720 164 149 -347 -473 165 312 -356 -225 313 173 -298 84 326 53 -310 279 298 -297 -495
2261d95P73J15m83m65O05P42p73o14K50Q88k47j047M93P99j79o74K48L89m98m
$$ -495 278 393 -90 -555 50 792 19 -595 -345 543 296 -751 -258 541 362 -312 -64 325 -173 -177
2281a77J90oQ9k66M9N05o89r1M63J08m69k67O39J11m54k17O66R9n50j47P77J43
$$ -177 13 7 96 -170 -121 384 -305 -396 67 175 -294 -561 78 189 -265 -482 184 283 -267 -414 363 506
2303E06o51l99Q42J24o97m5N65P0o15P2M74J73n82n72Q50L98o21k71K73L67l71
$$ 506 -145 -544 298 422 -275 -320 245 315 -300 -228 246 419 -163 -735 115 513 -108 -379 -106 261 -110
2324a10k2J24K7k11L42J13l46j41K99N32n70n84N25O97m19r20K95R07Lj000J74
$$ -110 -132 -8 19 -192 150 263 -83 -224 75 607 37 -547 -22 675 256 -664 -369 538 541 -459 -285
2345b85O35n7m60l29Q01k34l08J67K63q9m06O16j71ql72J13M68o15r8M70L09o13
$$ -285 350 293 -167 -496 305 71 -237 -70 193 104 -302 314 143 135 -237 -124 344 -271 -369 101 410 -203
2367b03l79N15K91j99m18M23J71l83k39O51J58o66l47R03K18o97m32P67M73p57
$$ -203 -582 -67 224 25 -393 30 201 -182 -421 230 388 -278 -625 278 496 -201 -633 134 607 -150
2387a50o44N34P70l09n89P8M25J0j33J17k40j13K75L31l45n16M91N92k69q70J89
$$ -150 -794 -260 510 201 -388 -310 115 125 -8 109 -131 -244 31 362 17 -499 -8 584 315 -555 -366
2408c66J041j60q63j49P14K59q02j75O71K32o44J16L61q9m77J0O25k49m26n4R29
$$ -366 675 515 -348 -497 217 476 -326 -501 170 402 -242 -126 235 146 -331 -321 304 55 -371 -425 504
2429E04j68p25J2O43j9o05L30K53k9k23Q1N8n7m39N93p8m48j56Q53K80p68n73
$$ 504 336 -389 -377 266 247 -358 -28 225 196 -27 54 112 55 -384 209 131 -317 -473 380 660 -108 -681
2451f81O99P50q55p57P50R38o41p91L71O90k30m55n3M97L1k09j28J60m13K65L37
$$ -681 18 768 -87 -844 -94 844 203 -588 -217 473 243 -212 -265 232 263 54 -74 86 -327 -62 275
2472B75m8n40J34N30N1n38n94R95K7k81n59P29J31m87j68L30L62o63J06M33j59
$$ 275 227 -313 -179 351 402 -136 -730 265 292 11 -548 181 312 -175 -343 -13 349 -314 -208 225 66
2493F6n11J95O47P0p95l34J146K33r84k25O38M54n35l80J52L85o1k77J01k54J06
$$ 66 -445 -250 397 467 -328 -662 484 717 -267 -492 146 600 65 -315 -163 222 161 -116 -15 -269 -163
2514a63M19R0p13j26O06N39n80r27P10Q23l22q73o6J245k36o31k49N48J69l87
$$ -163 256 346 -367 -493 113 652 72 -855 -145 678 356 -517 -583 662 426 -205 -454 94 263 -124
2534a24j70M25k89K5K04j15p1k86N41K21o32j72L13N53l34l87J91N99k83n25J98
$$ -124 -294 131 -158 -133 71 -44 -115 -401 140 361 -271 -443 -130 423 89 -298 -107 492 209 -316 -118
2555a18J01O9r5K46j90l86K3R96l42q29n0Q86M66r25o68Q12O91n00p44M75L84
$$ -118 -17 52 -43 203 13 -373 -350 646 304 -525 -575 311 777 -148 -816 -4 687 187 -557 -82 302
2576C02m7m75l4J34J44O2Pk59l36N49M16m10o70L78R68l31r21P1R03K8o78l96
$$ 302 255 -220 -254 -120 24 86 93 -166 -502 47 463 53 -617 -239 729 398 -523 -452 451 479 -199 -595
2598e95P28L03n98p5L26j06j74J33L11l64l13K94M47k31n53J17P68j45n63p3N25
$$ -595 133 436 -162 -237 89 -17 -191 -58 253 -111 -424 -130 317 86 -467 -350 418 273 -290 -363 162
2619A62L49m99j97K87J21k49K23k03l60J11O51j32n24l59Q03M58r00n58R58L65
$$ 162 511 12 -185 102 223 -26 197 -6 -366 -255 396 264 -260 -619 184 642 -258 -816 142 507
2639E07l18q16J39J019j5j044K97M29j47j06o4M3J11o4M05m43m57L42O82j02q35
$$ 507 189 -627 -488 531 516 -528 -231 198 51 -55 -119 -76 35 -29 376 -67 -524 -182 500 398 -437
2660d37L3N48K59n59j85M65K87n44l2R4R0p7P3L01m04Ro2M92K4q20P9P44M1p89
$$ -437 -404 144 403 -156 -341 124 411 -133 -165 -71 19 -58 15 316 -88 -79 -141 351 375 -445 -366 378 419 -370
2684c70j80Q07M13n41o69L82J85J61k02j49O4J30J29j69l69J12O28K34r34m24
$$ -370 -550 257 670 129 -540 -158 27 188 -14 -163 -99 31 160 -9 -378 -266 362 596 -338 -762
2704g62R26M63m20q90M39P21n2r30J5P48J2m16L4N2J68j68j9J63k15j50N17J29
$$ -762 164 627 207 -683 -244 477 425 -505 -490 258 270 -146 -112 -60 108 -60 -79 84 -131 -281 236 365
2726C65m05m33N21L06l10m14M05J98l30p5J03K14l2k08J02J18l91K27L64j56p74
$$ 365 -40 -473 48 354 44 -370 35 233 -97 -172 -69 145 113 -95 7 125 -266 -39 325 169 -605
2747f05K82N92L38r23k12O33O06o23p39Q27L12l81n03N9M97Q3K6k19k46MK86K12
$$ -605 -323 269 607 -316 -528 105 711 88 -651 176 488 107 -396 -337 160 243 269 50 -196 -192 94 306
2769C06l91l30M34M72k25p83K59O53n0o74M3N01K67p08j44N34k15n9k1J19J05
$$ 306 -85 -415 19 491 266 -517 -258 395 345 -329 -286 215 482 -226 -370 164 -51 -110 -131 -12 93
2790I3k72K63K74l22m12K10O29k69o06J75N06q2l86j2L57J2l74J59Q2k42K43K23
$$ 93 -179 84 358 36 -376 -166 463 194 -412 -237 269 187 -199 -211 146 158 -216 -57 25 -217 26 249
2812B49k60k84p2P02j0n29l51P91L23n81n73L15P31j35o59Q6O62o2n48J18J11
$$ 249 -11 -295 -367 335 325 -204 -555 236 559 -22 -595 -280 451 316 -343 -257 405 343 -205 -87 24
2833B4r9K05J27l64j29K04K96Pn41q9P85r9o18l1M65J79m90k07N55O3j74j49N8
$$ 24 -75 130 257 -107 -236 -32 264 271 -270 -359 426 327 -291 -322 143 322 -168 -375 180 243 69 -80 -22
2856b2P7k80K49L86l43n40K79L29J61n25j88P52J13m82l79O76K9l73k73M50K4
$$ -22 55 -225 24 410 67 -473 -194 135 296 -229 -417 335 448 -34 -413 263 292 -81 -354 96 120
2877A20p9J38j43j66J18K26o9o26J36L11O36o14o08N94N66m80q20N72N49j7n71
$$ 120 41 179 36 -130 -12 214 145 -481 -345 -34 602 -12 -620 -26 540 60 -760 -188 361 344 -227
2898b27l6L42K12l23j5J59k19j39L25l8j20l99N14K28l42j38L29K60l27k95L24
$$ -227 -263 79 291 -32 -47 112 -107 -246 79 41 -79 -478 36 264 -78 -216 113 373 46 -249 75
2919G5K67l43j00J32J74l48K06J56p1n41J32P88q1q44j43O18K53o30k55O06M22
$$ 75 342 -1 -101 31 205 -143 63 219 148 -393 -261 527 446 -398 -541 77 330 -300 -555 51 473
2940D73m91k13K38N28k61m09J11J84n7m7J81k43r7K92J90k03n95K52O64m22m94
$$ 473 -18 -231 7 535 274 -135 -24 160 103 56 237 -6 -103 189 379 176 -419 -167 497 75 -419
2961d19J02O45j25n36N4M45j57l03n4O17m23m1L86Q3k97j17R6L80j41m60J63M14
$$ -419 -317 328 203 -333 -279 166 9 -294 -348 269 -154 -195 191 274 -23 -140 -44 336 195 -265 -102 312
2983C12j92k30RK16Ol96K92o1K0j35L94l7l85j30O63j44n33P5O24N4o21k39N10
$$ 312 120 -110 -101 115 121 -275 17 -44 -24 -159 235 198 -187 -317 346 202 -331 -256 368 422 -199 -438 72
3006G2N23m78n46K11P56l72n52L50R0J15l56O0J73J53p6j04J44j69l1K99J67o38
$$ 72 595 117 -429 -218 538 166 -386 -36 54 169 -187 -127 46 199 123 19 163 -6 -37 262 429 -209
3028b09N2M25n8l35j36L94K3k24k34M70j7j68OJ54j03j52oJ71J43m73J09N17j97
$$ -209 -157 268 210 -125 -261 133 156 -68 -302 168 151 -17 -11 143 40 -112 -118 53 196 -277 -168 349 152
3051A52l70k16O34K0n27q2M12O3q2j92K35Kk04J57q6n8N3K01K02l91l31L66N11
$$ 152 -218 -434 200 220 -307 -389 23 86 4 -188 47 49 -155 2 -84 -142 -89 112 314 -77 -408 -42 469
3074D69m45m98M21N93k81m90J35J73K45l33k87K18J44k8K4L5k12O0J14Q6j16p2
$$ 469 24 -474 -53 540 259 -231 -96 77 322 -11 -298 -80 64 36 60 95 -117 -57 57 143 27 -45
3096d5J30K4j60l4Q5K48k79k07L19P7l12LM13k14l32K45K82R5n25j83O14j3m19
$$ -45 85 109 -51 -85 0 248 -31 -238 81 158 -154 -151 262 48 -284 -39 243 338 -187 -370 244 231 -188
3119a88j62O05J86n52j69J74J65j26k96L39K57k34m6N5p7q5J03K86j93j21P3M05
$$ -188 -350 255 441 -111 -280 -106 59 -67 -363 -24 233 -1 -47 8 -69 -154 -51 235 42 -79 -6 399
3141C99n23j80K20K89j51l77J66O02q2n86K74J47Kk52K3L55k33m00M22J24k09
$$ 399 -124 -304 -84 205 54 -323 -157 445 363 -223 51 198 200 -52 -29 326 93 -307 115 239 30
3162C0l01K25M52k07o01J98M61k01l14N4K78Qj08J94j39j17p7L04J6j78j83K60
$$ 30 -271 -46 406 199 -402 -204 257 56 -258 -204 74 82 -26 168 29 -88 -165 139 155 -23 -206 54
3184E4K06l39k09L91L74o32k29O03K14n57j35L14L72l47m17L65K82j74k14J79
$$ 54 260 -79 -288 103 477 -155 -384 219 433 -124 -259 55 427 80 -337 28 310 136 -78 101
3204A01K4p3j08M06j79l76NM47j23l79J1L14Ok68m7K42K38m05O3K24Q4m92J96
$$ 101 125 52 -56 350 171 -205 -200 247 124 -255 -244 70 76 -192 -239 3 241 -164 -101 123 207 -285 -89
3227h9L45j95k32j57M80Pk90j86N05L4k97m06N84j01q1j2J78J06l45L55ml61R8
$$ -89 256 61 -171 -328 152 159 -131 -317 188 222 -75 -481 103 2 -79 -91 87 193 -152 203 199 -162 -64
3250f4J20Q0q3m10N18K29m93k41M05L71j68o21J95Q15l84o85L92M69k51m93J86
$$ -64 56 136 53 -357 161 390 -103 -344 61 432 264 -357 -162 653 269 -416 -24 445 194 -299 -113
3271a13K05k04m2J23P1l15J11K67K8p4k40J78Q6k80K8K95L3l50k16L79K69k32
$$ -113 92 -112 -154 -31 40 -275 -164 103 131 57 -183 -5 81 -199 -171 124 157 -193 -409 -30 239 7
3293Gk99M80J5l76m4M09N8o58R7O50J65n05j99L41K77m47l09L27K45j52k55J11
$$ 7 -292 188 203 -173 -217 192 250 -408 -311 339 504 -1 -200 141 418 -29 -338 -11 234 82 -173 -62
3315f2J41j24L3K56l05oJ70K49k89k20J84K85l74k09J70M00q9o06L06J76j11l13
$$ -62 79 -45 -12 244 -61 -67 103 352 63 -157 27 312 -62 -271 -101 299 210 -396 -90 86 -25 -338
3337c38J71K84O5m21J22K59o2k35J16J79o3n20M25L36j45k93o5J63q0O1J21J47
$$ -338 -167 117 182 -239 -117 142 80 -155 -39 140 77 -443 -18 318 173 -120 -185 -22 -102 -41 80 227
3359B27j33j27J31J08k74J2K09R2n10N7L62k1k04l76M45L58o26p5K65L84k60l55
$$ 227 94 -33 98 206 -68 -56 153 245 -265 -208 154 133 -71 -447 -2 356 -270 -345 -80 304 44 -311
3381c11J30L30j77p5J6K12j72j1K10mk97j14L85k04l7j50M56o6m65K59J46Q6l96
$$ -311 -181 149 -28 -103 -87 125 -47 -58 152 148 -149 -263 122 -82 -119 -269 187 121 -344 -85 61 147 -249
3404b49K54J62l0m65K16J91N0k85p2K76N1n26K41K35K09l67%K13M2l16J48L9N8
$$ -249 5 167 137 -328 -112 79 129 -156 -228 48 99 -427 -186 49 258 -109 -109 104 146 -170 -22 17 75
3427G5k08J49J55k46J43J3N7l41N8M53K02p48O7R9N35n67r2K02J96l9m49L44L31
$$ 75 -133 16 171 -75 68 81 138 -203 -145 308 510 -238 -171 -72 463 -104 -196 6 202 163 -286 58 389
3450C89m68k40K87M18l67k61J28L37q0n11L48J73j62j5o7K22j44j00K43M0l14
$$ 389 -79 -319 -32 386 19 -242 -114 223 143 -368 -20 153 -9 -24 -91 131 -13 -113 130 170 -144
3471a44R4K37R9l70R5K02j6m00q7O17j87k52r8L46J99n76r3M05K62n84P4J24J27
$$ -144 -50 187 286 -84 11 213 197 -203 -290 327 140 -112 -210 136 335 -241 -334 71 333 -251 -177 -53 74
3494G4rk43J30K42l15Q5J60q1j71Q1K58p3l63J37K22l5m96M29J39k65k31K31N80
$$ 74 65 -178 -48 194 -121 -36 124 43 -128 -47 211 138 -225 -88 134 99 -397 32 171 -94 -325 -94 486
3517D86m40m35M60J46j72m32K75L96j63l64l2K79K21n29M61Ml73J41o0K73j22
$$ 486 46 -389 71 217 45 -387 -112 284 121 -243 -275 4 225 -304 157 161 -212 -71 -131 142 20
3538B0k30J94K05m10q7M25M8l05j18M26J89n75N0L91J54n48q0K73L38n65r5L41
$$ 20 -210 -16 189 -221 -308 117 165 -140 -258 168 357 -218 -168 223 377 -171 -251 22 360 -205 -300 41
3560D1M27m76l16L06K80l01k24K13K74j85k73J98J0L2j88J81M9m5q5K86j66j91
$$ 41 468 -8 -324 -18 262 -39 -263 -50 224 39 -234 -36 -26 6 -182 -1 48 3 -82 204 38 -153
3582a53R8J11l1k72J74K70k24l57K95L55j77k76K8L20N7m30q0L97O9l01K7K54
$$ -153 -55 56 25 -247 -73 197 -27 -384 -89 266 89 -187 -159 161 218 -212 -292 105 174 -127 -100 154
3604A54N4k36p0M01L9m90r4L62j70j15j36M26l8k64lM25m89q0L91O6k12k04M49
$$ 154 208 -28 -98 303 342 -148 -242 120 -50 -165 -301 125 87 -177 -180 245 -244 -324 67 133 -79 -283 166
$$ [...]
8191H1
##END NTUPLES=NMR FID
##END=
