##TITLE=1H_Pr 5-2-22
 CDCl3, 8 sc, 
 25.6.2019
##JCAMPDX= 6.0         $$ Bruker NMR JCAMP-DX V2.0
##DATA TYPE= NMR FID
##DATA CLASS= NTUPLES
##ORIGIN= UXNMR, Bruker Analytische Messtechnik GmbH
##OWNER= root
$$ XWIN-NMR		Version 3.5
$$ Tue Jun 25 16:31:32 2019 Russian Standard Time (UT+4h)  she@DPX200
##.OBSERVE FREQUENCY= 200.13155
##.OBSERVE NUCLEUS= ^1H
##.DELAY= (6, 6)
##.ACQUISITION MODE= SIMULTANEOUS
##.ACQUISITION SCHEME= undefined
##.AVERAGES= 8
##.DIGITISER RES= 18
##SPECTROMETER/DATA SYSTEM= spect
##.PULSE SEQUENCE= zg30
##.SOLVENT NAME= CDCl3
##.SHIFT REFERENCE= (INTERNAL, CDCl3, 0, 15.7039)
##AUDIT TRAIL= $$ (NUMBER, WHEN, WHO, WHERE, WHAT)
$$ ##TITLE= Audit trail, XWIN-NMR		Version 3.5
$$ ##JCAMPDX= 5.01
$$ ##ORIGIN= Bruker BioSpin GmbH
$$ ##OWNER= she
$$ F:/spectra/data/she/nmr/H-F/1/audita.txt
$$ ##AUDIT TRAIL=  $$ (NUMBER, WHEN, WHO, WHERE, WHAT)
(   1,<2019-06-25 16:30:07.65 +0400>,<she>,<DPX200>,
      <created by zg, POWCHK disabled, PULCHK disabled
       configuration hash MD5:
       00 E9 B6 7A A2 85 ED C7 34 08 36 98 17 FE 4E 26
       data hash MD5: 16K
       C4 64 CF 2A 7C A8 58 4D 16 7E 56 86 07 15 45 29>)
$$ ##END=
$$ 
$$ hash MD5
$$ 6A EE 11 A2 26 96 A1 DF DB E9 A6 56 3E 21 DA F6
##$RELAX= 
##$RELAX= 
##$RELAX= 
##$RELAX= 
##$RELAX= 
##$RELAX= 
$$ Bruker specific parameters
$$ --------------------------
##$DU= <F:/spectra>
##$EXPNO= 1
##$NAME= <H-F>
##$PROCNO= 1
##$TYPE= <nmr>
##$USER= <she>
##$AMP= (0..31)
100 100 100 100 100 100 100 100 100 100 100 100 100 100 100 100 100 100 
100 100 100 100 100 100 100 100 100 100 100 100 100 100 
##$AQSEQ= 0
##$AQ_mod= 1
##$AUNM= <au_zg>
##$AUTOPOS= <>
##$BF1= 200.13
##$BF2= 200.13
##$BF3= 200.13
##$BF4= 200.13
##$BF5= 200.13
##$BF6= 200.13
##$BF7= 200.13
##$BF8= 200.13
##$BYTORDA= 1
##$CFDGTYP= 0
##$CFRGTYP= 5
##$CHEMSTR= <none>
##$CNST= (0..31)
1 1 145 1 1 1 1 1 1 1 1 1 1 1 1 1 1 1 1 1 1 1 1 1 1 1 1 1 1 1 1 1 
##$CPDPRG= <>
##$CPDPRG1= <>
##$CPDPRG2= <>
##$CPDPRG3= <>
##$CPDPRG4= <mlev>
##$CPDPRG5= <mlev>
##$CPDPRG6= <mlev>
##$CPDPRG7= <mlev>
##$CPDPRG8= <mlev>
##$CPDPRGB= <>
##$CPDPRGT= <>
##$D= (0..31)
0 1.2 0 0 0 0 0 0 0 0 0 0.03 0 0 0 0 0 0 0 0 0 0 0 0 0 0 0 0 0 0 0 0 
##$DATE= 1561465807
##$DBL= (0..7)
120 120 120 120 120 120 120 120 
##$DBP= (0..7)
150 150 150 150 150 150 150 150 
##$DBP07= 0
##$DBPNAM0= <>
##$DBPNAM1= <>
##$DBPNAM2= <>
##$DBPNAM3= <>
##$DBPNAM4= <>
##$DBPNAM5= <>
##$DBPNAM6= <>
##$DBPNAM7= <>
##$DBPOAL= (0..7)
0.5 0.5 0.5 0.5 0.5 0.5 0.5 0.5 
##$DBPOFFS= (0..7)
0 0 0 0 0 0 0 0 
##$DE= 6
##$DECBNUC= <off>
##$DECIM= 24
##$DECNUC= <off>
##$DECSTAT= 4
##$DIGMOD= 1
##$DIGTYP= 9
##$DL= (0..7)
0 120 120 120 120 120 120 120 
##$DP= (0..7)
150 150 150 150 150 150 150 150 
##$DP07= 0
##$DPNAME0= <>
##$DPNAME1= <>
##$DPNAME2= <>
##$DPNAME3= <>
##$DPNAME4= <>
##$DPNAME5= <>
##$DPNAME6= <>
##$DPNAME7= <>
##$DPOAL= (0..7)
0.5 0.5 0.5 0.5 0.5 0.5 0.5 0.5 
##$DPOFFS= (0..7)
0 0 0 0 0 0 0 0 
##$DQDMODE= 0
##$DR= 18
##$DS= 0
##$DSLIST= <SSSSSSSSSSSSSSS>
##$DSPFIRM= 0
$$ [...]
##$SUBNAM2= <"">
##$SUBNAM3= <"">
##$SUBNAM4= <"">
##$SUBNAM5= <"">
##$SUBNAM6= <"">
##$SUBNAM7= <"">
##$SUBNAM8= <"">
##$SUBNAM9= <"">
##$SW= 24.9336996594482
##$SWIBOX= (0..15)
0 0 2 0 0 0 0 0 0 0 0 0 0 0 0 0 
##$SW_h= 4990.01996007984
##$TD= 16384
##$TD0= 1
##$TE= 0
##$TE2= 300
##$TE3= 300
##$TEG= 300
##$TL= (0..7)
0 120 120 120 120 120 120 120 
##$TP= (0..7)
150 150 150 150 150 150 150 150 
##$TP07= 0
##$TPNAME0= <>
##$TPNAME1= <>
##$TPNAME2= <>
##$TPNAME3= <>
##$TPNAME4= <>
##$TPNAME5= <>
##$TPNAME6= <>
##$TPNAME7= <>
##$TPOAL= (0..7)
0.5 0.5 0.5 0.5 0.5 0.5 0.5 0.5 
##$TPOFFS= (0..7)
0 0 0 0 0 0 0 0 
##$TUNHIN= 0
##$TUNHOUT= 0
##$TUNXOUT= 0
##$USERA1= <user>
##$USERA2= <user>
##$USERA3= <user>
##$USERA4= <user>
##$USERA5= <user>
##$V9= 5
##$VALIST= <valist>
##$VCLIST= <CCCCCCCCCCCCCCC>
##$VD= 0
##$VDLIST= <DDDDDDDDDDDDDDD>
##$VPLIST= <PPPPPPPPPPPPPPP>
##$VTLIST= <TTTTTTTTTTTTTTT>
##$WBST= 1024
##$WBSW= 4
##$XGAIN= (0..3)
0 0 0 0 
##$XL= 0
##$YL= 0
##$YMAX_a= 237452
##$YMIN_a= -441590
##$ZGOPTNS= <>
##$ZL1= 120
##$ZL2= 120
##$ZL3= 120
##$ZL4= 120
##$ABSF1= 10
##$ABSF2= 0
##$ABSG= 5
##$ABSL= 3
##$ALPHA= 0
##$AQORDER= 0
##$ASSFAC= 0
##$ASSFACI= 0
##$ASSFACX= 0
##$ASSWID= 0
##$AUNMP= <proc_1d>
##$AZFE= 0.1
##$AZFW= 0.1
##$BCFW= 1
##$BC_mod= 2
##$BYTORDP= 1
##$COROFFS= 0
##$CY= 11.3945322036743
##$DATMOD= 1
##$DC= 2
##$DFILT= <>
##$DTYPP= 0
##$F1P= 18.9103706918063
##$F2P= -1.10871071338519
##$FCOR= 0.5
##$FTSIZE= 0
##$FT_mod= 4
##$GAMMA= 1
##$GB= 0.15
##$INTBC= 1
##$INTSCL= 1
##$ISEN= 128
##$LB= 0.24
##$LEV0= 0
##$LPBIN= 0
##$MAXI= 10000
##$MC2= 0
##$MEAN= 0
##$ME_mod= 0
##$MI= 1.114404
##$NCOEF= 0
##$NC_proc= 0
##$NLEV= 6
##$NOISF1= 3.799351
##$NOISF2= 2.8
##$NSP= 1
##$NTH_PI= 0
##$NZP= 0
##$OFFSET= 15.70392
##$PC= 1
##$PHC0= -8501.343
##$PHC1= 21.00097
##$PH_mod= 1
##$PKNL= yes
##$PPARMOD= 0
##$PSCAL= 0
##$PSIGN= 0
##$REVERSE= no
##$SF= 200.130013532006
##$SI= 16384
##$SIGF1= 3
##$SIGF2= 2
##$SINO= 400
##$SIOLD= 16384
##$SREGLST= <1H.CDCl3>
##$SSB= 0
##$STSI= 0
##$STSR= 0
##$SW_p= 3612.71676300578
##$SYMM= 0
##$S_DEV= 0
##$TDeff= 0
##$TDoff= 0
##$TI= <>
##$TILT= no
##$TM1= 0
##$TM2= 0
##$TOPLEV= 0
##$USERP1= <user>
##$USERP2= <user>
##$USERP3= <user>
##$USERP4= <user>
##$USERP5= <user>
##$WDW= 1
##$XDIM= 8192
##$YMAX_p= 0
##$YMIN_p= 0
$$ End of Bruker specific parameters
$$ ---------------------------------
##NTUPLES= NMR FID
##VAR_NAME=  TIME,          FID/REAL,        FID/IMAG
##SYMBOL=    X,             R,               I
##VAR_TYPE=  INDEPENDENT,   DEPENDENT,       DEPENDENT
##VAR_FORM=  AFFN,          ASDF,            ASDF
##VAR_DIM=   8192,          8192,            8192
##UNITS=     SECONDS,       ARBITRARY UNITS, ARBITRARY UNITS
##FACTOR=    0.0002004,     1,               1
##FIRST=     0,             0,               0
##LAST=      1.6414764,     0,               0
##MIN=       0,             -441590,         0
##MAX=       1.6414764,     237452,          0
$$ Real data points
##PAGE= N=1
##DATA TABLE= (X++(R..R)), XYDATA
0 0 0 0 0 0 8 -8 8 -8 16 -16 24 -32 40 -48 57 -72 87 -101 121 -141 168 -193 224 -259 298 -341 390 -442
28 -442 500 -567 638 -718 805 -901 1005 -1120 1247 -1385 1537 -1703 1885 -2088 2314 -2560
44 -2560 2836 -3146 3496 -3892 4347 -4871 5493 -6238 7143 -8283 9762 -11770 14669 -19242
58 -19242 27567 -47684 197835 104681 -196386 153254 237452 214577 186768 22894 -84128
69 -84128 185475 230065 32900 63851 113688 -79772 10551 229110 82038 -77827 28827
80 28827 -18872 -42871 180480 129346 -195014 -125630 110654 70147 17155 -6889 -173946
91 -173946 -96414 167752 52562 -170407 -49605 -2342 -120688 5416 97549 -109514 -157306
102 -157306 -18778 -36894 -6532 85347 -108597 -241913 19982 152446 -21230 -78124 -76276
113 -76276 -112030 70815 192293 -65098 -189322 31473 96628 12428 48846 -5584 -104475
124 -104475 33748 116977 -15712 -5981 59340 -70472 -63291 127638 75343 -80851 -33260
135 -33260 -3371 -24311 85425 69062 -124144 -88210 80050 41881 -15709 9625 -66762
146 -66762 -73629 81702 64133 -76314 -31469 20274 -47366 4893 76534 -31331 -82565 4124
158 4124 11661 8132 51399 -36796 -114400 21108 100559 -10098 -53189 -15350 -21929 27732
170 27732 74742 -23089 -72328 26074 50093 -507 19023 13196 -29023 17310 48862 -3471
182 -3471 7528 41574 -18511 -31016 48533 44847 -18950 -21032 -11692 -771 39657 11093 -62658
195 -62658 -33842 25274 16 -23582 -15712 -34675 -27892 8153 -12690 -38419 -11701 -12529 -33064
208 -33064 -5180 5700 -22679 -17806 -6314 -14064 10980 21284 -24650 -22312 28252 21752 -3545
221 -3545 5974 1063 6532 41490 18663 -21489 17734 42382 4444 8099 28265 3395 13325
234 13325 39699 378 -7368 41633 18399 -18415 24856 28427 -16486 10632 27427 -17993
246 -17993 1294 33703 -20233 -24313 33691 -1433 -40071 9952 1647 -41051 5989 9027 -59665
259 -59665 -24786 23960 -40512 -47882 9972 -33240 -59215 9081 -13362 -69921 -11251 273
271 273 -65256 -18944 22371 -57544 -50621 25484 -23683 -49804 23254 -11505 -66407 17918 31901
284 31901 -54219 -13099 33999 -37959 -15855 53906 -22756 -49744 44818 13175 -48179 31189
296 31189 28881 -59004 6476 58617 -36756 -24644 51188 -20698 -37666 57358 6419 -62657
308 -62657 30845 35494 -53867 10260 50016 -51326 -21318 64909 -20691 -47370 50904 2684
320 2684 -59339 39091 33251 -63861 6750 51292 -49398 -17200 62439 -29543 -48775 57368
332 57368 5516 -59236 37694 28639 -63102 15026 56371 -50080 -18452 62724 -26166 -39670
344 -39670 61727 1625 -60060 43504 34322 -60249 14167 51824 -50070 -13240 62782 -31092
356 -31092 -41954 58545 -1640 -59028 40449 24861 -64606 15373 48633 -56056 -17338 58374
368 58374 -31840 -41103 54077 -7234 -58236 41231 22732 -62992 16095 44489 -53906 -9360
380 -9360 59338 -34550 -38839 57395 -3185 -52300 42136 21420 -57910 20529 45244 -49342
392 -49342 -7312 54540 -32389 -30572 56008 -8582 -51886 41430 18920 -56741 17781 37428
404 37428 -51820 -8976 48188 -33803 -32568 45367 -12601 -47548 35709 10904 -54760 16498
416 16498 31664 -47743 -5000 43711 -31828 -25785 46862 -7067 -38492 37176 15392 -39670
428 -39670 23219 33263 -35497 5034 46520 -20376 -12750 46661 -3152 -24346 42444 16553
440 16553 -33394 24884 33487 -25354 8865 39006 -20119 -8583 43862 -2283 -22298 30337
452 30337 8022 -26158 24278 20856 -33867 429 28073 -20680 -11793 22618 -20394 -28076 21609
465 21609 -2562 -37115 695 -1239 -35493 -3051 8427 -37139 -24146 8055 -21988 -24066
477 -24066 8189 -18497 -34903 5654 3790 -24265 -2076 2862 -22505 2236 23436 -9375
489 -9375 -11601 15130 4056 3169 25384 5701 -11367 19175 25664 5533 14718 15906 -2260
502 -2260 15464 32472 9485 3108 16527 7409 11190 29142 10469 -7509 11665 17496 8565
515 8565 16520 7471 -11119 8571 22960 1301 -2085 6271 -6984 -1541 16016 -3245 -15796
528 -15796 2137 -4863 -15079 6537 2203 -26194 -12942 2016 -12873 -4384 1627 -29132 -21537
541 -21537 17354 -535 -25894 -4907 -4933 -15061 11335 6027 -28645 -3804 20858 -11471 -9327
554 -9327 19144 -6388 -15299 19782 4489 -17200 16800 10460 -27165 6236 28445 -17095 -14315
567 -14315 18849 -8039 -11778 21952 -8771 -29642 21626 13388 -35845 -506 24771 -20518
579 -20518 -11482 18342 -17746 -13066 31435 -9060 -36897 23340 20962 -29326 3400 21598 -20649
592 -20649 2786 31779 -18712 -11099 44922 970 -31656 33536 34384 -16613 13268 25414 -11175
605 -11175 29638 55834 -18136 -14680 61866 33885 -4782 36356 22371 -7888 51496 54518
617 54518 -16134 15186 58297 2304 6599 62753 13892 -20857 37903 28644 -8475 38142
629 38142 24403 -46996 6250 64004 -6844 -29809 14962 -13539 -13860 45352 -3398 -64157
641 -64157 6274 30695 -32227 -4906 23607 -42117 -29493 36563 -3679 -25994 21977 -17754
653 -17754 -51223 39577 51724 -41574 -29956 18950 -2773 23973 46863 -41698 -50073 58280
665 58280 49950 -21880 5039 10145 -21157 36536 57664 -22463 -13676 43630 577 -4013 64436
678 64436 22198 -44019 12989 44563 11264 32343 17978 -53268 155 85751 18318 -43847
690 -43847 -1106 1852 -2669 45165 7720 -65819 -12350 34463 -18888 -13904 18392 -43098 -55568
703 -55568 18840 13137 -29173 -14209 -40686 -61303 26238 48943 -58428 -78072 -4165 6826
715 6826 5363 7009 -57804 -66134 30197 35543 -38973 -26103 -3064 -33930 -4426 34675 -14225
728 -14225 -34272 -817 -18311 -12282 48424 11770 -68644 -26844 38747 22339 5926 -14621
740 -14621 -53417 -5042 67988 15989 -50015 -15251 8901 447 26379 14143 -39071 -19835
752 -19835 19446 2828 6595 19490 -32218 -46150 23839 41097 -6271 -24193 -28784 -18973 38244
765 38244 43292 -35879 -51740 10228 29260 14505 6298 -21992 -24991 24188 32951 -1229 1297
778 1297 5881 -14523 7994 44341 18415 -14508 -7575 2311 22606 44819 7988 -38014 -8695
791 -8695 36103 29118 6094 -15010 -26221 7300 39336 8963 -24648 -13599 -1969 3010 15995
804 15995 2676 -24321 -17699 -988 2963 10304 -1679 -33291 -25390 13077 15655 -7831 -23023
817 -23023 -28903 -8877 21503 5829 -30914 -27087 -5689 1201 5127 -6724 -29101 -17779 5225
830 5225 -1246 -6581 -1585 -17102 -21265 6076 11632 -4919 -7691 -12915 -13415 16661 23497 -14279
844 -14279 -21544 5537 10812 9438 11587 -12836 -17354 17883 19628 -8637 -2274 4133 -10411 3843
858 3843 17802 -8787 -13247 6890 -5965 -10265 14823 -824 -29672 -3877 11761 -10719 -6006
871 -6006 -562 -24993 -10138 19433 -10895 -29024 2285 -1704 -20220 4593 1352 -29572 -6770
884 -6770 12189 -18934 -13245 12657 -16309 -24004 14630 2254 -23975 3662 2879 -23446 6038
897 6038 19854 -23359 -14310 22937 -4327 -15125 18182 -795 -20543 18221 15003 -22591 5531
910 5531 22303 -16704 -3966 27087 -8789 -16164 24371 2870 -21143 17936 12228 -25786 6212
923 6212 23978 -19676 -8325 23351 -11676 -14859 24902 -2595 -26743 18061 13369 -25961 5133
936 5133 19786 -23024 -4841 27506 -13439 -18648 24441 -275 -22927 19606 10479 -27802 8028
949 8028 22682 -21712 -4416 25467 -14782 -15250 28193 -1309 -25157 19535 11523 -25736 9848
962 9848 21412 -23719 -3340 27715 -13420 -14737 26778 -3119 -24001 21362 10988 -26672
974 -26672 9359 19841 -23981 -2347 26806 -16462 -16718 25570 -2842 -22808 19547 6416
986 6416 -27931 10411 19233 -25346 -4361 23147 -16524 -13828 24759 -6650 -24260 18716 7466
999 7466 -26186 8581 16067 -23946 -1687 22907 -16941 -13378 23641 -5101 -20958 18104 5613
1012 5613 -23699 10478 15390 -22511 -550 22482 -14573 -10735 21889 -5116 -17281 19116
1024 19116 4911 -21908 10726 14673 -19309 495 19451 -13780 -8204 20819 -5281 -15329
1036 -15329 17393 4211 -18700 10674 12512 -17124 2524 17899 -12547 -5876 19547 -4266
1048 -4266 -12529 15956 3152 -15198 11497 10248 -15558 3328 15373 -11099 -3954 16147 -6437
1061 -6437 -10273 14461 522 -15037 8186 6506 -14457 1671 9169 -13263 -4513 10878 -9326
1074 -9326 -10776 8767 -3811 -14148 4874 492 -15332 560 5100 -13747 -5727 5826 -9654
1087 -9654 -8261 5358 -6888 -11927 4138 -1181 -11787 478 644 -11463 -919 5105 -8909
1100 -8909 -5841 4292 -4708 -5274 5508 -2610 -7925 3899 2505 -4877 3182 2777 -5853 2329 7872
1115 7872 -2111 -493 5694 -1371 512 9312 1592 -3866 5026 3572 -863 7005 3331 -5836 2802
1130 2802 7383 -1450 736 3955 -5676 -1418 9401 -492 -6477 2711 -1259 -4600 7463 2396
1144 2396 -11181 -960 6141 -4404 299 4970 -9661 -5663 10338 -110 -8025 3991 -1925
1157 -1925 -9353 7774 7339 -12013 -3171 6781 -5941 -77 10249 -8675 -12067 10663 4151 -8628
1171 -8628 4971 800 -13084 6557 13852 -10418 -5656 10433 -4918 -3950 15961 -1528 -15639
1184 -15639 8478 8595 -8249 7341 7554 -16852 -700 20326 -3771 -10633 9060 -3414 -8346
1197 -8346 17399 4804 -20416 3807 14750 -9582 712 14574 -11879 -7491 20152 1424
1209 1424 -10857 14458 4080 -15324 14411 19994 -12874 -2065 17183 -4795 1908 23513
1221 23513 -6110 -15671 21115 13419 -12926 9359 11460 -14560 6493 22036 -11389 -6630 20291
1234 20291 -4691 -12530 21055 6352 -20477 7326 12970 -13139 5220 14609 -20282 -7255
1246 -7255 26162 -4243 -20032 11866 2711 -16471 10930 6642 -23928 1882 17220 -19834
1258 -19834 -11535 19233 -8235 -20001 11142 -708 -18375 10635 4135 -26654 2279 20397
1270 20397 -17233 -12875 15903 -6279 -12162 16204 -2652 -19632 15595 11059 -22691 2999
1282 2999 21661 -11888 -7472 16650 -6012 -6939 21152 -2200 -21003 16203 15846 -17249 2629
1295 2629 15617 -13062 -1495 19520 -8291 -11034 19191 -1853 -18483 16281 13365 -19704
1307 -19704 -1528 12114 -9670 3426 15181 -19731 -15994 23723 5059 -21007 2080 1954
1319 1954 -14394 9086 9742 -22768 -7278 15817 -10414 -11865 15026 -4191 -21036 6300 6114
1332 6114 -10544 6344 2734 -24308 866 27025 -4730 -19014 3681 824 127 17860 -3055
1345 -3055 -23677 7627 19961 -6945 -2550 8875 -9738 -4298 18145 2682 -8367 6404
1357 6404 -2683 -10481 17878 17027 -17013 -11777 10835 6999 7662 6508 -16847 -10880 23182 14123
1371 14123 -12393 -3943 2760 -2802 9305 10859 -9642 -5878 7534 -2781 -140 15450 -1472
1384 -1472 -19498 -373 13072 5890 1646 -9737 -17406 8225 24123 -2951 -19254 -4444 4679
1397 4679 7317 8807 -7267 -15613 3587 10451 -694 682 1074 -10405 -4786 10790 6687 -2130
1411 -2130 -5622 -11561 -705 18660 6859 -17063 -12583 4011 9531 7400 -5289 -17676 -3941
1424 -3941 12253 3490 -5734 -4504 -8066 -5419 7338 4472 -6501 -6648 -7758 -5383 9944 9070
1438 9070 -14017 -16140 803 7171 6667 -1237 -17575 -10990 13474 10945 -8155 -8113 -4022 -2826
1452 -2826 8722 7774 -10103 -7481 4185 -1035 1370 10414 -3985 -13886 3296 9258 1062 3382
1466 3382 -3566 -14532 5209 19361 -2626 -12322 724 -399 2487 13354 -3282 -17471 3574
1479 3574 10877 -3832 1469 4377 -13184 -4114 15316 910 -8944 2405 -5088 -7739 14515
1492 14515 7424 -18537 -5879 10018 -2306 1235 7424 -13686 -10292 16830 4471 -13144 3079
1505 3079 2102 -11069 7577 11329 -12846 -5551 10840 -5923 -4588 15165 -3700 -16948 9332
1518 9332 9633 -8742 3932 4976 -14768 2454 19730 -7459 -12295 10564 302 -7221 13267
1531 13267 2372 -17655 5949 13903 -10551 -1351 11959 -10665 -6796 17124 -953 -13978
1543 -13978 8819 2887 -12980 9225 9897 -18005 -2925 15423 -7737 -7622 12456 -6314 -13137
1556 -13137 13891 3722 -17108 5235 8749 -14967 840 14678 -11901 -8267 14735 -3583
1568 -3583 -11035 13874 1518 -16961 8859 11986 -13814 157 13199 -10324 -3653 17361 -5240
1581 -5240 -12863 14272 4340 -13197 8888 8374 -14655 3182 15351 -10678 -5527 14200 -5363
1594 -5363 -10215 14595 1252 -15969 8103 8944 -13527 1535 11155 -12301 -4576 14774 -5570
1607 -5570 -11379 12017 565 -13685 8507 6596 -14841 1966 11166 -11361 -3680 13372 -6739
1620 -6739 -10184 12550 815 -12163 7857 5586 -12894 3633 10755 -11003 -3713 12103 -5798
1633 -5798 -7410 11906 -828 -11386 8783 5881 -11195 3765 8897 -9751 -1048 12044 -5820
1646 -5820 -6462 10562 -797 -9081 8589 3390 -10729 4169 8170 -9270 -1130 9320 -6494
1659 -6494 -5249 9337 -2265 -8927 6924 1897 -9942 3522 6031 -8966 -666 7302 -6184
1672 -6184 -3932 8322 -2771 -7327 6577 1679 -7210 4159 4021 -7293 952 6725 -4990 -2325
1686 -2325 6817 -2753 -4621 6560 673 -6194 3727 2722 -5474 2336 5008 -5155 -1177 6173
1700 6173 -2437 -2655 4709 -1099 -4024 3913 1503 -4882 2095 2040 -4566 728 3638 -3885 -2466 3312
1716 3312 -2333 -2770 3266 -1503 -4648 2370 566 -4327 687 951 -4512 481 2491 -4043 -1722
1731 -1722 3094 -2267 -2147 4032 -1089 -3493 3426 1064 -2582 3242 2583 -3535 2001 4355 -2543
1746 -2543 454 5121 -1957 -1424 5676 -234 -2832 5049 1816 -3972 3772 3328 -4233 1418 5204
1761 5204 -3827 -1071 6207 -2281 -3493 5729 65 -5577 4485 2118 -6480 1731 4425 -6127
1775 -6127 -892 6069 -4808 -4641 5835 -1491 -6409 4468 62 -8402 2768 4604 -8104 -1622
1789 -1622 5803 -5987 -3520 7812 -3423 -7831 6504 1573 -7626 4363 4326 -9170 1237 9024
1803 9024 -5365 -3632 8250 -3010 -5250 10239 1732 -9452 5241 5953 -7337 3099 7968
1816 7968 -8943 -2799 11528 -2738 -6840 8077 -1187 -9157 8006 5597 -11850 523 7453
1829 7453 -8166 -1635 10168 -7513 -8947 9870 968 -9576 5700 2137 -12334 4153 10179
1842 10179 -9665 -4518 8616 -5486 -4395 11678 -2770 -12327 7633 6396 -9214 3514 7073
1855 7073 -10951 -562 13121 -4869 -6356 9509 -1681 -8155 11280 5513 -12262 2766 8932
1868 8932 -6331 1989 10760 -9019 -6319 14366 1806 -9580 6358 2257 -9603 7083 8662
1881 8662 -11602 -2585 9748 -6168 -4640 10511 -3995 -11836 7751 4040 -9486 4203 3864
1894 3864 -12957 864 12697 -7250 -8741 7921 -2112 -6099 9626 116 -12891 5481 8605
1907 8605 -9210 452 9053 -7814 -4395 11428 -1252 -6858 8141 137 -9281 8855 9057 -10623
1921 -10623 -1244 9685 -2915 -96 9277 -5342 -6629 12296 4056 -9181 4755 6463 -6871
1934 -6871 2748 8605 -6226 -1937 8713 -4327 -5654 10148 1244 -10029 3024 4633 -5932
1947 -5932 1849 3754 -9125 -1504 9694 -4818 -8345 5459 161 -6697 3800 1417 -7626 2447
1961 2447 4834 -7717 -1057 8771 -3234 -5916 5327 1536 -3388 5127 334 -6375 5082 7470
1975 7470 -5519 -1441 6677 -1211 -1526 5220 -733 -2895 6360 1057 -6093 4363 6630 -4011
1989 -4011 -1588 3963 -174 1985 4673 -4556 -3894 7286 3392 -5136 338 1856 -2063 1695 2271
2004 2271 -4254 -404 3854 -3284 -2762 5014 504 -5123 -476 720 38 3153 -1015 -7200 952
2019 952 7002 -567 -3569 -212 -229 1894 4374 -1635 -3781 3576 2333 -1859 2757 3299 -2242 -952
2035 -952 2688 1833 3536 2190 -5265 -2073 7726 5000 -3573 -2430 -670 2098 7136 997 -7045
2050 -7045 -283 6118 430 -700 1736 -2441 -1950 3706 355 -1507 2616 -1762 -6043 3818 6595
2065 6595 -3858 -4963 -455 -941 3799 5143 -6835 -7908 5497 4644 -3531 -578 -1626 -5045 3158
2080 3158 5272 -4490 -2800 3084 -3780 -1877 7993 569 -8086 455 3619 -102 4272 481 -10149
2095 -10149 173 11659 34 -6124 1372 -1070 -1457 7730 924 -8900 1422 5575 -4467 650
2109 650 5409 -6238 -5691 6528 856 -3680 3327 -2883 -8659 6182 8010 -8175 -4889 3703
2123 3703 -2370 781 6766 -6263 -8795 7264 4438 -6180 1997 1793 -7824 1956 9010 -5249
2137 -5249 -4597 5460 -3107 -3844 9248 766 -10543 2906 6326 -4457 2016 4236 -8631 -1660
2151 -1660 11515 -1519 -7527 5241 939 -5913 6657 4057 -9575 519 6987 -5414 -1184
2164 -1184 8114 -5506 -7386 7842 2239 -6751 3374 1140 -8845 4112 8322 -8669 -5051 7177
2178 7177 -2163 -3631 7234 -2673 -8680 6237 4994 -7761 1544 5364 -7117 -465 9242 -3702
2192 -3702 -6098 7136 -37 -5597 7132 2815 -9256 2763 8166 -4863 -883 6851 -4523
2205 -4523 -3327 9320 -10 -6597 5815 3447 -6664 3878 6459 -6544 -1069 7772 -3480
2218 -3480 -3150 7622 -1747 -6661 6352 3813 -7161 1707 4711 -5521 899 7172 -5623 -4205
2232 -4205 7330 -324 -4953 5027 1559 -6381 3631 5085 -6180 -242 6176 -3765 -2168 7276
2246 7276 -1390 -4870 5703 2428 -4705 3725 3964 -5243 1707 6574 -3395 -2098 6271 -1263 -3426
2261 -3426 5518 1298 -5003 3640 3299 -4363 1441 4910 -4197 -1926 5677 -1533 -3122 3526 -597
2276 -597 -4500 3567 1935 -5262 180 3952 -3593 -1148 3523 -3096 -3054 3827 -242 -3810 2762 1019
2292 1019 -4189 1377 2692 -3641 -790 3081 -1851 -1236 3528 -1002 -2561 2899 958 -2992 1375
2307 1375 1968 -2579 988 2390 -1942 -677 2591 -995 -1522 2731 -438 -2567 1471 577 -2778 764
2323 764 1364 -2603 -110 2157 -1867 -1007 1411 -2111 -1637 1776 -1178 -2838 678 21 -2730 39
2339 39 447 -3156 -685 945 -2762 -1003 1436 -2000 -2539 1430 -1270 -2748 961 -190 -2661 330
2355 330 1030 -2630 -220 1911 -2641 -1337 2521 -1181 -1910 2265 -314 -2619 2139 1038 -3185 712
2371 712 2366 -2337 -262 2672 -2632 -1870 3258 -742 -3529 2404 515 -4166 1392 1896 -4193 -679
2387 -679 2657 -3356 -1927 3487 -2284 -4092 3371 245 -4695 1487 1366 -4770 661 3619 -4103
2402 -4103 -2062 4240 -2633 -3882 4147 228 -4270 3094 2238 -4492 1759 4378 -4473 -1212 5685
2417 5685 -1644 -2802 4928 114 -4140 4741 2687 -5519 1716 4750 -4551 -425 5604 -3246 -3325
2432 -3325 5615 -947 -5737 3819 1582 -6901 1241 3629 -6298 -1919 4350 -4895 -4356 4481 -2246
2447 -2246 -6998 3182 84 -7998 857 3054 -6979 -2062 4079 -5229 -4111 5420 -2679 -6600
2461 -6600 4044 1461 -7027 1572 3233 -6512 -384 5772 -4489 -3434 5903 -1572 -5328 5629
2475 5629 1860 -6162 3347 4264 -5421 1150 6452 -4302 -2732 7029 -438 -4604 5248 1060 -5680
2490 -5680 4128 4659 -5998 -145 5619 -3879 -1766 6435 -2795 -6124 4862 1148 -6426 2263 2227
2505 2227 -7189 -136 5061 -5452 -4202 4207 -3380 -5073 4805 -758 -7886 1750 2801 -5846 110
2520 110 3348 -6070 -2581 6336 -2008 -4970 3845 -137 -4847 4547 3194 -6308 333 5029 -3043
2535 -3043 -526 5728 -2578 -3629 6128 2106 -4155 3237 2183 -4502 2846 5945 -3895 -1698 4968
2550 4968 -726 -1324 5251 -286 -4810 3899 3495 -3873 917 3029 -4282 -341 5437 -1772 -3049
2565 -3049 3505 -704 -3044 4557 1803 -5534 586 3658 -2009 234 2352 -3790 -2007 5342 46
2580 46 -3813 1750 1133 -2198 3032 2715 -3402 375 3873 -1685 -111 4162 -1102 -2526 3024 2284
2596 2284 -1255 1728 884 -2747 2497 3987 -2317 -1751 2241 13 -266 2580 -853 -2388 2436 1456
2612 1456 -2382 1058 1754 -2317 -620 2195 -774 -913 880 -1941 -1264 2950 315 -2995 -103 1047
2628 1047 -650 814 250 -2402 33 2261 -1296 -1408 1548 -290 -1405 1076 -3 -889 1569 173
2644 173 -2239 1662 2645 -1052 -877 1473 -86 1061 2572 -1166 -1205 3216 1288 -1814 1385 1262
2660 1262 -1097 1162 1488 -1736 496 2323 -1887 -1661 2920 -78 -2222 610 -378 -2409 1695 424
2676 424 -4122 -273 2528 -2633 -2031 1612 -1431 -2207 1564 -1093 -3130 2109 602 -4414 164 3146
2692 3146 -2312 -1763 1563 -1913 -802 3911 -1634 -4672 2940 2464 -3238 294 2113 -2992 240
2707 240 3669 -2860 -1836 4333 -1424 -3993 3578 2220 -3654 757 2105 -2812 1954 4364 -4097
2722 -4097 -2569 5911 189 -3825 2492 198 -4130 2849 2306 -4981 -22 4090 -3942 -2338 4911
2737 4911 -1631 -4834 3090 379 -3915 2842 1238 -6669 605 5809 -3543 -3020 3590 -1834 -2463
2752 -2463 4675 -833 -5465 3484 3085 -4718 957 4469 -4142 -1381 5336 -1204 -2848 4483 -934
2767 -934 -4760 5432 3965 -5522 -131 4290 -2670 261 5051 -4092 -3569 6447 1251 -4591 3167
2782 3167 2400 -4760 2241 4981 -4106 -1011 4798 -2767 -2574 5948 -711 -5981 2971 2471 -4237 1727
2798 1727 2940 -5569 -538 5977 -3023 -4123 3861 -542 -4266 3986 1431 -5640 1326 3644 -4234
2813 -4234 36 5010 -3395 -3235 5463 276 -3857 3470 902 -4433 3671 4357 -4963 -1002 4925
2828 4925 -1523 -1490 4609 -1171 -3657 4630 2053 -4468 2098 3098 -3865 651 4740 -2495 -1700 4253
2844 4253 -1129 -2628 4860 875 -4686 2290 3219 -3280 380 3668 -2518 -1028 4708 -1025 -3162
2859 -3162 3731 978 -3548 2473 2030 -4017 659 3245 -2545 -924 3634 -1921 -3113 3222 457
2874 457 -3659 1498 1114 -3063 930 2282 -3277 -810 3278 -1567 -2506 2244 -320 -2606 1957 475
2890 475 -3383 632 1544 -2883 -1070 2029 -2127 -2105 1952 -1051 -2263 1695 -508 -3107 1086 1246
2906 1246 -2948 -810 1423 -1986 -919 1644 -1520 -1969 1706 -179 -2674 1058 363 -2167 510
2921 510 1162 -1967 -236 1306 -1284 -963 1728 -1014 -1778 937 -79 -2013 607 1 -2128 101
2937 101 1224 -1862 -835 958 -1056 -1041 1485 -992 -1909 1075 148 -1986 997 492 -1945 -56
2953 -56 1124 -1685 -673 1066 -1226 -880 1496 -734 -2123 1308 236 -2136 287 597 -2436 -241
2969 -241 1832 -1834 -967 1861 -1297 -1481 1824 70 -2006 1356 723 -2162 1009 1661 -2057 -508
2985 -508 2266 -1244 -1068 2460 -530 -1751 2102 470 -2799 1229 1826 -2533 394 2322 -2337 -1252
3001 -1252 3043 -1280 -2229 2312 170 -2908 1937 1535 -3006 117 2799 -2244 -1036 3074 -1720
3016 -1720 -2160 2819 -118 -3219 2023 1516 -3146 696 2529 -3009 -1049 3338 -2081 -2710 2739 -1039
3032 -1039 -3776 1977 767 -4368 288 2271 -3864 -1225 2977 -2771 -3056 2930 -1292 -3994 2277
3047 2277 290 -4961 737 2088 -4594 -1569 2959 -3246 -3031 2982 -1768 -4642 1988 125 -5061
3062 -5061 880 1664 -5342 -1290 2834 -3553 -3012 2691 -1896 -4137 2995 72 -4818 1027 2283
3077 2283 -4468 -906 3253 -3374 -2112 3672 -1678 -3465 3294 813 -4427 1937 2753 -3842 182
3092 182 3513 -3075 -1314 4419 -1187 -3382 3531 536 -3862 2265 2359 -3754 483 3735 -3307 -1100
3108 -1100 4248 -1411 -3115 3772 452 -3754 2344 2211 -3886 883 3369 -3153 -1069 4062 -1819
3123 -1819 -2724 3738 300 -3486 2984 1989 -3482 763 3265 -2979 -1127 3876 -1394 -2323 3324 369
3139 369 -2948 2905 1912 -3547 973 3218 -2609 -310 3655 -1545 -1730 3734 143 -2721 2621 1579
3155 1579 -2833 1591 3154 -2360 -349 3378 -1414 -1197 3218 -171 -2541 2538 1260 -2497 1337
3170 1337 2082 -2667 326 3061 -1649 -1436 2741 -384 -1874 2302 601 -2754 1424 2149 -2049 529
3186 529 2212 -1804 -929 2716 -541 -1902 1958 43 -2063 1922 1694 -2534 -74 2114 -1097 177
3202 177 1915 -1544 -1608 2316 456 -1678 1426 257 -1734 880 1908 -1590 -258 1528 -1140 -607
3218 -607 2188 -564 -2037 1226 838 -987 1218 596 -2130 347 1804 -1057 -1073 671 -933 -869 1713
3235 1713 -331 -1925 483 201 -1710 927 754 -1990 -214 1263 -581 -329 1045 -1478 -974 2233
3251 2233 638 -1648 566 603 -894 1177 1002 -1622 128 1737 -418 -534 1559 -537 -887 1740
3267 1740 533 -1132 1228 460 -1616 1158 2369 -1208 -769 1607 -640 -228 1914 -740 -2258 2083
3283 2083 1221 -1701 118 636 -1651 604 2179 -1586 -1159 1950 -1029 -1754 1917 -1 -2542 958
3299 958 1100 -1998 542 1226 -2784 -1001 2699 -726 -2199 1203 -237 -1825 1730 593 -2863 688
3315 688 2151 -2061 -486 2482 -993 -1531 2626 208 -1832 2264 745 -2919 1568 2515 -2191 -416
3331 -416 2592 -1346 -853 2590 -674 -2409 2823 997 -2783 1045 2158 -2524 2 2591 -1856
3346 -1856 -844 3108 -1285 -2392 2826 823 -3130 980 1531 -2772 414 2418 -2872 -1297 3535
3361 3535 -1419 -2677 2509 531 -2913 1401 1164 -2972 516 2824 -3084 -1471 3279 -1004 -2487
3376 -2487 2382 276 -2398 2154 1398 -3189 889 3434 -2376 -964 3400 -709 -1652 2750 138
3391 138 -2462 2490 1370 -3351 1282 3368 -2230 -1059 2662 -1154 -1405 3115 -360 -3120 2326
3406 2326 1704 -3403 792 2654 -2496 -286 2558 -1731 -1519 2945 -834 -3071 2292 1535 -3327 544
3422 544 2028 -2489 105 2805 -2444 -1666 3294 -358 -3002 1705 997 -2781 1256 1507 -2915 -13
3438 -13 2623 -1839 -989 3142 -498 -2364 2071 885 -2181 1381 1537 -2528 394 3020 -1666 -1232
3454 -1232 2740 -407 -1577 2595 656 -2238 1444 1466 -2138 552 2187 -1693 -1008 2411 -639 -1518
3470 -1518 1812 -468 -2351 1416 1168 -2740 -200 1722 -1692 -411 1817 -1205 -1391 1950 -124
3485 -124 -2168 1399 878 -2252 551 1416 -1880 -30 1312 -1223 -1126 1653 -441 -1971 1084 573
3501 573 -1758 536 915 -1672 136 1597 -1403 -885 1644 -703 -1286 1107 8 -1851 875 223
3517 223 -1698 348 1409 -1554 -813 599 -521 -1237 591 -385 -1450 822 109 -1701 313 797
3533 797 -1332 -356 869 -1177 -536 848 -787 -1006 919 131 -1461 676 241 -996 357 633 -1209
3550 -1209 138 1236 -606 -206 1495 27 -657 1162 254 -805 1102 573 -1177 551 1209 -1065
3566 -1065 25 1227 -528 -557 1343 -559 -1099 1487 438 -798 572 956 -1096 189 1236 -1125
3582 -1125 -635 1358 -940 -1189 1428 -85 -1391 807 227 -1551 546 641 -1954 -728 1019 -1194
3598 -1194 -1363 1286 -539 -1631 1114 100 -2173 415 838 -2050 -94 1584 -1237 -1247 1516 -591
3614 -591 -1309 1385 -7 -1707 916 1230 -1875 -285 1554 -1670 -678 1525 -1017 -1708 1757 -108
3630 -108 -2287 844 591 -2584 195 1546 -1979 -1038 1420 -1716 -1534 1961 -400 -2503 1037 517
3646 517 -2648 -92 1306 -2406 -1001 1987 -1694 -2236 1180 -968 -2849 993 298 -3130 279 1306
3662 1306 -2506 -814 2116 -2192 -1723 1886 -665 -2693 1304 481 -2544 1056 1221 -2505 -130 2029
3678 2029 -1758 -970 2361 -461 -1918 2050 511 -2480 942 1414 -2281 -55 2560 -1309 -919 2555
3694 2555 -768 -1870 2064 342 -2456 1602 1379 -2151 290 1849 -1449 -723 2728 -731 -1782
3709 -1782 2271 681 -2197 1592 1522 -2352 631 2165 -1539 -335 2366 -590 -1256 2294 638 -2055
3725 -2055 1575 1721 -1999 758 2113 -1741 -164 2216 -808 -1573 2355 521 -2074 1663 1274 -1831
3741 -1831 755 1684 -1419 -291 2404 -848 -1376 2383 131 -1798 1423 986 -1605 750 1657 -1842
3757 -1842 -319 2229 -932 -1148 1869 88 -1241 1424 453 -1803 798 1444 -1683 -771 1788 -813
3773 -813 -874 1819 -159 -1743 1567 691 -1983 422 1525 -1664 106 1379 -904 -942 1547 -320
3789 -320 -1006 1026 288 -1462 1032 1111 -1301 -56 1185 -1102 -308 1551 -631 -1273 1235 -27 -1196
3806 -1196 763 144 -1468 248 726 -1255 -551 782 -784 -1148 661 -129 -859 816 150 -1174 595
3823 595 873 -1107 -1 701 -605 -341 1085 -32 -526 1135 102 -1080 897 445 -929 124
3839 124 749 -579 59 757 -433 -98 996 403 -336 607 615 -612 479 504 -849 451 1014 -722
3857 -722 -274 1036 -436 -549 736 -44 -606 525 191 -788 543 733 -927 -170 748 -571 -206 929
3875 929 -692 -427 1190 83 -846 555 249 -657 439 749 -1142 99 1184 -431 -343 1201 -107
3892 -107 -1116 992 142 -762 903 685 -1154 240 1406 -515 -527 888 -321 -860 1432 -150 -1265
3909 -1265 1182 745 -1152 346 955 -1083 -308 1573 -1070 -934 1398 -109 -1077 1178 776 -1497
3925 -1497 377 1205 -1014 -18 1162 -1188 -994 1701 -199 -1491 989 155 -1830 606 1125 -1490
3941 -1490 -214 1683 -1275 -615 1718 -801 -1643 1381 638 -1519 1040 759 -1930 436 1942 -909
3957 -909 -916 1519 -554 -1017 1682 -40 -1987 993 1305 -1958 -2 1663 -1478 -600 1963 -607 -1280
3974 -1280 1609 -394 -1905 1194 981 -1851 97 1292 -1437 -366 1923 -1261 -1269 1984 217 -2102
3990 -2102 1319 999 -1971 570 1372 -1903 -661 1752 -1229 -1109 2153 -238 -2164 1091 959 -1938
4006 -1938 440 1178 -1762 -172 2242 -1118 -1175 1856 86 -1284 1505 902 -1636 884 1554 -1835
4022 -1835 60 1991 -1094 -1155 1626 -15 -1340 1306 473 -2076 733 1104 -1921 -328 1871 -1203
4038 -1203 -1127 1675 -534 -1501 1572 417 -2442 852 1225 -1699 -214 1529 -1199 -645 1569 -749
4054 -749 -1298 1578 460 -1458 783 864 -1309 237 1336 -1307 -767 1543 -750 -1617 1319 373 -1559
4071 -1559 458 742 -1254 130 1148 -1189 -331 1604 -276 -1224 855 119 -1313 1006 592 -1447
4087 -1447 706 1179 -1262 -290 1658 -823 -1160 868 -236 -766 1019 255 -1570 375 954 -1115
4103 -1115 -105 869 -614 -209 1002 -617 -896 892 4 -1291 718 613 -784 85 902 -600 -84
4120 -84 1397 -540 -905 1057 -39 -1009 74 129 -446 364 1024 -588 -88 741 -689 -305 826 44
4138 44 -735 549 4 -547 133 426 -702 254 869 -816 -515 761 -526 -459 1004 -61 -1165 522
4156 522 699 -781 113 329 -674 65 420 -600 -536 529 -326 -849 696 475 -699 599 201 -727
4174 -727 324 720 -833 -141 1112 -339 -486 838 -251 -246 811 228 -640 653 408 -978 -14 1017
4192 1017 -547 -425 944 -284 -555 877 212 -979 924 174 -997 -17 698 -1192 -136 907
4208 907 -992 -785 1205 -515 -1342 1052 234 -1188 482 572 -977 90 1118 -868 -838 1156 -192
4225 -192 -1179 827 127 -1042 459 315 -1649 -87 1126 -956 -471 1184 -439 -1036 1116 -70
4241 -70 -1279 868 565 -1557 24 1117 -1067 -543 1123 -599 -911 1506 144 -1607 1107 643
4257 643 -1598 260 888 -1444 -292 1200 -803 -1289 1442 -269 -1646 1028 459 -1784 94 960
4273 960 -1066 21 1195 -899 -1185 1625 324 -1302 911 463 -1988 1012 1288 -1506 -129 1377
4289 1377 -792 -721 1944 -215 -1479 1551 647 -1406 806 1207 -1328 382 1855 -832 -628 1696
4305 1696 -209 -1018 1295 412 -1435 1013 1440 -1152 293 1483 -1305 -361 1899 -341 -1578 1354
4321 1354 559 -1728 999 964 -1455 360 1588 -1256 -439 1734 -400 -1103 1324 362 -1524 714
4337 714 902 -1760 244 1471 -1113 -569 1855 -730 -897 1422 -145 -1515 1379 617 -1285 235
4353 235 1527 -1094 -637 1452 -810 -710 1625 173 -1280 876 649 -1323 602 1191 -1447 -85
4369 -85 1325 -1083 -634 1248 -137 -1617 940 647 -1371 224 795 -1304 -407 787 -856 -689 984
4386 984 -221 -898 1017 288 -997 324 571 -1221 408 1111 -836 -943 1058 -428 -606 770 188
4403 188 -1009 614 1021 -710 72 1077 -836 -373 1106 -439 -638 1267 -79 -511 677 133 -828
4420 -828 220 470 -840 -257 686 -566 -350 1102 -341 -912 570 375 -847 403 506 -833 -140
4437 -140 883 -669 -528 954 -226 -467 1158 58 -989 779 290 -486 232 524 -584 0 975
4454 975 -185 -411 967 190 -809 845 166 -680 551 723 -547 239 441 -580 72 1057 -138 -377
4472 -377 447 178 -417 708 627 -924 462 457 -735 52 752 -125 -417 821 -22 -245 580 82 -839
4491 -839 697 617 -1043 -108 598 -1053 -254 678 -682 -764 1097 -96 -794 682 232 -1115 246 836
4509 836 -650 -176 955 -434 -433 932 -330 -668 1115 361 -646 579 309 -941 541 737 -712
4526 -712 -153 1328 54 -986 854 8 -1087 733 753 -976 544 895 -759 -247 1199 -820 -887
4543 -887 1083 -162 -1322 577 334 -995 390 1256 -1152 -145 1158 -791 -587 1304 -433 -916
4559 -916 947 221 -1618 426 980 -1449 -82 1126 -691 -731 1238 -267 -1053 1273 492 -1296 453
4576 453 935 -780 222 1477 -1253 -760 1459 -354 -1238 1039 790 -1304 765 773 -1420 -69 1303
4593 1303 -774 -362 1758 -533 -1205 1038 186 -1137 723 703 -1456 487 1336 -1131 -293 1315 -363
4610 -363 -728 1177 231 -1477 1012 713 -1478 55 1124 -1178 -461 1415 -895 -902 1185 -46 -1267
4627 -1267 960 634 -1348 118 1141 -915 -26 1206 -772 -644 1513 293 -1201 1067 405 -1031
4643 -1031 541 1314 -762 152 1260 -778 -443 1436 -389 -1280 1072 231 -951 553 570 -1152 164
4660 164 1347 -803 -598 1118 -64 -1047 806 224 -1276 605 398 -1254 53 1205 -770 -660
4676 -660 615 -445 -496 913 2 -1159 692 703 -1230 61 909 -689 -594 1003 -456 -784 1148
4693 1148 2 -1221 455 642 -867 94 665 -501 -299 1008 -746 -427 966 -263 -621 580
4709 580 395 -871 346 746 -677 -202 756 -504 -542 626 -253 -975 610 -55 -650 395 328 -770
4727 -770 -121 609 -815 -178 414 -467 -320 405 -71 -453 528 413 -575 363 549 -513 -63 422 -318
4746 -318 -333 722 35 -479 693 354 -404 234 292 -851 -161 649 -8 -248 789 -444 -553 518 -94
4765 -94 -568 346 429 -745 116 454 -801 -156 812 -449 -251 416 -70 -349 652 258 -615 276 479
4784 479 -592 130 625 -237 -302 377 -181 -397 846 -29 -911 376 203 -605 171 326 -593 87 1072
4803 1072 -576 -512 778 -15 -556 1037 -4 -983 472 444 -689 96 977 -684 -336 722 -172 -781
4821 -781 1116 -83 -1108 538 524 -821 313 567 -596 27 992 -653 -777 1067 -243 -1008 451
4838 451 89 -1017 433 534 -761 152 672 -585 -351 844 -69 -976 732 338 -1013 428 349 -966
4856 -966 189 718 -596 -788 1123 -42 -705 816 113 -912 642 810 -948 411 1031 -807 -378
4873 -378 1368 -604 -814 1088 41 -1016 779 418 -906 238 622 -769 -396 883 -297 -815
4889 -815 944 344 -766 840 597 -853 -88 787 -914 -222 897 -686 -545 1087 -73 -1034 896
4906 896 659 -950 610 740 -1142 -41 980 -781 -668 1257 -23 -1006 565 494 -1220 176 788
4923 788 -886 -25 1043 -1005 -486 1280 -249 -656 907 277 -945 657 483 -1226 -313 795 -664
4940 -664 -427 849 -207 -805 713 -116 -891 552 513 -1003 -187 773 -827 -342 798 -503 -562 720
4958 720 -223 -863 866 531 -975 372 550 -823 -193 1416 -334 -569 809 -27 -908 523 666
4975 666 -1010 292 825 -922 -28 973 -428 -287 749 402 -965 320 322 -870 451 451 -640 -316
4993 -316 844 -401 -542 735 -390 -723 670 358 -759 378 303 -717 247 564 -319 -433 445 -345
5011 -345 -446 700 -141 -834 441 508 -861 134 541 -599 71 641 -214 -605 296 48 -702 653 183
5030 183 -346 173 235 -557 314 588 -201 -13 935 -23 -554 504 257 -345 434 396 -695 199 417 -357
5050 -357 223 435 -250 -16 311 198 -502 372 -18 -474 -180 92 -425 272 405 -329 -172 550 -214 -470
5070 -470 470 -137 -261 218 151 -272 -40 482 -176 6 347 -255 -288 773 -168 -580 412 261 -779 132
5090 132 548 -585 -146 359 -378 -62 370 -323 -318 326 120 -499 487 83 -503 -26 304 -532 210 268 -608
5111 -608 -168 667 64 -652 324 -268 -449 201 302 -418 19 586 -431 -559 349 -347 -356 606 348 -603
5131 -603 472 433 -684 32 601 -517 -433 671 -640 -419 767 -74 -442 586 483 -599 160 590
5149 590 -545 179 753 -338 -569 741 281 -920 470 545 -977 464 561 -842 309 884 -371
5166 -371 -621 806 -24 -855 825 329 -769 496 415 -1043 -66 653 -379 -629 1083 -490 -497 797
5184 797 336 -691 371 492 -567 -69 1081 -431 -575 1169 -489 -806 646 207 -990 483 616
5201 616 -877 -112 926 -598 -170 831 -427 -772 760 197 -941 646 530 -602 48 594 -728
5218 -728 -422 895 -548 -511 670 305 -673 263 273 -967 113 751 -895 -413 817 -359 -696 969
5236 969 -66 -853 277 204 -902 124 780 -576 -135 1112 -347 -532 668 -341 -837 1078 303
5253 303 -874 582 749 -747 -252 866 -511 -330 856 -220 -1077 706 210 -1012 321 589 -940
5270 -940 20 518 -499 -258 930 -26 -786 624 130 -930 22 228 -507 149 963 -700 -97 814
5288 814 -422 -583 253 24 -954 351 418 -742 187 728 -480 -131 815 -211 -451 390 270 -292 565
5307 565 439 -695 502 748 -383 -217 812 -126 -453 298 -31 -616 441 -71 -629 154 500 -221
5325 -221 156 663 -251 -272 412 -52 -322 471 431 -596 -20 313 -466 -172 557 -550 -238 669 -153 -347
5345 -347 435 61 -331 433 335 -518 76 341 -597 -85 407 -176 -420 383 80 -410 116 248 -873 426
5365 426 396 -523 142 234 -524 -7 869 -78 -454 162 170 -282 261 289 -183 186 510 -232 323 278 -562 -348
5387 -348 343 -125 -374 249 -96 -397 472 66 -290 156 230 -197 194 287 -699 -240 546 -75 -568 500
5407 500 349 -504 137 306 -402 131 429 -326 -42 559 -736 -99 589 -33 -144 91 445 -356 43 324
5427 324 -328 91 727 -195 -166 442 -51 -311 337 475 -416 157 597 -399 128 792 -305 -475 502 -340
5447 -340 -589 406 -96 -698 452 457 -394 -79 278 -553 -176 625 -116 -584 666 -136 -698 579 307 -684
5467 -684 -6 431 -517 -209 530 -68 -298 690 -62 -480 429 605 -613 134 724 -358 -252 629 -326
5486 -326 -600 288 -183 -625 335 285 -551 296 672 -440 -261 660 -301 -544 714 82 -528 330 290 -730
5506 -730 149 660 -399 -264 784 -330 -475 667 -363 -408 475 186 -606 204 635 -894 -14 637
5524 637 -404 -253 702 -117 -553 857 441 -951 520 525 -613 170 921 -431 -121 777 -193 -581 425
5543 425 471 -741 349 704 -654 64 819 -536 -161 918 -213 -738 509 78 -841 376 268 -920
5561 -920 79 549 -432 -608 734 -325 -381 625 -135 -825 605 190 -746 115 507 -387 -303 689 19
5580 19 -393 544 92 -564 250 263 -515 413 802 -200 65 642 -717 -200 827 20 -519 607 205
5599 205 -378 31 590 -204 10 579 -700 -411 868 -132 -403 247 82 -419 323 306 -724 53 553
5618 553 -58 -249 365 -260 -337 113 -9 -654 131 212 -365 139 134 -240 -282 243 -183 -184 359 -75 -270 119
5640 119 317 -361 -60 79 -139 -14 364 -139 -277 579 69 -423 272 231 -514 -88 179 -268 223 395
5660 395 -98 -166 369 11 -227 126 -299 -25 246 -169 -369 2 160 -463 166 167 -344 101 122 -261 -155
5681 -155 442 -64 -633 151 209 -23 292 294 -448 -130 -64 -61 -486 182 164 -448 -65 165 -239 196 133 -218 -56
5704 -56 246 -425 83 221 27 -315 285 108 -222 40 96 -451 52 418 -600 -224 689 12 -127 156
5724 156 -126 -4 289 163 -252 99 221 -463 86 512 -246 79 481 117 -447 428 153 -481 143 489
5744 489 -616 103 301 -75 -312 321 -169 -536 533 19 -477 189 343 -585 202 337 -280 -262 720 -195
5764 -195 -461 379 -146 -536 265 273 -789 48 340 -454 -61 491 -160 -174 766 -270 -702 305 252 -475
5784 -475 95 464 -286 -69 504 -213 -333 696 -282 -419 490 143 -850 187 645 -685 -187 499 -377
5803 -377 -373 480 -423 -670 480 140 -598 -10 356 -535 53 346 -328 -256 497 -289 -265 384 40 -275 28
5824 28 229 -801 -127 700 -507 -116 627 -263 -117 229 34 -820 443 131 -560 16 405 -248 -514
5843 -514 718 -97 -522 521 198 -544 201 364 -389 81 308 -240 8 548 -445 -524 560 194 -531
5862 -531 688 -236 -172 218 437 -667 -366 485 -323 -78 399 5 -728 235 24 -475 36 397 -436 -23
5882 -23 400 -333 -279 535 -336 -384 333 103 -705 331 254 -477 74 474 -183 -238 326 -121 -323 557 155
5903 155 -574 382 428 -483 109 481 -318 -21 373 -494 -424 500 -163 -197 294 239 -370 112 319 -140 -32
5924 -32 521 -196 -172 294 22 -284 360 271 -400 195 366 -242 83 434 -326 -114 280 -246 81 122 145 -156
5946 -156 513 282 -304 -40 400 -231 -114 162 -302 -78 299 -102 -398 344 -84 -251 215 -87 -420 -181
5966 -181 173 -340 25 161 -225 -236 503 264 -227 309 443 -236 7 269 80 404 576 -333 -189 170
5986 170 -359 -500 86 57 -154 151 379 -335 44 214 -524 145 441 -514 -298 78 251 -458 567 42
6006 42 -310 328 423 -441 -298 494 -354 -279 157 -146 -98 371 256 -260 -148 -60 -158 -302 78 -313 -297 28
6028 28 -215 -319 256 -16 -340 220 235 -621 146 411 -367 -69 222 -109 -298 213 3 -322 140 460 -450
6049 -450 -170 343 -271 -191 218 -297 -114 355 -286 -514 480 205 -642 167 320 101 -168 343 -280 -316 295
6070 295 -211 -402 545 189 -209 245 320 -376 181 431 -400 -218 445 -172 -193 88 259 -774 472 265
6090 265 -500 -4 450 -98 -152 429 -117 -787 691 4 -269 363 399 -350 297 423 -172 -24 664 -282
6110 -282 -464 480 -185 -551 218 41 -162 -165 474 -216 -236 384 -374 -129 694 142 -248 184 261 -457 164
6131 164 423 -638 11 258 -134 -394 538 140 -527 335 102 -431 124 256 -317 -297 417 -156 -120 489
6151 489 -318 -117 153 -200 -97 111 -58 -682 12 138 -274 17 119 -18 -453 468 34 -186 184 406
6171 406 -262 41 614 -227 -402 515 -287 -164 409 -54 -567 -236 -154 -531 120 366 -225 -156 211 -417 -417
6192 -417 567 -140 -158 164 4 -107 183 372 -323 -34 281 -162 -393 456 -111 -348 -62 288 -347 307
6212 307 138 -526 -304 248 57 -140 315 -207 -323 191 13 -807 216 451 -348 -97 224 -206 -342 382
6232 382 12 -349 84 -65 -281 224 45 -276 92 99 -385 -76 433 -53 -569 296 -31 -623 219 280 -298
6253 -298 27 40 31 -289 322 -259 -133 128 -94 46 19 5 -93 -34 317 -244 -79 271 -162 231 -26 -351
6275 -351 -379 230 259 -230 -57 269 -310 119 247 -134 56 183 -435 90 249 -21 -338 407 334 -34 -52
6296 -52 422 -259 -13 337 -347 -117 457 -105 -400 -20 272 -69 -4 26 -380 84 285 40 219 281 -122
6317 -122 -28 183 72 -126 163 274 -141 47 296 8 -30 224 -617 -103 591 -165 35 204 24 -188 412
6338 412 162 -271 124 386 -332 204 254 -210 -160 120 -134 -159 197 293 -422 263 51 -402 227 361 -118
6359 -118 -369 555 -233 -302 250 193 -192 155 85 -273 25 -100 -262 36 442 -402 -557 286 -108 -424 -6
6380 -6 73 -199 -282 723 -342 -5 167 -403 -307 239 -139 -137 -54 186 -51 -327 346 -411 115 426 -286 -189
6402 -189 324 85 -380 246 -40 -572 158 522 -317 143 589 -269 -203 147 -155 -459 479 66 -178 184
6422 184 369 -214 -9 52 -329 -7 591 -316 -248 124 88 -306 290 411 -147 39 302 98 23 255 -434
6443 -434 -244 280 -32 -306 267 363 -37 -18 365 -137 -28 650 -185 -277 339 305 -103 13 414 -160 239
6464 239 392 -455 -197 536 -54 -182 323 120 -46 -115 76 -148 216 416 -158 -63 210 -344 -126 481 26
6485 26 66 236 100 -74 -174 -298 -150 261 239 -491 -59 -77 17 71 123 283 -349 151 255 -280 -159 224
6507 224 -450 1 255 -10 -306 -164 309 -10 376 -93 -123 196 251 23 -309 102 153 -63 462 223 -304
6528 -304 303 289 -76 102 366 -184 -50 30 -381 59 159 197 -107 -108 231 -529 25 150 -291 -17 -19 -102 247
6551 247 113 -437 151 484 326 -34 197 10 -233 -92 -71 -229 158 165 264 14 165 -149 208 -6 278
6572 278 -438 -165 -170 208 229 377 190 -195 -23 95 192 164 287 -27 -45 61 -22 235 174 -263 -153 191 163
6595 163 -184 69 382 -150 168 154 -125 140 231 -223 -68 208 -138 185 5 18 -259 111 283 -98 73
6616 73 -143 -198 221 335 55 -123 69 -256 -193 244 204 135 -34 109 -569 -193 -44 -150 -140 393 -13 78
6638 78 -53 -237 30 232 46 -272 243 -77 -146 -172 41 -132 68 382 -49 -212 344 -117 -323 190 -62
6659 -62 -293 -118 181 -389 -204 -121 -55 -245 119 -123 -339 354 183 -438 191 -197 -87 74 144 -148 -181 318
6681 318 -153 -210 78 -99 -146 331 468 -224 198 184 -70 -209 469 -27 -274 -150 292 -354 -287 48 -624
6702 -624 51 -68 -207 -40 354 -150 -111 -94 189 -257 167 185 -57 154 235 -306 -65 472 -149 -132 -18 -46
6724 -46 -80 -94 -75 -309 -50 229 47 -233 342 147 -27 246 -124 -291 75 -190 -213 112 125 -178 -200 258
6746 258 -162 153 461 260 -265 159 462 -185 188 238 -7 77 103 -277 -332 220 69 -191 439 109 -395
6767 -395 37 87 -397 -50 1 122 -143 410 135 -170 -8 115 -67 118 476 23 -267 303 -121 -368 232
6788 232 4 55 72 216 -274 206 -114 -117 -40 210 -52 -335 250 27 -410 -58 102 -211 350 135 -141 329
6810 329 596 -247 143 187 -43 -146 34 -238 -156 -122 194 -368 31 88 19 -97 285 -128 209 -26 246 29
6832 29 181 -61 -71 -95 16 28 27 82 61 -119 143 15 -332 86 -64 171 152 335 -28 182 54 286 -231
6855 -231 30 -256 -402 227 -73 19 80 265 165 -180 194 -24 273 -48 -215 -135 125 -6 -151 48 58
6876 58 -194 100 -7 -110 158 -17 -403 -17 284 142 -69 -22 257 89 61 394 142 280 -75 202 52
6897 52 200 -19 -56 40 169 62 157 18 -187 38 293 -45 43 -76 -1 -94 360 344 -346 131 -148 6 0
6920 0 -72 -70 164 82 -51 39 50 114 -218 253 -168 0 -18 36 -152 -181 298 60 -235 212 -105 35 147 67
6944 67 14 136 127 77 121 63 -318 -178 88 110 270 54 132 -128 581 183 -87 107 -182 -180 144 238 -234 84
6968 84 80 158 -64 -49 13 -25 216 392 -337 47 83 8 23 -226 -261 -181 49 252 -113 38 -103 -349 -34 -137
6992 -137 -34 77 241 -73 -2 46 -278 -110 -171 -347 -266 210 405 -34 125 312 -191 -153 -17 -75 76 397
7014 397 240 -93 -177 -155 179 -265 296 65 272 232 -173 -50 240 66 -235 64 40 256 131 -149 -283
7035 -283 -118 243 -267 -117 72 77 -140 -12 -121 -306 331 -22 -160 -9 424 -135 -172 203 38 -130 -61
7056 -61 -1 -175 322 200 238 -16 153 -161 -129 4 -175 -117 -179 -175 396 206 -102 -458 -210 11 -155 -123 3
7079 3 226 72 -192 -123 -138 -135 250 -196 -77 57 -358 -105 -40 281 -121 392 -19 -87 0 166 22 48 170
7102 170 187 -123 74 71 97 311 84 -99 175 -144 -368 280 165 -99 79 169 15 161 -131 -27 -195 -15
7124 -15 36 -36 222 64 -44 -57 7 111 55 63 -91 -176 32 53 -46 200 160 -155 14 -19 -2 32 211 -232 -277
7149 -277 343 178 -166 205 -58 -127 128 120 -11 7 283 71 132 70 5 -216 182 163 -88 -13 4 193 -275
7172 -275 53 -113 -103 48 -274 -372 -123 109 -107 305 358 -85 -55 -193 -25 85 -36 -212 109 -123 -92 62
7194 62 52 91 -64 -2 34 145 188 109 -556 177 -196 -131 -48 -143 -150 267 8 -116 19 134 139 65 -165 -80 144
7219 144 -238 218 -280 -325 -134 78 -68 -21 31 33 -96 315 72 -185 46 48 -108 51 222 -81 69 58 -267
7242 -267 69 320 -113 -87 62 -64 -181 -52 231 74 50 -322 19 255 189 -126 -19 96 -57 -249 137
7263 137 161 -197 -70 238 -160 5 -17 -130 122 187 -25 -137 307 -203 -42 -79 256 41 55 349 0 -287
7285 -287 173 -172 2 309 -154 118 271 161 -210 101 193 204 -149 288 -369 -41 -150 170 -111 217 -75
7306 -75 -242 158 -137 -41 6 151 -84 96 218 7 -158 188 -76 -123 -107 -361 98 86 48 -38 108 182 31
7329 31 -122 276 98 -122 -162 195 -63 34 44 -165 272 72 308 110 250 61 26 -165 31 20 13 -193 125
7352 125 -21 -6 -1 -190 63 -255 -135 309 205 -11 10 20 68 39 331 88 176 37 -13 -241 -28 41 -170
7375 -170 8 55 -283 119 30 -16 -57 168 -205 205 292 -76 80 -116 183 72 218 -235 -224 -77 164 145
7397 145 107 -31 -73 -138 300 192 -426 -38 -71 -81 -155 198 29 -96 167 -66 -93 119 -239 -98 -231 65
7419 65 97 233 223 33 -80 93 -212 50 -35 116 32 -57 195 -160 -151 57 -86 51 -78 75 -6 113 357
7442 357 -162 291 41 -123 -202 340 -74 60 -195 -179 -51 -196 -7 -26 -104 173 -87 191 157 153 99 -213 101
7465 101 55 -66 -141 81 111 20 -220 20 170 -26 77 -153 -156 -245 30 49 -122 -155 -18 206 10 35 79 52
7489 52 -96 60 -19 -21 -276 -239 34 -15 31 -32 158 216 8 381 -216 -33 262 -10 -21 -129 -15 -19 1 81 224
7514 224 -69 -277 -173 -274 -10 60 65 -53 120 136 -72 127 -65 54 -32 140 185 -115 -273 118 134 -72
7536 -72 -46 191 436 169 92 -35 -345 -2 227 -107 68 7 157 -345 -85 109 -133 149 173 -26 101 180
7558 180 -173 209 118 74 -75 195 -213 -32 12 -79 -123 4 100 -109 -180 231 289 -70 72 2 80 183 -86
7581 -86 107 -129 122 228 -172 12 54 73 -94 44 -233 -68 -43 -53 29 -91 -125 -51 40 -109 121 198 222 142
7605 142 185 -291 165 220 63 -43 -74 136 -247 -106 60 -239 74 48 -15 223 50 206 -14 -26 200 74
7627 74 50 -49 -65 -47 142 -90 -7 282 47 7 -52 250 -15 40 75 -107 -204 9 -234 -90 -47 -17 -86 68 330
7652 330 -215 10 -20 13 -245 58 231 -261 -45 -160 -122 -78 -139 115 -40 173 -225 21 14 -178 -35 -53 173
7675 173 73 7 190 51 -179 -145 -300 -396 75 -269 -110 -25 104 95 -88 205 -124 -1 118 269 1 56
7697 56 -89 124 -55 199 -8 -45 223 -83 -159 -230 18 97 -9 -192 -134 -152 155 -160 -222 -103 28 -1 84
7720 84 2 -46 -293 -74 -173 511 197 -51 -143 101 -239 86 167 20 110 -51 44 -292 108 104 -255 114 146 -56
7744 -56 141 -52 -215 -374 198 -98 -145 12 272 -36 -234 105 44 135 390 -65 114 -12 -221 -345 -217
7765 -217 188 -86 106 -46 -376 -22 248 -298 -9 -30 -177 -48 27 11 250 -179 -100 -83 -317 -46 -181 -130
7787 -130 194 2 104 -56 8 -54 -239 127 -22 -146 19 -173 -42 139 58 -200 23 119 -178 -275 157 -201
7809 -201 79 -191 -52 123 -6 -202 100 -155 98 169 -5 -3 -21 104 -83 -416 316 276 -115 19 156 111
7831 111 -215 36 -345 19 88 -183 -10 -80 -62 -28 2 -145 -134 59 -67 130 -153 25 67 175 -16 9 -365
7854 -365 -89 21 212 225 12 -187 61 -24 -458 -10 74 13 -4 49 -101 -81 169 397 -170 256 414 -158
7876 -158 -184 106 291 -234 9 68 74 35 444 -130 -1 242 -79 -290 294 -160 -215 -75 -281 -91 -121 236
7898 236 -339 73 376 -21 -29 -117 107 285 142 319 -20 -18 199 19 62 -27 150 -226 200 165 -270 173 250
7921 250 81 147 -287 148 -45 57 -138 -59 188 -141 -8 85 219 -109 95 244 -27 -131 39 -220 0
7942 0 168 52 -200 -248 25 -212 -53 -26 -202 222 82 -143 -286 -172 -154 -305 32 20 -118 283 48 -188
7964 -188 -5 69 17 -124 27 266 -189 12 186 -80 48 43 -85 244 -61 166 63 -145 13 -382 -12
7985 -12 -28 -447 186 -64 197 110 306 -92 -275 18 -2 299 199 -205 -316 38 213 -61 -15 176 -44 74
8007 74 120 -179 -334 24 91 -182 141 223 -20 -1 330 178 296 187 21 80 256 -30 123 -126 148 -59
8029 -59 -14 123 -33 -197 47 7 -12 638 -215 -283 -100 -19 -268 -154 -99 -115 -120 15 256 -104 28 -87 -288
8052 -288 -116 95 145 -70 31 -278 340 46 -59 141 246 -215 -23 123 -62 -169 -98 322 -17 269 -16
8073 -16 0 -2 70 -147 -291 -66 -233 92 -47 252 -305 -13 -141 38 -44 -169 -82 -110 147 -246 -242 -82 130
8096 130 75 -111 121 -167 -32 -185 -39 159 -218 45 62 -148 186 -108 187 -45 175 144 -279 269 188
8117 188 4 -92 -254 94 -107 174 38 -4 -47 237 -9 -160 51 -131 -161 -65 283 371 202 25 -25 -314
8139 -314 222 -216 -152 -252 -146 -145 -196 26 101 -35 514 39 88 -57 -51 -271 -48 52 40 -46 418 -130 -193 -122
8163 -122 -186 141 -245 -17 -61 63 -171 -5 320 1 -43 292 -305 -150 -237 163 -368 83 129 43 10 136
8185 136 -2 -184 -478 45 221 81
8191H1
$$ Imaginary data points
##PAGE= N=2
##DATA TABLE= (X++(I..I)), XYDATA
0 0 0 0 0 0 0 0 -8 8 -8 8 -16 16 -16 24 -30 33 -40 48 -57 67 -78 91 -105 121 -138 160 -179 202 -232 261
30 261 -292 328 -368 409 -457 509 -564 626 -693 769 -852 942 -1041 1153 -1279 1421 -1583
47 -1583 1766 -1979 2226 -2523 2883 -3329 3907 -4674 5754 -7388 10119 -15527 30236 -149548
61 -149548 -441590 -16257 148787 -15471 -83964 -149927 -205964 43968 132094 -106446 -120792
72 -120792 17915 -96070 -59385 163008 39432 -164990 -22211 43148 -20013 122504 106517
83 106517 -186697 -118009 179025 118053 -39604 -32367 -98698 -48994 179725 76616 -191374
94 -191374 -74726 64424 -60774 -19331 84510 -103356 -179846 6882 20953 -42526 10888
105 10888 -110525 -229640 13788 153303 -82587 -184586 -90876 -79325 17465 102295 -133567
116 -133567 -266187 -11970 90215 -67649 -80810 -69113 -142958 -34424 69781 -73670
126 -73670 -115250 -8761 -77530 -101265 73240 41220 -141860 -82702 21332 -11683 34881
137 34881 39207 -120463 -88737 108140 71241 -47722 -12738 -23467 -39301 88363 83784 -76307
149 -76307 -44528 57016 -1101 603 72505 -17070 -82945 23928 54866 4059 21476 -23206
161 -23206 -87570 31717 115270 -16571 -81124 -2238 16180 24207 55156 -24611 -77165 28291
173 28291 68546 -9466 -11484 9533 -24814 5129 46830 -6949 -20474 23967 -13733 -37369
185 -37369 36296 38203 -39533 -37659 285 5404 21817 234 -61981 -32564 37622 8777 -35306
198 -35306 -18513 -18249 -19530 10833 -3942 -38803 -14380 -1918 -27626 -12030 3145 -28959 -32548
211 -32548 -10986 -19613 -14147 -4497 -43248 -49227 1578 -4267 -45328 -35661 -25691 -29194 -6931 -20843
225 -20843 -60906 -28442 7870 -31821 -41419 -8692 -23345 -27245 3195 -20644 -38103 11021
237 11021 5753 -38071 -771 22647 -22448 -8141 26920 -10755 -8348 34865 -3367 -22629
249 -22629 37416 21378 -29841 15373 31467 -18808 10123 34366 -27894 -12103 50201 -2972
261 -2972 -34351 30194 10437 -34933 23769 25173 -43065 -1038 35270 -31049 -13749 42625
273 42625 -25855 -45264 38129 7554 -47922 16454 11837 -57272 6050 42513 -49694 -35702
285 -35702 35902 -24582 -38089 38081 -14899 -67072 24927 23612 -59446 -157 32600 -56074
297 -56074 -18835 57112 -27956 -48884 43919 112 -48220 42073 24661 -62361 15650 55925
309 55925 -41400 -8656 60841 -27344 -32579 67991 6872 -53546 44888 33243 -52651 25671
321 25671 55449 -49280 -8159 67414 -24548 -31612 65138 -1590 -55155 50671 32809 -58735
333 -58735 20498 50057 -51130 -4625 66740 -32894 -38305 62184 -2627 -53263 47472 22658
345 22658 -64870 22363 50209 -55854 -11334 59023 -35924 -35968 59367 -11033 -57552 46039
357 46039 19970 -64616 21122 44033 -57406 -5964 60108 -38781 -35507 61416 -7627 -52885
369 -52885 46911 19102 -59116 27769 45017 -54193 -1510 60009 -34594 -25873 63356 -10383
381 -10383 -49404 52317 22093 -55816 27724 42946 -51289 2060 57980 -35119 -26348 57400
393 57400 -11799 -44287 48459 12369 -57277 26656 36871 -53352 -2086 48286 -39387 -27566
405 -27566 50569 -16955 -47201 38568 6048 -54432 21303 26126 -53844 -2337 40548 -40124
417 -40124 -25171 43219 -19780 -42874 36284 3741 -50865 18753 23454 -45819 -33 34884
429 34884 -35592 -18302 41267 -15668 -33621 35297 5174 -37121 26303 24196 -36966 9403
441 9403 41138 -20528 -5607 42503 -7174 -15295 44918 13662 -24155 29213 28091 -18198 20994
454 20994 37223 -19322 848 44358 -633 -11023 32334 3325 -19456 29679 19690 -26489
466 -26489 5893 21848 -17145 470 23738 -18708 -18434 22491 -1757 -20437 12071 -1906
478 -1906 -28303 7384 14467 -23375 -10695 6466 -19371 -9055 15201 -16425 -28799 2677
490 2677 -2042 -16707 917 -9588 -30315 -2778 10468 -16260 -14603 -2274 -16115 -6441 13414
503 13414 -7515 -19224 1788 1484 -2740 13013 1888 -16899 5262 18290 3892 6024 6569
516 6569 -7396 8159 26497 4114 -5404 10422 4451 2767 19527 5794 -11522 7775 11073
529 11073 -4638 10262 12733 -14830 -5353 17427 1935 -1725 9509 -11767 -11078 25805 12320
542 12320 -21828 -1340 12076 -4390 9787 12475 -20420 -4566 27701 -2784 -14423 17719
554 17719 2973 -17232 15845 13086 -17774 8330 17570 -20984 199 33047 -9153 -19534
566 -19534 22828 7155 -12872 20561 6466 -22886 20498 27566 -25778 -2898 36404 -7046
578 -7046 -15651 24677 -238 -14700 27908 3353 -35997 17138 30497 -28918 -10980 25201
590 25201 -15746 -13079 25634 -14382 -26754 30123 3235 -42865 15340 32145 -29446 -12198
602 -12198 22534 -12829 2997 37618 -22517 -34456 47067 31182 -29307 8473 21931 -15671
614 -15671 24583 42955 -26267 -11714 49496 3959 -16730 42501 13208 -35643 22560 35856
626 35856 -16698 12334 24310 -38492 -3369 64456 -3102 -46458 14695 10496 -14324 31864
638 31864 4849 -61205 2196 46570 -25421 -25244 20831 -29885 -38585 31198 1094 -48633 -2627
651 -2627 -12550 -56136 11682 33667 -66413 -65940 9838 -9109 -21770 1731 -60308 -77352 28340
664 28340 29002 -66575 -47963 -6635 -36288 -6656 23849 -50156 -56974 18544 -6111 -37405 21853
677 21853 1569 -68734 -12561 40961 -7660 -13023 -1768 -49974 -12906 70740 6724 -71997
689 -71997 -12998 21801 -2433 22191 3643 -62143 -13496 51969 -4265 -27048 16314 -19209
701 -19209 -41136 32564 35031 -29204 -18431 -8561 -26850 33384 55346 -49201 -70822 25816
713 25816 41728 1425 -3357 -38255 -44981 42031 50638 -40823 -38569 12739 -9591 -4401 32681
726 32681 -10615 -43610 1939 5268 -8676 31919 7985 -65938 -22633 55514 23972 -19724
738 -19724 -21777 -33263 3860 64192 10511 -64089 -18564 29341 7926 9719 6104 -37926 -21153
751 -21153 30445 11615 -8690 5499 -24347 -36805 28951 44442 -19271 -37684 -13711 911
763 911 34711 32135 -40780 -51902 24020 43538 3182 -10916 -19267 -17072 26210 33575 -11396
776 -11396 -16262 4223 -6704 4535 34070 6650 -30498 -12013 11374 18052 24848 -6744 -42888
789 -42888 -7146 41799 22232 -13732 -21606 -15927 13725 37742 3574 -32265 -10824 13394
801 13394 11107 12241 1188 -21990 -10824 13279 11244 4532 -4870 -26503 -16368 21269 16864
814 16864 -17392 -27944 -19425 -1617 17922 -1862 -38819 -29624 1047 3057 -6126 -16594 -31887
827 -31887 -19528 5801 -3009 -18104 -12407 -17725 -21502 2348 8378 -15547 -19576 -11965 -9594 9657
841 9657 14232 -21425 -28512 7009 14031 63 -1147 -13115 -16360 16690 20500 -12787 -10061 8801
855 8801 -1646 3153 19449 -2549 -12770 12875 9548 -3414 16925 10481 -17890 4635 28552
868 28552 2688 -3365 11612 -4081 413 29252 5520 -20983 11360 19008 -8078 7318 14837
881 14837 -15526 -2191 24968 -3828 -12322 17993 -827 -18334 17220 13920 -20474 931
893 931 15002 -14529 1530 23141 -16136 -18403 24613 5334 -20190 11474 7487 -21344 10009
906 10009 19020 -21979 -5668 23501 -12161 -14250 22845 -2931 -23647 17081 9867 -24256 8146
919 8146 17873 -23211 -3136 27014 -13307 -16227 23924 -996 -19568 20725 7705 -26435 12323
932 12323 23140 -22261 -2933 25629 -13736 -11274 28250 -3150 -23512 21605 11009 -24105
944 -24105 11791 18820 -24621 -748 28021 -15073 -13868 25999 -5044 -21312 23563 7871
956 7871 -28045 11396 20162 -23489 -725 25342 -17648 -12810 27538 -5516 -22693 21555 6003
969 6003 -27459 13218 18602 -26224 -892 24620 -17890 -11938 26862 -7936 -23581 22560 7385
982 7385 -25959 12623 15854 -25063 2140 25437 -18361 -12153 26438 -5980 -19004 23124 4732
995 4732 -25408 15145 17976 -22993 2288 23668 -16487 -8043 26191 -7286 -18454 22737 4815
1008 4815 -23225 13078 14486 -22036 2394 20473 -18128 -9487 22859 -8557 -19213 17928
1020 17928 967 -22794 10537 9076 -24757 76 15843 -19733 -10918 17001 -11656 -18749
1032 -18749 14607 -2453 -23273 8272 6615 -23033 -312 13295 -18155 -8122 15779 -10494
1044 -10494 -14816 15395 -901 -18816 10486 8321 -16844 4634 13881 -13550 -2596 18137
1056 18137 -6051 -8214 16757 1044 -11650 14172 8683 -13094 7428 14316 -9026 429 15419
1069 15419 -5286 -4245 15597 70 -9445 11648 5447 -10961 6101 8657 -10233 693 10892
1082 10892 -8316 -6089 9898 -3378 -9097 6386 -919 -11448 3381 3290 -11287 -2137 3712
1095 3712 -9709 -4118 5678 -7346 -8733 4223 -2185 -7544 2992 -711 -8984 1901 4233 -5744
1109 -5744 -286 3777 -5110 -166 8156 -1299 -3200 5776 829 -1084 7653 2429 -5013 4287 6601
1124 6601 -877 4480 4567 -4552 2117 10117 143 -1221 5208 -1185 -317 10341 2654 -6309 3813
1139 3813 4962 -1780 6192 5381 -8299 -23 10675 -334 -2045 6159 -4249 -4587 11992 4069
1153 4069 -9093 2912 4519 -6044 6228 9868 -9858 -4675 11404 -153 -2004 10242 -3071
1166 -3071 -10384 12571 10978 -8316 2555 7744 -7069 5525 17047 -6680 -8335 13264 2743
1179 2743 -5772 12789 2658 -15552 6102 13356 -8916 -1025 8206 -13557 -5794 18683 -3131
1192 -3131 -18684 4851 1527 -12173 8604 4066 -23485 -3851 15509 -10087 -10539 9104 -10091
1205 -10091 -14607 14524 1980 -19146 4462 5431 -18444 3786 17060 -16256 -13152 14822 -2425
1218 -2425 -8715 14714 -4326 -20746 15014 16646 -17195 -956 14720 -10947 -576 22141
1230 22141 -6544 -12499 20327 4925 -13726 17634 13713 -18992 4163 21923 -7726 -1261
1242 -1261 17571 -10793 -9463 26298 2948 -23239 9061 11901 -15962 3733 11122 -20597 -5476
1255 -5476 18884 -14592 -18839 16788 -2952 -25749 5775 5536 -21050 958 6866 -25344 -6388
1268 -6388 19733 -15770 -22709 12670 -2008 -20136 7808 1029 -23441 5469 12612 -23963 -7353
1281 -7353 20618 -10845 -17927 13412 -872 -13967 13667 1872 -22987 9913 20008 -17180
1293 -17180 -5989 18671 -6862 -7228 19689 -1271 -14572 16945 7440 -17778 12343 19398 -17199
1306 -17199 -5728 19030 -2492 -3082 14703 -10765 -15191 24196 11880 -22568 -742 12557
1318 12557 -8889 4282 13694 -16753 -9544 20466 -1459 -14161 14015 3925 -19415 6050
1330 6050 15206 -8505 257 7048 -16023 -349 28007 -2746 -23894 5328 11072 -1620 9642
1343 9642 -1291 -22059 5763 23756 -7263 -11480 8104 -4241 -6711 15851 3960 -15000
1355 -15000 1474 3079 -8937 10818 13822 -19397 -15638 14660 9236 -2643 -989 -14229 -10612
1368 -10612 20356 12017 -19980 -11267 6157 -1418 2170 5989 -12356 -11613 6977 196 -5671 7201
1382 7201 -3647 -20874 -691 15760 1630 -8051 -9888 -11500 8412 21268 -6954 -23714 -1465
1395 -1465 12480 6028 2510 -8016 -13810 5395 14314 -1538 -4749 1063 -5830 -2251 12237 6258
1409 6258 -6640 -6228 -4515 2829 16293 3940 -19247 -10536 11196 11564 1320 -8339 -14505 -680
1423 -680 15282 3763 -10591 -6115 -2929 -1445 7139 3725 -9329 -7591 -2197 -577 8388 6088
1437 6088 -14545 -15153 6986 11845 1771 -5724 -14097 -6193 15510 11311 -12054 -10690 1427 2358
1451 2358 6957 5812 -9960 -8362 7360 3995 -884 6712 -2638 -12859 4946 13518 -331 -2918
1465 -2918 -1758 -8484 5957 18754 -3481 -16136 2304 7062 2102 8444 -1776 -15844 4482
1478 4482 16398 -2814 -4450 4836 -7264 -3386 16299 3555 -12670 1379 2732 -4944 11213
1491 11213 8838 -17502 -6988 16010 2222 -3867 5754 -7768 -9004 17146 8689 -15491 -671
1504 -671 8504 -6930 3656 12927 -10662 -9001 13132 223 -7723 11669 724 -16981 6782
1517 6782 14598 -9406 -3031 7690 -9997 -1270 18482 -5256 -17010 9875 6952 -9786 6528
1530 6528 4822 -16631 1415 16842 -9134 -8284 11461 -5840 -10610 14856 2317 -17498 4495
1543 4495 8617 -12170 2729 11857 -14845 -7204 17321 -3093 -12726 10494 358 -13919 10607
1556 10607 9170 -16528 947 13849 -10799 -3694 16217 -6143 -11706 14750 3367 -12888
1568 -12888 10025 6955 -15654 4880 15843 -12030 -5794 14887 -5319 -8454 15194 -618
1580 -618 -15993 10408 9086 -14718 2365 11675 -12907 -3092 15567 -7647 -11636 13273 -172
1593 -172 -13536 10086 5362 -16630 3472 12682 -12400 -3841 13093 -7705 -8561 14347 -852
1606 -852 -14226 9991 6251 -13136 4928 10856 -12075 -1902 13886 -6776 -7586 13481 -1068
1619 -1068 -12093 10371 6019 -12855 3874 9749 -11158 -758 12781 -7762 -7483 12766 -1216
1632 -1216 -10521 9300 3642 -12805 4985 8843 -11262 -1403 10473 -7663 -6116 11177 -3213
1645 -3213 -10873 8094 2354 -11258 4342 6037 -11453 -560 9559 -7926 -5634 8633 -3487
1658 -3487 -9069 7913 1430 -10102 4689 5098 -9266 694 8126 -6535 -3529 8785 -2567
1671 -2567 -5318 8142 896 -7718 5688 5351 -7008 2151 6733 -5492 -947 8153 -2520 -4149
1685 -4149 6926 146 -5449 5380 3483 -6178 2071 5414 -4536 141 6239 -3805 -2431 6133
1699 6133 -453 -4311 4182 736 -4620 3117 3162 -4984 479 3492 -3717 -710 4242 -2790 -3329 3650
1715 3650 -510 -3461 2950 214 -4655 1916 2544 -3713 -409 2486 -3081 -351 4042 -2339 -2203
1730 -2203 3799 -671 -2329 3909 785 -3722 2374 2544 -3187 990 3023 -3738 221 4260 -2544
1745 -2544 -2372 3939 -1129 -3721 3556 328 -4750 2627 2460 -5140 797 4312 -4287 -1389 4921
1760 4921 -2802 -3203 5116 -661 -5172 4560 2018 -6016 2535 4279 -5409 -131 5787 -3807 -2254
1775 -2254 7029 -1992 -5731 5934 1795 -6703 3284 4002 -6996 1237 7022 -5871 -3263 7687
1789 7687 -2126 -4990 7302 358 -8362 5415 5286 -7718 1408 6710 -7001 -1849 9777 -3759
1803 -3759 -6958 7288 -405 -7278 6679 3485 -10956 1479 7934 -7162 -1801 7854 -6803
1816 -6803 -6634 10539 -213 -10282 5150 2794 -9096 4681 7709 -10551 -2623 10153 -4252
1829 -4252 -4408 9598 -2986 -9687 9456 5962 -9741 3020 6498 -9136 1701 12655 -6841
1842 -6841 -7784 10301 100 -6379 9439 1394 -12693 6183 10335 -8480 -856 9048 -7105
1855 -7105 -3546 13504 -2107 -10153 8087 2993 -9146 7496 7911 -12233 -1449 11718 -4843
1868 -4843 -3572 9400 -5875 -9181 12554 4702 -12290 2416 6020 -8792 3084 10016 -10152
1881 -10152 -6418 11739 -1953 -7683 9420 284 -11837 6864 8831 -9312 73 7605 -8806
1894 -8806 -1262 14205 -3855 -11110 8397 3898 -7148 6751 3287 -12458 2702 11548 -7554
1907 -7554 -4674 9511 -4405 -7434 10484 1757 -9914 4814 3698 -9583 4800 9658 -10637
1920 -10637 -5483 10740 -763 -5004 6785 -2828 -8843 9193 5733 -11424 174 7854 -6235
1933 -6235 -1639 8489 -4909 -5579 8090 -1026 -7770 7695 3467 -11223 1062 8148 -5291
1946 -5291 -1707 5321 -5789 -3055 10347 -1107 -9227 5574 4540 -6416 2358 4972 -5980
1959 -5980 592 7154 -4989 -2904 8755 -1106 -8052 4660 4025 -4724 2059 2006 -6466 2249 7590
1974 7590 -6074 -5137 6276 -207 -4747 3124 -62 -4763 3441 1898 -6755 1613 6626 -4677
1988 -4677 -4930 3925 493 -1391 2760 -3471 -4876 6261 4075 -6515 -1615 3760 -1351 567 2798
2003 2798 -3524 -1719 4152 -1315 -3187 4608 1538 -5414 -320 3355 -33 919 -677 -5403 1136
2018 1136 7809 -1343 -6079 -131 1660 829 2041 -2489 -5094 2029 2793 -2989 -99 1955 -3968
2033 -3968 -3025 2359 512 -366 -844 -5523 -3082 6304 2861 -6819 -4640 1334 1788 3227 -1097 -7919
2049 -7919 -1139 6718 535 -3852 417 -1254 -2154 3370 935 -3087 852 -562 -4759 3002 6811
2064 6811 -4403 -6288 1844 2314 1859 3158 -6168 -7245 6007 6826 -4930 -3205 778 -2707 1950
2079 1950 5642 -4494 -5082 3785 -750 -2914 5680 809 -9453 -546 6044 -1163 -14 -365 -8429
2094 -8429 -1441 10690 -929 -10304 -229 1559 -2265 3899 268 -10119 -541 7220 -3476 -2995
2108 -2995 4547 -4519 -6265 6698 3224 -5697 870 336 -6346 4900 8789 -7446 -7159 6800
2122 6800 1514 -1183 5397 -3476 -8128 7455 7483 -6751 -828 4985 -4906 404 9489 -3443 -6738
2137 -6738 5824 776 -4307 7318 2230 -10769 1101 9128 -3418 -2038 4785 -6028 -3348
2150 -3348 10546 -334 -10321 2986 3811 -6118 3201 4766 -9007 -2602 8327 -3379 -4734 6805
2164 6805 -2761 -8585 7130 4973 -8207 558 4143 -6576 1807 8991 -6777 -6924 8338 1653
2178 1653 -5481 5369 837 -8059 5127 8110 -7178 -1712 7812 -4026 -2645 9556 -1687
2191 -1687 -7407 6349 3286 -6121 4418 5148 -8333 237 9324 -3790 -4254 6457 -1525 -5294
2205 -5294 7251 1449 -8740 2914 5505 -6815 -330 6500 -6250 -4463 7182 -1666 -5898
2218 -5898 5134 -164 -8173 3947 5140 -8245 -1879 5570 -4516 -2289 6356 -4228 -6383 6560
2232 6560 1967 -7261 2341 3789 -6494 789 5801 -5306 -2693 6240 -1655 -3908 5932 332
2246 332 -6527 4072 4097 -5490 901 4811 -4286 -755 6368 -2674 -4503 5479 487 -5277 3278
2261 3278 2150 -5900 1017 4147 -4681 -1790 4504 -3416 -4162 4316 -706 -5481 1774 899 -5348
2276 -5348 648 2160 -5670 -2307 3457 -3530 -3615 2524 -2023 -4764 2715 38 -5249 459 1620
2291 1620 -4527 -779 2353 -3907 -2840 2789 -1766 -3446 2162 -668 -4167 1315 1636 -3997 -489
2306 -489 1766 -2665 -713 2176 -1735 -2164 2483 -515 -2719 1528 537 -3110 872 1459 -2589 85
2322 85 1800 -2260 -1082 2336 -1243 -2053 1424 -780 -2300 1495 33 -3018 341 545 -2764 -291
2338 -291 954 -2465 -1345 1063 -1814 -1884 1722 -1136 -2456 1347 356 -2467 571 937 -2611 421
2354 421 1923 -2308 -536 2697 -1128 -1448 2740 -64 -2035 2361 1116 -2453 1512 2446 -2538 -257
2370 -257 3199 -1776 -1067 3257 -1202 -2296 3316 739 -3710 1668 1908 -3637 560 2844 -3508 -1841
2386 -1841 3537 -2058 -3425 3139 -917 -4800 2562 1344 -5273 41 2502 -4519 -1366 3786 -3261
2401 -3261 -3806 3173 -1005 -5153 2641 1361 -5559 1483 3101 -4574 -732 4529 -3360 -3210 5287
2416 5287 -65 -4382 3571 1944 -4559 3007 4218 -4715 100 5765 -2690 -2520 5868 -628 -4211
2431 -4211 5184 1936 -5414 3032 4192 -5326 457 5914 -3607 -2719 5780 -1641 -4698 5215 972
2446 972 -6363 2938 3602 -6388 -246 5066 -5019 -3334 5153 -2454 -5538 4300 -131 -7175 2525
2461 2525 3429 -6795 -739 4655 -5372 -3042 5514 -3105 -5812 4698 656 -6525 3320 3581 -6433
2476 -6433 658 5988 -4269 -1923 6300 -2490 -4560 6801 1761 -5134 3941 3996 -4525 2613 6756
2491 6756 -4558 -1720 7080 -1279 -3301 6538 803 -5721 5129 4510 -5172 1194 5236 -3807 -323
2506 -323 7278 -2445 -4393 5518 819 -4536 4785 3035 -6527 1558 6075 -3466 -1068 5335 -3210
2521 -3210 -3035 6865 334 -5817 3040 2668 -4625 2714 4353 -5727 -1533 5957 -1660 -2803 4605
2536 4605 -984 -4659 4606 3162 -5261 1197 3356 -3768 775 5899 -3233 -4179 4866 697 -3064
2551 -3064 3581 771 -5241 2770 5160 -3869 -1077 3716 -2324 -1662 5404 -775 -4441 2945 1476
2566 1476 -3180 2856 2574 -5136 -688 4813 -1204 -1782 2565 -2106 -2356 5435 1124 -4385 1075 2384
2582 2384 -2201 1078 2713 -3428 -973 3581 -615 -1527 3066 -290 -3519 2491 2990 -2103 -331
2597 -331 943 -2354 1094 3753 -2187 -2956 2273 928 -1559 1532 -197 -2919 2037 2201 -2623 -360
2613 -360 2216 -2309 -1149 2237 -515 -1816 384 -637 -1760 2210 290 -3775 -669 1331 -966
2628 -966 -789 -261 -2685 -938 2074 -1524 -2484 850 -128 -2023 352 264 -1886 258 624 -1956 80
2645 80 2093 -1532 -2215 1261 169 -243 1118 -1239 -2040 2252 1340 -2719 -320 1433 -1354 -207
2661 -207 1212 -1944 -774 2101 -1539 -2079 2491 762 -2868 396 1017 -1420 1125 1497 -3556 -782
2677 -782 3762 -1123 -2446 2472 166 -2330 2271 311 -2953 1609 2192 -3857 -415 4037 -1551
2692 -1551 -3028 1988 -526 -2016 2882 -504 -4785 2259 3564 -3406 -1410 2660 -1946 -1168 3058
2707 3058 -1436 -2803 3560 87 -4509 2511 3350 -4239 -588 3121 -2126 -623 3574 -2979 -3228
2722 -3228 5007 1305 -4928 1247 2124 -3427 1560 3508 -4286 -1184 4580 -1904 -3392 4447 -69
2737 -69 -4895 2621 2918 -3578 1449 2808 -4974 129 6674 -1994 -4388 4204 900 -2945 3751 949
2753 949 -5473 2032 4910 -3875 -1114 4708 -2994 -3198 5020 72 -4421 3343 840 -5110 3324
2768 3324 4603 -5561 -2117 5295 -1696 -2302 3871 -2018 -4881 5087 2280 -5944 1131 3638 -4217
2783 -4217 57 4958 -3465 -3308 4500 -858 -3841 4488 937 -6363 1532 4633 -3687 -946 3361
2798 3361 -3564 -1585 6443 -1214 -5122 3906 2363 -4076 2677 3436 -4780 95 5303 -2690 -1969
2813 -1969 5011 -1443 -4216 5074 1820 -4900 1446 2394 -4368 924 4684 -4883 -3289 4876 -1016
2828 -1016 -3873 2876 -540 -5023 2593 2452 -5521 -603 3173 -4078 -2282 3956 -2078 -4043 3005
2843 3005 186 -4383 2280 1448 -5043 262 3844 -2819 -2190 2996 -2159 -2482 3759 -447 -4573 2471
2859 2471 2013 -4008 705 2711 -3056 -934 3631 -1790 -2253 3163 -605 -3655 2643 1751 -3554 491
2875 491 2335 -2611 -294 2949 -2653 -1980 3475 -356 -3530 1629 582 -3145 848 1251 -3654 -665
2891 -665 2304 -2829 -2230 1841 -1395 -3592 1124 -454 -3043 204 175 -3447 -304 1436 -2785 -1714
2907 -1714 1723 -1222 -1774 1503 -756 -2259 1205 461 -2489 367 1535 -2018 -330 1876 -1085
2922 -1085 -680 1583 -584 -836 1792 343 -1660 1556 1503 -1206 292 1260 -1031 331 2225 -1287
2938 -1287 -649 1837 -92 -783 1551 427 -1353 954 1270 -1657 418 1387 -1689 -217 1823 -1077
2954 -1077 -907 1210 -698 -1494 1359 315 -1969 819 1096 -1761 116 1381 -1573 -571 2303 -668
2970 -668 -1088 2057 56 -1727 1995 824 -1846 948 2032 -1729 404 2614 -1082 -1162 2593 -315
2986 -315 -2013 1904 664 -2385 1544 1691 -2839 134 2036 -2072 -1040 2466 -1598 -2062 2032 -394
3002 -394 -3342 1706 877 -3493 -40 1513 -3354 -1324 2407 -2099 -2436 2355 -777 -3519 2016 844
3018 844 -4146 333 2481 -3582 -915 2603 -2736 -2541 3213 -785 -3521 2117 794 -3749 1397
3033 1397 2595 -3497 -360 3690 -1790 -1423 4155 -563 -2888 3691 1516 -3262 1879 2803 -3178
3048 -3178 388 4165 -2601 -1548 4160 -736 -2999 3412 737 -3972 1803 2682 -3800 359 3752
3063 3752 -3128 -1594 4109 -1149 -3338 3259 458 -3760 2644 2251 -4444 748 4031 -2669 -1255
3078 -1255 4101 -1519 -2268 4194 829 -3552 3249 2820 -3497 1254 4295 -2113 -547 4805 -1057
3093 -1057 -1746 5026 846 -3345 3867 3311 -2903 1701 4454 -2407 -165 5333 -840 -1771 4734 920
3109 920 -2657 3618 2995 -3170 1706 3880 -2574 -100 4641 -1727 -2098 4517 600 -3148 2903 1770
3125 1770 -3042 1406 3194 -3137 -297 4195 -1840 -1802 3794 -155 -3232 2766 1490 -3354 1362
3140 1362 2629 -3109 191 3808 -1484 -1682 3359 -720 -2595 3179 1418 -3198 1621 2430 -2502
3155 -2502 -14 3488 -2261 -1528 3295 -296 -2011 2567 570 -3144 1624 2340 -2538 18 2674
3170 2674 -2669 -1046 2890 -943 -2489 1894 269 -2800 1682 1003 -2933 91 2170 -2284 -1039
3185 -1039 2146 -1746 -2143 2545 102 -2707 900 624 -2215 767 1606 -2455 -1034 2432 -623 -1226
3201 -1226 1691 -514 -1645 2150 890 -1954 736 1356 -1522 441 2062 -853 -1043 1750 -74
3216 -74 -590 1752 -5 -1722 1248 1658 -1396 449 931 -1566 35 1824 -1167 -1502 921 -135
3232 -135 -948 1201 -328 -2241 529 1162 -1695 204 1138 -1351 -532 1470 -196 -964 631 -789
3248 -789 -1481 1930 838 -2317 -286 1111 -801 439 918 -1988 -701 2120 -177 -1229 1128 183
3264 183 -1132 1364 1117 -1290 256 1080 -1554 725 1899 -700 -1395 1721 503 -694 1676 -216
3280 -216 -1924 1438 1889 -1617 -74 1377 -1066 -447 1778 -1288 -1516 1771 280 -1641 1552 909
3296 909 -2583 -28 1994 -1131 -284 1433 -1811 -1266 2562 -69 -2800 1285 1138 -1905 701 1417
3312 1417 -2633 -126 2698 -1074 -1370 2184 -454 -2064 1907 928 -2140 1271 1425 -2870 477 2631
3328 2631 -1778 -1350 2593 -231 -1512 2160 -236 -2652 1935 1546 -3106 353 2525 -1875 -817
3343 -817 2687 -787 -1658 2819 -270 -3032 2124 2010 -3082 14 2676 -1963 -616 2804 -1447 -1904
3359 -1904 3071 -221 -3356 1963 1678 -2949 395 2375 -2448 -495 3058 -1770 -2018 3569 215
3374 215 -3200 1792 1494 -2618 864 2129 -2763 -155 3428 -2076 -2364 2997 -196 -2784 1831 1003
3390 1003 -2946 1247 1983 -3219 -216 3392 -1821 -2136 2696 -382 -2331 1932 512 -3388 1390
3405 1390 2348 -2894 -473 2850 -1744 -1496 2649 -331 -2105 2387 623 -2737 1655 2624 -3027 -578
3421 -578 2672 -1704 -1001 2427 -1445 -2343 2837 724 -3035 1002 1996 -2762 268 2740 -2144 -1243
3437 -1243 2816 -1202 -2164 2407 490 -3072 1221 1400 -2470 394 1759 -2502 -748 2622 -1417
3452 -1417 -2685 1849 195 -2308 1187 960 -2686 -9 1546 -2410 -712 2400 -1731 -2295 2032
3467 2032 79 -2294 1056 471 -2645 1039 1749 -2379 -677 2057 -767 -1422 2139 -331 -1892 1699
3483 1699 665 -2210 772 1634 -1616 -244 1970 -1161 -1242 1704 -200 -1517 1974 230 -1978 652
3499 652 1047 -1242 -196 1002 -1155 -629 1800 -857 -1416 1355 85 -1735 751 565 -1549 304
3515 304 1131 -1532 -497 1175 -1211 -1114 1133 -100 -1062 792 408 -1359 853 716 -1464 -51 875
3532 875 -695 -263 1045 -168 -511 1231 147 -852 1594 665 -920 259 1019 -397 -22 1146 -773
3549 -773 -315 1348 -156 -672 960 579 -1014 938 747 -960 248 460 -1298 -70 1245 -463
3565 -463 -882 1188 -241 -755 990 302 -992 812 727 -1279 129 909 -832 -855 1240 -1066 -781
3582 -781 1219 -625 -1078 904 117 -1473 -56 588 -1233 -379 1053 -1361 -976 1226 -621 -1270 945
3599 945 133 -1904 843 754 -1901 109 1245 -1373 -784 1538 -970 -1299 1417 -28 -2038 417
3615 417 709 -1773 255 1064 -2038 -975 1366 -1352 -1462 1812 -437 -2173 1425 642 -1928 372
3631 372 1377 -2105 -399 1921 -1348 -1219 2300 -346 -1646 1865 634 -2113 803 1549 -1368 316
3647 316 1807 -1047 -1079 2908 37 -1578 2086 1094 -1987 1730 1878 -1756 487 2778 -1166 -661
3663 -661 2638 -282 -1659 2403 897 -2026 1384 1756 -1918 853 2632 -1473 -404 2718 -272
3678 -272 -1524 2244 528 -1871 1625 1480 -1822 533 2426 -1556 -666 2723 -737 -1732 2708 818
3694 818 -2117 1560 1236 -1802 914 2581 -1538 -82 3226 -383 -1141 2554 803 -1721 2054 1620
3710 1620 -1818 1362 2661 -1344 48 3049 -371 -1317 2545 420 -1649 1966 1471 -2283 973
3725 973 2184 -1476 -139 2513 -1070 -948 2522 40 -2023 1828 894 -2215 707 1637 -1897 -451
3741 -451 2036 -1229 -1188 2216 -305 -2020 1546 811 -2031 802 1154 -2207 -18 1761 -1407 -1295
3757 -1295 1823 -430 -1610 1429 307 -2297 648 1479 -1541 180 1757 -1401 -1130 2126 -550
3772 -550 -1742 1789 101 -1526 1220 943 -1748 152 1422 -1218 -744 1830 -663 -1031 1319 83
3788 83 -1447 958 681 -1557 285 1420 -1250 -541 1173 -570 -787 1221 -127 -1517 1183 290
3804 290 -1267 316 750 -945 -151 1158 -504 -736 1261 -213 -989 1011 923 -607 707 822 -898
3821 -898 552 1268 -286 -338 1408 -191 -415 1176 409 -482 1058 497 -809 350 1024 -507 100
3838 100 1012 -312 -236 1170 -190 -786 1315 471 -1129 178 716 -785 347 477 -590 185 968
3855 968 -339 -336 951 -417 -531 412 -36 -749 576 93 -728 316 767 -1148 -520 1109 -120 -210
3873 -210 781 -277 -532 898 530 -1016 204 738 -613 424 991 -626 -335 1115 -195 -591 1126
3890 1126 239 -1210 491 686 -713 224 676 -1080 -71 1032 -494 -1085 608 -105 -802 900 173
3907 173 -1632 485 999 -1282 -119 1026 -991 -504 1222 -66 -1361 1138 -72 -1403 771 1093
3923 1093 -1618 -173 1196 -954 -495 1209 -776 -1426 1543 484 -1594 606 837 -1407 47 1603
3939 1603 -1342 -397 1651 -490 -1060 1703 253 -1520 1141 1130 -1202 261 1540 -1271 -53 2123
3955 2123 -980 -1418 1772 409 -1570 1126 565 -1828 471 1527 -1594 -778 1541 -842 -1357 1808
3971 1808 -44 -1913 1204 597 -2001 655 1333 -1974 -493 2052 -747 -1196 1693 -507 -1994 1448
3987 1448 950 -2171 358 1167 -1582 -98 1515 -1057 -1001 1795 -274 -1792 1535 527 -1812 628
4003 628 1749 -1473 -72 1881 -1291 -620 2269 -95 -1825 1489 1011 -1887 917 1074 -1608 166
4019 166 1346 -1554 -1101 2070 -695 -1748 1261 172 -1996 834 894 -1939 134 1909 -1403 -1245
4035 -1245 1740 -242 -1725 1452 352 -1669 1266 1134 -1911 419 1718 -1138 -572 1737 -512
4050 -512 -876 1580 98 -1410 1152 1008 -1882 281 1582 -1466 -482 1732 -310 -1016 1616 113
4066 113 -1211 831 1002 -1719 -37 1533 -1193 -197 1633 -932 -986 1683 -223 -1693 776 719 -1446
4083 -1446 180 671 -1325 -224 1351 -1036 -849 1362 -257 -1443 619 303 -1256 333 588 -1211
4099 -1211 288 1277 -745 -706 1067 -162 -664 967 -86 -879 544 754 -1236 224 1093 -869 -451
4116 -451 1226 -519 -727 907 -266 -907 770 529 -1114 431 966 -782 -47 962 -531 -259 1040
4133 1040 -24 -760 853 106 -310 501 306 -732 287 664 -1156 -64 935 -471 -614 757 -205
4150 -205 -1063 536 191 -935 304 611 -869 -125 946 -498 -475 1003 -167 -500 593 -75 -669
4167 -669 990 563 -748 265 567 -345 261 987 -537 -425 904 -150 -740 575 -161 -750 661
4184 661 434 -1057 249 563 -902 -290 949 -640 -591 897 125 -576 472 215 -1047 241 704
4201 704 -945 -297 870 -767 -526 1128 -106 -790 847 376 -1106 534 783 -1213 -25 1272
4217 1272 -867 -248 1309 -553 -736 1338 217 -1315 492 431 -1184 308 1083 -1005 -265 1319
4233 1319 -561 -679 1137 -54 -1068 945 770 -1243 660 1306 -1440 -175 1495 -671 -893 1321
4249 1321 -27 -1290 1387 347 -1749 715 1278 -1253 17 1768 -747 -611 1995 -218 -1288
4264 -1288 1327 500 -1168 862 1416 -1339 196 1848 -420 -670 1599 27 -1114 1391 550 -1313
4280 -1313 1046 1243 -1107 601 1950 -844 -338 2015 -153 -743 1627 287 -1417 989 1736 -1384
4296 -1384 266 1477 -1130 -269 2090 -623 -1201 1465 375 -1687 1021 1008 -1600 283 1530 -935
4312 -935 -704 1375 -1067 -1269 1200 193 -1391 983 695 -1688 279 1473 -1401 -394 1601 -922
4328 -922 -1031 1392 -192 -1617 915 859 -1476 -20 1272 -1152 -521 1359 -911 -760 1280 -20
4344 -20 -1202 933 377 -1532 254 1055 -1412 -244 1274 -974 -1023 1193 -403 -1376 1204 295 -1451
4361 -1451 246 1079 -1803 -398 1038 -852 -1186 1031 -586 -1125 870 407 -1388 310 1107 -1376
4377 -1376 -281 1169 -680 -494 870 -439 -951 1359 513 -1235 609 917 -1074 -10 796 -808
4393 -808 -132 1320 -551 -863 1082 355 -970 768 843 -1153 513 969 -568 -224 1376 -393 -416
4410 -416 1074 49 -766 770 394 -785 344 762 -681 -196 734 -607 -208 903 -279 -854 637
4427 637 -51 -1041 656 482 -933 203 699 -550 11 838 -215 -718 610 -29 -608 419 243 -805
4445 -805 556 771 -458 151 665 -420 -411 1221 10 -475 667 -123 -570 374 191 -583 236 727 -711
4464 -711 285 409 -473 -284 547 -407 -522 431 215 -604 318 813 -740 25 607 -626 -288 628 -352
4483 -352 -475 398 -278 -782 438 531 -1057 -86 -39 -939 -65 811 -400 -370 957 -311 -773 553 263
4502 263 -695 597 710 -861 443 1095 -590 -135 884 -132 -695 1116 -41 -992 670 574 -1186
4519 -1186 254 809 -851 -172 879 -503 -816 1018 -1 -1287 812 129 -934 85 898 -1394
4535 -1394 -695 972 -731 -732 1029 -248 -1060 990 349 -1051 507 722 -1055 19 1321 -719 -824
4552 -824 1173 -18 -726 1134 234 -1196 1033 744 -1304 -122 973 -1086 -487 1294 -375 -1015
4568 -1015 1108 204 -1279 861 733 -1530 155 1332 -846 -649 1303 -476 -1003 1616 223 -1249
4584 -1249 492 808 -1074 40 1019 -1259 -668 1324 -368 -813 1709 -127 -1533 620 475 -1535
4600 -1535 217 984 -1397 -192 1537 -775 -897 1178 106 -1173 1028 585 -886 859 1260 -898
4616 -898 -238 1241 -1001 -869 1525 159 -1161 791 211 -1334 744 1016 -1245 -145 857 -670
4632 -670 -520 1431 -516 -1385 968 532 -1056 791 1288 -1044 277 1552 -592 -673 1024 -396 -920
4649 -920 1281 144 -1479 456 865 -1137 111 1033 -1025 -507 1279 -428 -944 576 95 -982
4665 -982 321 454 -947 332 1064 -1196 -286 1141 -330 -739 920 125 -1092 844 451 -1071 191
4682 191 911 -627 -326 1117 -406 -755 911 -42 -789 931 224 -1120 309 907 -720 -266 976
4699 976 -535 -351 1020 -325 -1059 698 275 -759 89 664 -616 43 761 -809 -448 892 -504
4716 -504 -724 769 174 -799 359 466 -903 363 914 -604 -111 814 -136 -830 963 389 -544 513
4734 513 662 -576 180 510 -785 108 863 -574 -159 678 -20 -459 518 37 -728 138 450 -772 -19
4753 -19 848 -652 -243 446 -265 -616 510 -145 -834 275 209 -595 211 598 -919 -109 498 -571 -333
4772 -333 644 -112 -565 386 64 -463 684 263 -575 248 551 -362 -12 735 -267 -386 803 -188 -803
4791 -803 536 417 -666 486 501 -651 31 650 -500 -98 783 -329 -634 728 337 -724 646
4808 646 605 -285 237 702 -739 -314 790 -638 -455 934 30 -767 492 310 -723 189 436 -1228
4826 -1228 -33 684 -490 -122 785 -161 -935 696 202 -904 799 530 -961 165 974 -285 -442
4843 -442 732 -264 -327 905 60 -783 650 613 -1209 100 947 -648 -129 950 -674 -441 1072 553
4861 553 -578 954 569 -893 215 858 -710 -92 1166 -418 -897 1041 149 -918 763 499 -1375
4878 -1375 348 792 -1083 -519 1183 -676 -800 834 -431 -1186 1063 -19 -1546 332 709 -877
4894 -877 -281 1181 -664 -550 1004 41 -698 1008 281 -1295 511 958 -663 -52 1057 -741 -195
4911 -195 1007 -341 -971 1094 226 -583 719 566 -1102 -102 1097 -579 -559 765 -326 -768 1037
4928 1037 398 -760 396 625 -815 221 949 -702 -586 1074 -427 -921 780 14 -1261 792
4944 792 491 -1263 162 658 -856 -258 1010 -689 -645 659 126 -570 733 377 -1084 65 1218
4961 1218 -970 -386 919 -504 -367 1039 -179 -810 743 380 -866 440 476 -688 199 781 -759
4978 -759 -263 1092 -316 -499 596 532 -884 302 622 -681 115 427 -681 -90 1031 -338 -743
4995 -743 480 87 -944 368 326 -701 333 565 -411 -184 706 -543 -618 525 206 -837 255 402
5013 402 -533 225 621 -602 -74 707 -328 -209 877 328 -408 390 358 -500 259 486 -831 93 611
5032 611 -555 -358 678 -57 -463 211 233 -475 250 554 -685 44 451 -432 -105 329 3 -425 477
5051 477 -244 -443 255 226 -477 252 404 -429 -99 410 -280 -400 704 -152 -305 369 -70 -693 50 191
5071 191 -324 271 319 -540 -86 487 166 -420 576 -3 -166 334 180 -635 276 196 -272 -67 517 -52 -184
5092 -184 441 -327 -475 219 -345 -624 342 213 -319 182 444 -869 -66 812 -494 -126 525 215 -589
5111 -589 291 316 -431 180 248 -672 -334 580 -566 46 776 -160 -418 691 113 -764 423 400 -912 -75
5131 -75 592 -885 -183 964 -207 -534 788 83 -358 774 284 -868 374 594 -949 -286 879
5148 879 -311 -169 540 -141 -552 514 191 -604 455 883 -481 -247 585 -374 -449 930 -303 -566
5166 -566 748 -144 -893 575 528 -793 -19 601 -689 -232 811 -238 -569 681 -50 -1008 453 512
5184 512 -765 160 952 -807 -340 957 -93 -628 609 108 -1061 294 437 -767 138 680 -755
5201 -755 -207 695 -342 -606 643 -95 -621 418 338 -1042 212 857 -440 -316 615 -661 -149 567
5219 567 -242 -865 953 301 -1159 300 484 -772 0 887 -560 -296 687 -105 -458 693 426 -559
5237 -559 285 747 -649 -261 875 -463 -390 636 -235 -698 303 318 -865 383 543 -687 -88 980
5255 980 -874 -137 885 -244 -407 858 385 -1029 539 333 -762 147 713 -694 -493 794 -57
5272 -57 -561 550 78 -616 435 171 -701 168 498 -381 -310 643 -324 -409 717 -143 -570 517 341 -527
5292 -527 66 581 -733 -235 654 -309 -370 417 434 -644 727 104 -615 -64 424 -574 -170 128 -396 -412
5312 -412 522 -164 -484 307 184 -397 181 207 -608 93 298 -628 -54 667 -236 -547 184 -227 -555 383
5332 383 219 -693 -145 565 -163 -6 474 -65 -345 376 29 -466 423 77 -329 58 436 -92 230 612
5352 612 -69 -180 635 120 -316 241 52 -107 45 526 -504 -114 635 -81 19 617 -176 -349 408 -27
5372 -27 -549 517 203 -652 166 -68 -391 -100 367 -250 -38 363 -188 -375 381 -163 -803 127 71 -263
5392 -263 -81 412 -300 -282 679 -319 -60 345 -357 -279 478 189 -440 314 112 -444 154 468 -472 149 505
5413 505 -33 -211 412 134 -438 277 370 -626 84 590 -344 84 498 -169 -85 385 -8 -515 246 64 -771
5434 -771 376 522 -509 -225 427 -442 -23 582 -210 -473 105 52 -811 175 161 -554 250 496 -327 -95
5454 -95 517 -144 -363 290 68 -352 371 408 -769 -14 424 -300 -91 803 -615 -316 709 73 -578 445
5474 445 321 -452 99 431 -484 -160 732 -642 -649 702 -86 -862 677 78 -891 137 746 -454 -132
5493 -132 762 -444 -433 819 125 -695 564 229 -740 226 306 -446 -185 662 -663 -499 915 -177 -550
5512 -550 597 -33 -991 327 627 -741 79 536 -506 -31 821 -481 -470 503 311 -675 403 645
5530 645 -860 92 822 -549 -184 848 -284 -390 755 43 -812 235 483 -597 -113 618 -931
5547 -931 -433 708 -305 -582 574 143 -536 476 123 -895 -83 564 -358 -106 694 -451 -420 743
5565 743 -199 -478 574 70 -318 73 341 -447 -205 917 -324 -275 825 87 -812 198 87 -306 531
5584 531 502 -439 -152 726 -314 -578 706 153 -421 257 109 -467 291 351 -343 110 519 -409 -76 510
5604 510 -41 -104 243 -119 -643 325 165 -812 80 444 -532 28 659 -61 -109 17 45 -166 230 -81 -708
5625 -708 136 268 -464 -113 341 -188 -17 417 61 -151 479 100 -413 339 490 -368 255 729 -46 -142
5645 -142 535 -347 -288 245 -35 -538 163 310 -397 304 360 -187 -193 508 -153 -290 142 -189 -367 409 -218
5666 -218 -184 237 259 -242 -156 145 -399 169 185 -44 120 291 -57 -418 141 151 -302 -117 172 -226 -57 297
5688 297 -207 -270 339 -142 -561 341 185 -141 76 102 79 249 24 -416 -272 91 -53 -289 116 119 -85 516
5710 516 294 -313 129 451 -504 29 437 -293 -281 235 112 -291 166 101 -367 306 283 -587 -239 488 -300
5731 -300 -76 431 -87 -200 325 -271 -723 321 264 -304 137 516 -263 -196 496 -396 -347 362 52 -580 254
5752 254 532 -395 188 400 -685 -40 798 -559 -317 407 27 -250 400 158 -452 279 933 -362 -254
5771 -254 309 -364 -480 666 -192 -712 449 122 -732 197 332 -478 37 762 -92 -448 656 -342 -568
5790 -568 341 246 -345 506 210 -352 -58 534 -355 -121 652 -617 -593 612 190 -604 326 154 -585 84
5810 84 411 -431 -47 316 -286 -679 589 277 -733 382 270 -631 116 312 -411 -190 669 -140 -355
5829 -355 634 68 -678 149 30 -693 61 472 -229 -99 738 4 -451 251 139 -648 358 223 -607 238
5849 238 255 -655 62 690 -261 -267 539 198 -677 199 19 -657 216 470 -456 43 526 -225 -470 288 -187
5870 -187 -359 491 -10 -435 53 150 -281 234 553 -554 -116 671 -129 -699 475 -16 -693 133 305 -671
5890 -671 176 323 -442 10 470 -456 -499 491 318 -663 461 28 -741 307 716 -658 -57 707 -469
5909 -469 -412 492 185 -316 353 -33 -171 206 381 -400 174 534 -177 -482 239 -181 -60 356 358 -431 258
5930 258 354 -326 -88 542 -279 -156 524 -282 -64 577 288 -181 10 303 -455 53 369 -163 -374 163
5950 163 60 -211 206 -51 -462 276 101 -222 152 517 -234 -117 373 -186 93 386 -129 -370 185 139
5970 139 -214 111 258 -380 117 337 -102 39 274 46 -301 645 126 -402 675 233 -252 -45 211 -419
5990 -419 -34 297 -415 -316 609 -64 38 265 81 -378 302 123 -313 -10 116 -100 158 439 -428 80
6010 80 165 -231 73 178 223 -314 -14 43 -262 186 522 -234 -148 408 -99 -281 152 187 -242 335 232 -460
6032 -460 77 415 107 -159 430 -235 -435 550 -55 -380 315 428 -548 233 353 -366 3 354 -215 36
6052 36 508 18 -448 186 182 -534 117 42 -219 0 704 -619 -101 438 -2 -163 326 75 -546 72 62
6073 62 -334 -147 588 -143 -184 434 -18 -386 344 103 -525 92 269 -289 80 496 -291 -247 679 -288 -351
6094 -351 803 162 -353 281 506 -451 138 447 -266 -335 537 -337 -380 621 -36 -563 232 248 -779 82
6114 82 267 -476 57 435 -390 -260 384 -46 -403 394 214 -394 141 352 -357 -39 500 -385 -323 559 -194
6135 -194 -401 452 -42 -371 197 131 -784 296 478 -107 -174 588 -136 -235 425 267 -347 409 363 -689 256
6156 256 532 -327 -146 80 -158 -438 496 -176 -568 319 78 -447 244 309 -517 -216 234 -294 -426 495
6176 495 137 -624 213 275 -369 191 -79 -161 -33 231 -204 -570 432 -26 -476 126 245 -380 130 331
6196 331 -436 -69 393 -195 -235 546 -52 -466 325 288 -512 465 521 -326 -101 59 -167 29 491 -119 -419
6217 -419 590 326 -388 154 349 -414 -115 351 -158 -219 418 -88 -141 319 24 -525 218 188 -257 -13 28
6238 28 -464 -58 176 -324 -29 195 -234 -559 243 -22 -307 42 398 -258 6 271 59 -142 55 -107
6258 -107 -148 158 233 -193 256 -168 -257 136 209 -296 -78 458 -159 74 444 -51 -373 448 -44 -374 118
6279 118 53 -181 185 120 -181 -181 454 -230 -243 13 -69 -404 337 183 -41 85 178 -454 -278 122 -187 -236 24
6302 24 46 -415 115 133 -158 75 407 -7 109 218 -313 -164 297 137 -115 213 -120 -577 190 515 -262
6323 -262 -185 342 -320 -18 193 -60 -232 425 -241 -101 199 295 -26 79 514 -204 -25 307 -282 -297 463
6344 463 -158 -302 240 45 -346 37 532 -438 118 539 -373 10 -125 -127 -226 326 37 -291 49 201 -285
6365 -285 42 96 -139 -254 328 -211 -237 375 26 -557 271 368 -204 1 561 -226 -32 411 -84 -428 198
6386 198 -30 -629 78 206 -337 -10 300 -162 140 567 -64 49 229 99 -281 20 375 -367 400 80
6406 80 -92 -279 509 -54 -156 659 -146 -487 104 -13 -451 113 496 -440 14 220 -415 -390 213 -61 -382
6427 -382 336 -97 -384 271 222 -163 30 140 -91 -184 -87 -364 -233 102 54 -387 439 154 -186 70 541
6448 541 -215 -204 361 -94 -563 430 322 -515 130 144 -572 67 492 -706 -353 429 -23 -228 526 -101
6468 -101 -259 203 143 -381 254 227 -423 -158 217 -33 -209 432 61 -413 0 0 4 265 230 -445 15 644
6490 644 -142 125 110 -173 -579 472 223 -605 -125 150 -60 94 439 -273 -109 220 -31 -353 235 -71
6510 -71 -236 191 252 -633 -49 607 15 -163 403 -278 142 532 -37 -443 348 105 -421 -131 204 -269 -208
6531 -208 -72 -26 -186 191 -134 -148 432 280 -352 204 271 -67 -23 238 -224 -238 112 72 143 -27 89 -5 251
6554 251 -52 32 -43 16 -10 74 400 -13 -49 346 -91 -272 86 151 -417 32 10 -316 80 10 -88 103 18 -59
6578 -59 -271 96 -158 -381 194 -181 25 28 96 -245 -169 146 -18 -9 14 -222 -175 247 12 -481 -63 159 66
6601 66 113 399 -165 -238 65 -78 66 -89 152 -426 152 171 -418 76 222 -91 130 3 68 -41 175 85
6623 85 -49 73 -27 -283 -166 204 -445 30 237 -119 -99 172 -68 -216 98 44 -412 256 8 -78 35
6644 35 240 -241 -43 -11 -71 -278 149 -316 -292 275 84 54 -324 -148 -198 35 1 51 -109 334 -258 -196 163
6667 163 22 -125 -74 112 -82 -31 144 -357 -19 75 -8 -189 125 245 -378 86 151 -423 108 475 -342 5
6689 5 377 -441 -309 454 72 -35 348 246 -248 -106 388 -456 -56 252 -262 -135 394 295 -316 317 248
6710 248 -397 36 73 -268 -182 395 -167 -277 -88 -20 144 310 425 -155 -155 199 -434 -202 -14 -104 -357 -11
6732 -11 -25 -369 -20 167 -216 1 270 -434 -14 521 -10 -34 58 232 -451 322 166 -319 -169 189 42
6753 42 -144 -182 -286 -243 67 -128 -37 3 92 -161 125 265 -261 95 112 -356 -294 266 178 136 341 184 -182
6776 -182 136 68 -47 97 -108 -201 -74 48 249 140 105 164 -110 342 135 -220 77 308 4 122 109 224
6798 224 -140 256 -265 -583 179 90 -110 -5 -10 -37 132 134 172 -285 431 -363 -189 146 197 -62 -192 310 77
6821 77 164 240 -315 -167 340 -15 -110 -95 135 -460 72 253 -438 8 123 -52 -147 434 -32 134 124 118 -308
6844 -308 -49 149 -63 245 -133 85 17 192 70 -45 332 -120 -431 -87 17 56 -27 87 -49 59 225
6865 225 63 -175 369 -40 -274 29 253 -282 -19 -250 -236 -80 247 -165 38 275 -247 -346 -123 -185 -354
6886 -354 -21 66 -25 135 74 -366 -20 -205 -192 146 65 -83 -289 -106 74 -83 198 -56 -214 -130 374 -161
6908 -161 -71 41 -201 -143 186 243 -203 175 44 -328 91 323 -371 -44 182 52 35 -48 67 105 143 -371
6930 -371 86 34 267 92 -256 103 -62 -3 129 139 -15 422 163 -85 59 228 -173 157 45 -99 -79
6951 -79 138 184 -134 102 -144 -243 173 226 -35 252 -44 65 -29 128 101 -265 146 -102 -316 35 13 -145
6973 -145 125 -86 -270 154 303 -169 -342 408 -93 -148 46 -366 -152 228 -49 -161 -40 71 -434 -206
6993 -206 119 -359 -192 -85 40 -93 84 -149 -201 212 501 -169 -291 1 -106 -118 194 -253 -180 49 150
7014 150 -113 45 7 -212 -86 55 -59 -195 77 -31 -132 190 335 -207 270 84 -7 149 -33 2 239
7035 239 230 -278 -31 331 34 7 126 214 -114 -61 324 -53 -175 -39 -263 57 25 134 167 312 -245 -275 6
7058 6 156 -73 219 96 -58 -634 306 233 -71 -60 227 54 -264 321 -23 -151 -68 147 -29 -136 -149 189
7080 189 115 121 -246 -199 219 46 -271 -47 -162 79 -127 -49 -443 229 -96 -163 -9 278 -328 -330 46 -126 -3
7103 -3 40 131 245 140 -39 47 -293 70 -402 15 133 124 21 -19 -176 -68 244 -7 -119 -301 -74 -253 -199
7126 -199 77 -185 -128 199 -44 -273 179 -121 -25 138 163 -411 -548 241 144 -118 36 -150 -210 809 303
7147 303 158 129 25 61 350 -57 16 300 -345 134 79 -63 132 -265 17 300 -189 95 483 23 163
7168 163 -169 -118 -84 146 119 -214 -35 37 -215 255 261 -357 187 282 128 -109 286 -215 -65 -11 59 -139 103
7191 103 -47 -186 88 -170 -45 -57 156 -145 -231 -113 -98 -447 -100 -140 -191 -170 -42 64 23 155 -88 83
7213 83 -154 -85 -225 -276 -74 66 49 -42 -239 141 374 -236 -271 151 -3 -230 -3 -132 -135 -16 -45 -236 46
7236 46 -13 85 245 -205 34 -57 193 53 201 -241 -8 -204 -65 51 -299 79 64 -402 -285 -10 -1 -17 183
7259 183 -204 51 -298 128 -61 23 -230 -59 58 81 -124 145 -159 17 138 -12 -47 -285 250 77 3
7280 3 125 124 36 -203 -85 -157 -292 -6 140 -78 98 -61 -261 -134 45 23 -72 221 -96 128 143 -154 -18
7303 -18 -15 -151 -197 239 82 -125 228 297 -57 -234 -207 -48 34 75 161 -91 285 133 58 -140 31 13 68 76 73
7328 73 -30 132 3 25 117 166 33 -145 196 -113 -181 -198 149 -324 -203 -174 -341 -223 -98 -174 21 437 18
7351 18 -133 85 -2 -290 423 -209 -67 -16 -45 235 -65 71 -207 -423 -11 141 22 -17 82 -338 61 33
7373 33 63 -237 114 -310 149 -59 -47 -416 186 -7 -220 -211 203 -116 -134 56 171 -314 -202 -224 248 433
7395 433 145 -441 156 224 -182 65 294 56 -339 190 -312 -408 87 181 117 -178 213 -142 24 -5 198 -72
7417 -72 301 53 79 -171 94 238 241 -8 -21 243 -6 99 58 -118 206 -142 -111 -149 -368 61 94 -90 182
7440 182 72 -201 -168 254 10 313 387 -109 -12 -314 -39 -246 -4 45 100 78 -266 -52 128 260 -213 158
7462 158 89 181 -108 -208 318 -42 32 16 236 109 -62 240 -328 -92 102 -268 62 243 53 70 106 -146
7484 -146 73 68 -57 -120 352 -234 16 -77 -78 37 -174 -13 -207 158 31 76 -183 133 100 -15 -91 77 203
7507 203 -100 20 -11 44 -53 16 -2 -64 -102 -222 -20 166 -253 -60 65 -8 20 168 99 -46 94 78 14 181
7531 181 256 -212 -337 25 -168 86 192 -135 325 -87 210 -18 47 136 -67 144 -193 40 -294 -143 -295
7552 -295 104 62 -68 109 65 2 -23 380 -47 7 -219 2 -118 -111 72 14 -88 296 27 200 372 -84 -36
7575 -36 -18 -184 -363 -87 -70 -332 17 -576 -49 58 -51 109 -147 142 -14 97 274 184 -462 -39 168
7596 168 101 -173 130 8 -19 -67 85 97 -143 42 163 59 -35 -154 88 67 -332 144 143 -69 225 15 45
7619 45 52 95 -42 47 147 54 363 -450 -171 319 -247 89 -34 -199 24 15 -307 96 297 62 -227 -1 72
7642 72 -203 -209 129 -137 -112 -247 -275 231 -166 -324 -62 67 -208 -168 -386 -100 -187 72 73 -25 -203 21 -99
7665 -99 -282 262 -127 224 -62 -120 -82 -82 89 -124 106 99 -111 75 -196 -253 4 240 311 187 -119 -135 -59 -109
7689 -109 -205 -336 -22 1 57 -16 184 136 -58 -69 89 103 233 56 74 -95 71 69 28 -137 255 -217 -163 17
7713 17 -49 60 159 31 -104 226 143 -704 -337 44 -90 93 -54 -77 -3 77 47 26 -11 -61 277 86 212 -47
7737 -47 138 55 -91 -230 -33 43 278 68 -245 -82 169 251 47 -133 55 -48 -196 62 -134 -250 -33
7758 -33 173 11 39 -67 76 86 -21 -196 -184 -174 197 -11 -72 -161 180 -8 -11 73 -18 160 18 69 8 -328
7782 -328 93 -139 189 -221 158 140 -69 224 -193 95 -69 -2 -93 -82 -214 -188 15 74 -42 -239 -109 -347
7804 -347 49 -340 255 148 -119 123 -121 -63 -211 -25 -2 -8 87 88 21 206 -337 273 146 -55 349 183 -157
7827 -157 138 -196 -118 -91 46 -85 -53 102 36 -110 -1 162 165 -88 134 100 36 105 -135 -288 318 20 39
7850 39 -127 168 -114 289 90 -54 -97 35 -132 -231 143 -101 -217 -85 -40 -215 58 1 -266 -241 55 -195
7872 -195 14 46 32 84 -203 -263 -259 89 88 7 -527 376 216 -230 59 76 -248 240 241 0 -55 108 107 -221 -355
7897 -355 -20 -71 59 125 -144 417 45 -297 84 193 -123 -103 5 -116 71 108 -111 -468 80 -123 -523
7918 -523 -33 -209 -106 54 126 -192 115 195 236 -17 123 74 -422 -146 -47 179 200 93 -359 -303 269 -46
7940 -46 72 194 9 -220 36 274 109 111 -23 -8 216 -60 -20 84 393 130 -69 66 383 -171 -236 -74
7962 -74 22 111 77 258 -157 -191 -53 -136 -124 265 -10 86 -150 46 -76 242 -68 1 -56 209 -220 275 8
7985 8 -273 96 26 -218 -41 189 -115 -34 -238 -9 -102 42 175 -197 -121 178 -175 78 55 -119 -265 115
8007 115 -109 -82 137 308 -239 47 153 -235 -251 233 -152 -106 167 -161 -101 121 139 -109 -301 241 -7 -177
8029 -177 64 -398 -54 356 -36 -57 308 -22 -204 254 257 -117 41 12 -143 -97 -53 -193 172 -180 126 190
8051 190 -2 113 -43 -34 -161 -296 26 255 97 -47 -73 197 -26 -21 85 325 32 23 -93 13 217 -58
8073 -58 -152 89 40 -117 105 -68 186 -17 -200 -225 104 -82 -108 55 206 279 -69 272 77 102 354 -133
8095 -133 12 -204 -243 191 168 275 -107 152 15 -27 238 189 -284 -65 -20 28 -146 120 138 -11 -2 93 102 -74
8119 -74 123 226 86 350 -59 197 147 -109 -230 36 32 -182 -80 49 225 -91 178 -4 -44 34 131 115 64
8142 64 134 -129 15 -21 6 -92 139 182 -37 119 -104 -150 -32 51 -15 197 -158 -309 -188 60 -62 -70 112 22
8166 22 -108 -41 180 74 93 240 -123 -59 266 86 -334 191 3 99 -26 258 -257 -10 29 -197 -216 279
8188 279 285 -167 119
8191A19
##END NTUPLES=NMR FID
##END=
