##TITLE=1H_Pr 5-2-2
 CDCl3, 8 sc, 
 6.6.2019
##JCAMPDX= 6.0         $$ Bruker NMR JCAMP-DX V2.0
##DATA TYPE= NMR FID
##DATA CLASS= NTUPLES
##ORIGIN= UXNMR, Bruker Analytische Messtechnik GmbH
##OWNER= root
$$ XWIN-NMR		Version 3.5
$$ Thu Jun  6 13:57:38 2019 Russian Standard Time (UT+4h)  she@DPX200
##.OBSERVE FREQUENCY= 200.13155
##.OBSERVE NUCLEUS= ^1H
##.DELAY= (6, 6)
##.ACQUISITION MODE= SIMULTANEOUS
##.ACQUISITION SCHEME= undefined
##.AVERAGES= 8
##.DIGITISER RES= 18
##SPECTROMETER/DATA SYSTEM= spect
##.PULSE SEQUENCE= zg30
##.SOLVENT NAME= CDCl3
##.SHIFT REFERENCE= (INTERNAL, CDCl3, 0, 15.7039)
##AUDIT TRAIL= $$ (NUMBER, WHEN, WHO, WHERE, WHAT)
$$ ##TITLE= Audit trail, XWIN-NMR		Version 3.5
$$ ##JCAMPDX= 5.01
$$ ##ORIGIN= Bruker BioSpin GmbH
$$ ##OWNER= she
$$ F:/spectra/data/she/nmr/H-F/1/audita.txt
$$ ##AUDIT TRAIL=  $$ (NUMBER, WHEN, WHO, WHERE, WHAT)
(   1,<2019-06-06 13:55:56.96 +0400>,<she>,<DPX200>,
      <created by zg, POWCHK disabled, PULCHK disabled
       configuration hash MD5:
       00 E9 B6 7A A2 85 ED C7 34 08 36 98 17 FE 4E 26
       data hash MD5: 16K
       6D 1D CF B8 3D 46 74 D4 7B BA 15 F1 62 4C 50 30>)
$$ ##END=
$$ 
$$ hash MD5
$$ E8 77 51 A6 B3 9B C9 0F 59 5E AE 6C 53 2B 60 15
##$RELAX= 
##$RELAX= 
##$RELAX= 
##$RELAX= 
##$RELAX= 
##$RELAX= 
$$ Bruker specific parameters
$$ --------------------------
##$DU= <F:/spectra>
##$EXPNO= 1
##$NAME= <H-F>
##$PROCNO= 1
##$TYPE= <nmr>
##$USER= <she>
##$AMP= (0..31)
100 100 100 100 100 100 100 100 100 100 100 100 100 100 100 100 100 100 
100 100 100 100 100 100 100 100 100 100 100 100 100 100 
##$AQSEQ= 0
##$AQ_mod= 1
##$AUNM= <au_zg>
##$AUTOPOS= <>
##$BF1= 200.13
##$BF2= 200.13
##$BF3= 200.13
##$BF4= 200.13
##$BF5= 200.13
##$BF6= 200.13
##$BF7= 200.13
##$BF8= 200.13
##$BYTORDA= 1
##$CFDGTYP= 0
##$CFRGTYP= 5
##$CHEMSTR= <none>
##$CNST= (0..31)
1 1 145 1 1 1 1 1 1 1 1 1 1 1 1 1 1 1 1 1 1 1 1 1 1 1 1 1 1 1 1 1 
##$CPDPRG= <>
##$CPDPRG1= <>
##$CPDPRG2= <>
##$CPDPRG3= <>
##$CPDPRG4= <mlev>
##$CPDPRG5= <mlev>
##$CPDPRG6= <mlev>
##$CPDPRG7= <mlev>
##$CPDPRG8= <mlev>
##$CPDPRGB= <>
##$CPDPRGT= <>
##$D= (0..31)
0 1.2 0 0 0 0 0 0 0 0 0 0.03 0 0 0 0 0 0 0 0 0 0 0 0 0 0 0 0 0 0 0 0 
##$DATE= 1559814956
##$DBL= (0..7)
120 120 120 120 120 120 120 120 
##$DBP= (0..7)
150 150 150 150 150 150 150 150 
##$DBP07= 0
##$DBPNAM0= <>
##$DBPNAM1= <>
##$DBPNAM2= <>
##$DBPNAM3= <>
##$DBPNAM4= <>
##$DBPNAM5= <>
##$DBPNAM6= <>
##$DBPNAM7= <>
##$DBPOAL= (0..7)
0.5 0.5 0.5 0.5 0.5 0.5 0.5 0.5 
##$DBPOFFS= (0..7)
0 0 0 0 0 0 0 0 
##$DE= 6
##$DECBNUC= <off>
##$DECIM= 24
##$DECNUC= <off>
##$DECSTAT= 4
##$DIGMOD= 1
##$DIGTYP= 9
##$DL= (0..7)
0 120 120 120 120 120 120 120 
##$DP= (0..7)
150 150 150 150 150 150 150 150 
##$DP07= 0
##$DPNAME0= <>
##$DPNAME1= <>
##$DPNAME2= <>
##$DPNAME3= <>
##$DPNAME4= <>
##$DPNAME5= <>
##$DPNAME6= <>
##$DPNAME7= <>
##$DPOAL= (0..7)
0.5 0.5 0.5 0.5 0.5 0.5 0.5 0.5 
##$DPOFFS= (0..7)
0 0 0 0 0 0 0 0 
##$DQDMODE= 0
##$DR= 18
##$DS= 0
##$DSLIST= <SSSSSSSSSSSSSSS>
##$DSPFIRM= 0
$$ [...]
##$SUBNAM2= <"">
##$SUBNAM3= <"">
##$SUBNAM4= <"">
##$SUBNAM5= <"">
##$SUBNAM6= <"">
##$SUBNAM7= <"">
##$SUBNAM8= <"">
##$SUBNAM9= <"">
##$SW= 24.9336996594482
##$SWIBOX= (0..15)
0 0 2 0 0 0 0 0 0 0 0 0 0 0 0 0 
##$SW_h= 4990.01996007984
##$TD= 16384
##$TD0= 1
##$TE= 0
##$TE2= 300
##$TE3= 300
##$TEG= 300
##$TL= (0..7)
0 120 120 120 120 120 120 120 
##$TP= (0..7)
150 150 150 150 150 150 150 150 
##$TP07= 0
##$TPNAME0= <>
##$TPNAME1= <>
##$TPNAME2= <>
##$TPNAME3= <>
##$TPNAME4= <>
##$TPNAME5= <>
##$TPNAME6= <>
##$TPNAME7= <>
##$TPOAL= (0..7)
0.5 0.5 0.5 0.5 0.5 0.5 0.5 0.5 
##$TPOFFS= (0..7)
0 0 0 0 0 0 0 0 
##$TUNHIN= 0
##$TUNHOUT= 0
##$TUNXOUT= 0
##$USERA1= <user>
##$USERA2= <user>
##$USERA3= <user>
##$USERA4= <user>
##$USERA5= <user>
##$V9= 5
##$VALIST= <valist>
##$VCLIST= <CCCCCCCCCCCCCCC>
##$VD= 0
##$VDLIST= <DDDDDDDDDDDDDDD>
##$VPLIST= <PPPPPPPPPPPPPPP>
##$VTLIST= <TTTTTTTTTTTTTTT>
##$WBST= 1024
##$WBSW= 4
##$XGAIN= (0..3)
0 0 0 0 
##$XL= 0
##$YL= 0
##$YMAX_a= 122096
##$YMIN_a= -258023
##$ZGOPTNS= <>
##$ZL1= 120
##$ZL2= 120
##$ZL3= 120
##$ZL4= 120
##$ABSF1= 10
##$ABSF2= 0
##$ABSG= 5
##$ABSL= 3
##$ALPHA= 0
##$AQORDER= 0
##$ASSFAC= 0
##$ASSFACI= 0
##$ASSFACX= 0
##$ASSWID= 0
##$AUNMP= <proc_1d>
##$AZFE= 0.1
##$AZFW= 0.1
##$BCFW= 1
##$BC_mod= 2
##$BYTORDP= 1
##$COROFFS= 0
##$CY= 11.3945322036743
##$DATMOD= 1
##$DC= 2
##$DFILT= <>
##$DTYPP= 0
##$F1P= 18.9103706918063
##$F2P= -1.10871071338519
##$FCOR= 0.5
##$FTSIZE= 0
##$FT_mod= 4
##$GAMMA= 1
##$GB= 0.15
##$INTBC= 1
##$INTSCL= 1
##$ISEN= 128
##$LB= 0.24
##$LEV0= 0
##$LPBIN= 0
##$MAXI= 10000
##$MC2= 0
##$MEAN= 0
##$ME_mod= 0
##$MI= 1.114404
##$NCOEF= 0
##$NC_proc= 0
##$NLEV= 6
##$NOISF1= 3.799351
##$NOISF2= 2.8
##$NSP= 1
##$NTH_PI= 0
##$NZP= 0
##$OFFSET= 15.70392
##$PC= 1
##$PHC0= -8501.217
##$PHC1= 17.80019
##$PH_mod= 1
##$PKNL= yes
##$PPARMOD= 0
##$PSCAL= 0
##$PSIGN= 0
##$REVERSE= no
##$SF= 200.130013532006
##$SI= 16384
##$SIGF1= 3
##$SIGF2= 2
##$SINO= 400
##$SIOLD= 16384
##$SREGLST= <1H.CDCl3>
##$SSB= 0
##$STSI= 0
##$STSR= 0
##$SW_p= 3612.71676300578
##$SYMM= 0
##$S_DEV= 0
##$TDeff= 0
##$TDoff= 0
##$TI= <>
##$TILT= no
##$TM1= 0
##$TM2= 0
##$TOPLEV= 0
##$USERP1= <user>
##$USERP2= <user>
##$USERP3= <user>
##$USERP4= <user>
##$USERP5= <user>
##$WDW= 1
##$XDIM= 8192
##$YMAX_p= 0
##$YMIN_p= 0
$$ End of Bruker specific parameters
$$ ---------------------------------
##NTUPLES= NMR FID
##VAR_NAME=  TIME,          FID/REAL,        FID/IMAG
##SYMBOL=    X,             R,               I
##VAR_TYPE=  INDEPENDENT,   DEPENDENT,       DEPENDENT
##VAR_FORM=  AFFN,          ASDF,            ASDF
##VAR_DIM=   8192,          8192,            8192
##UNITS=     SECONDS,       ARBITRARY UNITS, ARBITRARY UNITS
##FACTOR=    0.0002004,     1,               1
##FIRST=     0,             0,               0
##LAST=      1.6414764,     0,               0
##MIN=       0,             -258023,         0
##MAX=       1.6414764,     122096,          0
$$ Real data points
##PAGE= N=1
##DATA TABLE= (X++(R..R)), XYDATA
0@%%%%%lJ1j6J6j6K4l2M0n3O2p4R1j11J33j57J83k12K48k88L33l85M40m98N64
$$ 0 0 0 0 0 0 -3 8 -8 8 -8 16 -16 24 -29 33 -41 50 -61 72 -85 98 -114 134 -154 179 -206 234 -264 300
29C00o39P24q18R15j021J142j276J421j581J755j946K156k388K645k927L240l592
$$ 300 -339 385 -433 482 -539 603 -673 748 -833 922 -1024 1132 -1256 1389 -1538 1702 -1890
46a890L989m433M942n532O219p034Q020r242J0801j2872J5778k0180K7724m4130
$$ -1890 2099 -2334 2608 -2924 3295 -3739 4281 -4961 5840 -7032 8746 -11434 16290 -27840
60b7840J41619r3434j50884K31215k8308k5944P5672r4940j21638J69966K6964
$$ -27840 113779 20345 -130539 100676 72368 46424 122096 27156 -94482 75484 102448
71A02448j29528O6052M1600j59545O6567J31638j40656m8435J51940q1036q8801
$$ 102448 -27080 38972 80572 -78973 -12406 119232 -21424 -69859 82081 1045 -87756
82h7756J56360j4174j66481J07303Q4461j41521K1552R5349j17271P294J43656
$$ -87756 68604 54430 -112051 -4748 79713 -61808 -40256 55093 -62178 -54884 88772
93H8772j06446r4276J53675q227j17660J12469K5255j62481P8984J35158j31561
$$ 88772 -17674 -111950 41725 33498 -84162 28307 53562 -108919 -29935 105223 -26338
104b6338l3197J20092q0728m5269J49977m5699j29802J12839L5115j21755Q1746
$$ -26338 -59535 60557 -20171 -65440 84537 38838 -90964 21875 56990 -64765 16981
115A6981O8426j55090K4521J47068j12308o7668J46540m5307j11964J27754K4397
$$ 16981 85407 -69683 -45162 101906 -10402 -78070 68470 23163 -88801 38953 63350
126F3350j40916O6295P6298j16065L1124R8307j23888k4912J49126o6906r5405
$$ 63350 -77566 -11271 65027 -51038 -19914 78393 -45495 -70407 78719 11813 -83592
137h3592J27776r533j25221J09665O0613j51891L4843J17608j11754k4113J28662
$$ -83592 44184 34651 -90570 19095 79708 -72183 -37340 80268 -31486 -55599 73063
148G3063p6867p8577J33011j0465j12375R5900K9162j30274P2432R6947j37181
$$ 73063 -3804 -82381 50630 40165 -72210 23690 52852 -77422 -4990 91957 -45224
159d5224j3231J31304p8647o0153J30223l7847j11851J11045L5808j24149N7571
$$ -45224 -58455 72849 -5798 -65951 64272 26425 -85426 25619 61427 -62722 -5151
170e151O9457j18768K1660J15274j00777m8552J27296m5411q7044J17861L073
$$ -5151 64306 -54462 -32802 82472 -18305 -66857 60439 15028 -72016 45845 48918
181D8918j31740Q1815P8231j22741J2037J01253r1530k6971J18009n9842p9191
$$ 48918 -82822 -1007 77224 -45517 -33480 67773 -23757 -50728 67281 7439 -71752
192g1752J12709n140j03054Q9272L8025j31336M8564J08562j09948l0955J14156
$$ -71752 40957 35817 -67237 22035 60060 -71276 -22712 85850 -24098 -55053 59103
203E9103o3060o1884J22768j8866j16656Q5529M7451j05647M6725O9076j14391
$$ 59103 -3957 -65841 56927 38061 -78595 6934 54385 -51262 -4537 64539 -49852
214d9852N465J18092p9749n7177J17149l5319r6451J10183L1156j27258M8737
$$ -49852 -44387 73705 -6044 -63221 53928 18609 -77842 32341 63497 -63761 -15024
225a5024P8376r9226J0594R5371r0488l8937J21471m0127q6387R8986N125j06502
$$ -15024 63352 -35874 -25280 70091 -20397 -59334 62137 22010 -64377 34609 39734 -66768
237f6768P9207N7951j24170K0340J04652q9194l3199J09776n3002p5521J06268
$$ -66768 12439 70390 -53780 -33440 71212 -17982 -51181 58595 5593 -69928 36340
248C6340K648j00468O9423L6502j03927M7163Q2360j08170j6142J12267n9910
$$ 36340 38988 -61480 7943 44445 -59482 -12319 70041 -38129 -54271 57996 -1914
259a914o0480J06677k0961r8028Q9169M0483j08263L7315P0299r2328N358R8792
$$ -1914 -62394 44283 23322 -74706 14463 54946 -53317 -16002 54297 -38031 -32673 66119
271F6119p5590n0523J06284k5136p7501R0772Q065j08929O6250P3341j06092L84
$$ 66119 -9471 -59994 46290 21154 -56347 34425 42490 -66439 -189 73152 -32940 -32556
283c2556R2529p2204l1880J04183m2694p8819R1828R112r2232O6593M2047j08855
$$ -32556 59973 -12231 -44111 60072 17378 -61441 30387 39499 -52733 13860 55907 -52948
295e2948K9736R2820q7380k9894R9316n0678o1523J03580q826j03533P2095M8301
$$ -52948 -23212 69608 -17772 -47666 51650 972 -60551 43029 34203 -69330 2765 51066
307E1066r6455K9556O7714q9422k989J00756o5224n6458J00659j8434q4532Q5304
$$ 51066 -45389 -15833 51881 -37541 -40530 60226 -4998 -61456 39203 20769 -63763 21541
319B1541K6983j07210M4583P4581r0413k394Q8724o7674m0265J02011k7315q0642
$$ 21541 48524 -58686 -14103 60478 -29935 -32329 56395 -11279 -51544 50467 23152 -57490
331e7490Q1350J6723q9795N6678N0965j00794J5605R3057p4660l7050R5833l7451
$$ -57490 23860 40583 -49212 7466 58431 -42363 -26758 66299 -8361 -45411 50422 12971
343A2971o8611Q9916P365r4817N5444M7027q8099K4085P2640q3406j9151R7444
$$ 12971 -55640 34276 41641 -53176 2268 49295 -38804 -14719 57921 -25485 -44636 52808
355E2808m7097o1137Q9099p025q6921O9590L9024r6193K9162P0847q0784j0354
$$ 52808 5711 -55426 33673 26648 -60273 9317 48341 -47852 -18690 52157 -28627 -38981
367c8981Q9895n3937n0884Q8420j5101p4989P4502K1127r4559M6123O5411q9398
$$ -38981 50914 -3023 -53907 34513 19412 -55577 18925 40052 -54507 -8384 57027 -32371
379c2371j763Q8420o1281m1702R1861k4398p1967P7075J4834q8007N1555N2086
$$ -32371 -34134 54286 -6995 -48697 43164 18766 -53201 23874 38708 -49299 2256 54342
391E4342r0125J1477Q1665o8993k8552Q8791l9299o3018Q8057L686r1350N5761
$$ 54342 -35783 -24306 57359 -11634 -40186 48605 9306 -53712 34345 38031 -53319 2442
403B442M8648q6066J7829P0573p4639j7887Q8574m3365n6056Q1583q056p7148
$$ 2442 51090 -34976 -17147 53426 -21213 -39100 49474 6109 -49947 31636 23580 -53568
415e3568O7569L2611r2846K7331O9755p3527j0911Q0927n2968m6778Q8153j0942
$$ -53568 14001 46612 -46234 -18903 50852 -22675 -33586 47341 -5627 -52405 35748 24806
427B4806p6223O1734K4140p8798L9704N4571q2080j444Q2228n3947l7198Q1401
$$ 24806 -51417 10317 34457 -44341 -4637 49934 -32146 -33590 48638 -5309 -42507 38894
439C8894k5571o7769P5823K0147q5163L7053N0548p3068J1295O9745o5766k8539
$$ 38894 13323 -54446 21377 41524 -43639 -6586 43962 -29106 -17811 51934 -13832 -42371
451d2371Q5528k7522o1264P1212L953p6700N4484M2027q4664J4473P0832o4171
$$ -42371 43157 15635 -45629 25583 29536 -47164 7320 49347 -35317 -20844 49988 -14183
463a4183k0798P9591l9319n4220P6450j19p1845N2430K8025p8153L1609O1687
$$ -14183 -34981 44610 5291 -48929 27521 27402 -44443 7987 36012 -42141 -10532 51155
475E1155p6617j3374Q1353m2540m4275P5202j5317o8283O5563K5680q0526K9986
$$ 51155 -25462 -38836 42517 -23 -44298 30904 15587 -52696 12867 38547 -41979 -11993
487a1993N3536o9542K121P1633n4488l5126P8488j9981n9914O6187J0674p7426
$$ -11993 41543 -27999 -25878 45755 -8733 -43859 34629 14648 -45266 20921 31595 -45831
499d5831M4695M9171p5293M606O7542n4443k3922P4342l0557n4114O8434N351
$$ -45831 -1136 48035 -27258 -22652 44890 -9553 -33475 40867 10310 -43804 24630 29981
511B9981p0271M6742L5062p4401J7430O3145o1213j9290P1580l4785m5896O9890
$$ 29981 -40290 6452 41514 -32887 -15457 47688 -13525 -32815 38765 3980 -41916 27974
523B7974m724o8888N0777L1402p0878K1361N1923o2397o190O9537m4401l9588
$$ 27974 23250 -45638 5139 36541 -34337 -12976 38947 -23450 -29640 39897 -4504 -44092
535d4092P2110j2347o2998N7715K2400p3499K9378N0603o3261j114O4499m8245
$$ -44092 28018 15671 -47327 10388 32788 -40711 -11333 39270 -23991 -25105 39394 -8851
547h851l0802P2505j7914n7826N8464J2113o5562M0401L9031p1494J0112O6206
$$ -8851 -39653 32852 14938 -42888 15576 27689 -37873 2528 41559 -29935 -19823 46383
559D6383n3931k5935P1036k7264n0337O4460N052o6486M1848L2042o5671J9931
$$ 46383 -7548 -33483 37553 10289 -40048 24412 29464 -37022 4826 36868 -28803 -8872
571h872N4204o1624j4172P0127l4383m2737O4738q032o1640N2996K6435p1405
$$ -8872 45332 -16292 -30464 39663 5280 -37457 27281 19249 -42391 10605 37040 -34365
583c4365K1706N1281n7385n641O1982m3059l3949O7325j3466n4869N3338J2988
$$ -34365 -12659 38622 -18763 -24404 37578 -5481 -39430 27895 14429 -40440 12898 25886
595B5886o6536L6181M5432o6810j020O3308m3116k7156O2860k0746m9118N7237
$$ 25886 -40650 -4469 40963 -25847 -26867 36441 -6675 -33831 29029 8283 -40835 16402
607A6402R202o2416L6812L4062o2934J2821N7422n3012k1078O5991k6625m4251
$$ 16402 25604 -36812 0 34062 -28872 -16051 41371 -11641 -32719 33272 6647 -37604
619c7604O1168J095o3571M2029L4125o2572J2944M9309n1531r478O1598l6031
$$ -37604 23564 24659 -38912 3117 37242 -25330 -12386 36923 -14608 -24086 37512 1481
631A481l8361O4080o316n9985M9596K4386o7620K2201N0246n6399p716O0592l8669
$$ 1481 -36880 27200 20884 -39101 10495 34881 -32739 -10538 39708 -16691 -24407 36185 -2484
644b484l3474O3419j2239n3134N0018J4986o2816L2138M0875o2207K313O0562
$$ -2484 -35958 27461 15222 -37912 12106 27092 -35724 -3586 37289 -24918 -22605 37957
656C7957m4918k7514O3908j9304n0030N5141J1307o1025L2449L4796n8204J0996
$$ 37957 -6961 -34475 29433 10129 -39901 15240 26547 -34478 -2029 32767 -25437 -14441
668a4441N3211n0836j8748O4053k5141m3947N7656K026n9243M0346L0512o0506
$$ -14441 38770 -12066 -30814 33239 8098 -35849 21807 23833 -35410 4936 35448 -25058
680b5058J3421M9093m9410j1048N9657l2883l8624N8338k437n2346M2080J8334
$$ -25058 -11637 37456 -11954 -23002 36655 3772 -34852 23486 21049 -31297 10783 29117
692B9117o0682K5112M7427n7620r277N9855l2954l2917N6594j1404n0011M8221
$$ 29117 -31565 -6453 40974 -16646 -25923 33932 978 -31939 24655 13251 -36760 11461
704A1461J6376n9131K5046L8471n4785L004N5654m2523k7545N9736j6322m4853
$$ 11461 27837 -31294 -6248 32223 -22562 -19558 36096 -6427 -33972 25764 9442 -35411
716c5411N2485O746o0656L4442L9121n7368K071N1344m0692j6566N6984k6022
$$ -35411 17074 23820 -36836 -2394 36727 -20641 -18570 32774 -7918 -24484 32500 6478
728F478m2311N5181N434n5119L6192K5955n8772J5725N1131m8818j6755N6576
$$ 6478 -35833 19348 24782 -30337 5855 31810 -26962 -11237 39894 -8924 -25679 30897
740C0897k6540l5892N5326m683n4506M1012K5287n6021J5910M0377m9962l473
$$ 30897 4357 -31535 23791 19108 -35398 5614 30901 -25120 -9210 31167 -18795 -22268
752b2268N6837l6145l4503N6620o850m8065M3539J6185n7857K3170M0435m8698
$$ -22268 34569 -1576 -36079 20541 13691 -34374 9165 25350 -32507 -9337 31098 -17600
764a7600k495M8992l6973k2069N6848j6685m6063M7204J2310n2514K8563L1612
$$ -17600 -20095 28897 -8076 -30145 26703 10018 -36045 11159 23469 -29045 -482 31130
776C1130n4402N932N2332l9353k2316N3048j7698l9012M7598M464m9943L2573
$$ 31130 -23272 -17340 34992 -4361 -26677 26371 8673 -30339 17259 21723 -28220 4353
788D353K5730n2957J3001M5317m6105j4063N5339k4496l6658M9332j291m8517
$$ 4353 30083 -22874 -9873 35444 -10661 -24724 30615 6119 -30539 18793 17502 -31015
800c1015L7556K2367n4591J5065M1655m4889p286N0104l0419k9722N1453q213
$$ -31015 6541 28908 -25683 -10618 31037 -13852 -21138 28966 -1453 -31175 20278 12065
812A2065m5244M2066J5434n4917K2089L9803m8792l900M9631l2860k3906N1844
$$ 12065 -33179 8887 24321 -30596 -8507 31296 -17496 -21396 28235 -4625 -28531 23313
824B3313j4377m2672M4352J1752n0810K7125L0489n0811M852M8490l7346k0711
$$ 23313 8936 -33736 10616 22368 -28442 -1317 29172 -21639 -16787 31703 -5643 -26354
836b6354N1265j7415l8057M6537N448n0167K9059K8770m8174P842M0436l9665
$$ -26354 24911 7496 -30561 15976 21424 -28743 316 29086 -19088 -11246 29190 -10475
848a0475j0543N0417k4476l4775M7299n5m6224L4654K2422n2205J2819M1595m0081
$$ -10475 -21018 29399 4923 -29852 17447 17392 -28832 5822 28244 -23961 -11142 30453 -9628
861i628j0055M5895k6939k7204M9093o587m5130L5913J7031m6218K0088L2328
$$ -9628 -19683 26212 -727 -27931 21162 14575 -30555 5358 22389 -23829 -3741 28587
873B8587m8032j561N1007l0857k7056M7040r882l9386M0527J1243m8687K3025
$$ 28587 -19445 -21006 30001 -856 -27912 19128 9246 -30140 10387 21630 -27057 -4032
885d032L0395m5034N331M3016l8117j8213N2018j5893l8123M1268N591m5577L0867
$$ -4032 26363 -18671 -13340 29676 -8441 -26654 25364 9471 -28652 12616 18207 -27370 3497
898C497K6618n0377O987M2394l5592j2390M5851k3261l1694M6862l95m5073L2714
$$ 3497 30115 -20262 -13275 29119 -6473 -18863 26988 3727 -27967 18895 18500 -26573 6141
911F141J9495m8524J6173L9641m4431j0641M8377k3319k7468M3685p141m1350
$$ 6141 25636 -22888 -6715 32926 -11505 -22146 26231 2912 -24556 19129 11988 -29362
923b9362L7044J6331m7505J7798L2010m3428p12M6263l1328k4787M6379r641l7572
$$ -29362 7682 24013 -23492 -5694 26316 -17112 -17824 28439 -2889 -27676 18703 9062 -28510
936b8510L9055Q940m7973K4016L1810m3226P29L9509l2248j4274M7109j8339l6127
$$ -28510 10545 19485 -28488 -4472 27338 -15888 -15159 24350 -7898 -22172 24937 6598 -29529
949b9529M1667O670m4000K7368K4133m6121Q122M0847l5336j3286M3568k1163
$$ -29529 12138 18808 -25192 2176 26309 -19812 -11690 29157 -6179 -19465 24103 2940
961B940k8996M5717j202m5058L0039K1114m3326J4004L3439m2625n374M7767k5582
$$ 2940 -26056 19661 18459 -26599 3440 24554 -18772 -4768 28671 -13954 -19328 28439 2857
974B857k8357M3323o097l9123L6506J3769m7885J8413L2880m1100n86M1637l2306
$$ 2857 -25500 17823 11726 -27397 9109 22878 -25007 -6594 26286 -14814 -15400 26237 -6069
987f069k0489M8357j1628l9127L7318R149m3135K5308K6618m6591M269M3232l2040
$$ -6069 -26558 21799 10171 -28956 8362 17511 -25624 -316 26302 -20289 -16020 27212 -4828
1000d828j7956M4671j6772l3243M2263N276m4687K5688K3906m3354J0673L7918
$$ -4828 -22784 21887 5115 -28128 14135 19411 -25276 412 24318 -19036 -8363 29555
1012B9555l8569j3001M6873j8200l0835M0359j104m1271L2483J9888m6617J1704
$$ 29555 -9014 -22015 24858 6658 -24177 16182 15078 -26193 6290 26178 -20439 -8735
1024h735L6336l7516p634M2784k4233k6315M3476n414l9713L4194J4876m6394
$$ -8735 27601 -9915 -17549 25235 1002 -25313 18163 12749 -26964 7230 22106 -24288
1036b4288J7362L4236m0130n393M1868k6543k1951M3924j0333l7618L6942J1398
$$ -24288 -6926 27310 -12820 -18213 23655 -2888 -24839 19085 8752 -28866 8076 19474
1048A9474m4630K1096K9144m2485J564M1599l1294j8290M5100j4380l4857L9946
$$ 19474 -25156 -4060 25084 -17401 -15837 25762 -5532 -23822 21278 6898 -27959 11987
1060A1987P590m4514K3903K5606m1762P192L7594l5395j3549M6386j8613l1521
$$ 11987 19577 -24937 -1034 24572 -17190 -9998 27596 -7799 -21348 25038 6425 -25096
1072b5096M1294M06m2361L0414K1902m5117R348L6013l5797p637M2843k4846k7731
$$ -25096 16198 16604 -25757 4657 26559 -18558 -9210 26803 -8994 -16631 26212 1366 -26365
1085b6365M4115k352m0222L0719J4883m3163J7706L2146m1429n065M3479k5569
$$ -26365 17750 15398 -24824 5895 20778 -22385 -4679 27467 -13962 -19027 24452 -1117
1097a117k2663M2092r634l7327L6040J2676m3046J8552K6315l9752L649M1128
$$ -1117 -23780 18312 8678 -28649 7391 20067 -22979 -4427 21888 -17864 -14215 26913
1109B6913l2384k0927M4524j0148l2277L5163M359m1669K6829K5866m3497M071
$$ 26913 -5471 -26398 18126 7978 -24299 10864 15223 -26446 383 26249 -17248 -13177
1121a3177L7671l0919j2421M2318j9007l0333M0022K801l9866K7358J8712m3394
$$ -13177 24494 -6425 -18846 23472 4465 -25868 14154 16955 -22911 4447 23159 -20235
1133b0235J2666L6622l6977j1552M1894j9771k4756M0430n801l9799L2836J8190
$$ -20235 -7569 29053 -7924 -19476 22418 2647 -22109 18321 12520 -27279 5557 23747
1145B3747m3734J3467L0655l7734k565M1853k7009k4685M2213o297l5123L3342
$$ 23747 -19987 -6520 24135 -13599 -16164 25689 -1320 -26005 16208 9911 -25212 8130
1157H130J0426m4102K0269L0680l9266j972L7902k7830j6460M2898j4047l4422
$$ 8130 18556 -25546 -5277 25403 -13863 -15835 22067 -5763 -22223 20675 6628 -27794
1169b7794L7094Q685m1181K2136K4487m0414M391L7877l0476j4806M0830j6219
$$ -27794 9300 17985 -23196 -1060 23427 -16987 -12596 25281 -5195 -20001 20829 4610
1181D610k8814L8206K940m0396K5080K1471l9469R215L2687l4890q499M2118j9844
$$ 4610 -24204 14002 16942 -23454 1626 23097 -16372 -7157 25530 -9360 -17859 24259 4415
1194D415k7837L8326o14l7313K8021J5880l9928J3312K9948l5588m550L9410k4526
$$ 4415 -23422 14904 14290 -23023 4998 20878 -19050 -5738 24210 -11378 -15928 23482 -1044
1207a044k2613M0222n990l5139L0700J1344l9473J8120K7567l7977j690L8535
$$ -1044 -23657 16565 10575 -24564 6136 17480 -21993 -3873 23694 -14283 -15973 22562
1219B2562k5986j8293L9188j0983l1717L4484P424l9384K1551K3540l9018M825
$$ 22562 -3424 -21717 17471 6488 -25229 9255 16679 -22705 -1154 22386 -16632 -11807
1231a1807L6830l0439j5487M0369j3317k9122L6117J981l8566K5824K0609l8949
$$ -11807 25023 -5416 -20903 19466 6149 -22973 13144 15125 -23441 2383 22992 -15957
1243a5957P825L2690l2623q856M0140j9316k6526L7601j351l6355K8498J5694
$$ -15957 -8132 24558 -8065 -16921 23219 3903 -22623 14978 13627 -22728 5770 21464
1255B1464m0718J2273L2109l3976o771L6688k1961j9880L7856p375l4620L1132
$$ 21464 -19254 -6981 25128 -8848 -15619 21069 -892 -20772 17084 9709 -24911 6221
1267F221J2000l8776J6375K6729l6549j048L7052k5117j8004L8124j0642l0982
$$ 6221 18221 -20555 -4180 22549 -14000 -15048 22004 -3113 -21117 17007 6365 -24617
1279b4617L3828O865l8139J9626K3291l5491M266L3087l0164j1930M0206j4773
$$ -24617 9211 16076 -22063 -2437 20854 -14637 -10371 22716 -7448 -19378 20828 6055
1291F055k9141L4363L044l5449K4039J8641l7902Q909L1075l1694p542L7519k0246
$$ 6055 -23086 11277 14321 -21128 2911 21552 -16350 -7441 23634 -8060 -15602 21917 1671
1304A671k3345L7669l013l5115K7835J3713l8564J4501K9182l5710m665L7358
$$ 1671 -21674 15995 12982 -22133 5702 19415 -19149 -4648 24534 -11176 -15841 21517
1316B1517k2367j9466L6772q219l2376L1333R962l8187J7668K4616l6527J950
$$ 21517 -850 -20316 16456 8237 -24139 7194 17156 -21031 -3363 21253 -15274 -13324
1328a3324L6367k7761j7547L9027r975l0304L2635N417l7432K1548K2790l7025
$$ -13324 23043 -4718 -22265 16762 6787 -23517 9118 14535 -22897 -1349 21441 -15584
1340a5584M536L2916k9188j1117L8586j5802k7740L5082K591l5935K4773J8053
$$ -15584 -11048 21868 -7320 -18437 20149 4347 -23393 11689 14280 -21655 3118 21171
1352B1171l8702R006L3165l0798j0482L6324j7891k1646L5913l808l5495K7735
$$ 21171 -17531 -8525 24640 -6158 -16640 19684 1793 -19853 16060 12252 -23243 4492
1364D492J6148l7560J1536K7772l3300l822L7085k1730k2689L6820n269l1064
$$ 4492 20640 -16920 -5384 22388 -10912 -14734 22351 621 -22068 14752 9483 -21581
1376b1581K8876R751l8233J6241K6998l3745j545L2927k5493j4667L8773j1412
$$ -21581 7295 17046 -21187 -4946 22052 -11693 -13238 19689 -5804 -20471 18302 6890
1388F890l1838L2053Q383l6136J9375K1605l6946M422L5028k7545j4111L6073
$$ 6890 -24948 7105 15488 -20648 -1273 20332 -16614 -12192 22836 -4709 -18820 17253
1400A7253j4133k4740L5432Q46l7380K3345K0238l5321Q274K9605l2608q012L9793
$$ 17253 3120 -21620 13812 14658 -22722 623 20861 -14460 -6186 23419 -9189 -17201 22592
1413B2592j7649k6961L4756j05l2581K5825J3521l7522J2424K8799l2451m406
$$ 22592 4943 -22018 12738 12633 -19948 5877 19398 -18124 -5700 23099 -9352 -13758
1425a3758L5235k2805k0541L8531n156l3866K7121J1468l5255J5729K4907l4930
$$ -13758 21477 -1328 -21869 16662 11506 -22360 4761 16229 -19026 -3297 21610 -13320
1437a3320j786L5484k2338j7618L4208r634k7438L1561O092l7216J9469K3475
$$ -13320 -15106 20378 -1960 -19578 14630 4996 -22442 9119 15211 -22005 -2536 20939
1449B0939l5269K559L3526k6275j5008L5882j0774k6179L1106K555l3550K2076
$$ 20939 -14330 -11771 21755 -4520 -19528 16354 5580 -20599 10507 13062 -20488 1588
1461A588J8829l5681P042L0874k8879r817L5956j6258k4993L4537N57l3999K3479
$$ 1588 20417 -15264 -8222 22652 -6227 -16044 19912 3654 -21339 13198 13755 -20244 3235
1474C235J6116l5220R294K8505k9376o032L3714k0854j9468L5504m606l3098K7625
$$ 3235 19351 -15869 -6575 21930 -7446 -13478 20236 -618 -20086 15418 10812 -22286 5339
1487E339J2238l6311J3830K6032l2295l091L3841k1659j7133L3948q816k8257
$$ 5339 17577 -18734 -4904 21128 -11167 -14258 19583 -2076 -19209 14739 5923 -22334
1499b2334L0441P331l5470J6958K1635l2386L212L1498k6654j4046L6752j1111
$$ -22334 8107 15438 -20032 -3074 18561 -13825 -10613 20885 -5769 -19815 16937 5826
1511E826k6646K9807M018l2292K0119J7873l3149N978K9059k6710q716L4337j6870
$$ 5826 -20820 8987 13005 -19287 832 18705 -14444 -8466 20593 -6117 -14833 19504 2634
1524B634k3677L3304J398l2093K1384J4237l2985J1051K6765l0181o526L3664
$$ 2634 -21043 12261 13659 -18434 2950 17187 -15798 -4747 22018 -8163 -14689 18975
1536A8975j7203j9466L1547n041k8971K6278J1413l4585J2271K3571k9593r24
$$ 18975 1772 -17694 13853 8812 -20159 6119 17532 -17053 -4782 18789 -10804 -11728
1548a1728L1920k2455j8076L3789n996k7122K6176O682l2775J7583K1664l2777
$$ -11728 20192 -2263 -20339 13450 7454 -19668 6508 13190 -19585 -2002 19662 -13115
1560a3115R74L0409k2544j2177L2834j2208k5709L0289M583l1775J9069J7188
$$ -13115 -12141 18268 -4276 -16453 16381 4173 -21536 8753 13336 -18439 630 17818
1572A7818l2682O317K9861k5966j1154L2202j3764k0438L0848j906l1328K3778
$$ 17818 -14864 -8547 21314 -4652 -15806 16396 2632 -17806 13042 11136 -20192 3586
1584C586J5201l2922Q460K5508k8046m624L2664j8658j9599L1397l761k7917K4784
$$ 3586 18787 -14135 -5675 19833 -8213 -12837 19827 1169 -18430 12967 9206 -18711 6073
1597F073J0285l3326J2594K3299k8073j423K8526k1798j4094L3676q820k7857
$$ 6073 16358 -16968 -4374 18925 -9148 -10571 17955 -3843 -17937 15739 6919 -20938
1609b0938K6660P752l0862J6114J8883l1080K687K9085k2406j1780L0799j2303
$$ -20938 5722 13474 -17388 -1274 17609 -13471 -10784 18301 -4105 -15885 14914 2611
1621B611k2577K9753K882l1336J8913J6325l0414P667K6248k7222q432L2783j3669
$$ 2611 -19966 9787 12669 -18667 246 16571 -13843 -6176 20072 -7150 -15582 17201 3532
1634C532k0944K8341r47k7962K3166J2459l2294R733K4143k7542l081L1085j9950
$$ 3532 -17412 10929 9982 -17980 5186 17645 -14649 -4916 19227 -8315 -11396 19689 -261
1647b61j8291L2021l407k7923K3273Q533l0506J4541K1881l0723j596L0466j9985
$$ -261 -18552 13469 10062 -17861 5412 13945 -16561 -2020 19861 -10862 -12458 18008 -1977
1660a977j4358L0548r347k5306K7941O475l2031J6129J8901l0271L016K9648k3869
$$ -1977 -16335 14213 4866 -20440 7501 13976 -18055 -1926 16975 -13296 -10280 19368 -4501
1673d501j2796L1491j0385k2001K7597J042l0028K0676J7328l1668M571K6534
$$ -4501 -17297 14194 3809 -18192 9405 10447 -19581 1095 18423 -13245 -8674 17860
1685A7860k3972p654L1056j5088k0859K9427L48k8724K1225J3482l1662R546K4519
$$ 17860 -6112 -13766 17290 2202 -18657 10770 11118 -17606 3619 17101 -14561 -5015 19504
1698A9504k6285n512K9766j7145j6809L0553m882k7980K3857J0399l0441J1981
$$ 19504 -6781 -12293 17473 328 -16481 14072 9190 -18790 5067 15466 -14975 -2994
1710b994K1195k8008j045K8891j9900j4900K9951p269k5132K6352O210l0687J5004
$$ -2994 18201 -9807 -10852 18039 -1861 -16761 13190 5921 -19211 7141 13351 -17336 -2332
1723b332J9298k9143L006K7296k3704j1135L1301j0383k2867K7073K381k9497
$$ -2332 16966 -12177 -9171 18125 -5579 -16714 14587 4204 -18663 8410 10791 -18706
1735a8706J9625J5616k9811O068K4825k4517o304L0452j5567k0315K9447P8k7290
$$ -18706 919 16535 -13276 -7208 17617 -6900 -13204 17248 1681 -18634 10813 10891 -16399
1748a6399K0509J0883k9807J1091K4152k7819n324K9580j6063j6142K8695n354
$$ -16399 4110 14993 -14814 -3723 20429 -7390 -12714 16866 803 -15339 13356 8002
1760H002k6275K3723R717k9403J1826J9966k8261N4K9266j9803j5723K8652o227
$$ 8002 -18273 5450 15167 -14236 -2410 17556 -10705 -10651 18615 -1188 -16911 11741 5514
1773E514k2097K4093M156l0001J6408J9478k7970O69K5355k1112r220K9586j1241
$$ 5514 -16583 7510 11666 -18335 -1927 17551 -10419 -9750 15605 -5507 -14727 14859 3618
1786C618k2347K5197M036k6525J7214J4039k9029N471K6729k2851q933K7466j2842
$$ 3618 -18729 6468 10504 -16021 1193 15232 -13797 -8326 18403 -4448 -13381 14085 1243
1799A243j7116K7731j827k7857J9992J3952k8244Q172K1079k4683l650K8643j5856
$$ 1243 -15873 11858 10031 -17826 2166 16118 -12126 -3954 17125 -7558 -11208 17435 1579
1812A579j7407K7424l637k4302K2695Q452k9791J1298K1010k5039j083K4910j9617
$$ 1579 -15828 11596 7959 -16343 6352 14804 -14987 -3689 17321 -7718 -8801 16109 -3508
1825c508j1967K9703p671k4289K2874O261k6719J5130J5679k7742K680K5979k0451
$$ -3508 -15475 14228 6557 -17732 5142 11403 -15316 -186 15493 -12249 -9569 16410 -4041
1838d041j0246K7577j1128j9927K5811K820k7477J6443J3864k6159O939K2363
$$ -4041 -14287 13290 2162 -17765 8046 10866 -16611 -168 13696 -12463 -5524 16839
1850A6839k3468p180K8832j2379j8276K4918j097k4057J9276J1293k7176Q134
$$ 16839 -6629 -13809 15023 2644 -15632 9286 8189 -15868 3408 14701 -12475 -4341
1862d341K1010k3603l477K6735j5770j5516K6303l195k2910K0385P670k7031J1628
$$ -4341 16669 -6934 -10411 16324 554 -14962 11341 8146 -14764 5621 13291 -13740 -2112
1875b112J9373k5004j725K5158j7096j2200K6086o886k1676K2188N519k6073J3181
$$ -2112 17261 -7743 -9468 15690 -1406 -13606 12480 5594 -16082 6106 11625 -14448 -1267
1888a267J6325k6037K142K4831j9436j0303K5476r313j8298K4040J551k6212J6390
$$ -1267 15058 -10979 -8837 15994 -3442 -13745 11731 2418 -15880 8160 9711 -16501 -111
1901a11J4476k5658M599K1640k0955o188K6364j2280j7116K4578r03k3444J8824
$$ -111 14365 -11293 -6694 14946 -6009 -12197 14167 1887 -15229 9349 8446 -14998 3826
1914C826J0702k6919P680K0558k1609l231K4259j6005j3632K6401l766k3251J9576
$$ 3826 14528 -12391 -4711 15847 -5762 -8993 15266 -739 -14371 12030 8264 -14987 4589
1927D589Q072k4774J0992J6992k4290k40K4039j6443j1387K4263p369k0288K2237
$$ 4589 12661 -12113 -1121 15871 -8419 -8659 15380 -1063 -12450 11813 4444 -15844 6393
1940F393N205k5436J2463J4723k3483L340K2174k0348q515K5882r100j8883K1979
$$ 6393 11598 -13838 -1375 13348 -10135 -6795 15379 -4969 -13484 12398 3298 -15585 6394
1953F394J816k3186J5824J2294k4866N100K0725k0118m834K4629j2756j6805K4397
$$ 6394 8210 -14976 848 13142 -11724 -6624 14101 -6017 -10851 13778 1022 -15783 8614
1966H614k92k2359J6789R432k4695R221J9528k2400l837K4077j3408j2987K3614
$$ 8614 8322 -14037 2752 12184 -12511 -3290 16238 -6162 -9999 14078 670 -12317 11297
1979A1297m479k1496J9766P708k4684J0886J6048k3620K31K4403j6717j2031K3366
$$ 11297 6818 -14678 5088 12796 -11888 -1002 15046 -8574 -8343 16060 -657 -12688 10678
1992A0678o326j8446K1280L072k5086J3806J5328k3633J843K1548j8804p640K5016
$$ 10678 4352 -14094 7186 10258 -14828 -1022 14306 -9327 -7484 14064 -4740 -12380 12636
2005A2636r767j8517K2104J532k2367J5641J1992k5146N276K0628j9101n126K2966
$$ 12636 2869 -15648 6456 7988 -14379 1262 13254 -11892 -6616 14012 -5089 -10215 12751
2018A2751j3009j4780K5087j524k3574J7162J0399k3562P821J7897k1857k490
$$ 12751 -258 -15038 10049 8525 -15049 2113 12512 -11050 -3229 14668 -7189 -9679
2030i679K3953j3370j3038K2314m237k0223K0270O871k5122R518J7139k1696K24
$$ -9679 14274 904 -12134 10180 5943 -14280 5990 12861 -12261 -2743 14396 -7300 -7076
2043g076K2076j7262j0883K4708n425k0199J8848M759k2519J3338J3494k3749
$$ -7076 15000 -2262 -13145 11563 6138 -14061 4787 9546 -12973 365 13859 -9890
2055i890J974K1842j7907p688K3940r963j8513K2855K813k3585J3835J1557k2010
$$ -9890 -7916 13926 -3981 -11669 12271 2308 -16205 6650 9463 -14122 -287 11270 -10740
2068a0740N398J9403k0010o277K4796j0536j5671K1567j185k1406J7774J0068
$$ -10740 -5342 14061 -5949 -12226 12570 2034 -13637 7930 6745 -14661 3113 13181
2080A3181k4684O958J9146k0651l469K3380j3379j3617K3123l233k0152J8022
$$ 13181 -11503 -4545 14601 -6050 -9519 13861 482 -13135 9988 6755 -13397 4625
2092D625O341k2930J0631J6622k2980r11K2632j4643j0925K2742o535j8682K0382
$$ 4625 10966 -11964 -1333 15289 -7691 -8602 14030 -613 -11538 11204 4669 -14013 6369
2105F369M326k3478J2106J4016k2239J661K0721j6645q597K2811q485j6422K0922
$$ 6369 10695 -12783 -677 13339 -8900 -7239 13482 -3163 -11760 11051 2566 -13856 7066
2118G066O52k2233J4742J2496k2685L428J9571j8436n537K2665j0502j5049K1487
$$ 7066 7718 -14515 227 12723 -9962 -6534 13037 -5399 -10936 11729 1227 -13822 7665
2131G665o46k0905J6007R817k2646O526J7556j9278k830K2198j3733j2504K2463
$$ 7665 7019 -13886 2121 11938 -10708 -4182 13374 -5904 -8734 13464 -269 -12773 9690
2144I690k468k0540J6643P460k1193Q633J5614k0285j329K0933j4508r588K2275
$$ 9690 7222 -13318 3325 10785 -10408 -1775 13839 -6446 -7775 13158 -1350 -10938 11337
2157A1337o549j8751J9155N308k1756J0676J3064k1142K268K0402j7179q816K2213
$$ 11337 4788 -13963 5192 10500 -11256 -580 12484 -8658 -6390 14012 -3167 -11983 10230
2170A0230o723j6378J8639J439k0914J4202J1686k2226M589J7885j7867n584K2823
$$ 10230 3507 -12871 5768 7207 -13707 495 12181 -10045 -5456 12429 -5438 -11022 11801
2183A1801r752j5665K0122N83j9558J4503Q399k1626P473J7307j8994l911K0726
$$ 11801 2049 -13616 6506 7089 -12469 2034 10433 -11193 -3720 13587 -5407 -9318 11408
2196A1408j1113j1649K0774l373j9129J6363P849k1077P926J4996j9441l79J9846
$$ 11408 295 -11354 9420 6047 -13082 3281 11130 -9947 -2021 12975 -6466 -6845 13001
2209A3001j3035j0497J9960m877j6282J7343L668k1566J1581J3716k0265P10J8614
$$ 13001 -34 -10531 9429 4552 -11730 5613 9281 -12285 -704 13012 -7253 -6543 12071
2222A2071j5121p316K1021p800j5608J7674K866j9896J2479J0553k0469M247J7258
$$ 12071 -3050 -10366 10655 2855 -12753 4921 7787 -12109 370 10923 -9546 -5299 11959
2235A1959j6545n086J9749r724j2821J9995q68j9837J4400R247j9873N866J5283
$$ 11959 -4586 -9672 10077 353 -12468 7527 6659 -13178 1222 10469 -9404 -3538 11745
2248A1745j7591k630K0197j1926j1050J9841k991j7602J5883O252k0759Q388J4782
$$ 11745 -5846 -8476 11721 -205 -11255 8586 5595 -12007 3876 10128 -10631 -2243 12539
2261A2539j8452n61J8947j4032r284K0971m915j6945J6262L848j8655J0377J1763
$$ 12539 -5913 -6474 12473 -1559 -10843 10128 5213 -11732 4530 8378 -10277 100 11863
2274A1863j9659J907J8176j4695p682K0157p337j5107J7764K099j8982J1454J0277
$$ 11863 -7796 -5889 12287 -2408 -10090 10067 2730 -12377 5387 7486 -11496 -42 10235
2287A0235j8962L874J6785j6489n673J9865q089j3339J8494j076j8051J4073Q718
$$ 10235 -8727 -4853 11932 -4557 -10230 9635 1546 -11793 6701 5625 -12426 1647 10365
2300A0365k0064N796J5559j6837l177J9377j0711j1625J8939j973j6446J4631
$$ 10365 -9699 -3903 11656 -5181 -8358 11019 308 -11317 7622 5649 -10797 3834
2312C834N219j9437Q608J4724j8346j607J8340j1935r041J9491n415j6220J6914
$$ 3834 9053 -10384 -1776 12948 -5398 -7005 11335 -600 -9641 9850 4435 -11785 5129
2325E129L894j8889R445J2004j8672J735J7672j4345p927J9269p304j3819J8299
$$ 5129 9023 -9866 -421 11583 -7089 -5354 12318 -2027 -9954 9315 2011 -11808 6491
2338F491J004j9767J2364J0742j9135L296J5663j5486m251J9587r756j2848J8581
$$ 6491 7495 -12272 92 10834 -8301 -5005 10658 -4828 -9079 10508 752 -12096 6485
2351F485n95j7605J3452P921j9437N969J5280j6635k980J8690j0841j0783J9486
$$ 6485 5890 -11715 1737 9658 -9779 -3810 11470 -5165 -8145 10545 -296 -11079 8407
2364H407k670j7288J4769O069j8598P794J3245j7741m33J8289j2623r195J9286
$$ 8407 5737 -11551 3218 9287 -9311 -1517 11728 -6013 -6446 11843 -780 -9975 9311
2377I311m458j6013J5826M388j8857R225J1471j7983K135J6781j4132p620J9388
$$ 9311 4853 -11160 4666 9054 -9803 -578 10893 -7090 -4955 11826 -2306 -9926 9462
2390I462o437j4323J6976J669j8443J1817J0001j9238L541J6053j5396m756J8898
$$ 9462 3025 -11298 5678 7347 -11096 721 10722 -8516 -4975 11078 -4318 -9074 9824
2403I824q670j3103J7534J43j7294J3008P482j9146N884J5815j6268l568J8190
$$ 9824 1154 -11949 5585 5728 -11566 1442 8924 -10222 -4338 11477 -4791 -8359 9831
2416I831j0019j0217J8189l249j6587J4845O805j9209P873J3425j7968n61J8212
$$ 9831 -188 -10405 7784 4535 -12052 2793 9598 -9611 -1738 11687 -6281 -6842 11370
2429A1370j1212r839J7794l948j4950J6160L643j9685R385J2868j7526N82J6481
$$ 11370 158 -9681 8113 4165 -10785 5375 9018 -10667 -1282 11586 -5940 -5358 11123
2442A1123j3947o460J9754o877j5412J6517K809j7677J0727R761j8886K957J6734
$$ 11123 -2824 -9284 10470 3593 -11819 4698 7507 -10170 557 10318 -8568 -5611 11123
2455A1123j4077n438J7518q678j2467J8489L07j8644J1686R482j7607M742J4052
$$ 11123 -2954 -8392 9126 448 -12019 6470 6777 -11867 -181 9301 -8306 -3564 10488
2468A0488j6235k947J8923r185j1859J7308j712j6254J4331O868j9090O254J3842
$$ 10488 -5747 -8694 10229 1044 -10815 6493 4781 -11473 2858 9726 -9364 -3110 10732
2481A0732j5562j065J6878j1864r533J9071k822j6282J3759M727j7158R246J1099
$$ 10732 -4830 -5895 10983 -881 -10414 8657 5835 -10447 3312 8039 -9119 127 11226
2494A1226j7949L15J7550j1982q101J7924n888j4197J6087L340j8419R748J0026
$$ 11226 -6723 -6408 11142 -840 -8941 8983 3095 -11102 4985 8325 -10094 -346 9680
2507I680j7064L184J5543j4837o124J8115o218j2509J5240N49j6530J1921Q847
$$ 9680 -7384 -4200 11343 -3494 -9618 8497 2279 -10230 5010 5559 -10971 950 9797
2520I797j8495M077J4804j4392l789J7259q803j1464J7036q98j5753J2956O224
$$ 9797 -8698 -4621 10183 -4209 -7998 9261 458 -11006 6030 5132 -10621 2335 8559
2533H559j7683O529J3704j5544k748J6870r687r021J6926l342j5224J4076N361
$$ 8559 -9124 -2595 11109 -4435 -7183 9687 0 -9021 7905 4563 -10661 3415 8776
2546H776j7335P701J1581j6071j40J6301j1327q153J6599m682j3349J5223K958
$$ 8776 -8559 -858 10723 -5348 -5488 10813 -514 -8667 7932 3250 -10099 5124 8082
2559H082j8024R291J0487j6072J786J4429j2974n558J7529o606j2678J5122R58
$$ 8082 -9942 -651 9836 -6236 -4450 9979 -2995 -8553 8976 2370 -10308 4814 5772
2572E772j6295J1506Q376j7495L471J4339j3722l417J6449q919j0928J7053n41
$$ 5772 -10523 983 9359 -8136 -4665 9674 -4048 -7465 8984 65 -10863 6190 5649
2585E649j6193J1583O850j6012O120J2798j6077k037J7024r428r519J6670k785
$$ 5649 -10544 1039 7889 -8123 -2003 10795 -5282 -7319 9705 277 -9242 7428 4643
2598D643j5011J3913N282j6863O775J1189j5333J49J6469j2011q573J6826l270
$$ 4643 -10368 3545 8827 -8036 -1261 9928 -5405 -5256 11213 -798 -9371 7455 4185
2611D185j3618J3695K481j6614R683J0506j6685J063J4654j1791n875J6684o255
$$ 4185 -9433 4262 6743 -9871 -188 10318 -6367 -5304 9350 -2441 -8316 8368 2113
2624B113j2854J4952J870j5445J0190P622j6787L602J5299j3770n410J6304p307
$$ 2113 -10741 4211 6081 -9364 826 8448 -8339 -4737 10562 -3208 -8618 7686 379
2637C79j0163J5930q23j6105J1752P717j5972M025J3023j4594k225J6505r130
$$ 379 -9784 6146 5323 -10782 970 8687 -7285 -3260 9763 -4831 -7056 9449 319
2650C19r742J5971k278j4287J3824N102j7858O660J2790j4635r91J4914j1444
$$ 319 -9423 6548 4270 -10017 3807 8909 -8949 -2289 10501 -4134 -5125 9789 -1655
2663a655o766J7040m662j3813J3753L219j5950R133R777j6932J330J5614j1992
$$ -1655 -8421 8619 3957 -9856 3897 7116 -8834 299 10076 -6856 -5526 10088 -1904
2676a904o384J6637p124j1880J5891J555j6562R273Q879j5951M430J3360j4661
$$ -1904 -8288 8349 1225 -10655 5236 6791 -9771 -498 8381 -7570 -3140 10220 -4441
2689d441l955J7152p635j0866J5305j075j4886J2075P499j7505M720J2841j3758
$$ -4441 -8396 8756 1121 -9745 5560 4485 -10401 1674 9173 -8332 -3612 9229 -4529
2702d529j501J6078j0395r536J6310j334j4183J1957M248j5984P988J1831j6234
$$ -4529 -6030 10048 -347 -9883 6427 5093 -9090 2867 7115 -8869 -881 10950 -5284
2715e284n38J5682j0361p883J6564m299j3943J3998M013j5952P724R320j5900
$$ -5284 -5822 9860 -501 -8384 8180 3881 -10062 3936 7949 -8003 -279 9041 -6859
2728f859K338J5449j2875o711J6536n509j1790J4534P96j6072J0422R128j6684
$$ -6859 -4521 10928 -1947 -8658 7878 2369 -9421 5113 5909 -10163 259 9387 -7297
2741g297L050J3639j3377l102J6460q438j1266J5606m33j4392J1955N559j6951
$$ -7297 -4247 9392 -3985 -7087 9373 935 -10331 5275 4842 -9550 2405 7964 -8987
2754h987N853J3518j4542k686J5592r178q661J6647l343j4241J2952N171j6604
$$ -8987 -3134 10384 -4158 -6844 8748 -430 -9091 7556 4213 -10028 2924 8095 -8509
2767h509P376J0990j5568J60J5727j0911p788J6607m724j3093J4484L418j7328
$$ -8509 -1133 9857 -5711 -5551 10176 -735 -8523 8084 3360 -9733 4751 8169 -9159
2780i159Q525J0363j5784J880J4068j2686n253J6613o456j2240J5275Q16j5938
$$ -9159 -634 9729 -6055 -4175 9893 -2793 -8046 8567 2111 -10129 5146 5962 -9976
2793i976J0468Q752j6496L224J3397j3121l709J6262q185j1237J5996K1j5178
$$ -9976 492 9244 -7252 -4028 9369 -3752 -7461 8801 616 -10621 5375 5396 -9782
2806i782J1209O202j5927N429J2626j4547k143J6009q960r681J6462k086j4978
$$ -9782 1427 7629 -8298 -2869 9757 -4790 -6933 9076 116 -9565 6897 4811 -10167
2819a0167J2737N448j5802O170J1164j4931j04J5896j0869q421J6386l867j2696
$$ -10167 2570 8018 -7784 -1614 9550 -5381 -5485 10411 -458 -8879 7507 3640 -9056
2832i056J3553K981j6733Q717J0836j5783O26J4440j1644n639J6208n992j2450
$$ -9056 4497 7478 -9255 -538 10298 -5485 -4859 9581 -2063 -7702 8506 2514 -9936
2845i936J4156J444j4557J0271P475j6896L339J4763j3066m580J5448p369j0476
$$ -9936 4220 5664 -8893 1378 8853 -8043 -4704 10059 -3007 -7587 7861 492 -9984
2858i984J5752m73j5577J0878P402j5095M543J1783j4230j920J5949q568r427
$$ -9984 5768 5295 -10282 596 7998 -7097 -2554 9229 -5001 -6921 9028 460 -8967
2871h967J5019k553j3596J3575N122j7038O147J1754j3733q74J4881j0965p008
$$ -8967 6052 3499 -10097 3478 8600 -8438 -2291 9463 -4270 -5144 9737 -1228 -8236
2884h236J5974l781j2919J2951K701j4839Q287R622j5835J148J4711j1417n718
$$ -8236 7738 3957 -8962 3989 6690 -8149 138 9760 -6075 -4927 9784 -1633 -7351
2897g351J5629o081j2041J4620J815j4888Q019Q186j4848L660J2939j3541l839
$$ -7351 8278 2197 -9844 4776 6591 -8297 -278 7908 -6940 -3280 9659 -3882 -7721
2910g721J6238p798r910J4438o23j4463J1114P213j6015M498J1603j3359j618
$$ -7721 8517 719 -9191 5247 4624 -9839 1275 8488 -7527 -3029 8574 -4785 -6403
2923f403J5554r488q964J5540k020j3044J1876L870j5419P234J0904j4674l70
$$ -6403 9151 -337 -9301 6239 4219 -8825 3051 6921 -8498 -1264 9640 -5034 -5404
2936e404J4468r989o684J5017m101j2338J2850K947j4724Q264R047j5908K429
$$ -5404 9064 -925 -7609 7408 3307 -9031 3819 6766 -7958 306 9353 -6555 -4126
2949d126J4225j1755n719J4836n555j0665J4069L73j4497R675P738j5051L233
$$ -4126 10099 -1656 -7375 7461 1906 -8759 5310 5683 -8814 861 8599 -6452 -3219
2962c219J2011j2456l172J4930p465r541J3973j138j3600J1569N949j5993N222
$$ -3219 8792 -3664 -6836 8094 629 -8912 5061 3923 -9677 1892 7841 -8152 -2930
2975b930J1475j2659j936J3943r130p387J5066k654j3141J1927M124j4531P177
$$ -2930 8545 -4114 -6050 7893 -1237 -8624 6442 3788 -9353 2574 6698 -7833 -656
2988f56R732j4440l41J5018j0496o068J4705m779j1939J3820K997j5837P981Q888
$$ -656 9076 -5364 -5705 9313 -1183 -7251 7454 2675 -9264 4556 7553 -8284 -303 8585
3002H585j3780J919J2617j1902m836J5599n873j1129J3901M65j4307R793P293
$$ 8585 -5195 -3276 9341 -2561 -7397 8202 2329 -8800 5101 5566 -8741 1052 8345
3015H345j5234L385J2212j2230k967J5019q058r613J4264n80j3592J0942M895
$$ 8345 -6889 -3504 8708 -3522 -6489 8530 472 -9141 5123 4543 -9049 1893 6788
3028F788j4882N638J1336j3740j661J4755q775q148J4817k336j3146J1680M533
$$ 6788 -8094 -2456 8880 -4860 -6521 8234 -541 -8689 6128 3792 -9354 2326 6859
3041F859j4549O632R629j3972M56J4477j0331o944J4711l943j1185J2543K239
$$ 6859 -7690 -1058 8571 -5401 -4945 9532 -799 -7743 6968 3025 -8160 4383 6622
3054F622j4845Q013R347j4110J263J3023j1444m922J4991n613j0373J2822M72
$$ 6622 -8223 -210 9137 -4973 -3710 9313 -2131 -7053 7938 2325 -8048 4774 5246
3067E246j3606R926O836j5450L454J2689j1665l825J3746p333q909J4778j569
$$ 5246 -8360 1566 8402 -7048 -3594 9095 -2570 -6395 7351 18 -8891 5887 4318
3080D318j3451J0709N292j4160N270J0825j3608j882J4880q807p708J4243l074
$$ 4318 -9133 1576 6868 -7292 -2022 8803 -4805 -6687 8193 -614 -8322 5921 2847
3093B847j2239J2491L936j5005O087R988j2760R6J3374j0419o040J5198m338j1689
$$ 2847 -9392 3099 7035 -7970 -1883 8105 -4655 -4559 8815 -1604 -7644 7554 3216 -8473
3107h473J2230K276j4125Q523Q696j4577J052J2652j0216l898J3747o322j0403
$$ -8473 3757 6033 -8092 431 9127 -5450 -4398 8254 -1962 -5860 7887 1565 -8838
3120h838J3680J302j4096Q446O871j3568L490J1779j2352l754J4686o358r646
$$ -8838 4842 6144 -7952 494 7365 -6203 -2713 9066 -3286 -7040 7646 1288 -8358
3133h358J3400j127j2800J0055O194j4639M462J0790j2630r48J3901q759q531
$$ -8358 5042 3915 -8885 1170 7364 -7275 -2813 7977 -4653 -5601 8300 -459 -8990
3146h990J4158j705j1614J0968K974j3811O476J0564j3690l72J3276r343o062
$$ -8990 5168 3463 -8151 2817 5791 -8020 -1544 9020 -4670 -5042 8234 -1109 -7171
3159g171J4231m431j1254J2523K362j3772P918P904j3911K022J2347j0271m983
$$ -7171 7060 2629 -8625 3898 6260 -7512 406 8310 -5601 -3579 8768 -1503 -6486
3172f486J3772n581r319J2720O3j3760R784O688j3915L219J1388j2152k345J3410
$$ -6486 7286 1705 -7614 5106 5169 -8591 1193 7881 -6034 -2815 8573 -3579 -5924 7486
3186G486p161q178J3308j886j2030J0548M974j4354N007J0344j2072j451J2953
$$ 7486 325 -7853 5455 3569 -8461 2087 7061 -7293 -2286 8058 -4014 -5465 7488
3199G488q863o306J3749l291j1613J0935L736j3335O344Q769j2579K3J2756q995
$$ 7488 -1375 -7681 6068 2777 -8836 2099 5835 -7500 -1156 7613 -4966 -4943 7813 -1182
3213a182n640J3094m059j0954J2555K165j3315P263P578j2839K184J1698j0642
$$ -1182 -6822 6272 2213 -8741 3814 5979 -7336 -73 7505 -5334 -3150 8548 -2094
3226b094m214J3559n379r586J1999P21j2709Q836O687j3922L270J0770j1162k564
$$ -2094 -6308 7251 1872 -7714 4285 5006 -7703 1133 7820 -6102 -2832 7938 -3224 -5788
3240e788J3507p213q764J3263q01j1834R201M642j3634N483J0124j2581r61J2191
$$ -5788 7719 506 -8258 5005 4204 -7630 1571 6213 -7421 -1938 8186 -4395 -5356 6835
3254F835p485o913J3087k773j1149J0717L562j2814N810Q438j2660O92J2826r170
$$ 6835 -650 -7563 5524 2751 -8398 2319 5881 -6933 -1123 7315 -5345 -4653 8173 -997
3268i97o053J3109l984r360J1373J092j3095Q018P915j2850J660J1145r899l831
$$ -997 -7050 6059 2075 -7285 4088 5180 -7915 103 8018 -4832 -3172 7973 -1926 -5757
3282e757J2733n249q983J1786j20j1540Q653N340j2747L194J0827j0761k354J1923
$$ -5757 6976 1727 -7256 4530 4410 -7130 1523 6863 -5884 -2690 8137 -2624 -4978 6945
3296F945p020p206J2743j706j1736R522M476j2432M800Q974j1563r48J2117p779
$$ 6945 -75 -7281 5462 3756 -7980 1542 6018 -6414 -1614 7360 -4203 -5151 6966 -813
3310h13o270J2125k612j0543J0747L176j2884N785Q400j1679P91J1485r914m480
$$ -813 -7083 5042 2430 -8113 2634 5810 -7074 -1289 7111 -4568 -3777 7708 -2206 -6686
3324f686J3004l897r847J0755J314j2083P703P210j2575J882J0905r636l496J2802
$$ -6686 6318 2421 -7426 3329 4643 -7440 263 7473 -5102 -3220 7685 -1951 -5447 7355
3338G355o342q576J2292J4j1316P950M981j2199M012J0120j1536k351J2697o690
$$ 7355 1013 -7563 4729 4743 -6573 1377 6358 -5841 -1829 8291 -3245 -5596 7101 411
3352D11p126J2140k277j0534R358M018j2251M956Q107j1025l10J1722q312o110
$$ 411 -6715 5425 3148 -7386 1972 5990 -6261 -1305 6802 -4223 -4533 7189 -1123 -7233
3366g233J2225k430r997J0453K122j2478O460Q055j1800N67J1055q881m339J2242
$$ -7233 4992 2562 -7435 3018 5140 -7338 -878 7177 -4623 -4056 6999 -1882 -6221 6021
3380F021m412r163J1332R22j1423P416O397j2783L004J0829j0181l292J1872n565
$$ 6021 1609 -7554 3778 4700 -6723 693 7090 -5693 -2689 8140 -2041 -5333 6539 974
3394I74p399J1360o53j1293Q304N441j1905L205R466j0850j491J1839p035p034
$$ 974 -6425 4935 4282 -7011 1293 6734 -5171 -1966 7500 -3350 -4841 6998 -37 -7071
3408g071J1830j715j0293R655L742j2722M550R213j0983o60J1248q101n480J2411
$$ -7071 4759 3044 -7249 2406 6148 -6574 -2024 7189 -3794 -4454 6794 -1307 -6787 5624
3422E624l415r937R901K532j1542O227P666j1891N51J1113q132m649J1627m138
$$ 5624 2209 -7728 2173 4705 -6837 -610 7056 -4835 -4284 6829 -1303 -5952 5675 1537
3436A537r061J0941J266j1359O795O321j1452K374J0155r967l304J2242n041q079
$$ 1537 -7524 3417 4683 -6676 119 6440 -5012 -2638 7517 -2450 -5754 6488 1447 -6632
3450f632J0973k14j1022Q094N127j1213K887R034j0258j596J1509o557o943J1144
$$ -6632 4341 4127 -6895 1199 6326 -4887 -2000 7034 -3224 -4820 6689 132 -6811 4333
3464D333j130r916Q708L433j1648M815Q682j1017j299J1793p353o069J1678k782
$$ 4333 3203 -6713 1995 5428 -6220 -1405 7277 -3740 -5039 6754 -599 -6668 5010 2228
3478B228r848R528K961j1220N826P174j1498Q18J0951q370m600J1157l763q199
$$ 2228 -7620 1908 4869 -6351 -525 6649 -4849 -4031 6920 -1450 -6050 5107 1344 -6855
3492f855J0218J218j1390O855O525j1359K390R200r238k904J1937n199p917J0815
$$ -6855 3363 4581 -6809 46 6571 -4788 -2398 6802 -2436 -5340 6597 1398 -6519 4296
3506D296p99j0326Q589M847j1688L011R051q997k217J0722o812o141J1832j668
$$ 4296 3497 -6829 1760 6607 -5081 -2070 6981 -2016 -4233 6489 -323 -6464 5368 3700
3520C700j0523Q496L820j1466N147P679j0902l53J1045p383n248J0903l033r198
$$ 3700 -6823 1673 5493 -5973 -826 6853 -4049 -4402 6643 -740 -5988 4915 1882 -7316
3534g316R803K424j1260N455O575j0130J215R903q863m002J1753l730q392R658
$$ -7316 2487 4911 -6349 -894 5681 -4449 -3234 6669 -2194 -6196 5557 1827 -6565 3093
3548C093J012j0755P024O025j0685J512R303q635k423J0698n628o946J0135M85
$$ 3093 4105 -6650 374 6399 -4286 -2774 6529 -2106 -4529 6169 541 -6405 3730 4215
3562D215j0092P509L790j0560L692R052j0099k242J0926n627o323J0494j762r746
$$ 4215 -5877 1632 5422 -5138 -1446 7606 -2493 -4735 6191 564 -5759 4735 2973 -6773
3576f773Q640L295j0511M367P109j0173L88J0226p382n529J1026l043q195R170
$$ -6773 1867 5162 -5349 -982 6127 -4046 -3658 6568 -814 -6343 4683 1640 -6555 2615
3590B615J641j1064O348O387r897L15R443p995l118J0726m421p617R937L69j0020
$$ 2615 4256 -6808 -460 5927 -3970 -3655 5788 -2207 -5325 5401 980 -6637 3300 3669 -6351
3605f351P178N184j0846K126R504q463k897R984m967o123J0164r80r903P657M136
$$ -6351 827 6011 -4835 -2709 6795 -1668 -4565 5419 452 -5671 4493 3513 -6390 1267 5403
3620E403j0347L906P855r611j445J0575o196n606J0077j836q887Q208L381j0665
$$ 5403 -4944 -1038 6817 -2794 -4239 6336 140 -5466 4611 2775 -6112 2096 5477 -5188
3634e188M223O963r321J09R461p518m851J1096k929q497Q766J953j0246N577O144
$$ -5188 -965 5998 -3323 -3214 6247 -1271 -6122 4974 2045 -6452 2314 4267 -5979 -402 5742
3649E742r855J008Q763p107l685J0131m335o922R263Q86j0128O649M745j0389
$$ 5742 -4113 -3105 5658 -1449 -5134 4997 662 -6260 3003 3889 -6239 410 5155 -5234
3663e234L247Q478q629k773J0472n107o198R360l45r225P442L616r512L260P073
$$ -5234 -1987 6491 -2138 -4911 5561 454 -5744 3616 3271 -5954 1488 5104 -4408 -1148 5925
3678E925q916l11R652o489n486R825j648q033Q085K253j0393N073O791r299k11
$$ 5925 -2991 -3302 6350 -139 -5625 4200 2552 -5481 2604 4857 -5536 -463 6328 -2971 -3182
3693c182Q952o859m127J0187l556p560Q717J457r944N742N580r915J489R417q239
$$ -3182 5770 -1089 -5216 4971 1415 -6145 2572 4029 -5915 -173 5407 -4508 -3019 6398 -1841
3708a841l086R794m201o528R142Nr375O672M945j0114K819P522q515j282R479
$$ -1841 -4927 4867 666 -5862 3280 3285 -6090 582 5527 -4587 -1768 5754 -2761 -4043 5436
3723E436m900o103R623j198q715P677L808j0655L400P459q515o12R441o582n124
$$ 5436 536 -5567 4056 2858 -5857 1820 5628 -5027 -1627 5832 -2683 -3295 6146 -436 -5560
3738e560J0245j729q792P822K561r659M643O492r420n2R459o552m317R558l475
$$ -5560 4685 2956 -5836 1986 4547 -5112 -469 6023 -3397 -3449 6010 -542 -4859 4699 1224
3753A224p502Q767J658r584M997N505r499J591Q903q172l223J0235l699p103Q852
$$ 1224 -6278 2489 4147 -5437 -440 5065 -4434 -2843 6060 -2112 -5335 4900 1201 -5902 2950
3768B950J76r428P061M419r662K454P866q527j601J0022n366o211R636l91q733
$$ 2950 3126 -6302 759 5178 -4484 -2030 5836 -2691 -4292 5730 364 -5847 3789 3398 -5335
3783e335O870L237r673L862P451r297r04R576n664n118R689k175q362Q211K155
$$ -5335 1535 4772 -4901 -1039 6412 -2885 -3789 5787 123 -4995 4694 2519 -5843 2368 4523
3798D523r528M685O069r341N09R193o922m402R745k952p315Q415J050r826N785
$$ 4523 -5005 -320 5749 -3592 -3083 6110 -812 -5214 4531 1579 -5736 2679 3729 -6097 -312
3813c12N765r498J028Q488p646k822R791l728p146Q873O53r624O822M470r760
$$ -312 5453 -4045 -3017 5471 -2175 -4997 4794 1066 -6080 2793 3446 -6178 644 5114 -4646
3828d646K452P783p942k096R908n500n661R837q80r299P013M224r935L623P277
$$ -4646 -2194 5589 -2353 -4449 5459 -41 -5702 4135 3255 -6044 969 5193 -4742 -1119 6158
3843F158q732j175R640n946n007R724j843q497Q023K557r389L863O595r018K38
$$ 6158 -2574 -3749 5891 -55 -5062 4662 2819 -5678 2345 4902 -4487 -624 5971 -3047 -2809
3858b809Q600o923m012R780k527q223Q515J505r271N401N205r268J003Q553p188
$$ -2809 5791 -1132 -5144 4636 2109 -6114 2401 3906 -5365 36 5241 -4027 -3024 5529 -1659
3873a659l183R583l780p126Q847O28q745N835M370r307K425P857p721k638R746
$$ -1659 -4842 4741 961 -6165 2682 3310 -5435 400 4770 -4537 -2112 5745 -1976 -4614 5132
3888E132m623o167Q939m15q503O921L340r015L113O804q092j125R187n207n083
$$ 5132 509 -5658 3281 2866 -5637 1284 4624 -4391 -1278 5526 -2566 -3691 5496 289 -4794
3903d794Q889j537q023P614K494r760M385O521q924j13Q783o535l720R309k986
$$ -4794 4095 2558 -5465 2149 4643 -5117 -732 5789 -3135 -3248 5535 -1000 -4720 4589 1603
3918A603p270P950J294r078N265N583r414J269Q337o994l113R232m346o049R040
$$ 1603 -5667 2283 3577 -5501 -236 5347 -4067 -2798 5539 -1455 -4568 4664 318 -5731 3309
3933C309r9r179O217M778r347K001P713p935j658R280m766n713Q835o09q768P215
$$ 3309 3210 -5969 248 5026 -4321 -2320 5393 -2542 -4200 5080 314 -5399 3436 2827 -5941 1274
3949A274L472r207K819P271q033m32Q607n941n083R649j784p992P369K453r246
$$ 1274 4746 -4461 -1642 5629 -2404 -2836 5771 -170 -5253 4396 2612 -5380 1989 4442 -4804
3964d804M433N905q684O2Q758o471l611R046l163p152Q444J320r001M981M898
$$ -4804 -371 5534 -3150 -3088 5670 -801 -4412 4634 1471 -5681 2763 4083 -4918 63 4961
3979D961q884J696P614p475k779R625m038o351Q550j31q397O026M439r191K306
$$ 4961 -3923 -2227 5387 -2088 -4867 4758 720 -5631 2919 2788 -5609 417 4856 -4335 -2029
3994b029P413p934j547R235m953n512Q705n29q192O528L111q959L784O661q472
$$ -2029 5384 -2550 -4097 5138 185 -5327 3378 2849 -5343 1185 4296 -4663 -879 5782 -2690
4009b690p16Q682n610m336Q912k425p436P907J951q996M657N763r088Q91Q532
$$ -2690 -3406 5276 -334 -4670 4242 1817 -5619 2288 4239 -4757 -100 5663 -3425 -2534 5998
4024E998p001l647R081k940o655P775J270r431N419N351q904J069P946p371k135
$$ 5998 -1003 -4650 4431 1491 -5164 2611 3881 -5550 -131 5220 -3684 -2615 5331 -2040 -4175
4039d175Q878m094o145Q098M56q484O261L795r127K781P214p824j258Q316m712
$$ -4175 4703 609 -5536 2562 3018 -5466 795 4590 -4537 -1756 5458 -2366 -3624 4692 -20
4054b0n233Q771r99q000O717L250r043L460O567q074q03R048n911m479Q566j492
$$ -20 -5253 3518 2519 -5481 1236 4486 -4557 -1097 5470 -2604 -3407 5641 -270 -4749 3817 2325
4070B325p657P555J988q915M085N896q451P57P885o520l643R415l123o858P858
$$ 2325 -5332 2223 4211 -4704 -619 5277 -3174 -2417 5468 -1052 -4695 4720 1597 -5261 2597
4085B597J064q691N048M792q584J431P697p082k586R176m318o242Q607J42q330
$$ 2597 3661 -5030 18 4810 -3774 -2343 5354 -1728 -4314 4862 544 -5698 2909 3051 -5279
4100e279N982L793r270K681P681q150j554Q937m716n401Q962j320q130P279K760
$$ -5279 703 4496 -4774 -2093 5588 -2562 -4116 4821 105 -5296 3666 2346 -5784 1495 4255
4115D255q967L568O526q340k87Q691n704m821R287k068p517P811K004r207M452
$$ 4255 -4712 -1144 5382 -2958 -3245 5446 -258 -5079 4208 2140 -5377 2434 4438 -4769 -317
4130c17N926q483K85P959o274l328R122l359o985Q188R05r002N313N500r309J334
$$ -317 5609 -2874 -2589 5370 -904 -4232 4890 1531 -5454 2734 3639 -5363 -50 5450 -3859 -2525
4146b525Q178p022k688Q789m415n762Q710j53q521N695M402q880K488P006q019
$$ -2525 5653 -1369 -4057 4732 317 -5445 3265 3112 -5409 286 4688 -4192 -1704 5302 -2717
4161b717j450R386m958n595Q488q22p742O762K942q844L205O529p809n62Q601
$$ -2717 -4167 5219 261 -5334 3154 2332 -5410 1352 4294 -4550 -1345 5184 -2625 -3187 5414
4176E414o056m094R171k025p738P484K146q912M423N670q499K23Q353o177l678
$$ 5414 -642 -4736 4435 2410 -5328 2156 4302 -4610 -187 5483 -3016 -2793 5560 -617 -4295
4191d295Q749l021o984Q262J370q752N093M844r006J685P844p412k821R013l724
$$ -4295 4454 1433 -5551 2711 4081 -4671 422 5266 -3740 -2055 5789 -1623 -4444 4569 845
4206H45n834P807R5q482O257L957r023K845O766q193j037R315n258n627Q761r84
$$ 845 -4989 2818 2913 -5569 688 4645 -4378 -1533 5233 -2960 -3997 5318 60 -5567 3194 2210
4222B210p732P045K726r395L933O477p962o78Q343n465m197Q582k039p220P648
$$ 2210 -5522 1523 4249 -5146 -1213 5264 -2698 -3376 4967 -498 -4695 3887 1848 -5372 2276
4237B276J865q819M677N553r213J203Q125o227l796Q623k765o488P739R18r027
$$ 2276 4141 -4678 -1 5552 -3661 -2458 5667 -560 -4356 4267 1502 -4986 2753 3671 -5356
4252e356N546N018q863J694P132o947k461Q877l852o052Q407m95q157O262L787
$$ -5356 190 5208 -3655 -1961 5171 -1776 -4237 4640 788 -5264 3143 2648 -5509 753 4540
4267D540q697K274O677p024j233Q211n175m659Q924j569p828O694K716q513L431
$$ 4540 -4157 -1883 4794 -2230 -3463 4748 -427 -5086 3838 2269 -5559 1135 3851 -4662 -1231
4282a231O258p792m83Q327n474m132Q407k123o990P095K158q597M082N605q244
$$ -1231 5027 -2765 -3248 5079 -395 -4527 3880 1757 -5233 1862 4020 -4577 -495 5110 -3134
4297c134O98P836o603l454R191k922o722P624J162q496N526M299q434J582P062
$$ -3134 -2436 5400 -1203 -4657 4534 1612 -5110 2514 3676 -4820 706 5005 -3429 -1847 5215
4312E215o983k105Q610m089n748Q109K2q280O296L211q678K763O875p581j496
$$ 5215 -1768 -3873 4737 648 -5100 3009 3031 -5249 1047 4258 -4420 -1657 5218 -2363 -3859
4327c859Q381m328n090Q595j586p631P078K243q608L692O135q317o8Q419n531
$$ -3859 4522 194 -4896 3699 2113 -5518 1560 3803 -4805 -1113 5022 -3295 -3363 5056 -475
4342d75m263Q467j794o804P055J539q439M179N730q379R73P595o426l085Q613
$$ -475 -4738 3729 1935 -4869 2186 3725 -4714 -535 5195 -3184 -2211 5384 -1042 -4127 4486
4357D486l096o535P467J105q367N579M430q804J355P662o428k708Q575m417n434
$$ 4486 1390 -5145 2322 3427 -4940 639 5069 -3735 -2380 5282 -1146 -3854 4721 304 -5130
4372e130Q091R6q372N807L873q741K705O607p479j544Q559m287n706Q685j240
$$ -5130 2961 3057 -5315 492 4365 -4376 -1671 4936 -2543 -4087 4472 185 -5521 3164 1924
4387A924p591O713L491r303L118O319p521k04P826n397m305Q834j637p389O874
$$ 1924 -5667 1046 4537 -4766 -1648 4671 -2850 -3054 4772 -625 -4930 3904 2267 -5122 1752
4402A752K134q731M408N786q129j54Q097n990l171Q377k794o840Q022J155q590
$$ 1752 3886 -4845 -437 5349 -2780 -2934 5163 -827 -3998 4379 1585 -5255 2767 3922 -4668
4417d668N330M538q884J914P521p196k873R025l680n894P555O8p947O264L402
$$ -4668 662 5200 -3684 -1770 5751 -1445 -4318 4707 1027 -4867 2688 2756 -5191 1073 4475
4432D475q559K234O896p417j288Q611m749n348Q366q07p859O618K909r241M062
$$ 4475 -4084 -1850 5046 -2371 -3659 4952 203 -5145 3221 2414 -5445 1173 4082 -5159 -1097
4447a097O274p760q47P972n416l711Q690k545p022P167K317r009M722N621q918
$$ -1097 5177 -2583 -3430 4542 -874 -4585 4105 1560 -5462 1705 4022 -4987 -265 5356 -3562
4462c562J100P655o150k832Q041l113o166Q009M82q614N296M910q633J843P054
$$ -3562 -2462 5193 -957 -3789 4252 1139 -5027 2982 3464 -5150 146 5056 -3577 -1734 5320
4477E320p091k351Q970l936o049Q150J43q243N828M065r132K638O520p265j088
$$ 5320 -1771 -4122 4848 912 -5137 3013 3156 -5087 741 4806 -4326 -1688 4832 -2433 -3521
4492c521Q299n368m576Q579j116p537O555K535q239L133O167p999j93Q050n571
$$ -3521 4778 -590 -5166 3413 2297 -5240 1315 3850 -4389 -1256 4911 -3088 -3281 4769 -802
4507h02l837Q517k223o963P246J993q467M190M916p832R83P830o878k967Q618
$$ -802 -4639 3878 1655 -5308 1938 3931 -4536 -346 4570 -3262 -2279 5551 -1327 -4294 4324
4522D324k969n833P044L80p733N449M024q253J749P018o908j723Q445m385n711
$$ 4324 1355 -4478 2566 2946 -4787 662 4686 -3567 -1818 5200 -1708 -3431 5014 629 -5082
4537e082Q258o13p489N926L188q340K571O849p447j608Q277m538m834Q227j384
$$ -5082 3176 2563 -4926 1000 4188 -4152 -1581 5268 -2179 -3787 4490 -48 -4882 3345 1961
4552A961p422O610K687q465L556O022q059r6P993n311m379Q180j701o693P200
$$ 1961 -5461 1149 3836 -4629 -1073 4949 -3110 -3206 4787 -524 -4903 3277 1576 -5117 2083
4567B083J862q781M324N374p844J120O824n903l044Q407l183o098O951J165p745
$$ 2083 3945 -4836 -512 4862 -2982 -1862 4962 -941 -3985 4422 1239 -4859 2092 3257 -4488
4582d488M854M521q171J373O970o456k140Q144m144n010P552L78q244N731L641
$$ -4488 366 4887 -3284 -1911 5059 -1397 -3537 4607 463 -4547 3005 3383 -4861 870 4511
4597D511q491K799N832p403r13P899m127m613P675j291p098O540K308q021L373
$$ 4511 -3980 -1181 4651 -2752 -3665 4234 107 -4506 3169 1878 -5220 1320 3628 -4393 -1020
4612a020N580p614J87P560n469l952Q078j892o091O613J418p944M299N008p828
$$ -1020 4560 -3054 -2867 4693 -776 -4728 3350 1458 -4633 1980 3398 -4546 -247 4761 -3067
4627c067P42O914n816k777Q531l419n883P053J057p556M666M300q113J617P035
$$ -3067 -2325 4589 -1227 -4004 4527 1108 -4775 2278 3335 -4221 445 4745 -3368 -1751 5284
4642E284o730k057P951l415n406P468l76p537N764L408q193K873O031p354r82
$$ 5284 -1446 -3503 4448 1033 -4373 3095 2719 -4818 946 4354 -3839 -966 5065 -2289 -3271
4657c271P793m215n049P780j319o742O671K236q399L355N672p043p34P746n148
$$ -3271 4522 307 -4742 3038 1719 -5023 1648 3884 -4515 -1160 4512 -2531 -3265 4481 -667
4672f67l599P903k029o595O636J906q230M205M947p360L04P094n166l083P606
$$ -667 -4266 3637 1608 -4987 1649 3555 -4675 -470 4477 -2883 -2579 4515 -651 -3734 3872
4687C872k530n968P115P61p796M584M634p620J150O737o476j965P835l449n551
$$ 3872 1342 -4626 2489 3250 -4546 38 4672 -2948 -1798 4939 -1537 -3502 4333 884 -4667
4702d667P263N69p752N406L692q040K122N998o421j587P794m297m809P834o22
$$ -4667 2596 3165 -4587 819 4511 -3529 -1407 4591 -1830 -3417 4377 80 -4729 3105 2483
4717B483p000N545K600p609K926N560p321k14P339m807l754P666j597o542O259
$$ 2483 -4517 1028 3628 -3981 -1055 4505 -2816 -3030 4309 -498 -4252 3414 1817 -4725 1534
4732A534J820p631M023M782p555L94P113n173l425P641k476n452O361J211p414
$$ 1534 3354 -4277 -254 4528 -3027 -2633 4480 -693 -4118 3523 1047 -4405 1956 3167 -4247
4747d247M420M272p574J600O105n939j985P398k901n537P420l35o843N060L411
$$ -4247 173 4445 -3129 -1529 4576 -1363 -3348 4050 1149 -4388 3032 2697 -4146 914 4325
4762D325p908K073O460o696j375P206l863m475P429r88o705N677K730p565K444
$$ 4325 -3583 -1510 4950 -1746 -3121 4085 222 -4253 3176 2188 -4517 1160 3890 -3675 -1231
4777a231N725o628j093P496m608m163P519j634o126O456J532p493K962N529o941
$$ -1231 4494 -2134 -3227 4269 -339 -4502 3017 1383 -4743 1713 3245 -4248 -1286 4243 -2698
4792b698L53O472n247k913P863k024o605O860J089p254M168M223p297R56O853
$$ -2698 -2345 4127 -1120 -4033 3830 1806 -4799 2061 3150 -4104 64 4287 -3010 -2054 4799
4807D799n882k261P651l308n733P488K63p440M925L727p439J752O095o386j827
$$ 4799 -1083 -3344 4307 999 -4734 2754 3017 -4423 502 4229 -3210 -1458 4637 -1749 -3576
4822c576P813l818m910P386o48o925O031K507p498K225N546o406o20O843m520
$$ -3576 4237 419 -4491 2895 2247 -4678 1353 3860 -3638 -1413 4133 -2273 -2893 3950 -570
4837e70m090P876j290o644N864K014p538L671M843p036L85O972n241l359P708
$$ -570 -4660 3216 1926 -4718 1146 3160 -4378 -707 4136 -2900 -2515 4457 -784 -4143 3565
4852C565k367n817O648R52o792L636M446p366J097O921n813k563P124k774m951
$$ 3565 1198 -4619 2029 2981 -3811 -175 4271 -3095 -1998 4923 -890 -3453 3671 897 -4054
4867d054O684O8o859M496L910p346J619O126o542j435P469l831m342O806m98o785
$$ -4054 2630 2698 -4161 335 4245 -3101 -1482 4644 -1898 -3333 4136 305 -4037 2769 2271 -4514
4883d514N693K723p596K864N408o868m77O679m339m000P517j281o211N766K149
$$ -4514 1179 3902 -3694 -830 4578 -2290 -2767 3912 -427 -4427 3090 1809 -4402 1364 3513
4898C513p483L254N024p273K70O541m689l203P291j849o210O776J023p147L635
$$ 3513 -3970 -716 4308 -2965 -2695 3846 -843 -4046 3245 1396 -4814 1962 2985 -4162 -527
4913e27M640o832P10O780n780k551P132k413n437O531Q07o894M180L668p227J707
$$ -527 4113 -2719 -2009 4771 -1009 -3560 3572 1159 -4278 2253 3060 -3834 346 4014 -3213 -1506
4929a506N977n732j901P410l789m947O975K3p053N448K805p104K203N065o011
$$ -1506 4471 -1261 -3162 4248 459 -4488 2487 2510 -4543 905 3710 -3394 -1191 3874 -2137
4944b137j052P217m291l423O582j347o103N947J983o962K797M720o295l00O922
$$ -2137 -3189 4028 -263 -3686 2896 1549 -4554 1393 3376 -3586 -789 3931 -2364 -2664 4258
4959D258m561l642O546j526n030N904J031p128L965M383o992P27O504n304k674
$$ 4258 -303 -3945 2601 1075 -3955 1949 2980 -4148 -183 4200 -2792 -2065 4439 -865 -3539
4974c539P451k708n415O239R46p029M824L241o790J224O100n570k046O952l719
$$ -3539 3912 1204 -4211 2028 2974 -4055 769 4010 -2780 -1556 4544 -1026 -3072 3880 161
4989A61m340P016m32o437M740L100o949J902N511o336j006O801m091l567O802
$$ 161 -4179 2837 2405 -4032 708 3808 -3141 -1239 4272 -2064 -3070 3731 -360 -3927 2875
5004B875j170o309N571K452p129K390N534o851J92O541m684l419P130j541n905
$$ 2875 1705 -4604 967 3419 -3710 -1320 4214 -2637 -2445 4096 -588 -4007 3123 1582 -4323
5019d323N976J185o434L384M181o922P92O238n094k310O892k485n249O322J035
$$ -4323 1653 2838 -3596 -212 3969 -2953 -2161 4077 -1017 -3327 3565 1080 -4169 2153 3188
5034C188o940M066L116o014J359N293n281k009O711k867m353O143k58o111M955
$$ 3188 -3752 314 3430 -2584 -1225 4068 -1213 -3222 3489 622 -3731 2412 2154 -3957 998
5049I98K929p284K263N488o104j239O732l443m493O563l99o091N145J886o566
$$ 998 3927 -3357 -1094 4394 -1710 -2949 3783 340 -4153 2410 2011 -4080 1065 2951 -3615
5064c615L006M728o531j80O544m614l160O896j502n829N571J748o546L086M239
$$ -3615 -609 4119 -2412 -2592 3952 -662 -3822 3074 1572 -4257 1314 3062 -3484 -398 3841
5079C841o686M32O545m702k771O620k230n016O497q6o342M172M102o923J063N648
$$ 3841 -2845 -2413 4132 -570 -3341 3279 1049 -3967 2530 2444 -3898 274 4376 -2547 -1484 4164
5095D164n167j767O638k997m692O023J16o046M633L003p292K198M988n315j142
$$ 4164 -1003 -2770 3868 871 -3821 2202 2318 -3728 905 3908 -3384 -1186 3802 -1513 -2655
5110b655O165l668l628O357p67o194N155K376o608K913M264o208l60O577m267
$$ -2655 3510 -158 -3786 2571 1804 -4390 765 3141 -3467 -554 3710 -2498 -2858 3719 -548
5125e48l247O656j766n620O146J132o320L210L868o004N30N997m752k761O755
$$ -548 -3795 2861 1095 -4525 1621 2753 -3567 -357 3511 -2493 -1963 4034 -718 -3479 3276
5140C276k044n215N767Q67o185L587L825o411R51N523m825j758O563l178m282
$$ 3276 1232 -3983 1784 2651 -3534 53 3878 -2533 -1582 3941 -884 -2642 3921 743 -3539
5155c539O014o0n816L966K616o461K628M858n937q87N992l401l625O164p07o102
$$ -3539 2475 2415 -3401 565 3181 -3280 -652 4206 -1731 -2618 3374 -27 -3652 2512 1805 -4297
5171d297M805K641o371K246M553n958j84O340m197l239O217j424n030N101J369
$$ -4297 508 3149 -3222 -976 3577 -2381 -2565 3775 -422 -3661 2556 1132 -3898 1203 2572
5186B572o610L832M037o368L68N756m433k419O379j927n026N637N13n652L790
$$ 2572 -4038 -206 3831 -2537 -2169 3587 -846 -3265 3114 1187 -3839 1798 2311 -3341 449
5201D49L167o113Q71N625m895j853N965k876l810N979K2n940L756K900n949J811
$$ 449 3616 -2497 -1626 3999 -896 -2749 3216 340 -3470 2509 2531 -3409 347 3247 -2702 -891
5217h91M531n277r93O128l492l909O320q46n527N185J840o430K596M304n497n61
$$ -891 3640 -1637 -2630 3498 6 -3903 2417 1571 -3956 1229 3069 -3361 -765 3539 -1958 -2519
5233b519N931m073k870O249j507n300N327J047n759K989L884n800J36N755m320
$$ -2519 3412 -661 -3531 2718 1211 -4089 1238 2285 -3474 -485 3399 -2401 -2265 3490 -830
5248h30j888N771j916n388N999R41o280L666L099n489J009N320n123j993O614
$$ -830 -2718 3053 1137 -4251 1748 2689 -3591 75 3174 -2315 -1306 4014 -1109 -3102 3512
5263C512k806l932N406n9n718M462K552o285J668N143n642o97O126l654l543N747
$$ 3512 706 -3226 2180 2121 -3597 865 3417 -2868 -1200 3943 -1699 -2396 3730 76 -3467 2280
5279B280n53n011M337J687o233K631M710n797m75N714l483l085N950j519m658
$$ 2280 1727 -3284 1053 2740 -3493 -862 3848 -1949 -2424 3290 -193 -3278 2672 1153 -3505
5294c505M616J333o186L491L836o036P95M997l934k327N799k203m382N619O07
$$ -3505 1111 2444 -3742 -251 3585 -2451 -1656 3341 -593 -2920 2879 676 -3706 1913 2520
5309B520n886L362L500n752Q82M864m747j385O043k797l873N243P16o336M139
$$ 2520 -3366 -4 3496 -2256 -1374 3490 -1257 -2642 3401 604 -3269 1974 2690 -3646 493
5324D93K830o009J606M789n163o96N576l327k967N068o06m979M370J559n505K597
$$ 493 3323 -2686 -1080 3709 -1454 -2150 3426 99 -2868 2200 1594 -3385 985 2544 -2961 -364
5340c64L901n556l22N628l854k668O023j757m964N355J284o133K985L537n389
$$ -364 3537 -2019 -2341 3287 -567 -3235 2788 1031 -3933 1422 2706 -3427 -442 3095 -2294
5355b294O77N117m689j999O129k143m157M856L14n039L686K783n568J315M496
$$ -2294 -1617 3500 -1189 -3188 2941 798 -3359 1497 1811 -3228 458 3241 -2327 -1012 3484
5370C484m852p92N697l164l702N759m72n073L901K325o073K297M143m961n42N244
$$ 3484 -1368 -2160 3537 373 -3329 2430 1958 -3115 786 3111 -2962 -665 3478 -1483 -2025 3219
5386C219l096l246N647j118n278M857J665n588K480L589n554L62N834m557k481
$$ 3219 123 -3123 2524 1406 -3872 985 2650 -2938 -458 3131 -2423 -2061 3773 -784 -3265
5401c265O040k131m405N309O66n762L412L167n243O01N240m824j769N910k183
$$ -3265 2775 644 -3761 1548 2214 -3548 -136 3031 -2212 -1611 3629 -1195 -2964 2946 763
5416G63m024M832N61n672M047K796o087J409M859m810q11N335k594l840N640j11
$$ 763 -3261 1571 2132 -3540 507 3303 -2784 -1375 3484 -1326 -2137 3198 604 -3236 2404 2293
5432B293n392L871K356n855J986M409n032j000N440l106l030N503j114m735M571
$$ 2293 -3099 772 3128 -2727 -741 3668 -1364 -2364 3076 -30 -3060 2443 1329 -3406 1165
5447A165J828o004K463L868n540M04M905l748k812O089j481m841M797J146n462
$$ 1165 2993 -3011 -548 3320 -2220 -1816 3089 -659 -3471 2618 1137 -3704 1093 2239 -3223
5462c223L415K990n833O70N249m275j935N927k561m016M919Q65n334L494K371
$$ -3223 192 3182 -2651 -1981 3268 -1007 -2942 2985 424 -3592 1327 2192 -3142 352 2723
5477B723n430J692M524m779j103N490k562l686N172j86n100M065K481n876J566
$$ 2723 -2707 -1015 3509 -1270 -2373 3117 555 -3131 2041 1855 -3245 820 3301 -2575 -1009
5492a009M306m753o13N368k996l538N695q28m989M656J088n736K615M449n493
$$ -1009 3297 -1456 -2069 3299 303 -3235 2460 1632 -3357 1299 2387 -3349 -734 3715 -1778
5507a778m39N667l832k631N606j142n026M607J664o003K715L781n678N16N377
$$ -1778 -2217 3450 -382 -3013 2593 1451 -3575 1032 2696 -3307 -592 3189 -2489 -1973 3404
5522C404m216j948N551k333m022N405O99n853L067L810n862Q78M593m401j219
$$ 3404 -812 -2760 2791 458 -3564 1841 2540 -3313 -246 3564 -2298 -1420 3173 -1228 -2447
5537b447N474k473l704N220r5n251L822K662o121J874M832n227q86N733l382l475
$$ -2447 3027 554 -3150 2070 1975 -3276 546 3208 -2913 -1039 3793 -1434 -2320 3413 31 -3444
5553c444N546m68n220M146K088n125J783M312n276l94N175l489k704N541j180
$$ -3444 2102 1634 -3586 560 2648 -2477 -694 3618 -1658 -2052 3123 -366 -3070 2471 1291
5568A291n420N230J458n623K945L115n149L19N195m183k226N421j458m398M990
$$ 1291 -4129 1101 2559 -3064 -119 2996 -2153 -1834 3361 -822 -3048 2373 915 -3483 1507
5583A507N05n391L344L445n817P49N017m651j206N743k477m255N377N02n604L689
$$ 1507 2012 -3379 -35 3410 -2407 -1658 3359 -1292 -2498 3245 768 -3487 1890 2392 -3212 477
5599D77K720n766J809M131m683j001N315k685l603N488n18n061L992K386n603
$$ 477 3197 -2569 -760 3371 -1312 -2313 3002 317 -3286 2202 1684 -3377 615 3001 -2602
5614b602K172L700m561n28M884l141l028N655j096m642M385J234n738K982L740
$$ -2602 -430 3270 -1291 -1819 3065 -76 -3104 2551 1455 -3187 1198 2432 -3306 -324 3416
5629C416m968n87N322m057k081N476j868l931M777P32n308K971L153n459Q29M908
$$ 3416 -1552 -2139 3183 -874 -2955 2521 653 -3278 1499 2231 -3077 -106 3047 -2412 -1583 3325
5645C325m342j424N144k182l732N212j45m900L505K390n219J361M525m801q83
$$ 3325 -1017 -2441 2703 521 -3211 2001 1856 -3044 461 2851 -2368 -1007 3518 -1283 -2166
5660b166N379l100k997N304p55n053M244J797n140J820L878m762m01N369l655
$$ -2166 3213 113 -2884 2420 1665 -3388 856 2653 -2487 -667 3211 -1551 -1952 3417 -238
5675b38k661N437j553l938M509N35n258L126L088n137J84N035l806k205N614k010
$$ -238 -2899 2538 985 -2953 1556 2091 -3167 -41 3047 -2090 -1906 3129 -677 -2882 2732 722
5691G22m053M481R53n184L059K786n593J401M787m461j513N769k833l545N271
$$ 722 -3331 1150 2103 -3081 -22 2764 -2829 -1428 3359 -1102 -2615 3154 321 -3224 2047
5706B047l12m781L547K632n524J255M463m570j161N509k789l393N126p84m193
$$ 2047 1735 -3046 501 3133 -2391 -1136 3327 -1243 -2404 3105 316 -3077 2049 1265 -2928
5721b928M376J182n549K220M113n138n09N362l373k487N102j289m542M537J088
$$ -2928 1448 2630 -2919 -699 3414 -1724 -2233 3129 -244 -2731 2371 1082 -3460 1077 2165
5736B165n118K715L144n065J29N465m158k199N541j637m257M729O02n533L340
$$ 2165 -2953 -238 2906 -2159 -2030 3435 -723 -2922 2619 982 -3275 1454 2056 -3477 -137
5751a37K734n005J063M442m206j423N376j970m192N349m61m629L391K547n285
$$ -137 2597 -2408 -1345 3097 -1109 -2532 2844 874 -3318 2031 1570 -3059 332 2879 -2406
5766b406J335M319m353j168N100k625k985M985m49m679L843J821n505K232L632
$$ -2406 -1071 3248 -1105 -2273 2827 202 -2783 2202 1753 -2926 917 2738 -2767 -535 3097
5781C097m597n44N271l371k666N170j246m335M121J795n730K687L521n311L66
$$ 3097 -1500 -2044 3227 -144 -2810 2360 1114 -3221 900 2695 -3035 -348 3173 -2138 -1772
5796a772M886l686k541N717j855m098M907N70n453L233K827n211J154M355l881
$$ -1772 3114 -572 -3113 2604 749 -3349 1558 2128 -3325 -92 2735 -2476 -1322 3033 -848
5811h48j698N166j853l947M650N11n146L647K472n680J814M360m944n83N012k591
$$ -848 -2546 2620 767 -3180 1470 1981 -3165 482 2954 -2726 -912 3448 -1496 -2079 2933 342
5827C42l420N280m35m986L883K130n543K345L649m866l66N085l251k477M783j021
$$ 342 -3078 2202 1767 -3219 664 2794 -2749 -404 3245 -1621 -1987 3098 -153 -2630 2153 1132
5843A132m154L963J690n541K357L400m830L98M745l690k502N578j824m057M733
$$ 1132 -3022 941 2631 -2910 -553 2847 -1983 -1585 3160 -530 -3032 2546 722 -3335 1398
5858A398O24n298L387K929n519Q40M746l885j844N437k585l255M931l36m514L322
$$ 1398 2022 -3276 111 3040 -2479 -1639 3107 -778 -2622 2815 230 -3025 1906 1570 -2944 378
5874C78K228n062J518M221m854m49N315l062k983M577K3n036M241J706n198J723
$$ 378 2606 -2456 -938 3283 -1571 -2020 3295 233 -2750 1827 1850 -3186 1055 2761 -2437 -714
5890g14M121m984n55N019l057k884N531j337m355M304J355n204K381L932n594
$$ -714 3407 -1577 -2132 2887 -170 -3054 2477 1140 -3215 1089 2444 -2760 -379 3553 -2041
5905b041j3N161l864k009N300j637m047M504Q62n244L134K716n026Q65M383m140
$$ -2041 -2054 3107 -757 -2766 2534 897 -3150 1354 2216 -3028 106 2822 -2204 -1339 3044 -1096
5921a096j646N675k344l758M888K43m926L196K402n094J749L986m599r81N353
$$ -1096 -2742 2933 589 -3169 1719 1962 -2964 232 2634 -2460 -711 3275 -1324 -2305 3048
5936C048k460l680M956k06m455L692J857n201K059L541m470p68M860k891k251
$$ 3048 588 -3092 1864 1658 -2797 895 2752 -2449 -390 3151 -1319 -2087 2773 -118 -2369
5951b369N154j489m476M103J285m748K144L681n044K4M645l656j887N164k023
$$ -2369 2785 1296 -3180 923 2208 -2540 -396 3285 -1759 -1735 2910 -746 -2633 2531 508
5966E08l690M876N15n317K780K936m931Q17M548m020j645N100k111l382M688R2
$$ 508 -3182 1694 2209 -3108 -328 2608 -2323 -1506 3042 -978 -2623 2477 366 -3016 1672 1764
5982A764m926L500K394n162J023M115l944p58N156k981l220M695J16m424L516
$$ 1764 -3162 338 2732 -2430 -1407 2708 -1236 -1994 3162 181 -3039 1656 1772 -2652 864
5997H64J797n119J857M047m721q45N060k945k552N176j572m393M427J549n278
$$ 864 2661 -2458 -601 3446 -1275 -2120 2940 -5 -2557 2619 1047 -3346 1081 2630 -2648
6012b648K289L064m677M98M767l960j997M909j426l999M759M61n071L073K708
$$ -2648 -359 2705 -1972 -1474 3293 -667 -2664 2245 819 -3180 1579 2040 -3031 42 2750
6027B750n011O90M423m023j134N027k267l550M674J03m620L422K312n298J227
$$ 2750 -2261 -1571 2852 -1171 -2305 2722 455 -3095 1579 1682 -2938 484 2796 -2502 -1275
6042a275M504m337j572N605k690l056M887p07m374L698J924n149K131L541m905
$$ -1275 3229 -1108 -2680 2925 235 -2821 2066 1359 -3015 683 2607 -2542 -411 3130 -1775
6057a775R2M961l276k673N028j055m361M586J163n454K531L241m893L47M610l760
$$ -1775 -1683 3278 2 -2671 2357 1302 -3059 1527 2690 -2764 -233 3008 -1885 -1538 3072 -688
6073f88j945N149j608l725M170K52m649L229K445m940Q43M274l835j434M896k240
$$ -688 -2633 2516 908 -2817 1353 1605 -3044 185 2630 -2310 -1467 2807 -1028 -2462 2434 194
6089A94l370M730O5m446L146J761m750J948M025m804p54M989k426l059N002j021
$$ 194 -3176 1554 1619 -2827 319 2080 -2670 -722 3303 -1501 -2255 2734 308 -2751 2251 1230
6105A230m188L663K257n586K022L669m693L24M548l625k464N116p78m459M344
$$ 1230 -2958 705 2962 -2624 -602 3067 -1626 -1302 3246 -379 -2843 2273 1495 -2964 1380
6120A380P08m706K634L072n020M46M534l578j691M740k066l615M585N18m577K554
$$ 1380 2088 -2618 16 3088 -1932 -1486 3048 -530 -2221 2519 453 -3162 1423 1941 -2636 -82
6136h2K753n071J104M422m122j295M647k449l074M807k13m873L847K234n194J542
$$ -82 2671 -2400 -1296 3126 -996 -2291 2356 -93 -3167 1640 1427 -3446 401 2635 -2559 -1017
6152a017L968m265p26M954k993k761M931o54m370M106J163n051K269L495m614
$$ -1017 2951 -1314 -2040 2914 -79 -2840 2091 1437 -2933 1173 2336 -2715 -446 3049 -1565
6167a565k59M742l550j735M967j508m030M410O06m823K954K896m793O56M148l956
$$ -1565 -1824 2918 -632 -2367 2600 1092 -2938 1472 2078 -2745 209 3105 -1688 -1032 3116 -840
6183h40j400M443j740l703M855J15m778L425K208m719J236L981m230j306N017
$$ -840 -2240 2203 463 -3240 1615 1730 -3048 377 2585 -2134 -898 3083 -1147 -2453 2564
6198B564k552k755M658r27l978L867J220m411J436L827m351k31M442l221k331
$$ 2564 12 -2743 1915 988 -2990 877 2097 -2314 -878 2949 -1402 -1633 2809 -412 -2743
6213b743M818j049m053L981J105m776K324L415m713N4M763l222k225M773j323
$$ -2743 2075 1026 -3027 954 2059 -2717 -393 3022 -1691 -1637 3126 -96 -2321 2452 1129
6228A129l950L773J192m755K699K744m817M76M716m044j533N193k279l353M419
$$ 1129 -2821 952 2144 -2611 88 2832 -1985 -1509 3207 -837 -2370 2823 544 -2809 1610
6243A610K73m697L032K527m860J139L340l778o06M651k332l075M350k68l985L586
$$ 1610 1883 -2814 218 2745 -2115 -976 2364 -1414 -2020 2631 299 -2776 1574 1306 -2679 907
6259I07J413m955J899L749m432n60M543k658k681M930r02m132M023J003m474K333
$$ 907 2320 -2635 -736 3013 -1419 -1979 2564 -94 -2775 2155 1253 -2879 1144 2147 -2327 6
6275FK701m476K71M326k778k282M690j604l628M077O75m415K310K681m161N13
$$ 6 2707 -1769 -1498 2828 50 -2232 2458 854 -2774 1303 1978 -2437 -127 2554 -1607 -1094
6291a094M000l631j284M532j912l411M175L89m539L226K203n029J073M057l778
$$ -1094 2906 -725 -2009 2523 611 -2800 1375 1764 -2775 451 2654 -2375 -1302 2755 -1023
6306a023r20M557k405l053M651k85m271L154J611m837K338L019m263k60N053l357
$$ -1023 -1943 2614 209 -2844 1807 1522 -2749 405 2016 -2821 -483 2536 -1727 -1987 3066 -291
6322b91k409M779j085l827L706J392m864K160L146m560L87M491l561j733M503
$$ -291 -2700 2079 994 -2833 873 2265 -2599 -439 2707 -1853 -1466 3025 -536 -2269 2234
6337B234j541l489M188N69m276K363K727m734O14M324l769j035M273j898l225
$$ 2234 693 -2796 1392 1961 -2315 48 2775 -1959 -1345 2979 -790 -1825 2448 550 -2675
6352b675M052K03m462L230K351n112J340L894l935j018M461k403k818M902o60
$$ -2675 1377 1580 -2882 348 2699 -2413 -1073 2821 -1114 -2132 2329 -74 -2892 2010 1350
6367A350m201L428J270m383J977L162m071p20M835k675k402M302r12l868L826
$$ 1350 -2851 577 1847 -2536 -559 2603 -1468 -2188 2647 -28 -2430 1872 960 -2908 918
6382I18J393m698J832L263m256L51M321l531j867M248j069l308L909L97m292K576
$$ 918 2311 -2387 -555 2708 -1548 -1197 3124 -407 -2274 1974 905 -2403 1506 1903 -2389 187
6398A87K825m923O37M049l260j337M133j839l166M458K1m466K497K628m352J083
$$ 187 3012 -1911 -1274 2775 -485 -1822 2311 472 -2694 1764 1785 -2681 -184 2444 -1908 -825
6414h25L765l972r31M231k375k567M203o56l657L167J736m369J476L358m102j96
$$ -825 2940 -1032 -1963 2268 -107 -2674 1529 873 -2784 383 2119 -2250 -774 2584 -1518 -1714
6430a714M047k784k334M870j352l466L617J135m359K110L056m344J06M350l428
$$ -1714 2333 -451 -2785 2085 733 -2733 884 2019 -2340 -230 2826 -1518 -1412 2938 -490
6445d90j700M386j477l185L694N60m011K347K142l777O54L534l337j303M320j738
$$ -490 -2190 2196 719 -2466 1228 1788 -2223 124 2266 -1511 -857 2677 -660 -1963 2357 619
6461F19l152M111p2l903K612J999m376J605L200l970l61M141k350k777M233m45
$$ 619 -2533 1578 1506 -2397 215 2214 -2162 -557 2643 -1327 -1688 2453 103 -2674 1559 1114
6477A114l910L405J488m670J647L373l775m03M074k566k155M101r91l399L121
$$ 1114 -2796 609 2097 -2573 -926 2447 -1328 -1731 2343 -223 -2378 1723 732 -2667 454
6492D54J283m113K178K846m220J18M008k923j741M498j851l093M003O02m345K182
$$ 454 1737 -2376 -198 2648 -1572 -1454 2554 -369 -2110 2388 537 -2556 1447 2049 -2296 -114
6508a14K507l931N17L803l561j222M231k086k367L852pm260L097K002m149P05
$$ -114 2393 -1538 -1021 2782 -779 -2001 2230 144 -2223 1629 1622 -2638 459 2461 -1688 -983
6524i83L439l788o69M511k506k866M212m1l797K759J575m120J764K815l965J0
$$ -983 2456 -1332 -2001 2510 4 -2862 1350 1309 -2488 271 1846 -2274 -510 2305 -1660 -1650
6540a650M232k582k130M151j079l577L392J126m140K029K628l826J53L879k902
$$ -1650 2582 0 -2130 2021 942 -2635 757 1883 -2257 -228 2400 -1426 -1273 2606 -296
6555b96j830M359j439k925L019R98m329K631K209m141P72L187k696j561M193j521
$$ -296 -2126 2233 794 -2131 888 1886 -2443 188 2397 -1744 -972 2215 -481 -2042 2151 630
6571F30k893L668J95m042K794K032m507J444K936l219r28M042j764k679L746m46
$$ 630 -2263 1405 1600 -2442 352 2384 -2123 -679 2257 -962 -1890 2152 388 -2291 1455 1009
6587A009l357L059J594m516J557K784l218o97M171k472k016L750r43l397L693
$$ 1009 -2348 711 2305 -2211 -654 2130 -1088 -1785 2386 -86 -2102 1648 705 -2692 1001
6602A001O87m127J962K674l634L48L523k879j493M168j368l026L239N98l944K499
$$ 1001 1688 -2439 -477 2197 -1437 -1089 2434 -445 -1938 2230 862 -2164 1075 1673 -2271 228
6618B28K335l811N88L021l167r02L927j657l127L970K2l903K745K151m392J588
$$ 228 2563 -1248 -660 2361 -806 -1708 2219 562 -2565 1405 1427 -2476 269 2420 -1972 -384
6634c84L067l597o75L873k273k088L469l55l739L248J453m043J325L150l746r9
$$ -384 2683 -914 -1589 2284 11 -2077 1392 1037 -2702 546 1999 -2044 -719 2431 -1315 -1414
6650a414L773k660k276M249p81l232L154Q14l934J852K699l676M05L058k492j497
$$ -1414 2359 -301 -2577 1672 891 -2341 813 1627 -2307 -455 2244 -1432 -1027 2031 -461 -1958
6666a958M079j267l258L068R99l876K742J756l953O97L472k995j336M065j905
$$ -1958 2121 854 -2404 664 1663 -2213 529 2285 -1668 -971 2501 -494 -1830 2235 330
6681C30k649L897j14l554K352J611l706J195K960l360n46L871j934k818L818k81
$$ 330 -2319 1578 1464 -2090 262 1873 -1833 -638 2322 -1038 -1584 2287 353 -2465 1353 1072
6697A072l508K889J423l950J522K971l648l83M080k825j728L616n54l478L475
$$ 1072 -2436 453 1876 -2074 -552 2419 -1229 -1612 2468 -357 -2085 1531 977 -2501 974
6712I74O66l877J954K362l111k27L455k458j680M052j356l009L514K8l381J934
$$ 974 1640 -2237 -283 2079 -1032 -1259 2196 -262 -1942 2110 754 -2255 1259 1287 -2094 -160
6728a60K196l557P78L153k987r12L733j778k575L405R7l427K576J165l305R70
$$ -160 2036 -1521 -743 2410 -577 -1489 2244 466 -2109 1296 1393 -2034 542 1707 -1598 -628
6744f28K838l069q24L898k174k175L533j70l628L082J164l974J410K860l380m85
$$ -628 2210 -859 -1683 2215 41 -2134 1399 1229 -2399 683 1847 -2127 -717 2143 -1237 -1722
6760a722L620k320j712L786p73l139K665J142l459J778K290l751M03L604k804
$$ -1722 1898 -422 -2134 1652 879 -2260 405 1547 -1912 -134 2156 -1595 -1192 2412 -392
6775c92j778L783r38l060L812K90l747K041K212l838J003K941k664j443L494j053
$$ -392 -2170 1613 675 -2385 1427 1717 -2030 11 2223 -1615 -612 2329 -335 -1778 1716 663
6791F63k544L189J48l621K430J696l422P98K868k974o39L566k109k173L712p38
$$ 663 -1881 1308 1456 -2165 265 1961 -1461 -663 2205 -769 -1408 2158 49 -2124 1588 850
6807H50l225K516J727l797J538K351l128m25L713k188k071L470n76l045L162P72
$$ 850 -2375 141 1868 -1929 -391 1960 -1168 -1593 2120 -68 -2139 1331 755 -2290 872 1644
6823A644l799J783K384l046j25L395k721j324L320q00k967L177N22l478K049K248
$$ 1644 -2155 -372 2012 -1034 -1159 2236 -485 -1809 1511 711 -2256 921 1443 -2035 14 2262
6839B262l731Q65L343l551q47L272j233k731L716l34l047K352J470l294R21L024
$$ 2262 -1469 -604 2739 -812 -1659 1613 380 -2351 1365 1031 -2016 336 1806 -1488 -567 2457
6855B457l656m10L662j728k226L513m45k952K329J346l612J332K441l176m68L797
$$ 2457 -1199 -1609 2053 325 -1901 1612 1167 -1785 544 1890 -1722 -390 2051 -1125 -1593 2204
6871B204k376j836L513o98k909K489J197l717J839K195l584N15L286k808j482
$$ 2204 -172 -2008 1505 807 -2102 387 1584 -2133 -294 1901 -1683 -1168 2118 -690 -2172
6886b172L623p34k892K837P61l246K074J936l967N17L680k879j062L572j628k582
$$ -2172 1451 717 -2175 662 1423 -1823 251 2187 -1780 -1263 2417 -462 -1524 2048 420 -2162
6902b162L663j66k908K025J436l644J113L052l175q47L621j696k407L471j86l457
$$ -2162 1501 1335 -1573 452 1888 -1756 -643 2409 -766 -1613 2008 312 -2095 1376 1190 -2267
6918b267K823J326l622Q79L085l257k66L295k278j837L650r71k514K515J148l654
$$ -2267 556 1882 -1740 -861 2224 -1033 -1299 1996 -282 -2119 1531 560 -1954 561 1709 -1945
6934a945J711K563l818K54L163k294j468L398j128k680L164Q18l810J896J980
$$ -1945 -234 2329 -1489 -1235 1928 -366 -1834 1564 436 -2244 920 1738 -2072 -176 1804
6949A804l201N91K921k970j043L758j444k498L468o4l522K420K056l612R24K559
$$ 1804 -1397 -806 2115 -855 -1898 1860 416 -2082 1386 1322 -2200 220 2276 -1336 -412 2147
6965B147k768n91L544k188j955L374n88k692K323J062l476J324K407k749n57L420
$$ 2147 -621 -1212 2332 144 -1811 1563 975 -1717 606 1668 -1808 -484 1923 -826 -1383 2037
6981B037k227j729L309n20k855K895O17l502J743K221l313K53L108k447j503L402
$$ 2037 -190 -1919 1390 870 -1985 910 1527 -1975 -232 1989 -1324 -1071 2037 -410 -1913 1489
6997A489o27l135L227N77l647K171J717l274J000K563k998o55L268j413k099L156
$$ 1489 862 -2273 954 1531 -2116 55 1772 -1502 -502 2061 -937 -1592 1676 263 -1836 1320
7013A320m1l327K342J881l627Q51K881l190o01L434j778j883L154l14k920K437
$$ 1320 1279 -2048 294 2175 -1452 -601 2280 -910 -1511 1923 145 -1738 1416 1102 -1818 619
7029F19J370l768J361K819l168r06L700j942k118L472p79k916K501J401l310J558
$$ 619 1989 -1779 -418 2401 -767 -1673 2027 85 -2033 1439 660 -2256 245 1646 -1664 -106
7045a06K183l364n1L400k684j177L503j220k308K797L02l318K154J707l078L02
$$ -106 2077 -1287 -1338 2062 -622 -1799 1704 484 -1824 973 1275 -2043 111 1818 -1260 -958
7061i58K964k244j224L064j137k517L625l24l031K499J304l652J199K733l125
$$ -958 2006 -238 -1462 1602 465 -2052 1573 1249 -1782 717 2021 -1631 -432 2301 -824
7076h24n07L026j549k214L515n02l206K479J478l033J044K139l088m1L149j835
$$ -824 -1331 1695 146 -2068 1447 945 -2261 218 1696 -1337 -293 1846 -1242 -1283 1866 31
7092C1k109L570p31k847K930M44l176J361K114k985J20L133k441j036L324j458
$$ 31 -2078 1492 761 -2086 844 1288 -1888 -527 1587 -1398 -1278 1855 -586 -1622 1702 244
7108B44k547L455Q3l250K082J882l279M04K908k520n21K712j285k300L022J97
$$ 244 -2303 1152 1235 -2015 67 1949 -1330 -926 1982 -538 -1059 1653 368 -1932 1090 1287
7124A287l235K273J641l354J072K095k482o61L773k392j773L317q22k648K509
$$ 1287 -1948 325 1966 -1388 -316 1779 -703 -1364 2409 17 -1756 1561 739 -1909 600
7139F00Q18l109J397K286l009k3L060k370j407L306q98k785K770M91l154J654
$$ 600 1418 -1691 -294 1992 -1017 -1040 2020 -350 -1757 1549 651 -2134 636 1127 -2027 -373
7155c73K569l603P08K691k531j598L920j345k518L138L38l266J812J852l296Q06
$$ -373 2196 -1407 -699 1992 -539 -2137 1783 438 -2080 1058 1396 -1870 -58 1794 -1502 -696
7171f96K817k839r28L389j576j891K899K77l487K593J202l252R33K403k666n10
$$ -696 2121 -718 -1646 1743 167 -1724 1175 1452 -2035 558 1760 -1492 -559 1844 -822 -1332
7187a332L363j972k236L659j32l394K672R98l438J553K551l110m87L158j759j927
$$ -1332 2031 59 -2177 1482 1350 -2044 628 1626 -1812 -259 2292 -818 -1305 1853 94 -1833
7203a833L375p08k717K519J014l592J656K123l369N71K980k536j276L235r04k547
$$ -1833 1542 834 -1883 636 1650 -1942 -286 1837 -1532 -961 2019 -517 -1793 1442 538 -2009
7219b009L129M1l310K375J707l101jL283k715j037L609j754k133K786M40l550
$$ -2009 1120 1161 -2149 226 1933 -1168 -1169 2114 -601 -1638 1971 217 -1916 870 1310 -2240
7235b240K695J536l613J023K702l094l36L164j944j940L607o32k765K818Q21l619
$$ -2240 455 1991 -1622 -599 2103 -991 -1327 1837 -107 -2047 1560 928 -1837 981 1802 -1817
7251a817J406K151k372p51L543k179j948L422r52k642K864P39l269J317K325k866
$$ -1817 -411 1740 -632 -1383 2160 -19 -1967 1455 503 -2139 725 1464 -1805 -488 1837 -1029
7267a029OK749j902j739L468j169k348K989J65l167J875J606k995R10K521k614
$$ -1029 -1023 1726 -176 -1915 1553 384 -1964 1025 1190 -1977 -102 1504 -1491 -581 1940 -674
7283f74q53L315j653k149K816N62l204K324J283l328Q25K595k709m90L217k037
$$ -674 -1527 1788 135 -2014 802 1364 -1840 484 1767 -1561 -736 1859 -850 -1340 1877 -160
7299a60j617L225j99l185K604J108l515J506K234l037q2L221k208j681L314j225
$$ -160 -1777 1448 1249 -1936 668 1776 -1739 -233 2001 -1036 -1118 2103 -105 -1786 1528 303
7315C03k406L364L26l458J690K514l710N43K599k338r70L515j274k689K977J44
$$ 303 -2103 1261 1587 -1871 -181 2333 -1377 -834 1765 -573 -1543 1972 698 -1991 986 1130
7331A130k965K108J728l661P58K772k781o66L291j599k008L464j91l361K228J347
$$ 1130 -1835 273 2001 -1660 -902 1870 -911 -1577 1714 115 -1893 1571 1380 -1981 247 1594
7347A594l005J094K578l123m30L135j646k020L247m73l156K819J174l357J091
$$ 1594 -1411 -317 2261 -862 -1292 1843 197 -1823 1424 951 -2205 614 1788 -1569 -478
7362d78K401k696j4K529j992j300L059q29k462K501M87l308K145J633l281N96
$$ -478 1923 -773 -787 1742 -250 -1550 1509 680 -1782 719 1206 -2102 43 1676 -1605 -1009
7378a009L125k634p31L276k034k222L227J44l172K118J465k833N28K645k462j046
$$ -1009 2116 -518 -1249 2027 -7 -2229 998 1142 -2030 88 1553 -1280 -752 1893 -569 -1615
7394a615L343j907j992L244k38k511J918J485l383J288K125k402q37L224j697
$$ -1615 1728 -179 -2171 1073 835 -1676 242 1727 -1656 -368 1757 -645 -1482 1742 45
7409D5j745K960n02k500K349Q75l148J529J916k584l47L111k234j270K915n59
$$ 45 -1700 1260 758 -1742 607 1482 -1666 -137 1779 -805 -1152 1959 -275 -1545 1370 811
7425H11k614K684O68l195J656J769l081K49K809k207j197L120j469j906L026k92
$$ 811 -1803 881 1549 -1646 10 1779 -1302 -1053 1756 -451 -1648 1472 3 -1903 1123 831
7441H31k581J671J526k745N57K508k677o83L480j728j707K876n43k710K355Q95
$$ 831 -1750 -79 1447 -1298 -741 1767 -910 -1593 1887 159 -1548 1328 785 -1925 430 1325
7457A325k984J136K585k886j18K822j823j738L211q05k720K760N17k948J251K100
$$ 1325 -1659 -523 2062 -824 -942 1880 57 -1681 1530 725 -1995 765 1282 -1666 -415 1685
7473A685k669k78L050k041j272K864r71k406K887L85k948J856J472k929O37K645
$$ 1685 -984 -1262 1788 -253 -1525 1339 368 -2038 849 1234 -1714 142 1614 -1315 -678 1967
7489A967k549j066L249j339k374L056O0k971K010J778l538J178K426k594n50K637
$$ 1967 -582 -1648 1601 262 -2112 944 1004 -1967 43 1821 -1717 -539 1887 -707 -1257 1380
7505A380j306j933L111k49l135K664J179l348J246K218k637m29L019j901j478
$$ 1380 74 -1859 1252 1003 -2132 532 1711 -1637 -391 1827 -810 -1239 1780 -121 -1599
7520a599L215j179j968K367Q47l301J501K053k965q7K960k116j286L032r15k385
$$ -1599 1616 437 -1531 836 1683 -1618 -117 1936 -1029 -1116 1844 -272 -1558 1474 559 -1826
7536a826K888K68l202K000J565k922O58K445k218j192L011j370k039K887q5k779
$$ -1826 1062 1330 -1872 128 1693 -1229 -571 1874 -344 -1536 1475 105 -1934 953 868 -1911
7552a911J760J712l117P88K637k760n19K870j541j884L000L3k643J944J396l234
$$ -1911 -151 1561 -1556 -768 1869 -891 -1410 1460 -81 -1965 1035 1068 -1575 369 1765 -1469
7568a469J035K654l227l85L067j708j619L016q92k624L151O59k978P90K522k613
$$ -1469 -434 2220 -1007 -1392 1675 -33 -1652 1364 472 -2152 999 1658 -1320 -530 1992 -621
7584f21j88K746k345j360L245j241k076K495O58l005J860J643k904J6K992k426
$$ -621 -809 1937 -408 -1768 1477 236 -1840 655 1313 -1692 168 1811 -1093 -1077 1915 -511
7600e11j070L213j332k149K521N74l178J787J640l020O95K845k953n89L375j501
$$ -511 -1581 1632 300 -1849 672 1246 -1932 -145 1495 -1525 -830 2015 -938 -1527 1848 347
7616C47j964K374j13k310K218Q49l068J338J735k320k91L052j709j934L141q03
$$ 347 -1617 757 644 -1666 552 1401 -1667 -329 1406 -914 -1205 1847 138 -1796 1345 542
7632E42k257K226J078l104J547J928k905K57K527k184r27K778j069k378K908M88
$$ 542 -1715 511 1589 -1515 32 1960 -945 -688 1839 -345 -1272 1506 437 -1941 967 1455
7648A455k935J650J359k643L34K653k328r31K673j047k158K937R7k659J549J633
$$ 1455 -1480 170 1529 -1114 -780 1873 -455 -1386 1287 240 -1918 1019 1116 -1543 6 1639
7664A639l254R35K508k530n85K897j593j796K822k90k393K189J041k894P38K302
$$ 1639 -1615 -680 1828 -702 -1287 1610 17 -1779 1043 753 -1640 549 1590 -1304 -566 1736
7680A736k631k83L121k284j312K827l58k768K632P97l078J382J793k406j09K776
$$ 1736 -895 -1178 1943 -341 -1653 1174 816 -1952 680 1477 -1601 -219 1574 -832 -941 1835
7696A835j926j407K638l62k640K758L96k845J206J974k817M67K702k319q87K683
$$ 1835 -91 -1498 1140 778 -1862 896 1292 -1553 -347 1627 -1190 -723 1979 -340 -1227 1456
7712A456j209k005K752K07k953J707J516k898P12K427k447n43K826j485j506K295
$$ 1456 247 -1758 994 1201 -1752 -45 1471 -1427 -715 1712 -735 -1278 1548 63 -1443 852
7728H52j01k525K031J200k625O75K175k308n65K934j667j515K922r99k364K431
$$ 852 751 -1774 257 1457 -1168 -493 1682 -626 -1191 1743 76 -1439 1483 484 -1880 551
7744E51Q50k750J341J740k667N3K404j696j129K871r02k237K235M11k753J960
$$ 551 1401 -1349 -8 1732 -935 -882 1522 -174 -1303 1568 666 -1571 664 1075 -1678 282
7760B82J153k798N09K456k102o38K757j555j643K463K02k709J841J416k974O68
$$ 282 1435 -1363 -854 1602 -500 -1138 1619 64 -1579 884 1086 -1623 218 1634 -1340 -672
7776f72K068k194o25K807j421j567K749o63k203K244J005l010J047K147k776l8
$$ -672 1396 -798 -1423 1384 -37 -1604 1145 482 -1721 523 1528 -1482 -435 1712 -1064 -1102
7792a102K777j827j701L087m71k188K250L9k172Q31K034k573N14K412k065j075
$$ -1102 1675 -152 -1853 1234 763 -1425 825 864 -1308 -477 1557 -1016 -502 1910 -155 -1230
7808a230K952j342k232K660K42k659J409J795k741L88K418k185p48K919j472j475
$$ -1230 1722 380 -1852 808 1050 -1609 -200 1595 -1146 -758 1660 -525 -1273 1646 174 -1301
7824a301K368O7k703J710J402k952Q17K213k139q87K936j503j875K742L3k615
$$ -1301 1067 1134 -1569 141 1543 -1409 -592 1621 -518 -1405 1531 28 -1847 895 928 -1687
7840a687J934J120k411R78J621k634k95L355j940j446K360m59k095J898P85k847
$$ -1687 247 1367 -1044 -66 1555 -1079 -1374 1981 41 -1405 955 496 -1599 299 1084 -1763
7856a763J359K175k669P8K464j896r39K596j086j929K285K81k541J599J276k592
$$ -1763 -404 1771 -898 -820 1644 -252 -1191 1405 319 -1610 675 956 -1585 14 1290 -1302
7872a302O16K392k355o39K596j093j577K472k44k343J948J013k767O94K211k563
$$ -1302 -686 1706 -649 -1288 1308 215 -1362 1110 866 -1477 471 1484 -1283 -589 1622 -941
7888i41l44K957j738j651K908n30k315K188O65k889J525J874k413k56K420j776
$$ -941 -1285 1672 -66 -1717 1191 661 -1654 534 1199 -1690 -165 1709 -704 -960 1460 -316
7904c16j054K302m67k082K332N78k728J592J312k348K31K482k308q97K831j164
$$ -316 -1370 932 465 -1617 715 1293 -1435 157 1469 -879 -648 1834 -474 -1371 1460 296
7920B96j876K307L79k491J238J768k745O19K215k373n34K369q88j829K380L1k582
$$ 296 -1580 727 1106 -1385 -147 1621 -1124 -505 1710 -663 -1197 1172 284 -1545 835 866 -1716
7937a716J935J254k887Q23K033k206P3K147j483j526K505n5k311J697Q95k175
$$ -1716 219 1473 -1414 -591 1442 -764 -691 1456 -27 -1553 952 897 -1414 283 1178 -997
7953i97P10J642k378l08K692j832j153K617n45j921K282O20k893J459J452k444
$$ -997 -287 1355 -1023 -1331 1361 -471 -1624 993 448 -1473 809 1429 -1464 -5 1447 -997
7969i97L53K226k173o45K532j346j389K431l81k135J644J341k581M28K309k232
$$ -997 -644 1582 -591 -1236 1296 -50 -1439 992 611 -1524 120 1461 -1120 -692 1617 -615
7985f15p03K764j218j687K274j61k364K095R24k511J073J555k070l55K533j436
$$ -615 -1318 1446 228 -1459 815 654 -1710 385 1309 -1202 -129 1426 -644 -999 1534 98
8001I8j636K583k43k452K278N51k543R73K011k593r4K687j824j064K284m15k135
$$ 98 -1538 1045 802 -1650 628 1179 -1364 -391 1620 -973 -1067 1620 -204 -1268 1016 601 -1534
8018a534K203O81k689J384J456k609K76K314j874p56K540j095j772K242Rk324
$$ -1534 669 1350 -1339 45 1501 -1108 -832 1482 -392 -1148 1392 297 -1475 767 776 -1548
8034a548J668J331k522P33J696j800n49K225j080j644K417N6k543J895R27k429
$$ -1548 120 1451 -1071 -338 1358 -442 -991 1234 154 -1490 927 983 -1560 335 1262 -1167
8050a167R24K073k567k58K196j067j576K270j13k183K178M85k663R62J764k097
$$ -1167 -243 1830 -737 -995 1201 134 -1442 828 715 -1468 710 1195 -1468 -506 1258 -839
8066h39J03K284j613j052K031o12j663K128N00k491J408J264k470K84K148j909
$$ -839 -736 1548 -65 -1117 914 302 -1361 767 1267 -1224 184 1448 -1022 -738 1410 -499
8082d99p60K626j041j759J984K23k045J456J431k650L17K610k290n57K093r30
$$ -499 -1259 1367 326 -1433 551 774 -1271 185 1616 -1034 -717 1893 -397 -954 1139 209
8098B09j590J870K74k362J945Q44j950K55J665j703p27K932j498j717K425m04
$$ 209 -1381 489 763 -1599 346 1190 -760 -505 1160 -543 -1270 1662 164 -1553 872 468
8114D68k173K468K80k220J262J178k331L42K122j819q54K096l13k077K315M1k077
$$ 468 -1705 763 1043 -1177 85 1263 -1068 -726 1396 -423 -1277 819 506 -1571 744 785 -1292
8131a292J317J329k269M98J982k301l29K695j540j601K213K95k247J324J392k524
$$ -1292 25 1354 -915 -417 1565 -736 -1065 1630 90 -1511 702 997 -1250 74 1466 -1058
8147a058O62J981k097o39K566j227j740K638n01j987K000N31k299P23J989k347
$$ -1058 -396 1585 -512 -1151 1415 188 -1552 1086 585 -1402 598 1129 -1170 -447 1542 -805
8163h05k89K149j334j237K623q88j514J736M74k147P75J728k134n4K159j429j030
$$ -805 -1094 1055 -279 -1516 1107 219 -1295 441 915 -1232 -457 1271 -863 -917 1242 -187 -1217
8180a217K276r90j554K146L33k502J447J352k391M89K014
$$ -1217 1059 69 -1485 661 994 -1508 -61 1291 -1100 -611 1403
8191A403
$$ 1403
$$ Imaginary data points
##PAGE= N=2
##DATA TABLE= (X++(I..I)), XYDATA
0@%%%%%%%%qJ6j6J6k0K8l2M0m8N6o9Q0r3J08j25J44j67J92k17K46k79L15l56M00
$$ 0 0 0 0 0 0 0 0 0 -8 8 -8 8 -12 16 -16 24 -24 32 -37 43 -50 58 -67 77 -90 102 -115 131 -148 167 -189 211
32B11m46M99n57O20o91P65q48R41j041J153j276J411j565J738j931K152k406K701
$$ 211 -235 264 -293 327 -364 401 -447 494 -547 606 -670 741 -824 914 -1017 1135 -1271 1430
50A430l053L478l998M656n522O717q465J1274j6508K9357j13496j63893K82265
$$ 1430 -1623 1855 -2143 2513 -3009 3708 -4757 6517 -9991 19366 -94130 -258023 24242
63B4242M1733j15866N0045l1915j14837J50935Q0840j54035J8148R4951j22873
$$ 24242 65975 -49891 154 -31761 -146598 4337 85177 -68858 -50710 44241 -78632
74g8632J7829J57569j06515r7572J58101j7331j26333J26800M0414j72646O6583
$$ -78632 -60803 96766 -9749 -107321 50780 33449 -92884 33916 74330 -98316 -31733
85c1733J33000j33479l3097J28563p5060m6595J40046n9611j27995J40368M6483
$$ -31733 101267 -32212 -65309 63254 -11806 -58401 81645 22034 -105961 34407 80890
96H0890j44955O3504P6740j46476L0265J59693j12937q9862J35059k6028q8211
$$ 80890 -64065 -561 76179 -70297 -40032 119661 6724 -83138 51921 25893 -62318
107f2318J24424p37j51413Q4843Q8820j25508K5460J02155j27464k4719J61515
$$ -62318 62106 61369 -90044 -5201 83619 -41889 -16429 85726 -41738 -66457 95058
118I5058p2715j14736J37445J1308j37320R3041P2180j44662K3201J16971r9550
$$ 95058 22343 -92393 45052 56360 -80960 12081 84261 -60401 -37200 79771 -19779
129a9779k4934J15203q3470o6603J46178k1597j31401J03955M6298j35778O3961
$$ -19779 -44713 70490 -12980 -79583 66595 44998 -86403 17552 63850 -71928 -7967
140g967J00054j40415j3395J44213p8503p4582J29112k8579j10497J13705L6768
$$ -7967 92087 -48328 -61723 82490 3987 -70595 58517 29938 -80559 33146 69914
151F9914j32179N7427P6326j20783K3262J22317j12686n8847J43918l5614j01960
$$ 69914 -62265 -4838 71488 -49295 -26033 96284 -16402 -75249 68669 33055 -68905
162f8905J11921J1095j30102P9909P8783j26821J1294J03581r5405k6293J25417
$$ -68905 43016 54111 -75991 3918 82701 -44120 -32826 70755 -24650 -50943 74474
173G4474o6129q8814J22161J505j15362Q6463M7668j33882M2157J12118j10135
$$ 74474 8345 -80469 41692 43197 -72165 14298 61966 -71916 -29759 82359 -27776
184b7776l4858J20529n6103o8289J12965j7825j06136R3230M0931j15927N0694
$$ -27776 -62634 57895 1792 -66497 46468 28643 -77493 15737 56668 -59259 -8565
195h565P6553j17495O437J28565q5166p4177J19627j7200r3150J00016K2410j28471
$$ -8565 67988 -49507 -43070 85495 329 -73848 45779 28579 -64571 35445 57855 -70616
207g0616N6254Q8409j02741l35R3597q7143l5032J25136m5286r4777J04754J1492
$$ -70616 -14362 74047 -28694 -29029 64568 -22575 -57607 67529 22243 -72534 32220 43712
219D3712j13831P7729O7273j28042R789J09645q0189l5733J04085n4691p2581
$$ 43712 -70119 7610 74883 -53159 -43370 66275 -13914 -49647 54438 -253 -72834
230g2834J13597k55j11638P4652M8877j10056L9639Q8038j08296j9568J22190
$$ -72834 40763 40508 -71130 3522 52399 -57657 -18018 70020 -38276 -57844 64346
$$ [...]
8191h
##END NTUPLES=NMR FID
##END=
