##TITLE=1H_Pr 5-15
 CDCl3
 8 sc, 
 27.1.2023
##JCAMPDX= 6.0         $$ Bruker NMR JCAMP-DX V2.0
##DATA TYPE= NMR FID
##DATA CLASS= NTUPLES
##ORIGIN= UXNMR, Bruker Analytische Messtechnik GmbH
##OWNER= root
$$ XWIN-NMR		Version 3.5
$$ Fri Jan 27 16:35:34 2023 Russian Standard Time (UT+4h)  she@DPX200
##.OBSERVE FREQUENCY= 200.13175
##.OBSERVE NUCLEUS= ^1H
##.DELAY= (6, 6)
##.ACQUISITION MODE= SIMULTANEOUS
##.ACQUISITION SCHEME= undefined
##.AVERAGES= 8
##.DIGITISER RES= 18
##SPECTROMETER/DATA SYSTEM= spect
##.PULSE SEQUENCE= zg30
##.SOLVENT NAME= CDCl3
##.SHIFT REFERENCE= (INTERNAL, CDCl3, 0, 15.7039)
##AUDIT TRAIL= $$ (NUMBER, WHEN, WHO, WHERE, WHAT)
$$ ##TITLE= Audit trail, XWIN-NMR		Version 3.5
$$ ##JCAMPDX= 5.01
$$ ##ORIGIN= Bruker BioSpin GmbH
$$ ##OWNER= she
$$ F:/spectra/data/she/nmr/H-F/1/audita.txt
$$ ##AUDIT TRAIL=  $$ (NUMBER, WHEN, WHO, WHERE, WHAT)
(   1,<2023-01-27 16:34:36.34 +0400>,<she>,<DPX200>,
      <created by zg, POWCHK disabled, PULCHK disabled
       configuration hash MD5:
       00 E9 B6 7A A2 85 ED C7 34 08 36 98 17 FE 4E 26
       data hash MD5: 16K
       39 57 12 3F 53 FD 51 36 12 AC 59 48 C9 AA 16 CA>)
$$ ##END=
$$ 
$$ hash MD5
$$ 06 53 61 57 BD 75 ED 99 B2 A7 58 4B 43 F5 F1 D4
##$RELAX= 
##$RELAX= 
##$RELAX= 
##$RELAX= 
##$RELAX= 
##$RELAX= 
$$ Bruker specific parameters
$$ --------------------------
##$DU= <F:/spectra>
##$EXPNO= 1
##$NAME= <H-F>
##$PROCNO= 1
##$TYPE= <nmr>
##$USER= <she>
##$AMP= (0..31)
100 100 100 100 100 100 100 100 100 100 100 100 100 100 100 100 100 100 
100 100 100 100 100 100 100 100 100 100 100 100 100 100 
##$AQSEQ= 0
##$AQ_mod= 1
##$AUNM= <au_zg>
##$AUTOPOS= <>
##$BF1= 200.13
##$BF2= 200.13
##$BF3= 200.13
##$BF4= 200.13
##$BF5= 200.13
##$BF6= 200.13
##$BF7= 200.13
##$BF8= 200.13
##$BYTORDA= 1
##$CFDGTYP= 0
##$CFRGTYP= 5
##$CHEMSTR= <none>
##$CNST= (0..31)
1 1 145 1 1 1 1 1 1 1 1 1 1 1 1 1 1 1 1 1 1 1 1 1 1 1 1 1 1 1 1 1 
##$CPDPRG= <>
##$CPDPRG1= <>
##$CPDPRG2= <>
##$CPDPRG3= <>
##$CPDPRG4= <mlev>
##$CPDPRG5= <mlev>
##$CPDPRG6= <mlev>
##$CPDPRG7= <mlev>
##$CPDPRG8= <mlev>
##$CPDPRGB= <>
##$CPDPRGT= <>
##$D= (0..31)
0 1.2 0 0 0 0 0 0 0 0.06 0 0.03 0 0 0 0 0.0002 0 0 0 0 0 0 0 0 0 0 0 0 
0 0 0 
##$DATE= 1674822875
##$DBL= (0..7)
120 120 120 120 120 120 120 120 
##$DBP= (0..7)
150 150 150 150 150 150 150 150 
##$DBP07= 0
##$DBPNAM0= <>
##$DBPNAM1= <>
##$DBPNAM2= <>
##$DBPNAM3= <>
##$DBPNAM4= <>
##$DBPNAM5= <>
##$DBPNAM6= <>
##$DBPNAM7= <>
##$DBPOAL= (0..7)
0.5 0.5 0.5 0.5 0.5 0.5 0.5 0.5 
##$DBPOFFS= (0..7)
0 0 0 0 0 0 0 0 
##$DE= 6
##$DECBNUC= <off>
##$DECIM= 32
##$DECNUC= <off>
##$DECSTAT= 4
##$DIGMOD= 1
##$DIGTYP= 9
##$DL= (0..7)
0 120 120 120 120 120 120 120 
##$DP= (0..7)
150 150 150 150 150 150 150 150 
##$DP07= 0
##$DPNAME0= <>
##$DPNAME1= <>
##$DPNAME2= <>
##$DPNAME3= <>
##$DPNAME4= <>
##$DPNAME5= <>
##$DPNAME6= <>
##$DPNAME7= <>
##$DPOAL= (0..7)
0.5 0.5 0.5 0.5 0.5 0.5 0.5 0.5 
##$DPOFFS= (0..7)
0 0 0 0 0 0 0 0 
##$DQDMODE= 0
##$DR= 18
##$DS= 0
##$DSLIST= <SSSSSSSSSSSSSSS>
$$ [...]
##$SUBNAM2= <"">
##$SUBNAM3= <"">
##$SUBNAM4= <"">
##$SUBNAM5= <"">
##$SUBNAM6= <"">
##$SUBNAM7= <"">
##$SUBNAM8= <"">
##$SUBNAM9= <"">
##$SW= 18.0516922627508
##$SWIBOX= (0..15)
0 0 2 0 0 0 0 0 0 0 0 0 0 0 0 0 
##$SW_h= 3612.71676300578
##$TD= 16384
##$TD0= 1
##$TE= 0
##$TE2= 300
##$TE3= 300
##$TEG= 300
##$TL= (0..7)
0 120 120 120 120 120 120 120 
##$TP= (0..7)
150 150 150 150 150 150 150 150 
##$TP07= 0
##$TPNAME0= <>
##$TPNAME1= <>
##$TPNAME2= <>
##$TPNAME3= <>
##$TPNAME4= <>
##$TPNAME5= <>
##$TPNAME6= <>
##$TPNAME7= <>
##$TPOAL= (0..7)
0.5 0.5 0.5 0.5 0.5 0.5 0.5 0.5 
##$TPOFFS= (0..7)
0 0 0 0 0 0 0 0 
##$TUNHIN= 0
##$TUNHOUT= 0
##$TUNXOUT= 0
##$USERA1= <user>
##$USERA2= <user>
##$USERA3= <user>
##$USERA4= <user>
##$USERA5= <user>
##$V9= 5
##$VALIST= <valist>
##$VCLIST= <CCCCCCCCCCCCCCC>
##$VD= 0
##$VDLIST= <DDDDDDDDDDDDDDD>
##$VPLIST= <PPPPPPPPPPPPPPP>
##$VTLIST= <TTTTTTTTTTTTTTT>
##$WBST= 1024
##$WBSW= 4
##$XGAIN= (0..3)
0 0 0 0 
##$XL= 0
##$YL= 0
##$YMAX_a= 368564
##$YMIN_a= -429279
##$ZGOPTNS= <>
##$ZL1= 120
##$ZL2= 120
##$ZL3= 120
##$ZL4= 120
##$ABSF1= 10
##$ABSF2= 0
##$ABSG= 5
##$ABSL= 3
##$ALPHA= 0
##$AQORDER= 0
##$ASSFAC= 0
##$ASSFACI= 0
##$ASSFACX= 0
##$ASSWID= 0
##$AUNMP= <proc_1d>
##$AZFE= 0.1
##$AZFW= 0.1
##$BCFW= 1
##$BC_mod= 2
##$BYTORDP= 1
##$COROFFS= 0
##$CY= 11.3945322036743
##$DATMOD= 1
##$DC= 2
##$DFILT= <>
##$DTYPP= 0
##$F1P= 2.36226072786647
##$F2P= -0.459571619588291
##$FCOR= 0.5
##$FTSIZE= 0
##$FT_mod= 4
##$GAMMA= 1
##$GB= 0.15
##$INTBC= 1
##$INTSCL= 1
##$ISEN= 128
##$LB= 0.24
##$LEV0= 0
##$LPBIN= 0
##$MAXI= 10000
##$MC2= 0
##$MEAN= 0
##$ME_mod= 0
##$MI= 1.114404
##$NCOEF= 0
##$NC_proc= 0
##$NLEV= 6
##$NOISF1= 3.799351
##$NOISF2= 2.8
##$NSP= 1
##$NTH_PI= 0
##$NZP= 0
##$OFFSET= 15.70392
##$PC= 1
##$PHC0= -19113.29
##$PHC1= 13.20079
##$PH_mod= 1
##$PKNL= yes
##$PPARMOD= 0
##$PSCAL= 0
##$PSIGN= 0
##$REVERSE= no
##$SF= 200.130013532006
##$SI= 16384
##$SIGF1= 3
##$SIGF2= 2
##$SINO= 400
##$SIOLD= 16384
##$SREGLST= <1H.CDCl3>
##$SSB= 0
##$STSI= 0
##$STSR= 0
##$SW_p= 3612.71676300578
##$SYMM= 0
##$S_DEV= 0
##$TDeff= 0
##$TDoff= 0
##$TI= <>
##$TILT= no
##$TM1= 0
##$TM2= 0
##$TOPLEV= 0
##$USERP1= <user>
##$USERP2= <user>
##$USERP3= <user>
##$USERP4= <user>
##$USERP5= <user>
##$WDW= 1
##$XDIM= 8192
##$YMAX_p= 0
##$YMIN_p= 0
$$ End of Bruker specific parameters
$$ ---------------------------------
##NTUPLES= NMR FID
##VAR_NAME=  TIME,          FID/REAL,        FID/IMAG
##SYMBOL=    X,             R,               I
##VAR_TYPE=  INDEPENDENT,   DEPENDENT,       DEPENDENT
##VAR_FORM=  AFFN,          ASDF,            ASDF
##VAR_DIM=   8192,          8192,            8192
##UNITS=     SECONDS,       ARBITRARY UNITS, ARBITRARY UNITS
##FACTOR=    0.0002768,     1,               1
##FIRST=     0,             0,               0
##LAST=      2.2672688,     0,               0
##MIN=       0,             -429279,         0
##MAX=       2.2672688,     368564,          0
$$ Real data points
##PAGE= N=1
##DATA TABLE= (X++(R..R)), XYDATA
$$ plain form
0 0 0 0 0 0 0 0 0 0 -8 8 -8 16 -16 24 -24 32 -41 56 -64 80 -96 115 -137 163 -193 225 -263 305 -352 405 -464
31 -464 529 -604 685 -776 874 -984 1104 -1234 1381 -1539 1713 -1902 2107 -2336 2583 -2853
47 -2853 3146 -3471 3826 -4215 4644 -5120 5649 -6237 6899 -7646 8502 -9488 10641 -12010
61 -12010 13667 -15721 18346 -21841 26752 -34216 47124 -75997 280673 -67214 21094 368564
73 368564 -341753 -59221 -75525 -279549 -173519 -84807 -96328 -117731 50698 123404 -110117
84 -110117 85207 166085 -166414 -1268 111899 -184508 37440 87677 -19753 133080
94 133080 163359 119918 110584 141804 86505 -116976 16513 -110449 -244444 -134674 -164404
105 -164404 -145901 -118786 -11816 67124 -16776 202676 108637 40374 216279 20229 -22904
$$ packed form
0@%%%%%%%%qJ6j6K4l2M0m8N6p3R7j20J44j76K11k52L00l56M18m88N68o57P57q69
31d64R93j133J289j461J650j858K088k338K615k920L252l615M009m443M919n436
47b853N999o617P297q041Q859r764J0769j1886J3136j4545J6148j7990K0129k2651
61a2010K5677k9388L4067m0187M8593o0968Q1340j23121L56670l47887Q8308L47470
73C68564p10317K82532j6304k04024J06030Q8712j1521k1403J68429P2706k33521
84a10117J95324Q0878l32499J65146J13167k96407K21948N0237j07430J52833
94A33080L0279m3441r334L1220n5299k03481J33489j26962j33995J09770k9730
105a64404J8503K7115J06970P8940q3900K19452r4039o8263J75905j96050m3133
$$ plain form
116 -22904 89074 -28049 -69831 14421 8118 -8635 -3405 56793 33736 -69345 55193 -49987
128 -49987 -188813 60531 -186223 -174186 81154 -138499 -20997 140160 32286 134571
138 134571 132670 147324 95375 55612 91513 -68711 -44589 5630 -178212 -71217 9394
149 9394 -147100 -11597 44635 -62738 34433 23799 -37768 15463 -31936 -11721 -46095 16657
161 16657 36009 -26174 113444 84536 31156 141249 34620 39508 20373 -53944 -47383 -98108
173 -98108 -93595 -95860 -96864 -30204 -38871 -7228 58196 36305 55597 64246 42175 34687 12311
186 12311 -5660 9868 -32494 11186 -161 -6092 52008 1917 8083 42377 -40465 -11948
198 -11948 -49227 -60755 -54964 -83078 -24490 -43958 -13001 54401 5741 76166 92979 20574
$$ packed form
116b2904J11978j17123m1782Q4252o303j6753N230O0198k3057j03081J24538j05180
128d9987j38826K49344k46754J2037K55340k19653J17502J61157j07874J02285
138A34571j901J4654n1949l9763L5901j60224K4122N0219j83842J06995Q0611
149I394j56494J35503N6232j07373R7171j0634o1567N3231m7399K0215l4374O2752
161A6657J9352o2183J39618k8908n3380J10093j06629M888j9135p4317O561n0725
173i8108M513k265j004O6660q667L1643O5424k1891J9292Q649k2071p488k2376
186A2311j7971J5528m2362M3680j1347n931N8100n0091O166L4294q2842K8517
198a1948l7279j1528N791k8114N8588j9468L0957O7402m8660P0425J6813p2405
$$ plain form
210 20574 84378 46166 -14890 18962 -19894 -52351 -14854 -49914 -23152 -22263 -12171 7238
222 7238 -22240 17979 9479 -51504 34446 -29175 -45117 33799 -31925 -976 49635 1659
234 1659 45352 50429 27178 34708 13192 12403 -19602 -31078 -21378 -48377 -49202 -11873 -45046 -9956
248 -9956 9847 -7123 19330 28335 6631 23965 9400 12118 -2733 4888 1481 -3201 7250
261 7250 2535 8803 7776 1925 11427 -11164 -5268 -3072 -36776 -5456 -21481 -29830 582 -9151
275 -9151 -4724 23110 3080 29415 16282 16484 24496 -3380 6977 9986 -33425 11849 -13725
288 -13725 -29719 18512 -19231 -8379 21345 -17901 8484 6619 -13572 10583 -12267 -77
300 -77 1577 -11342 10947 4213 -6561 27708 -6305 6320 18542 -12674 2409 7155 -24516
$$ packed form
210B0574O3804l8212o1056L3852l8856l2457L7497l5060K6762Q89J0092J9409
222G238k9478M0219q500o0983Q5950o3621j5942P8916o5724L0949N0611m7976
234A659M3693N077k3251P530k1516p89l2005j1476R700k6999q25L7329l3173L5090
248i956J9803j6970K6453R005k1704J7334j4565K718j4851P621l407m682J0451
261G250m715O268j027n851R502k2591N896K196l3704L1320j6025q349L0412r733
275i151M427K7834k0030K6335j3133K02Q012k7876J0357L009m3411M5274k5574
288a3725j5994M8231l7743J0852K9724l9246K6385j865k0191K4155k2850J2190
300g7J654j2919K2289o734j0774L4269l4013J2625J2222l1216J5083M746l1671
$$ plain form
313 -24516 6818 -10675 -11821 4743 -7289 80 7289 -3454 8840 2502 -566 7316 -2960
326 -2960 -187 2294 -4773 -2884 3776 -10443 3926 -3831 -4800 2412 -1982 -3856 10140 -6353
340 -6353 8375 6720 -1786 7399 7044 -10642 9548 -5800 -11852 6326 -11637 -5829 6458 -10459
354 -10459 5456 1258 -5205 10196 -12331 4358 -731 -14915 7945 -1780 -10746 22025 -4007
367 -4007 7681 19947 -252 5530 11307 -14739 745 -13657 -15614 -6470 -20339 -3309 873
380 873 -11773 18821 3757 1548 23818 -2344 4612 9349 -7216 -3258 2295 -8314 3372
393 3372 -2591 3599 5055 -2193 1140 4081 -19628 2208 -14455 -22551 1391 -13628 -12258 14118
407 14118 -728 11087 18721 14695 16687 11411 10960 4450 -3656 -3852 -5137 -18624 -1100 -9179
$$ packed form
313b4516L1334j7493j146J6564j2032P369P209j0743J2294o338l068P882j0276
326b960K773K481p067J889O660j4219J4369p757r69P212m394j874J3996j6493
340f353J4728j655q506R185l55j7686K0190j5348o052J8178j7963N808J2287j6917
354a0459J5915m198o463J5401k2527J6689n089j4184K2860r725q966L2771k6032
367d007J1688J2266k0199N782N777k6046J5484j4402j957R144j3869J7030M182
380H73j2646L0594j5064k209K2270k6162O956M737j6565L958N553j0609J1686
393C372n963O190J456p248L333K941k3709K1836j6663q096K3942j5019J370K6376
407A4118j4846J1815P634m026J992n276m51o510q106j96j285j3487J7524q079
$$ plain form
421 -9179 -18175 7338 -4276 -16347 14630 -12328 -3299 -163 -8889 -1251 -1759 -1540 5850 4469
435 4469 16127 9931 11986 19112 12224 -2376 9423 -1981 -19472 -2418 -23087 -14817 -8390
448 -8390 -20221 -480 -196 -653 13233 266 19829 4776 3118 8737 2296 -3549 105 -452
462 -452 1426 1434 2942 3030 10859 -5789 3830 -2958 -11829 -3412 -25104 -7434 -9042 -17801 1808 1037
478 1037 11674 13367 11001 29328 10630 14422 6356 5766 -5914 -6152 -11904 -14097 -648 -15225
492 -15225 -9038 10883 -9711 6026 -5347 3085 2098 -20679 7669 -7141 -10298 9745 -1099
505 -1099 7912 21693 7739 9091 26271 7969 -10674 15150 -12467 -10128 -15841 -13805 -2079
518 -2079 -23534 2369 2388 -14063 28023 -11489 -1099 27109 -10650 -7473 15773 -122 -10168
$$ packed form
421i179q996K5513j1614j2071L0977k6958R029L136q726P638n08K19P390j381
435D469J1658o196K055P126o888j4600J1799j1404j7491J7054k0669Q270O427
448h390j1831J9741K84m57J3886j2967J9563j5053j658N619o441n845L654n57
462d52J878QJ508Q8P829j6648R619o788q871Q417k1692J7670j608q759J9609p71
478A037J0637J693k366J8327j8698L792q066n90j1680k38n752k193J3449j4577
492a5225O187J9921k0594J5737j1373Q432r87k2777K8348j4810l157K0043j0844
505a099R011J3781j3954J352J7180j8302j8643K5824k7617K339n713K036J1726
518b079k1455K5903J9j6451M2086l9512J0390K8208l7759L177K3246j5895j0046
$$ plain form
531 -10168 12426 1200 3537 11700 -2375 10950 -1784 523 -1216 -28210 18567 -24623 -27308
544 -27308 20978 -17427 -9847 19112 -614 7972 14349 8074 1768 17995 -4001 -3048 3605 -2313
558 -2313 -1765 -19649 14962 1142 -26463 23825 -4934 -15450 17342 -15893 -4587 6361 -9688
571 -9688 -12631 11933 -317 -5891 9456 12306 10716 -1864 13445 19757 -23876 18561 -5477
584 -5477 -26534 18878 -24840 -18042 15933 -14387 -9576 9892 7485 -2961 3053 10740 1478
597 1478 -2065 -542 6740 -14102 13418 -3002 -15139 29691 -5996 -13674 27128 -8659 -4162
610 -4162 -501 -4309 -7164 -8965 -4966 -7834 -348 1615 -1499 2900 13837 6993 -8644 19665
624 19665 4468 -17141 15799 -9605 -3801 1136 -8142 3139 259 -1026 728 -1448 7489 -7440
$$ packed form
531a0168K2594j1226K337Q163j4075J3325j2734K307j739k6994M6777m3190k685
544b7308M8286l8405P580K8959j9726Q586O377o275o306J6227k1996R53O653n918
558b313N48j7884L4611j3820k7605N0288k8759j0516L2792l3235J1306J0948j6049
571i688k943K4564j2250n574J5347K850j590j2580J5309O312m3633M2437k4038
584e477k1057M5412m3718O798L3975l0320M811J9468k407j0446O014P687r262
597A478l543J523P282k0842K7520j6420j2137M4830l5687p678M0802l5787M497
610d162L661l808k855j801L999k868P486J963l114M399J0937o844j5637K8309
624A9665j5197k1609L2940k5404N804M937r278J1281k880j285J754k176Q937j4929
$$ plain form
638 -7440 -3343 1892 2432 -14195 4314 6779 -12166 11460 -243 -1679 13352 -8254 3750
651 3750 4028 -3356 1317 -9487 7795 -4142 -8793 5018 1492 -7346 5112 -224 -2879 7461
665 7461 -2426 -5100 14876 -8823 1674 4364 -3431 4125 -8116 2813 1976 -10437 6093 -4386
679 -4386 -638 6476 -6353 5049 6002 -1998 -1748 7867 -5755 -91 39 -5461 4665 -3177 -4576
694 -4576 9019 -5764 5135 -2341 -1078 4388 -7085 -2093 1709 -5679 477 890 -196 5253
708 5253 4090 17 8997 3606 -3683 7607 -7184 -746 -2459 -10318 1175 -5291 -7820 5703
722 5703 -6584 4034 2094 -1192 4820 3237 -2810 5469 -219 -1073 4069 -2053 2799 4803 -4282
737 -4282 7683 -950 -3825 6486 -10342 -468 -2773 -12370 -1202 -3748 -9217 4171 -2350 2630
$$ packed form
638g440M097N235N40j6627J8509K465j8945K3626j1703j436J5031k1606J2004
651C750K78p384M673j0804J7282j1937m651J3811l526q838J2458n336k655J0340
665G461r887k674J9976k3699J0497K690p795P556j2241J0929q37j2413J6530j0479
679d386L748P114j2829J1402R53q000K50R615j3622N664J30n500J0126p842j399
694d576J3595j4783J0899p476J263N466j1473M992L802p388O156M13j086N449
708E253j163m073Q980n391p289J1290j4791O438j713p859J1493o466k529J3523
722E703j2287J0618j940l286O012j583o047Q279n688q54N142o122M852K004r085
737d282J1965q633k875J0311j6828R874k305r597J1168k546n469J3388o521M980
$$ plain form
751 2630 7082 4420 6615 10214 727 8312 254 -1366 1747 -8163 -2885 -540 -10602 2499 -2531
766 -2531 -5537 5009 -4911 -1387 2113 -6370 -2821 698 -6896 3760 1463 2881 9864 6552 7706
781 7706 13316 838 8294 -975 -6774 -2450 -11770 -12555 -4495 -13812 -3344 -444 -3759 7506 4775
796 4775 2545 9409 1059 998 4960 -5895 2841 329 -2180 6586 3253 1625 10721 -2477 3543
811 3543 -1167 -8830 -5569 -9919 -14383 -4215 -11401 -2692 3556 89 10744 11506 5916 15156 5583
826 5583 2760 7130 -5764 -1484 -2461 -7723 -1697 -2221 -4913 4165 -4628 1095 312 -5998 -1689 -2849
842 -2849 -9714 1723 -5315 -708 6477 2665 7666 12341 5351 11791 6104 1959 4436 -5874 -5047
857 -5047 -4438 -12090 -5926 -4234 -10256 2638 -1948 -733 5752 1284 1245 6604 -3062 5129 -409 -546
$$ packed form
751B630M452k662K195L599r487P585q058j620L113r910N278K345j0062J3101n030
766b531l006J0546r920L524L500q483L549L519p594J0656k297J418O983l312J154
781G706N610j2478P456r269n799M324r320p85Q060r317J0468K900l315J1265k731
796D775k230O864q350o1L962j0855Q736k512k509Q766l333j628R096j3198O020
811C543m710p663L261m350m464J0168p186Q709O248l467J0655P62n590R240r573
826E583k823M370j2894M280r77n262O026n24k692R078q793N723p83o310M309j160
842b849o865J1437p038M607P185l812N001M675o990O440n687m145K477j0310Q27
857e047O09p652O164J692o022J2894m586J215O485m468l9N359r666Q191n538j37
$$ plain form
873 -546 4818 -774 2429 8398 -2651 7252 4038 -4156 3795 -3096 -8726 -1368 -8641 -7903 -1639
888 -1639 -7156 1938 1153 2195 9201 3648 5850 11031 -3450 7525 1207 -6534 1780 -3270 -6783
903 -6783 2764 -4596 156 1657 -964 1092 457 -2208 1540 -5330 -2123 2220 -6616 2925 3502 -1797
919 -1797 7915 4648 1117 7835 -591 1273 -1299 -1601 -4542 -3782 -3838 -993 -4798 -309 2532 -1263
935 -1263 760 6020 -3719 4834 1675 -4286 5458 -1176 -2250 2482 -509 796 -1061 -4 2001
950 2001 -3050 -324 -255 -1449 -1534 2891 -5341 4123 1177 -4466 5311 170 -2650 4133 -4658 4880
966 4880 -2420 -1908 4316 -3568 1604 -505 -3285 2603 -2818 -4510 1571 -347 -2368 2799 2542 2397
982 2397 6410 -1890 8041 364 -2238 1341 -6984 -1521 -4389 -10882 3371 -5973 -748 1811 1983
$$ packed form
873e46N364n592L203N969j1049R903l214q194P951o891n630P358p273P38O264
888a639n517R094p85J042P006n553K202N181j4481J0975o318p741Q314n050l513
903f783R547p360M752J501k621K056o35k665L748o870L207M343q836R541N77n299
919a797R712l267l531O718q426J864k572l02k941P60n6K845l805M489K841l795
935a263K023N260r739Q553l159n961R744o634j074M732k991J305j857J057K005
950B001n051K726O9j194q5M425q232R464k946n643R777n141k820O783q791R538
966D880p300N12O224p884N172k109k780N888n421j692O081j918k021N167k57j45
982B397M013q300R931p677k602L579q325N463k868o493J4253r344N225K559J72
$$ plain form
997 1983 4216 1951 1715 2914 2112 -3445 -306 1826 -3602 3191 -1367 3212 7531 -4980 6948
1012 6948 -375 -2751 -2610 -8379 -4908 -5981 -11038 -3101 -546 -293 828 10461 4043 12002 6193
1027 6193 2256 12104 -4816 -1572 58 -9415 766 -10104 -3293 4564 -8510 2747 1529 -1735
1041 -1735 -449 -1667 -6867 1658 -5118 -7872 6643 -292 2580 11352 2718 19422 3005 4784
1055 4784 12395 -7320 -789 -7936 -15247 -4944 -16400 -12467 -2648 -3373 -2554 4067 8174 5454 9369
1070 9369 942 8696 2150 -4022 4403 -3342 2182 5073 -3839 13084 3226 1470 3356 -314 -6734
1085 -6734 -11199 -10824 -14983 -11448 -12949 -8602 4139 -382 12209 13004 13877 22396 2838 13550 7696
1100 7696 -6851 -1701 -7727 -9209 -5062 -9966 -2650 932 235 -2265 4111 -3851 -2016 -8233 -10043
$$ packed form
997A983K233k265k36J199q02n557L139K132n428O793m558M579M319j2511J1928
1012F948p323k376J41n769L471j073n057P937K555K53J121R633o418P959n809
1027F193l937R848j6920L244J630r473J0181j0870O811P857j3074J1257j218l264
1041a735J286j218n200Q525o776k754J4515o935K872Q772q634J6704j6417J779
1055D784P611j9715O531p147p311J0303j1456L933R819p25Q19O621M107k720L915
1070I369q427P754o546o172Q425p745N524K891q912J6923r858j756J886l670o420
1085f734m465L75m159L535j501M347J2741m521J2591P95Q73Q519j9558J0712n854
1100G696j4547N150o026j482M147m904P316L582o97k500O376p962J835o217j810
$$ plain form
1115 -10043 17 -12886 -2400 7691 -274 18207 11852 14920 23398 6023 10052 2581 -5865
1128 -5865 -10712 -17422 -15744 -14359 -16945 -9907 -1435 -198 2959 10327 2843 13132 2502 -427
1142 -427 6998 -3634 -351 1773 1442 9630 3730 10309 10328 5179 2967 -3953 -5977 -14112 -15378 -20408
1158 -20408 -15229 -11886 -13234 1140 5506 6894 18692 11906 20093 13627 7796 8220 63 -3827
1172 -3827 -4680 -8441 -4406 -3995 -5121 -242 3190 -5076 1159 -4031 -9543 -3055 -16171 -7399 -5238
1187 -5238 -8785 5077 5738 11335 20744 12728 22357 15307 7610 5812 -3231 -11593 -11139 -19504 -16597
1202 -16597 -11530 -14080 -5534 1607 -1065 8607 4503 5222 7609 -3044 2661 -772 -2585 3489 1491
1217 1491 6974 12297 8379 12524 9622 4994 -1420 -4540 -14321 -14692 -19722 -19640 -13754 -11908 -4809 4538
$$ packed form
1115a0043J0060j2903J0486J0091p965J8481o355L068Q478j7375M029p471q446
1128e865m847o710J678J385k586P038Q472J237L157P368p484J0289j0630k929
1142d27P425j0632L283K124l31Q188n900O579J9n149k212o920k024q135j266n030
1158b0408N179L343j348J4374M366J388J1798o786Q187o466n831M24q157l890
1172c827q53l761M035M11j126M879L432q266O235n190n512O488j3116Q772K161
1187e238l547J3862O61N597R409q016R629p050p697j798r043q362M54q365K907
1202a6597N067k550Q546P141k672R672m104P19K387j0653N705l433j813O074j998
1217A491N483N323l918M145k902m628o414l120r781l71n030Q2N886J846P099R347
$$ plain form
1233 4538 6028 15564 14558 14174 15341 8447 4418 2028 -3542 -4499 -2948 -6285 -310 213 -889 3719
1249 3719 258 -3738 -1025 -12066 -7528 -11959 -14192 -5983 -6412 -1387 9617 7849 17233 17980 14051
1264 14051 16200 9502 2140 1081 -8608 -10955 -10183 -16006 -8170 -8152 -6792 1738 -973 1279 5887
1279 5887 -2130 3312 -870 -3316 574 -720 465 7388 4842 11004 11119 8834 9551 4891 -1034
1294 -1034 -1962 -10803 -12901 -12835 -16781 -11271 -8515 -6042 1932 4787 6817 12106 8236 9559 7714 3350
1310 3350 1774 937 -3866 555 -2394 -473 2613 709 1603 2866 -3660 -1597 -5909 -9838 -7122
1325 -7122 -10358 -8486 -2802 -3656 3869 8261 7630 14688 11112 10326 9991 2296 122 -1538 -9700 -5029
1341 -5029 -8611 -8278 -2896 -4245 -1530 3067 -1735 3594 143 -2137 220 -3322 -3321 1176 -2100 3809
$$ packed form
1233D538J490R536j006l84J167o894m029k390n570r57J551l337N975N23j102M608
1249C719l461l996K713j1041M538m431k233Q209m29N025J1004j768R384P47l929
1264A4051K149o698p362j059r689k347P72n823P836J8J360Q530k711K252M608
1279E887q017N442m182k446L890j294J185O923k546O162J15k285P17m660n925
1294a034r28q841k098O6l946N510K756K473P974K855K030N289l870J323j845m364
1310C350j576q37m803M421k949J921L086j904Q94J263o526K063m312l929K716
1325g122l236J872N684q54P525M392o31P058l576p86l35p695k174j660q162M671
1341e029l582L33N382j349K715M597m802N329l451k280K357l542JM497l276N909
$$ plain form
1357 3809 6548 4275 10189 7381 5357 6254 -337 -2575 -3379 -10587 -7033 -9706 -8767 -4195 -3472 -1169
1373 -1169 4977 1611 6444 5545 2505 3967 2068 -1327 1993 -1773 -469 2200 -375 2930 2612
1388 2612 -239 2680 -1520 -3495 -1390 -7562 -4437 -4586 -5932 -1864 267 -975 5902 3374 5116
1403 5116 6655 3529 3416 3695 -2571 1753 -2946 -3755 -232 -4655 -1509 71 -3142 1517 38 -2050
1419 -2050 1453 -1326 -1403 267 -1767 -303 2075 -1470 3777 1827 1436 4784 452 1042 3382 -3915
1435 -3915 1106 -2246 -3595 -1343 -3607 -1840 -368 -1883 866 1806 252 2256 1824 97 2849
1450 2849 -854 -778 2723 -3660 1676 -307 -1643 2181 -1220 -66 2173 -1868 1000 -973 -260 -546
1466 -546 -861 -1483 1487 -1027 -960 2614 -851 1051 1437 -2210 3002 -1721 -1373 2020 -2884 1262 -1751
$$ packed form
1357C809K739k273N914k808k024Q97o591k238q04p208L554k673R39M572P23K303
1373a169O146l366M833q99l040J462j899l395L320l766J304K669k575L305l18
1388B612k851K919m200j975K105o172L125j49j346M068K131j242O877k528J742
1403E116J539l126j13K79o266M324m699q09L523m423L146J580l213M659j479k088
1419b050L503k779p7J670k034J464K378l545N247j950l91L348m332N90K340p297
1435c915N021l352j349K252k264J767J472j515K749R40j554K004m32j727K752
1450B849l703P6L501o383N336j983j336L824l401J154K239m041K868j973P13k86
1466e46l15o22K970k514O7L574l465J902L86l647N212m723L48L393m904M146l013
$$ plain form
1483 -1751 -278 1553 -1099 136 1454 105 582 570 784 186 2413 -2720 2643 -483 -2611 751
1499 751 -2925 -108 -1512 -3651 2768 -1580 -16 1591 325 3263 380 1207 1425 1752 -2055 649
1515 649 377 -2172 954 -1636 384 2835 -4415 3668 -1320 -1570 -207 -4769 159 -2003 -3750 1571
1531 1571 222 1876 2277 3685 3744 4075 1359 248 3346 -4851 -1230 -2506 -4293 -26 -5171 -118
1547 -118 2091 -3373 3385 -765 1584 362 -2203 263 260 -1341 -1035 2678 1587 1781 3925 880
1563 880 5846 -385 -1354 2620 -5786 -1717 -5353 -4759 -763 -5549 -1331 1872 278 2394 2213 4243
1579 4243 1915 2892 -1290 2959 528 -3048 1770 -1302 786 1338 -2646 5149 -1652 -1665 908 -3736
1595 -3736 -982 -4561 -3620 -1424 -1558 -2186 1244 3297 2183 4888 3629 3975 5919 -2653 3803 -1072
$$ packed form
1483a751J473J831k652J235J318j349M77j2K14n98K227n133N363l126k128L362
1499G51l676K817j404k139O419m348J564J607j266K938k883Q27K18L27l807K704
1515F49k72k549L126k590K020K451p250Q083m988k50J363m562M928k162j747N321
1531A571j349J654M01J408N9L31k716j111L098q197L621j276j787M267n145N053
1547a18K209n464O758m150K349j222k565K466lj601L06L713j091J94K144l045
1563H80M966o231r69L974q406M069l636N94L996m786M218L203j594K116j81K030
1579D243k328R77m182M249k431l576M818l072K088N52l984P795o801j3K573m644
1595c736K754l579R41K196j34o28L430K053j114K705j259L46J944q572O456m875
$$ plain form
1611 -1072 -3753 -525 -5701 -977 -1756 -4755 1807 -964 177 395 622 979 -681 -1446 -1337 1417
1627 1417 -2279 1315 2567 1449 5268 1283 3707 5136 -2500 1861 -2625 -3271 -3582 -6427 -3521
1642 -3521 -2916 -3279 -638 1694 2271 2179 4010 1708 4026 69 -1204 2948 -2959 -7 -3 -1412 3311
1659 3311 -737 986 3166 -1340 61 -2507 -1961 -3364 -3254 -4440 -682 -1311 -924 3660 2013 3855
1675 3855 5160 839 6010 457 -1020 1533 -3529 -978 -2375 -3054 629 -1566 -1032 1133 -347
1690 -347 184 121 -1187 -904 395 -3277 1525 -125 -422 3272 783 3499 3800 -224 3951 -208 -757
1707 -757 -458 -2865 -2032 -2320 -3296 -1653 -606 -1807 770 927 189 2503 520 698 2796 -1693 1718
1724 1718 -241 -417 1492 -566 298 1507 -1058 1227 186 -628 -438 -1005 -2249 -522 -2060 -1874
$$ packed form
1611a072k681L228n176M724p79k999O562k771J141K18K27L57j660p65J09K754
1627A417l696L594J252j118L819l985K424J429p636M361m486o46l11k845K906
1642c521O05l63K641K332N77r2J831k302K318l957j273M152n907K952Mj409M723
1659C311m048J723K180m506J401k568N46j403J10j186L758o29L87M584j647J842
1675C855J305m321N171n553j477K553n062K551j397o79L683k195N34K165j480
1690c47N31o3j308K83J299l672M802j650k97L694k489K716L01m024M175m159n49
1707g57K99k407Q33k88r76J643J047j201K577J57p38K314j983J78K098m489L411
1724A718j959j76J909k058Q64J209k565K285j041q14J90n67j244J727j538J86
$$ plain form
1740 -1874 813 -2101 1079 1430 265 3324 1098 1059 2757 -1248 1211 -684 -1562 -378 -1401 -1897
1756 -1897 507 -1590 48 1097 -391 699 777 -1960 1511 -1395 -874 1281 -1723 1038 1044 -702
1772 -702 2226 299 48 1830 -1033 98 -228 -1876 -776 -568 -2151 647 -1003 -31 1321 -243
1788 -243 669 1738 -837 1687 -705 -348 569 -963 -189 581 -955 303 222 -996 978 -386 -477
1805 -477 587 -876 -441 1241 -1806 1553 -158 -240 966 -160 -399 1405 -1406 876 29 -1221
1821 -1221 813 -59 -815 1154 -1227 -346 415 -1580 854 -81 -674 1517 -460 304 1942 -791 1059
1838 1059 50 -828 185 -1006 -1719 560 -2005 287 458 -713 1127 644 -628 1916 -961 -139
1854 -139 510 -1027 443 50 -768 1330 -105 -122 1558 -831 686 -77 -1358 -209 -968 -2111 33
$$ packed form
1740a874K687k914L180L51j165L059k226l9J698m005K459j895q78J184j023m96
1756a897K404k097J638J049j488J090P8k737L471k906N21K155l004K761Oj746
1772g02K928j927k51J782k863J131l26j648J100K08j583K798j650R72J352j564
1788b43R12J069k575K524k392L57R17j532P74P70j536J258q1j218J974j364r1
1805d77J064j463M35J682l047L359j711q2J206j126k39J804k811K282q47j250
1821a221K034q72p56J969k381Q81P61j995K434r35n93K191j977P64J638k733J850
1838A059j009q78J013j191p13K279k565K292J71j171J840m83j272K544k877Q22
1854a39O49j537J470l93q18K098j435j7J680k389J517p63j281J149p59j143K144
$$ plain form
1871 33 -1599 12 624 -231 1170 2119 -275 2288 377 216 1076 -1030 -481 68 -1803 432 -203
1888 -203 -998 829 -790 -272 679 -1194 31 228 -1853 1012 -668 -455 1324 197 715 2231 -526
1905 -526 2138 170 -184 1094 -1014 -1237 123 -2224 -612 -808 -1675 251 -182 -579 1682 -113 505
1922 505 1673 -995 1516 -256 -662 1250 -423 -90 1205 -790 1207 484 -348 198 60 -1896 -147
1939 -147 -1675 -1584 -360 -1976 666 785 -658 2570 822 1320 2737 -173 1412 51 -1368 -248
1955 -248 -931 -1598 -252 -745 -14 719 -178 -159 1519 -2075 595 -969 -1255 740 -1590 22 1489
1972 1489 -383 2324 895 1652 1608 197 539 -92 -1239 -1702 -643 -1948 -575 -853 -950 1554 -270
1989 -270 114 1938 -958 1543 -976 13 889 -1110 89 461 78 1063 458 930 619 350 -1178 395
$$ packed form
1871C3j632J611O12q55J401R49k394K563j911j61Q60k106N49N49j871K235o35
1888b03p95J827j619N18R51j873J225J97k081K865j680K13J779j127N18J516k757
1905e26K664j968l54J278k108k23J360k347J612j96q67J926m33l97K261j795O18
1922E05J168k668K511j772m06J912j673L33J295j995J997p23q32N46j38j956J749
1939a47j528R1J224j616K642J19j443L228j748M98J417k910J585j361j419J120
1955b48o83o67J346m93P31P33q97J9J678l594K670j564k86J995k330J612J467
1972A489j872K707j429P57m4j411L42o31j147m63J059j305J373k78r7K504j824
1989b70L84J824k896K501k519R89Q76j999J199L72l83R85o05M72l11k69j528J573
$$ plain form
2007 395 -942 -1905 89 -2324 423 -842 -1349 2043 -74 950 1700 3 2321 -815 247 332
2023 332 110 -888 -312 -325 -507 337 -684 283 636 -1913 1082 -836 -486 323 -2123 1321 -824 -588
2041 -588 1351 -41 1132 645 421 1796 232 145 -375 816 -1741 -453 -964 -1459 549 -2086 258
2058 258 1064 -1275 1752 -729 1173 704 -1252 1250 187 -511 -701 376 405 483 270 160 1558 -649
2076 -649 -750 1237 -2115 678 -1635 -889 959 -1884 529 1153 -589 1494 -503 1351 923 -370
2092 -370 -375 737 -423 -1152 619 -1082 836 -94 -1183 1970 -1057 -100 920 -1414 1280 -1636 -111
2109 -111 981 -562 -40 369 60 427 -100 -189 331 680 -1595 1208 -41 -123 888 -1208 1327 -232
2127 -232 -1097 1233 -432 98 -288 -471 1208 -463 -96 -1 931 -822 182 -277 -830 537 -1114 1
$$ packed form
2007C95j337r63J994k413K747j265n07L392k117J024P50j697K318l136J062Q5
2023C32k22r98N76j3j82Q44j021R67L53k549K995j918L50Q09k446L444k145K36
2041e88J939j392J173m87k24J375j564q7n20J191k557J288n11m95K008k635K344
2058B58Q06k339L027k481J902m69j956K502j063o98j90J077K9P8k13j10J398k207
2076f49j01J987l352K793k313P46J848k843K413O24j742K083j997J854m28j293
2092c70nJ112j160p29J771j701J918r30j089L153l027R57J020k334K694k916J525
2109a11J092j543N22M09l09L67n27q9N20L49k275K803j249q2J011k096K535j559
2127b32q65K330j665N30l86j83J679j671L67R5R32j753J004m59n53J367j651J115
$$ plain form
2145 1 1238 -1769 1169 -263 522 1156 -512 1349 550 -940 -137 -585 -606 -557 -661 -352 700 -549
2163 -549 -292 1271 -1231 793 -806 -986 739 -1757 140 922 -690 1918 266 1370 1494 258
2179 258 673 656 -664 -848 -812 -1399 -761 -1147 -1537 828 -630 197 1726 -349 1755 -87 537 1208
2197 1208 -467 169 713 -513 468 -297 604 337 735 -707 277 -516 -1225 -683 -2443 -736 -892 -1660
2215 -1660 809 -42 828 2272 1252 2788 1372 1168 1106 136 -1137 -58 -1188 -1088 -636 -1314 -672
2232 -672 350 -1276 1087 -569 -238 249 -1712 169 -576 -1071 976 224 1150 2327 1334 2424 2077
2249 2077 718 822 219 -2240 -1270 -2959 -2909 -1862 -2229 -814 408 -407 1958 1161 1495 1807 145
2266 145 547 698 -547 388 86 -139 1282 1130 826 1640 -20 -116 -216 -2360 -1784 -3263 -3324 -2197 -1968
$$ packed form
2145AJ237l007K938j432P85O34j668J861p99j490Q03m48k1M9j04L09J052j249
2163e49K57J563k502K024j599j80J725k496J897P82j612K608j652J104J24j236
2179B58M15j7j320j84L6n87O38l86l90K365j458Q27J529k075K104j842O24O71
2197A208j675O36N44j226R81p65R01k67L98j442R84p93p09N42j760J707j56p68
2215a660K469q51Q70J444j020J536j416k04o2r70j273J079j130J00M52o78O42
2232f72J022j626K363j656L31M87j961J881p45m95K047p52R26J177r93J090l47
2249B077j359J04o03k459R70j689N0J047l67J415J222q15K365p97L34L12j662
2266A45M02J51j245R35l02k25J421j52l04Q14j660r6j00k144N76j479o1J127K29
$$ plain form
2285 -1968 -685 1332 1108 3298 3117 2848 3247 1838 564 929 -1389 -1062 -1111 -1996 -652 -662 -1004 703
2303 703 -246 -264 167 -1575 -874 -1681 -2001 -408 -519 -93 1660 1465 2877 3477 2652 2909 1970 221 580
2322 580 -2177 -2261 -2531 -3459 -2150 -2027 -2008 290 69 762 1883 697 909 968 123 566 74 -186 899
2341 899 376 1377 1804 1159 1463 1287 -640 -152 -2407 -2692 -2908 -3527 -2777 -1831 -1669 856 1203 1877 3374
2360 3374 2754 2764 2830 858 723 -28 -1444 -544 -1512 -1060 -186 -559 134 502 -798 187 -1126 -1654 -1277
2379 -1277 -2231 -2023 -503 -1145 935 1938 1845 3491 3218 2339 3211 633 280 -915 -2747 -2237 -3135 -3009
2397 -3009 -1522 -1760 -777 931 -45 1607 947 406 845 226 -674 429 -552 526 1357 1016 1971 2202
2415 2202 1092 1657 -141 -650 -1261 -2961 -2525 -2924 -3072 -1882 -1018 -324 1465 1145 2133 2558 1779 1559
$$ packed form
2285a968J283K017k24K190j81k69L99j409j274L65k318L27m9q85J344j0l42J707
2303G03r49j8M31j742P01q07l20J593j11M26J753j95J412O00q25K57r39j749L59
2322E80k757q4k70r28J309J23J9K298k21O93J121j186K12N9q45M43m92k60J085
2341H99n23J001M27o45L04j76j927M88k255k85k16o19P50R46J62K525L47O74J497
2360C374o20J0O6j972j35p51j416R00r68M52Q74l73O93L68j300R85j313n28L77
2379a277r54K08J520o42K080J003r3J646k73q79Q72k578l53j195j832N10q98J26
2397c009J487k38R83J708r76J652o60n41M39o19r00J103r81J078Q31l41R55K31
2415B202j110N65j798n09o11j700M36l99j48J190Q64O94J789l20R88M25p79k20
$$ plain form
2433 1559 1431 -303 565 -1240 -810 -99 -728 -73 465 -319 699 -544 -832 -540 -1637 -1767 -1461 -1684
2451 -1684 -803 -122 34 1992 1995 1767 2973 1818 1537 1284 -662 53 -1513 -1755 -1511 -2009 -1143 -609 -883
2470 -883 315 203 189 446 187 -347 256 -651 -85 473 -226 1111 1281 832 2029 942 1149 876 -641
2489 -641 -293 -1709 -1904 -2011 -1805 -1393 -453 -652 37 1186 651 1360 1763 460 1517 -445 -19 382
2507 382 -1254 250 -266 0 799 -253 630 330 -306 -841 -986 -956 -1555 -507 -1146 376 -481 219 1670
2526 1670 643 1512 1498 384 1482 -885 -383 -188 -1283 -606 -982 -452 -380 -47 -238 356 341 -355 529
2545 529 -181 -150 84 -1125 1074 -446 262 1199 189 724 429 -32 881 -358 -472 -629 -410 -827 -219
2564 -219 -390 -318 723 -527 589 309 -136 926 -314 311 554 -1194 667 -362 134 -42 -272 230
$$ packed form
2433A559j28j734Q68j805M30P11o29O55N38p84J018j243k88K92j097j30L06k23
2451a684Q81O81J56J958Lk28J206j155k81k53j946P15j566k42K44m98Q66N34k74
2470h83J198j12j4K57k59n34O03r07N66N58o99J337J70m49J197j087K07k73j517
2489f41L48j416j95j07K06M12R40j99O89J149n35P09M03j303J057j962M26M01
2507C82j636J504n16K66P99j052Q83l00o36n35j45L0n99J048o39J522q57P00J451
2526A670j027Q69j4j114J098k367N02J95j095O77l76N30P2L33j91N94j5o96Q84
2545E29p10L1K34j209K199j520P08R37j010N35k95m61R13j239j14j57K19m17O08
2564b19j71P2J041j250J116k80m45J062j240O25K43j748J861j029M96j76k30N02
$$ plain form
2582 230 242 -485 330 189 -541 -195 375 -721 620 -422 -8 812 -886 395 12 -299 359 -740
2600 -740 144 378 -419 675 -109 218 -353 211 -307 478 -304 -330 900 -397 -29 657 -501 1035 -593
2619 -593 -19 680 -816 -29 -371 -501 246 -404 33 128 66 -285 660 419 68 450 -482 1002 -429 -577
2639 -577 561 -639 93 -218 -1035 438 -732 83 181 -374 -344 -204 -123 -139 153 -587 557 547 -222 1139
2659 1139 95 659 951 -600 828 -389 -277 -321 -1042 -323 -632 -850 145 -173 192 105 630 -139 672
2678 672 -239 1 741 -542 -108 366 -7 811 -72 537 746 -268 207 -501 -555 -805 -928 -800 -643 -722
2698 -722 -202 805 515 579 1376 428 1103 -134 284 305 -764 253 -271 -581 349 -272 118 422 -197
2717 -197 -63 -52 -699 -430 -305 -809 109 -423 -159 1148 403 1145 1213 719 1374 -225 71 -115 -650 -449
$$ packed form
2582B30J2p27Q15j41p30L46N70j096J341j042M14Q20j698J281l83l11O58j099
2600g40Q84K34p97J094p84L27n71N64n18P85p82k6J230j297L68O86j158J536j628
2619e93N74O99j496P87l42j30P47o50M37R5o2l51R45k41l51L82r32J484j431j48
2639e77J138j200P32l11q17J473j170Q15R8n55L0J40Q1j6K92p40J144j0p69J361
2659A139j044N64K92j551J428j217J12m4p21P19l09k18R95l18L65q7N25p69Q11
2678F72r11K40P40j283M34M74l73Q18q83O09K09j014M75p08n4k50j23J28J57p9
2698g22N20J007k90O4P97r48O75j237M18K1j069J017n24l10R30o21L90L04o19
2717a97J34J1o47K69J25n04R18n32K64J307p45P42O8m94O55j599K96j86n35K01
$$ plain form
2737 -449 -601 -1212 -287 -533 -569 122 -67 144 609 -59 30 284 -410 646 -158 70 371 196 481 643
2757 643 145 849 -66 -331 -299 -742 -740 -595 -1078 -767 -428 -617 447 292 424 1145 225 600 782 -56 472
2778 472 39 -452 42 -164 -201 523 -332 167 118 -139 -126 -438 -750 56 -889 -597 -125 -131 256 696 462 1189
2800 1189 825 697 959 143 -67 -614 -748 -568 -591 -963 -89 -509 67 383 -213 327 159 -32 380 -448
2820 -448 -127 -94 -125 372 609 210 818 611 478 379 -252 -347 -415 -1199 -638 -721 -925 -311 -299 -4 508 278
2842 278 659 918 138 498 190 -134 149 -244 -187 451 -107 355 -79 6 86 -335 -426 -1 -773 -487 -511 -390
2864 -390 -162 177 80 610 373 504 867 -155 761 84 -365 -186 -167 -572 -57 -643 -170 -158 -338 266 -91
2885 -91 -407 409 -578 -402 163 -143 417 -132 -109 519 176 313 879 -24 419 21 -398 -47 -450 -865 42
$$ packed form
2737d49j52o11R25k46l6O91j89K11M65o68Q9K54o94J056q04K28L01j75K85J62
2757F43m98P04r15k65L2m43KJ45m83L11L39j89J064j55J32P21r20L75J82q38N28
2778D72m33m91M94k06l7P24q55M99m9k57J3l12l12Q06r45K92M72oL87M40k34P27
2800A189l64j28K62q16k10n47j34J80k3l72Q74m20N76L16n96N40j68j91M12q28
2820d48L21L3l1M97K37l99O08k07j33r9o31r5o8p84N61q3k04O14J2K95N12k30
2842B78L81K59p80L60l08l24K83l93N7O38n58M62m34Q5Q0m21r1M25p72K86k4J21
2864c90K28L39r7N30k37J31L63j022R16o77m49J79J9m05N15n86M73J2j80O04l57
2885i1l16Q16r87J76N65l06N60n49K3O28l43J37N66r03M43l98m19L51m03m15R07
$$ plain form
2906 42 -487 -180 124 -5 -42 240 -104 870 259 82 212 -18 -44 97 -397 -161 119 -149 357 24 -97
2927 -97 219 -117 -213 -87 -786 106 -534 -258 184 -148 343 901 241 404 366 272 411 2 -448 164 -330
2948 -330 -196 -174 -366 212 -145 -111 498 -463 201 185 -578 9 -268 -152 -189 53 -182 298 -85 182 414
2969 414 -550 35 -17 -725 382 -610 224 69 -436 260 -111 -59 478 -175 -21 379 44 318 93 -241
2989 -241 2 331 -479 570 -312 -109 237 -561 18 172 -501 418 -7 427 93 20 110 102 -142 52 142
3010 142 -165 74 117 -245 675 -191 -48 433 -571 444 -433 -142 84 -300 390 243 -214 387 254 438
3030 438 162 171 -255 245 -474 -442 -81 -471 -98 -344 -286 556 -644 317 369 -441 657 -519 -181 29 -200
3051 -200 9 322 164 177 149 109 266 280 -693 400 -532 -271 58 -516 167 -262 -510 523 -408 595
$$ packed form
2906D2n29L07L04j29l7K82l44R74o11j77J30k30k6J41m94K36K80k68N06l33j21
2927i7L16l36r6J26o99Q92o40K76M42l32M91N58o60J63l8r4J39m09m50O12m94
2948c30J34K2j92N78l57L4O09r61O64j6p63N87k77J16l7K42k35M80l83K67K32
2969D14r64N85n2p08J107r92Q34j55n05O96l71N2N37o53J54M00l35K74k25l34
2989b41K43L29q10J049q82K03L46p98N79J54o73R19m25M34l34p3R0qk44J94R0
3010A42l07K39M3l62R20q66J43M81j004J015q77K91K26l84O90j47m57O01j33J84
3030D38k76Rm26N00p19L2L61l90L73k46N8Q42j200R61N2q10J098j176L38K10k29
3051b00K09L13j58J3k8m0J57J4r73J093r32K61L29n74O83m29k48J033r31J003
$$ plain form
3071 595 573 351 367 -81 221 -58 3 -797 312 -113 -225 202 -359 142 141 -559 660 -249 105 110 -295 474
3093 474 -219 -329 328 402 333 525 407 334 254 -365 -193 261 -1076 -19 -687 -363 -4 -763 -235 307 -313
3114 -313 694 67 625 -33 -120 -139 -17 -189 -361 257 -196 325 511 -3 477 -224 74 357 -805 50
3134 50 -1098 -537 44 -523 227 219 181 355 371 406 172 273 -268 325 -404 -286 -130 -604 260 -84 -235 505
3156 505 -448 -59 -429 -286 74 -688 39 73 233 121 378 519 410 567 167 133 551 -699 328 -584
3176 -584 -425 -153 -484 267 -176 -237 355 -122 257 14 103 192 -46 185 -100 371 -483 315 -41 -82 377
3197 377 -293 726 185 -653 207 -562 -6 -443 -289 -28 319 -216 117 147 442 557 285 158 298 -271
3217 -271 33 44 -744 -68 -397 -349 45 -370 127 85 -137 381 -72 46 -166 -137 -241 187 -225 -58 526
$$ packed form
3071E95k2k22J6m48L02k79O1q00J109m25j12M27n61N01jp00J219r09L54Nm05P69
3093D74o93j10O57P4o9J92j18p3q0o19J72M54j337J057o68L24L59p59N28N42o20
3114c13J007o27N58o58q7j9J22j72j72O18m53N21J86n14M80p01K98K83j162Q55
3134E0j148N61N81n67P50ql8J74J6L5k34J01n41N93p29J18J56m74Q64l44j51P40
3156E05r53L89l70J43L60p62P27L4J60j12K57J41j09J57m00l4M18j250J027r12
3176e84J59K72l31P51m43o1N92m77L79k43Q9Q9k38K31k85M71q54P98l56m1M59
3197C77o70J019n41q38Q60p69N56m37J54K61L47n35L33L0K95J15k72j27J40n69
3217b71L04J1p88O76l29M8L94m15M97m2k22N18m53J18k12K9j04M28m12J67N84
$$ plain form
3238 526 62 167 24 83 499 -8 276 -70 -137 34 -593 -354 73 72 194 65 27 328 248 -198 -10 3
3260 3 -206 331 -63 114 273 -324 67 64 114 187 -106 143 175 -106 -135 11 -88 148 -79 169 397 -234 61
3283 61 104 -193 22 48 -332 97 -391 280 -63 -191 97 -176 -177 130 15 -57 -29 124 -12 365 -74 218
3305 218 142 -159 -346 -273 -275 -136 -557 -234 93 -310 801 36 133 -28 89 -40 113 -536 -44 -52 -216 524
3327 524 295 -17 108 -176 193 -174 -423 -395 -312 -590 -181 -440 -42 303 -136 288 488 200 443 300 -155
3348 -155 192 -44 169 -291 -527 115 6 -243 368 -176 -72 128 -109 136 22 -508 -7 24 -116 414
3368 414 64 175 476 341 468 99 7 -326 -567 -362 -382 -741 -223 -374 -373 363 -158 13 398 256 198 529
3390 529 -75 391 162 44 -123 42 87 345 -111 13 295 -41 -43 -443 -241 -414 -517 -368 -303 -193 471
$$ packed form
3238E26m64J05j43N9M16n07K84l46o7J71o27K39M27jJ22j29l8L01q0m46J88J3
3260Ck09N37l94J77J59n97L91lN0P3k93K49L2k81k9J46r9K36k27K48K28o31K95
3283F1M3k97K15K6l80M29m88O71l43j28K88k73jL07j15p2K8J53j36L77m39K92
3305B18p6l01j87P3kJ39m21L23L27m03J111p65R7j61J17j29J53o49M92qj64P40
3327E24k29l12J25k84L69l67k49K8Q3k78M09k59L98L45m39M24K00k88K43j43m55
3348a55L47k36K13m60k36O42j09k49O11n44J04K00k37K45j14n30N01L1j40N30
3368D14l50J11L01j35J27l69r2l33k41K05k0l59N18j51JP36n21J71L85j42n8L31
3390E29o04M66k29j18j67J65M5K58m56J24K82l36km00K02j73j03J49O5J10O64
$$ plain form
3411 471 174 279 496 466 544 667 109 40 -328 -444 -347 -592 -499 -160 -230 191 -57 -182 156 -105 -432 -53
3433 -53 -346 -275 31 -224 151 411 329 805 1019 384 514 -13 53 -4 -790 -583 -680 -590 -254 -507 26 184
3455 184 266 535 604 224 450 39 -253 283 -232 378 207 -171 685 105 -179 545 -453 -67 -505 -533 -542 -862
3477 -862 -471 -394 -241 -28 599 638 709 915 645 630 491 9 61 -466 -475 -141 -672 -21 -18 -175 26 -243 93
3500 93 -280 -72 -724 56 -349 -179 36 135 480 403 595 1058 171 696 2 61 -76 -667 -733 -649 -894 -777
3522 -777 -363 -241 43 326 241 363 527 -259 272 -416 451 156 -446 81 290 445 694 200 417 58
3542 58 -243 -597 -549 -624 -647 -647 -610 16 -118 382 857 421 795 930 431 526 -296 243 -144 -415 -485 -359 -172
3565 -172 224 36 194 157 260 -144 -45 -479 -392 -289 -424 316 -309 695 900 670 1141 555 242 123 -200
$$ packed form
3411D71k97J05K17l0P8J23n58o9l68j16R7k45R3L39p0M21k48j25L38k61l27L79
3433e3k93P1L06k55L75K60q2M76K14o35J30n27O6n7p86K07r7R0L36k53N33J58
3455A84Q2K69O9l80K26m11k92N36n15O10j71l78Q56n80k84P24r98L86m38k8rl20
3477h62L91P7J53K13O27L9P1K06k70j5j39m82N2n27rL34n31O51Lj57K01k69L36
3500I3l73K08o52P80m05J70K15R9L45p7J92M63q87N25o94N9j37n91o6Q4k45J17
3522g77M14J22K84K83q5J22J64p86N31o88Q67k95o02N27K09J55K49m94K17l59
3542E8l01l54M8p5k3%L7O26j34N00M75m36L74J35m99R5q22N39l87k71p0J26J87
3565a72L96j88J58l7J03m04R9m34Q7J03j35P40o25J004K05k30M71n86l13j19l23
$$ plain form
3586 -200 -2 -391 -621 -597 -361 -433 -393 165 113 280 437 -348 408 24 342 25 -251 318 -71 364 378 505
3608 505 369 226 40 171 -116 -376 -394 -198 -753 -116 -664 -215 90 14 709 467 140 420 -138 468 -255
3629 -255 -122 186 -65 -158 -297 66 123 352 -309 1 365 -221 -108 -80 -490 55 -433 104 -131 -243 658
3650 658 300 375 282 201 373 -163 36 -522 276 -408 -424 -84 -234 309 -106 73 188 -295 277 -267 -359 265
3672 265 -363 102 -38 43 326 487 274 -82 382 -6 26 28 -479 -28 -613 -402 -534 -127 218 -173 52
3693 52 224 65 440 0 -103 137 -216 96 -89 64 -384 236 -79 82 268 -110 -88 -5 -279 159 -517
3714 -517 -143 -41 -254 425 -192 75 219 -71 211 97 51 -11 -121 -422 294 86 -185 296 -191 -47 65
3735 65 -388 83 84 -210 -84 -325 20 420 -6 -32 82 -344 183 127 -196 20 285 44 360 -209 188 -79
$$ packed form
3586b00J98l89k30K4K36p2M0N58n2J67J57p85P56l84L18l17k76N69l89M35J4J27
3608E05j36j43j86J31k87k60j8J96n55O37n48M49L05p6O95k42l27K80n58O06p23
3629b55J33L08k51r3j39L63N7K29o61L10L64n86J13K8m10N45m88N37k35j12R01
3650F58l58P5r3q1J72n36J99n58P98o84j6L40j50N43m15J79J15m83N72n44r2O24
3672B65o28M65j40Q1K83J61k13l56M64l88L2Kn07M51n85K11j32M07L45l91K25
3693E2J72j59L75m40j03K40l53L12j85J53m48O20l15J61J86l78K2Q3k74M38o76
3714e17L74J02k13O79o17K67J44k90K82j14m6o2j10l01P16k08k71M81m87J44J12
3735F5m53M71Jk94J26k41L45M00m26k6J14m26N27n6l23K16K65k41L16n69L97k67
$$ plain form
3757 -79 -273 461 -153 -83 -103 27 172 287 -273 -14 202 179 86 -54 113 192 -49 47 21 2 194 -161 -102
3780 -102 296 182 370 173 -10 40 -405 2 -90 0 -142 50 -237 140 -51 -166 405 -189 -66 384 -326
3801 -326 103 412 186 0 7 -169 96 -137 -55 -188 -141 84 -25 -388 38 -96 -157 64 -271 -143 -5 -20
3823 -20 -133 30 201 269 62 153 36 18 -213 -80 -309 -46 -266 -78 132 -110 -43 -29 -302 299 -141 57
3845 57 115 -234 -24 285 -156 270 257 289 784 231 322 393 -144 -309 -130 -553 -366 -531 -178 84 -179 123
3867 123 125 -6 443 257 126 44 -242 -272 134 -96 163 349 360 206 126 -35 131 -48 -397 -240 -654 -256
3889 -256 -357 -40 250 -41 -3 524 322 395 477 409 431 98 -104 -150 -126 -184 77 -32 230 19 191 124 -289
3912 -289 -335 10 -500 -92 -40 -236 -25 42 254 225 275 871 384 280 83 68 -161 -183 -213 -602 -385 -298 -12
$$ packed form
3757g9j94P34o14P0k0J30J45J15n60K59K16k3r3j40J67P9k41R6k6j9J92l55N9
3780a02L98j14J88j97j83N0m45M07r2R0j42J92k87L77j91j15N71n94J23M50p10
3801c26M29L09k26j86Pj76K65k33Q2j33M7K25j09l63M26j34o1K21l35J28J38j5
3823b0j13J63J71O8k07R1j17j8k31J33k29K63k20J88K10k42O7J4k73O01m40J98
3845E7N8l49K10L09m41M26j3L2M95n53R1P1n37j65J79m23J87j65L53K62k63L02
3867A23Kj31M49j86j31q2k86l0M06k30K59J86J1j54q0j61J66j79l49J57m14L98
3889b56j01L17K90k91L8N27k02P3Q2o8K2l33k02m6K4n8K61j09K62k11J72o7m13
3912b89m6L45n10M08N2j96K11O7K12k9N0N96m87j04j97j5k29k2l0l89K17Q7K86
$$ plain form
3935 -12 -183 -174 217 -433 107 123 -68 211 -168 181 -82 -37 45 195 168 252 56 35 -114 -58 -291 -76 -195
3958 -195 -718 -12 -190 -198 -163 166 149 190 62 410 349 341 -43 -136 -154 -173 -412 -239 -45 -298 302 110 62 303
3982 303 -368 105 -25 -173 47 -164 106 -28 207 222 45 123 143 397 71 -191 -97 -488 10 -353 21
4003 21 -218 -369 1 -57 78 184 -2 -120 -117 -161 169 -50 -77 -37 109 -41 430 -173 96 264 1 70 -365
4026 -365 -277 253 -562 6 -292 -72 90 73 45 171 18 301 343 9 -207 81 -302 32 -62 -89 277 -302
4048 -302 27 -140 -286 -93 -314 -47 44 -63 -314 12 151 -72 57 20 430 510 -83 323 -85 -181 -34
4069 -34 -130 37 -380 -285 -32 -310 -32 -169 8 29 -266 -26 87 108 107 177 188 -114 -4 -473 64 -55 -109
4092 -109 -21 44 104 58 -454 151 -46 76 10 59 88 175 11 37 149 52 48 238 -247 53 -23 -316 300 -186
$$ packed form
3935a2j71RL91o50N40J6j91K79l79L49k63M5Q2J50k7Q4j96k1j49N6k33K15j19
3958a95n23P06j78qL5L29j7M1j28L48o1ql84r3j8j9k39J73J94k53O00j92m8K41
3982C03o71M73j30j48K20k11K70j34K35J5j77P8K0K54l26k62R4l91M98l63L74
4003B1k39j51L70n8J35J06j86j18Lm4L30k19k7M0J46j50M71o03K69J68k63O9m35
4026c65Q8N30q15N68k98K20J62j7k8J26j53K83M2l34k16K88l83L34r4k7L66n79
4048c02L29j67j46J93k21K67R1j07k51L26J39k23J29l7M10Q0n93M06m08r6J47
4069c4r6J67m17R5K53k78K78j37J77K1k95K40J13K1jP0J1l02J10m69N37j19n4
4092a09Q8O5O0m6n12O05j97J22o6M9K9Q7j64K6J12r7mJ90m85L00p6k93O16m86
$$ plain form
4116 -186 -33 -185 -8 21 22 2 93 -141 -184 -156 -26 -239 411 50 146 -10 21 -29 -191 120 18 -76 123 -48
4140 -48 -38 -57 -206 32 -50 -70 51 35 120 -111 -7 78 161 217 -174 210 -219 141 -169 -373 -110 -49 -84 47
4164 47 -182 109 -285 0 2 319 240 62 -54 -3 251 5 154 223 -22 188 58 -49 62 -335 264 -32
4186 -32 -67 -56 -135 -118 88 225 278 233 203 178 300 -53 289 16 -222 -52 -434 -190 -155 -296 64 75 186 -17
4210 -17 180 100 -102 -201 166 -93 -107 17 15 13 29 18 -89 302 -209 382 -37 -182 -216 -318 -197 -238 -94 -87 -164
4235 -164 42 92 75 113 93 -24 -68 198 -299 322 -79 -51 303 251 80 413 -81 201 -179 -88 -320 23 118
4258 118 -290 -20 144 258 -383 386 340 143 265 220 -339 416 -475 -20 -134 -5 -133 -470 -196 280 -231
4279 -231 80 -94 -78 74 -108 -28 -133 -73 6 20 -147 310 -42 -143 306 230 -47 84 -13 41 -354 -569 -690
$$ packed form
4116a86J53j52J77K9Jk0R1k34m3K8J30k13O50l61R6j56L1n0j62L11j02r4J99j71
4140d8J0j9j49K38q2k0J21j6Q5k31J04Q5Q3N6l91L84m29L60l10k04K63O1l5J31
4164D7k29K91l94K85KL17p9j78j16N1K54k46J49O9k45K10j30j07J11l97N99k96
4186c2l5J1p9J7K06J37N3m5l0k5J22l53L42k73k38J70l82K44L5j41L60J1J11k03
4210a7J97q0k02r9L67k59j4J24kkJ6j1j07L91n11N91m19j45l4j02J21m1J44Pp7
4235a64K06N0j7L8k0j17m4K66m97O21m01K8L54n2j71L33m94K82l80R1k32L43R5
4258A18m08K70J64J14o41P69m6j97J22m5n59P55q91M55j14J29j28l37K74M76n11
4279b31L11j74J6J52j82Q0j05O0P9J4j67M57l52j01M49p6k77J31r7N4l95k15j21
$$ plain form
4302 -690 -289 -191 -23 55 12 119 -29 144 266 12 164 -10 -12 177 -158 132 122 63 194 8 -125 238
4324 238 -169 -476 -145 -153 -24 -100 -91 369 354 348 -59 129 303 -62 -30 266 -221 -82 80 -102 198 66 -173
4347 -173 -8 -41 -209 129 -43 -165 206 -20 -194 -22 -74 15 347 412 281 -94 139 311 158 85 -5 -181
4369 -181 -16 -223 44 -377 -38 -56 -61 -18 305 346 164 -181 -374 -197 209 45 43 -38 -58 -54 -19 -152 -61 -16 -37
4394 -37 206 78 330 -67 17 -226 6 -28 97 -144 119 98 74 281 -185 -43 140 -104 -50 49 59 10 -74
4417 -74 -262 174 -12 -55 -150 -190 -88 169 -284 -15 176 79 62 134 -59 192 183 5 -125 -11 28 -128 122
4440 122 -56 75 51 371 -294 104 30 237 40 -59 -93 -23 -338 61 145 -221 89 -138 87 8 204 33
4462 33 83 124 -129 97 -185 23 176 -21 150 -245 53 -134 -150 -85 -44 -118 128 -4 372 -38 -21 -65 256
$$ packed form
4302f90M01R8J68P8m3J07j48J73J22k54J52j74kJ89l35K90j0n9J31j86j33L63
4324B38m07l07L31qJ29p6RM60j5om07J88J74l65L2K96m87J39J62j82L00j32k39
4347a73J65l3j68L38j72j22L71k26j74J72n2Q9L32O5j31l75K33J72j53p3r0j76
4369a81J65k07K67m21L39j8nM3L23M1j82l45j93J77M06j64kq1k0ML5j33R1M5k1
4394c7K43j28K52l97Q4k43K32l4J25k41K63k1k4K07m66J42J83k44N4R9J0m9q4
4417g4j88M36j86m3r5m0J02K57m53K69J91r7j7P2j93K51rj78j30J14L9j56K50
4440A22j78J31k4L20o65L98p4K07j97r9l4P0l15L99Q4l66L10k27K25p9J96j71
4462C3N0M1k53K26k82K08J53j97J71l95K98j87j6O5M1p4K46j32L76m10J7m4L21
$$ plain form
4485 256 -69 -142 -102 -110 75 -351 -78 -144 16 55 151 -3 20 -169 19 -214 90 -318 80 89 -79 -173 -213 44
4509 44 -72 246 113 -285 10 -171 -268 -72 -212 277 67 -8 32 117 180 33 -279 -133 -67 -13 -209 163 -215
4532 -215 113 256 56 123 277 363 245 80 143 22 91 -58 192 -123 -217 -69 -167 -320 1 151 -175 -239
4554 -239 183 -110 -378 190 -103 -10 -67 111 344 212 359 180 -182 269 -26 234 -216 -24 -346 -57 -311
4575 -311 -207 -18 126 141 408 374 686 238 171 99 -240 125 152 204 262 73 16 32 192 67 55 130 -253 -37
4599 -37 -513 -57 26 -180 133 2 286 313 285 623 177 68 130 -34 -21 -200 -136 -258 -76 28 -24 173 -37
4622 -37 20 73 -56 134 -212 -20 -177 -163 153 -3 205 533 182 316 36 54 -159 -180 -75 -445 -206 -470
4644 -470 -132 -323 -5 257 102 80 44 246 385 -49 303 47 188 90 -47 225 -169 125 5 11 61 -191
$$ packed form
4485B56l25p3M0qJ85m26K73o6J60L9R6j54K3j89J88k33L04m08L98Rj68r4m0K57
4509D4j16L18j33l98K95j81r7J96j40M89k10p5M0Q5O3j47l12J46O6N4j96L72l78
4532b15L28J43k00O7J54Q6j18j65O3j21O9j49K50l15r4J48r8j53L21J50l26o4
4554b39M22k93k68N68k93R3n7J78K33j32J47j79l62M51k95K60m50J92l22K89k54
4575c11J04J89J44J5K67l4L12m48o7p2l39L65K7N2N8j89n7J6J60j25j2P5l83K16
4599c7m76M56Q3k06L13j31K84K7k8L38m46j09O2j64J3j79O4j22J82J04n2J97k10
4622c7N7N3j29J90l46J92j57J4L16j56K08L28l51J34k80J8k13k1J05l70K39k64
4644d70L38j91L18K62j55k2l6K02J39m34L52k56J41r8j37K72l94K94j20ON0k52
$$ plain form
4666 -191 32 -496 -160 -237 -564 -28 -204 59 228 60 283 291 234 285 -30 59 -77 -18 -205 -114 -531 -230 -157
4689 -157 -19 183 39 65 55 -127 120 -336 -220 30 -188 80 -198 62 292 282 296 248 247 -9 -163 -120 -420
4712 -420 122 -564 -5 -475 -44 125 77 70 103 71 172 -313 -156 -91 -216 -66 -181 137 114 248 -120 112
4734 112 145 1 -91 114 -288 -98 -343 -232 -139 -143 149 41 362 448 117 162 257 0 -9 12 -59 24 -198 0
4758 0 -92 -237 179 79 -289 -45 -19 -154 -119 -75 -95 -37 138 237 306 -8 332 311 382 39 222 16 -14 -43 -188
4783 -188 -155 -406 -44 -240 105 -152 -59 -49 7 168 -116 -77 -185 -289 -126 -90 169 53 81 98 109 28 -72
4806 -72 -140 -141 -198 -142 -108 69 -24 -16 -123 188 86 300 45 90 298 -369 -58 -113 151 25 -231 -156 45 186
4830 186 245 147 9 93 34 -182 146 121 97 21 -104 -150 31 -97 180 79 -252 213 -288 41 236 31 -86
$$ packed form
4666a91K23n28L36p7l27N36j76K63J69j68K23Qn7N1l15Q9j36N9j87R1m17L01P3
4689a57J38K02j44K6j0j82K47m56J16K50k18K68k78K60K30j0J4m8jk56j54M3l00
4712d20N42o86N59m70M31J69m8pL3l2J01m85J57O5j25J50j15L18k3J34l68K32
4734A12L3j44r2K05m02J90k45J11R3mK92j08L21Q6l31M5R5k57rK1p1Q3k22J98
4758@r2j45M16j00l68K44K6j35L5M4k0N8J75R9O9l14L40k1P1l43J83k06l0k9j45
4783a88L3k51L62j96L45k57R3J0N6J61k84L9j08j04J63L6K59j16K8J7J1q1j00
4806g2o8jn7N6L4J77r3Qj07L11j02K14k55M5K08o67L11n5K64j26k56P5K01J41
4830A86N9r8j38Q4n9k16L28k5k4p6j25m6J81j28K77j01l31M65n01L29J95k05j17
$$ plain form
4853 -86 129 -137 -103 -212 -23 36 -196 55 -97 17 61 -188 -14 -10 -19 75 -144 -318 -10 212 139 -105 89
4876 89 163 55 87 -122 215 -121 169 154 9 60 -77 -166 170 10 -156 -82 -91 -83 -26 -226 29 -74 -332 47
4900 47 113 -134 35 -286 -16 130 -6 244 -56 118 -81 -178 -250 126 -387 -2 -38 -77 -84 -149 79 30 -15 -67
4924 -67 23 293 117 174 134 -45 49 -199 -110 150 76 -121 88 -29 -35 -8 -154 -339 75 24 73 41 -141 -109 299
4949 299 218 24 131 159 -139 339 -243 10 -354 -163 -190 -297 -229 205 -366 -154 -116 -18 5 36 67 111 34 111
4973 111 -101 -16 -2 -9 -141 196 -57 77 139 -376 -210 -341 -115 -35 -227 -119 -8 -241 236 -1 169 324
4995 324 -80 44 30 128 245 -94 -176 -39 -51 -207 79 37 -152 63 -45 103 -235 -106 -378 -285 -173 -167 237
5018 237 44 193 321 396 135 -109 109 13 -5 -108 -92 40 1 -190 161 -295 148 195 -58 178 -39 -148
$$ packed form
4853h6K15k66L4j09J89N9k32K51j52J14M4k49J74MrR4k19j74L08K22p3k44J94
4876H9P4j08L2k09L37l36K90j5j45N1j37q9L36j60j66P4rQN7k00K55j03k58L79
4900D7O6k47J69l21K70J46j36K50l00J74j99r7p2L76n13L85l6l9po5K28m9m5n2
4924f7R0K70j76N7m0j79R4k48Q9K60p4j97K09j17oK7j46j85M14n1M9l2j82L2M08
4949B99q1j94J07K8k98M78n82K53l64J91k7j07O8M34n71K12L8R8K3L1L1M4p7P7
4973A11k12Q5J4pj32L37k53J34O2n15J66j31K26Q0j92J08J11k33M77k37J70J55
4995C24m04J24j4R8J17l39q2J37j2j56K86m2j89K15j08J48l38J29k72R3J12OM04
5018B37j93J49J28P5k61k44K18r6j8j03J6J32l9j91L51m56M43M7k53K36k17j09
$$ plain form
5040 -148 57 -65 -52 67 129 239 535 176 92 329 29 -94 -267 -48 -96 -39 -311 -59 -95 109 81 26 -189
5063 -189 146 193 237 256 -184 2 -14 201 -54 -238 257 -146 268 345 -105 7 -173 -38 191 -294 -292 11
5085 11 245 -18 239 181 294 193 63 152 220 -94 48 -360 -52 -94 -235 155 -252 -21 240 175 22 -90
5107 -90 -128 -122 2 -119 131 24 -56 196 -277 62 238 140 289 -15 3 124 22 164 -265 -68 -53 105 -4
5130 -4 -109 49 266 183 157 -187 177 47 24 -182 31 -60 -148 221 21 80 109 -73 -176 -230 -311 -54 -47 -28 -215
5155 -215 298 -168 -124 -37 111 293 -111 138 85 -257 91 -423 -11 206 30 168 -20 -66 274 -243 -268 82
5177 82 221 -16 -165 -198 -130 104 -159 275 316 -109 468 -27 3 142 -74 -68 9 106 -112 -227 -134 -245 -208 -244
5201 -244 -22 -154 -4 53 -86 106 -21 248 423 95 81 -155 -24 -99 191 95 127 191 -99 -60 168 -180
$$ packed form
5040a48K05j22J3J19O2J10K96l59q4K37l00j23j73K19m8N7k72K52l6K04k8n5k15
5063a89L35M7M4J9m40J86j6K15k55j84M95m03M14P7m50J12j80J35K29m85KL03
5085A1K34k63K57n8J13j01j30Q9O8l14J42m08L08m2j41L90m07K31K61o5j53j12
5107i0l8OJ24j21K50j07q0K52m73L39J76r8J49l04J8J21j02J42m29J97J5J58j09
5130dj05J58K17q3k6l44L64j30k3k06K13r1q8L69k00N9K9j82j03n4q1K57PJ9j87
5155b15N13m66M4Q7J48J82m04K49n3l42L48n14M12K17j76J38j88m6L40n17k5L50
5177H2J39k37j49l3O8K34k63M34M1m25N77m95L0J39k16OP7R7k18j15R3j11L7l6
5201b44K22j32J50N7j39J92j27K69J75l28j4k36J31p5K90r6L2O4k90L9K28l48
$$ plain form
5223 -180 -32 -259 -75 -3 -94 182 121 142 246 35 293 -135 -48 -102 56 -38 -63 -140 -360 94 -288 49 -8
5246 -8 -79 142 5 -81 285 40 76 158 104 130 -54 136 27 -211 -55 101 -148 -225 -106 -171 -87 164 -232 41
5270 41 176 -184 25 92 10 -106 -104 118 -299 -131 219 123 33 103 32 -155 54 -148 202 -62 16 -178 -16
5293 -16 92 20 -22 -130 15 472 9 244 -57 -98 -128 -37 96 -17 138 40 -315 10 -112 90 -141 131
5315 131 -20 14 307 158 -79 7 -146 34 -139 -74 200 -55 -128 122 16 -39 -48 156 391 59 155 68 85
5338 85 -181 140 -108 127 50 -137 61 140 -40 148 -142 34 99 35 77 -67 -110 -201 -16 -445 34 27 78 51
5362 51 74 -116 217 -113 166 251 -158 206 1 -229 100 132 445 -22 61 -144 -225 -164 -74 242 21 -46 -129
5385 -129 131 186 232 101 -125 155 255 -77 269 11 -205 -100 -133 -288 -60 -126 -125 -178 -179 94 -231 90 260
$$ packed form
5223a80J48k27J84P2r1K76o1K1J04k11K58m28Q7n4J58r4k5p7k20M54l82L37n7
5246hp1K21j37q6L66k45L6Q2n4K6j84J90j09k38J56J56k49p7J19o5Q4K51l96K73
5270D1J35l60K09O7q2j16KK22m17J68L50r6r0P0p1j87K09k02L50k64P8j94J62
5293a6J08p2m2j08J45M57m63K35l01m1l0R1J33j13J55r8l55L25j22K02k31K72
5315A31j51L4K93j49k37Q6j53J80j73O5K74k55p3K50j06n5rK04K35l32R6q7J7
5338H5k66L21k48K35p7j87J98P9j80J88k90J76O5o4M2j44m3r1J85m29M79pN1k7
5362E1K3j90L33l30K79Q5m09L64k05k30L29L2L13m67Q3k05q1O1R0L16k21o7q3
5385a29K60N5M6j31k26K80J00l32L46k58k16J05l3j55K28o6Jn3jK73l25L21J70
$$ plain form
5408 260 -76 -201 251 179 211 -146 -318 136 -84 -43 140 -56 -157 -179 -4 -77 -508 -424 -56 -294 -2 -35
5430 -35 -128 42 79 151 163 -100 -63 176 -69 30 269 -52 -105 43 -135 47 -246 3 -169 -241 -149 -3 -284
5453 -284 -70 -216 -37 60 53 243 -108 -79 42 59 116 -77 -101 -86 -137 -229 -66 0 73 29 -122 -316 -170 -230 261
5478 261 -9 -161 178 58 -176 -12 283 -25 -4 -159 -113 -192 -401 -257 -12 -225 -373 -10 30 -22 38 152
5500 152 -39 94 311 -253 82 -283 18 152 -41 59 63 203 10 6 -8 -14 135 -60 -2 17 5 189 -128
5523 -128 -200 70 21 56 7 259 134 41 42 -129 -110 245 -160 -135 -224 -88 -63 -94 -380 -35 25 -86 21 -16 64
5548 64 202 -298 -203 -207 -139 82 -369 322 100 -97 -260 99 -100 -351 121 -227 -26 92 -218 212 -389 -67
5570 -67 144 109 197 -140 -60 129 61 108 155 72 -50 -161 -37 23 289 -245 11 36 226 254 115 -72 -311 -168
$$ packed form
5408B60l36j25M52p2L2l57j72M54k20M1J83j96j01k2J75p3m31Q4L68k38K92l3
5430c5r3J70L7P2J2k63L7K39k45R9K39l21n3J48j78J82k93K49j72p2R2J46k81
5453b84K14j46J79R7pJ90l51K9J21J7N7j93k4J5n1r2J63O6P3m4j51j94J46o0M91
5478B61k70j52L39j20k34J64K95l08K1j55M6p9k09J44K45k13j48L63M0n2O0J14
5500A52j91J33K17n64L35l65L01J34j93J00MJ40j93mj4oJ49j95N8J9j2J84l17
5523a28p2K70m9L5m9K52j25r3Jj71J9L55m05K5q9J36K5l1k86L45O0j11J07l7Q0
5548F4J38n00R5mO8K21m51O91k22j97j63L59j99k51M72l48K01J18l10M30o01L22
5570f7K11l5Q8l37Q0J89o8M7M7q3j22j11J24O0K66n34K56K5J90K8j39j87k39J43
$$ plain form
5594 -168 -155 -145 309 -157 165 170 -63 -161 30 27 173 -52 42 167 -60 -189 -175 273 -118 187 -35 111 45
5617 45 -30 32 122 -71 23 -54 139 -72 194 84 -41 134 -153 92 -424 -18 -171 -52 40 -80 59 282
5639 282 -61 -16 -181 78 -35 -257 53 -27 248 32 282 49 19 225 -124 -102 119 -95 -87 -19 -82 -83 -196
5662 -196 -37 128 93 -175 9 43 -28 -14 -188 -75 21 -22 209 -104 -5 -78 238 -11 -148 211 357 -66 80
5685 80 100 -267 -217 183 142 85 41 -324 -31 -100 192 145 88 -121 193 -164 146 55 5 94 337 -240 54 -79
5709 -79 -55 235 -130 -130 8 85 118 -199 182 43 -207 165 -168 -8 -284 275 119 -161 -55 -151 -99 282 -46
5732 -46 88 25 63 -7 -263 77 -283 -177 -383 82 -147 -229 -231 -68 -7 -80 -220 188 -65 -54 -80 -149 269 270 -54
5757 -54 263 -50 52 205 173 -247 -61 -467 -178 -17 -31 -178 -106 -57 -64 -55 -76 84 36 -63 -54 -116 295 -272 -75
$$ packed form
5594a68J3J0M54m66L22Nk33r8J91lJ46k25R4J25k27j29J4M48l91L05k22J46o6
5617D5p5O2R0j93R4p7J93k11K66j10j25J75k87K45n16M06j53J19R2j20J39K23
5639B82l43M5j65K59j13k22L10q0K75k16K50k33l0K06l49K2K21k14QO8o3jj13
5662a96J59J65l5k68J84L4p1J4j74J13R6m3K31l13R9p3L16k49j37L59J46m23J46
5685H0K0l67N0M00m1n7m4l65K93o9K92m7n7k09L14l57L10r1n0Q9K43n77K94j33
5709g9K4K90l65%J38P7L3l17L81j39k50L72l33J60k76N59j56k80J06r6N2L81l28
5732d6J34o3L8p0k56L40l60J06k06M65k29q2kJ63O1p3j40M08k53J1k6o9M18Jl24
5757e4L17l13J02J53l2m20J86m06K89J61j4j47P2M9pRk1J60m8r9Ro2M11n67J97
$$ plain form
5782 -75 -167 -121 85 -126 309 22 1 66 -135 -159 -20 -184 -268 -179 70 -275 -112 94 91 219 127 -16 71 114
5806 114 105 33 -100 91 75 -121 -222 -146 -40 88 167 -299 99 7 -245 68 65 176 117 -178 -3 -161 51
5829 51 76 82 12 -24 318 132 -148 88 -199 -79 -177 48 314 100 102 172 38 152 -137 290 170 30 11 -85
5853 -85 37 78 7 48 211 178 -143 -109 15 -554 -14 -128 59 -102 39 134 -102 252 388 -2 60 374 89
5876 89 -163 -181 224 -301 -7 -31 -37 24 -189 184 -57 -19 -86 -20 -11 -126 228 -25 156 -194 65 397 72 156
5900 156 -66 258 127 -187 -148 167 -62 -97 -61 -196 133 -113 47 52 158 134 93 -60 182 -27 65 5 -148
5923 -148 -40 171 -61 57 5 -42 174 -10 99 134 -48 -50 36 105 98 -42 114 -289 140 201 277 6 18 3
5947 3 -36 -100 -80 62 -55 247 27 -96 -4 -184 -69 -166 -31 139 100 95 -191 53 -117 -41 -8 -16 115 74 92
$$ packed form
5782g5r2M6K06k11M35k87k1O5k01k4J39j64q4Q9K49l45J63K06lJ28r2j43Q7M3
5806A14rp2j33J91j6j96j01P6J06J28P9m66L98r2k52L13lJ11n9k95J75j58K12
5829E1K5Op0l6L42j86k80K36k87J20r8K25K66k14KP0j34J14k89M27j20j40j9r6
5853h5J22M1p1M1J63l3l21L4J24n69N40j14J87j61J41R5k36L54J36l90O2L14k85
5876H9k52j8M05n25K94k4oO1k13L73k41L8o7O6Rj15L54k53J81l50K59L32l25Q4
5900A56k22L24j31l14L9L15k29l5L6j35L29k46J60NJ06k4m1j53K42k09R2o0j53
5923a48J08K11k32J18n2m7K16j84J09L5j82kQ6O9pj40J56m03M29O1P6k71J2j5
5947Cl9o4K0J42j17L02k20j23R2j80J15r7J35J70l9nk86K44j70P6L3qJ31m1J8
$$ plain form
5972 92 264 7 -137 -31 -56 -20 -204 -103 89 -66 -40 76 217 -13 -243 45 -79 -36 38 215 -358 182
5994 182 162 71 171 -73 -3 -22 -8 128 -36 -176 26 -222 72 52 -52 16 -12 -157 -196 77 -97 44 19
6017 19 -16 23 -111 -18 63 338 85 42 -107 105 -106 78 -120 -289 -159 2 -5 21 302 -69 255 -261 -34
6040 -34 -126 54 200 207 -97 73 102 71 -171 10 -120 159 58 -345 147 -162 42 168 -131 160 -58 113
6062 113 -98 -198 -48 46 0 -23 -134 -196 111 -48 -237 109 -122 127 26 -150 100 69 -302 -160 -59 -39
6084 -39 -8 -195 15 -130 49 110 25 -221 -47 -85 -35 -108 101 -19 10 -19 -71 17 112 -177 -67 -31 -130 -198 134
6109 134 58 -149 -17 55 42 138 162 -345 474 6 166 144 165 172 -80 86 -61 63 76 -173 182 284 -193
6132 -193 37 -53 -155 -181 336 -49 -42 88 58 13 -87 -51 283 -294 8 -65 195 -180 2 99 -368 -40 -256
$$ packed form
5972I2J72k57j44J06k5L6j84J01J92j55K6J16J41k30k30K88j24M3P4J77n73N40
5994A82k0r1J00k44P0j9J4J36j64j40K02k48K94k0j04O8k8j45l9K73j74J41k5
6017A9l5L9j34R3Q1K75k53m3j49K12k11J84j98j69J30J61pK6K81l71L24n16K27
6040c4r2J80J46Pl04J70K9l1k42J81j30K79j01m03M92l09K04J26k99K91k18J71
6062A13k11j00J50R4m6k3j11o2L07j59j89L46k31K49j01j76K50l1l71J42J01K0
6084c9L1j87K10j45J79O1q5k46J74l8N0p3K09j20K9k9n2Q8R5k89J10L6r9o8L32
6109A34p6k07J32P2j3R6K4n07Q19m68J60k2K1Pk52J66j47J24J3k49L55J02m77
6132a93K30r0j02k6N17l85PJ30l0m5j00L6L34n77L02p3K60l75J82R7m67L28k16
$$ plain form
6155 -256 138 -16 138 -101 81 -4 -152 184 74 -187 -63 -5 -68 156 -2 150 95 184 83 -142 -66 -105
6177 -105 -19 63 -44 95 108 -140 -135 128 266 -81 247 -1 258 113 68 -44 187 112 12 -89 70 108 113
6200 113 203 -31 111 -2 -154 -27 162 -174 -358 280 119 62 41 -58 -52 126 -109 265 -236 -24 -112 -168 17
6223 17 -230 271 -292 -24 -64 -279 -151 3 -311 301 12 -118 -73 303 72 91 -229 138 198 26 15 -73
6245 -73 -126 26 -289 32 -247 60 -121 -4 -23 -58 -10 -144 95 64 -49 284 30 56 -179 -73 -88 68 -9
6268 -9 -186 152 -243 -21 -145 4 65 -73 -163 3 -192 -263 33 -36 54 2 -10 -29 97 123 66 -104 -36 252
6292 252 -47 -126 197 -127 -174 -65 37 1 26 -149 -94 76 -44 -156 -43 -44 156 -105 88 151 -198 200 -16
6315 -16 -60 264 -121 -20 -84 -368 -67 -55 45 -114 96 -165 -97 177 171 6 9 118 85 63 166 -108 360 -49
$$ packed form
6155b56L94j54J54k39J82q5j48L36j10k61J24N8o3K24j58J52n5Q9j01k25P6l9
6177a05Q6Q2j07J39J3k48NK63J38l47L28k48K59j45m5j12K31p5j00j01J59L8N
6200A13R0k34J42j13j52J27J89l36j84O38j61n7k1r9OJ78k35L74n01K12q8n6J85
6223A7k47N01n63K68m0k15J28J54l14O12k89j30M5L76k31J9l20L67O0j72j1q8
6245g3n3J52l15L21k79L07j81J17j9l5M8j34K39l1j13L33k54K6k35J06j5J56p7
6268ij77L38l95K22j24J49O1j38r0J66j95p1K96o9R0n2j2j9J26K6n7j70O8K88
6292B52k99p9L23l24m7J09J02l6K5j75N5J70j20j12J13jK00k61J93O3l49L98k16
6315a6m4L24l85J01o4k84L01J2J00j59K10k61O8K74oj65LJ09l3k2J03k74M68m09
$$ plain form
6339 -49 133 -163 42 -126 -80 -49 -77 -42 178 135 350 -125 -233 137 -221 185 149 109 277 -11 -207 -13 -3
6362 -3 141 -14 -18 68 191 -48 -459 68 152 -356 49 120 -9 4 48 39 50 1 141 -146 36 -361 168 114 -206
6387 -206 81 -88 -16 111 -127 66 -98 205 50 311 79 86 -14 28 158 46 -101 -8 27 -189 -58 -87
6409 -87 56 -302 32 170 -98 -273 -14 -55 -5 1 -104 -54 80 -48 -97 216 -177 32 61 81 -124 173 -213
6432 -213 70 88 -36 137 294 254 -121 154 -77 36 -42 83 279 -56 117 67 3 -29 -290 99 204 -289
6454 -289 -9 -145 -97 -261 49 86 -330 -87 -188 -80 12 309 -108 79 -21 210 -254 -177 -114 -258 196 9
6476 9 -77 261 -166 194 18 53 47 -2 108 36 18 289 242 -60 168 -105 36 249 370 -285 -137 5 98 104
6500 104 72 -194 169 -33 -73 -114 -169 55 -56 78 101 -307 -199 411 84 125 194 96 -284 -245 -216 112 -174
$$ packed form
6339d9J82k96K05j68M6L1k8L5K20m3K15m75j08L70l58M06l6m0J68k88j96J94J0
6362cJ44j55mQ6J23k39m11N27Q4n08M05P1j29J3M4rJ1m9J40k87J82l97N29n4l20
6387b06K87j69P2J27k38J93j64L03j55K61k32Pj00M2J30j12j47R3L5k16J31k9
6409h7J43l58L34J38k68j75K59m1N0Oj05N0J34j28m9L13l93K09K9K0k05K97l86
6432b13K83J8j24J73J57m0l75K75k31J13p8J25J96l35J73n0o4l2k61L89J05m93
6454b89K80j36M8j64L10L7m16K43j01J08R2K97m17J87j00K31m64P7O3j44M54j87
6476Iq6L38m27L60j76L5om9J10p2j8K71m7l02K28k73J41K13J21o55J48J42R3O
6500A04l2k66L63k02m0m1n5K24j11J34K3m08J08O10l27M1O9r8l80L9K9L28k86
$$ plain form
6523 -174 -2 105 -48 -175 -228 20 69 -104 -83 227 -75 260 -10 185 -43 153 -73 129 262 -199 41
6544 41 7 -167 92 -171 -187 94 301 -222 -225 -91 -153 194 57 -77 77 3 167 -72 66 17 82 7 -233
6567 -233 -103 -151 71 13 -146 -205 -188 -357 -74 -235 248 4 27 -88 75 179 43 127 355 40 -59 -320
6589 -320 42 48 -174 -300 -165 51 -7 63 82 226 53 60 143 10 -77 -111 -62 157 -81 -160 33 133 176 -219
6613 -219 24 -406 -318 -204 -52 65 -222 310 -77 20 8 330 224 12 -235 -3 217 63 -50 -234 223
6634 223 -39 47 83 -92 -31 -36 257 -104 188 162 -61 77 -227 -74 237 122 242 -168 -163 -1 -66 -87 -6 -9
6658 -9 42 101 83 -308 119 -477 38 72 -19 154 -2 58 -117 100 -73 29 -115 -68 149 -92 -62 -248 -252 128
6682 128 165 -118 79 -56 -240 124 -38 86 -87 137 23 35 -87 -108 -168 92 107 151 198 60 144 219 -139
$$ packed form
6523a74J72J07j53j27n3K48M9j73K1L10l02L35k70J95k28J96k26K02J33m61K40
6544D1l4j74K59k63j6K81K07n23lJ34o2L47j37j34J54p4J64k39J38m9O5p5k40
6567b33J30m8K22n8j59n9J7j69K83j61M83k44K3j15J63J04j36Q4K28l15r9k61
6589c20L62Ok22j26J35K16n8P0J9J44j73PQ3j33q7l4M9K19k38p9J93J00M3l95
6613b19K43m30Q8J14J52J17k87N32l87R7j2L22j06k12k47K32K20j54j13j84M57
6634B23k62Q6L6j75O1nK93l61K92k6k23J38l04J53L11j15J20m10NJ62o5k1Q1l
6658iN1N9j8l91M27n96N15L4r1J73j56O0j75K17j73J02j44M7K17k41L0j86mL80
6682A28L7k83J97j35j84L64j62J24j73K24j14J2j22k1o0K60J5M4M7j38Q4P5l58
$$ plain form
6705 -139 20 19 -114 -148 -139 159 -11 39 -198 172 33 -152 -49 239 -18 61 -16 -130 -69 123 218 -23 226
6728 226 242 18 22 -68 -65 230 -101 208 338 -41 53 132 -184 -19 289 -258 -21 177 -216 143 308 86 90
6751 90 204 -151 207 9 232 153 -330 -193 -80 49 -48 271 40 -142 83 -130 98 176 129 -198 -70 32
6773 32 -90 169 -160 -23 16 154 -183 -22 -347 -103 139 103 207 -165 -176 104 10 -98 52 51 122 -102 -143
6796 -143 117 51 -57 29 136 -116 32 -7 -91 217 -55 90 -26 -119 -35 207 -42 192 15 -213 236 26
6818 26 161 49 -85 172 -21 72 283 57 91 147 -177 -239 -228 12 -70 4 206 142 -58 342 128 -21 -2
6841 -2 107 193 115 -188 5 58 -119 96 10 -128 69 139 25 195 36 35 61 57 56 21 -102 15 32 130 -9 -45
6867 -45 -178 -234 -37 -98 -236 18 -320 2 182 -179 -253 152 -28 -133 164 -90 108 28 51 111 -322 18
$$ packed form
6705a39J59jj33l4RK98j70N0k37L70j39j85J03K88k57P9p7j14O1J92R5k41K49
6728B26J6k24Mr0LK95l31L09J30l79R4P9l16J65L08n47K37J98l93L59J65k22M
6751I0J14l55L58j98K23p9m83J37J13J29r7L19k31j82K25k13K28P8m7l27J28J02
6773C2j22K59l29J37L9J38l37J61l25K44K42l6J04l72j1K80r4j08J50jP1k24m1
6796a43K60o6j08Q6J07k52J48l9q4L08k72J45j16r3Q4K42k49K34j77k28M49k10
6818B6J35j12j34K57j93R3K11k26L4N6l24o2J1K40q2P4K02o4k00M00k14j49J9
6841bJ09Q6p8l03J93N3j77K15q6j38J97P0j14J70j59jK6mjl5j23J17J7R8j39l6
6867d5j33n6J97o1j38K54l38L22J80l61p4M05j80j05K97k54J98q0K3O0m33L40
$$ plain form
6889 18 -175 -2 -37 177 42 104 16 -44 27 -144 200 211 -112 -290 108 1 92 -132 9 9 11 -12 -84 -48 -169
6914 -169 -25 -205 143 -210 66 67 -203 213 -13 -44 132 -159 139 212 188 -145 59 113 24 105 -52 54 243
6937 243 -181 38 -318 -44 19 -5 118 -73 -129 11 -59 48 -59 10 -58 260 167 129 109 -256 -30 -137 -259
6960 -259 -38 -29 -306 257 -365 -68 -143 -33 309 -195 151 -150 91 65 -161 26 41 124 20 -5 78 -14 -41
6983 -41 -69 -225 -110 139 265 -142 39 25 69 140 246 -33 65 172 -221 -119 -19 -63 -51 -156 159 -98 188
7006 188 -28 76 -72 -132 87 76 -76 -86 78 -191 -88 52 -161 -25 40 184 143 -97 -186 93 -143 -204
7028 -204 -73 -136 -141 136 -20 -179 -43 -61 -74 4 12 -78 101 375 -93 179 30 208 -147 205 -101 -134 46
7051 46 -104 9 -40 295 194 -21 100 -98 -179 -115 101 -311 197 -58 -78 -266 -99 -14 108 -42 -23 -25 -22 -85
$$ packed form
6889A8j93J73l5K14j35O2q8o0P1j71L44J1l23j78L98j07R1k24J41%Kk3p2L6j21
6914a69J44j80L48l53K76Jk70M16k26l1J76k91K98P3k4l33K04N4q9Q1j57J06J89
6937B43m24K19l56K74O3k4J23j91n6J40p0J07j07O9o8L18r3l8k0l65K26j07j22
6960b59K21Rk77N63o22K97p5J10L42n04L46l01K41k6k26J87J5Q3j04k5Q3r2k7
6983d1k8j56J15K49J26m07J81j4M4P1J06k79R8J07l93J02J00m4J2j05L15k57K86
7006A88k16J04j48o0K19j1j52j0J64k69J03J40k13J36O5J44m1k40q9K79k36o1
7028b04J31o3nK77j56j59J36j8j3P8Qr0J79K74m68K72j49J78l55L52l06l3J80
7051D6j50J13m9L35j01k15J21j98q1O4K16m12N08k55k0j88J67Q5J22j50J9kLo3
$$ plain form
7075 -85 43 -107 -46 -67 -154 -335 -104 -143 119 92 -97 -40 40 72 320 90 -38 213 73 196 98 -159 47
7098 47 -35 1 -26 -191 135 178 177 89 109 -133 140 -17 13 -159 -7 133 -99 -12 83 -5 111 -81 33 -82
7122 -82 41 92 -43 177 -24 -302 -39 93 145 34 47 -54 135 -492 -127 339 128 181 -326 37 36 -44 46
7145 46 -101 34 138 116 -235 205 -24 -282 237 -49 134 212 16 -111 102 -7 -28 -9 287 -215 74 32
7167 32 -74 -105 -117 163 95 -264 -265 -105 -63 -146 215 -51 -158 45 -16 -46 -10 139 133 -75 72 -106 173 4
7191 4 73 -165 44 108 99 175 288 -41 -14 -72 -281 -15 0 111 16 286 131 -47 -13 -123 40 85 1 -317 30
7216 30 37 -143 -86 -32 13 186 -205 69 5 -217 -159 -78 143 191 281 -146 66 -71 -53 270 50 -95 36 -108
7240 -108 11 -6 -12 -179 -66 -39 13 -2 -181 91 150 45 -188 109 -218 -128 -102 -265 143 196 -57 -153 25 -87
$$ packed form
7075h5J28j50O1k1q7j81K31l9K62k7j89N7Q0L2K48k30j28K51j40J23r8k57K06
7098D7q2L6k7j65L26M3jq8K0k42K73j57L0j72J52J40k32Q7R5q8J16j92J14j15
7122h2J23N1j35K20k01k78K63J32N2j11J3j01J89o27L65M66k11N3n07L63jq0R0
7145D6j47J35J04k2l51M40k29k58N19k86J83P8j96j27K13j09k1J9K96n02K89m2
7167C2j06l1j2K80o8l59jJ60M2q3L61k66j07K03o1l0L6J49ok08J47j78K79j69
7191DO9k38K09O4rP6J13l29K7n8k09K66J5J11r5K70j55j78L4j10J63M5q4l18L47
7216C0Pj80N7N4M5J73l91K74o4k22N8Q1K21M8R0m27K12j37J8L23k20j45J31j44
7240a08J19j7oj67J13K7N2j5j79K72N9j05k33K97l27R0K6j63M08N3k53r6J78j12
$$ plain form
7264 -87 -45 -32 -59 1 109 -107 -173 86 -138 -45 52 201 -159 41 -37 75 -15 -81 -2 78 -65 -97 86 102 57
7289 57 -3 -147 -214 82 50 211 157 47 20 13 -107 -231 -71 29 107 190 80 -39 237 101 103 50 -251 49
7313 49 26 -140 -200 -141 -77 55 -37 -4 -292 -59 199 -93 -81 -136 167 -362 -138 -73 -203 207 144 -15 120 194
7337 194 -118 -8 101 -149 328 -44 -138 -220 -21 15 197 -47 -66 -67 -321 55 71 111 -61 30 100 198 163 161 12
7362 12 -201 168 69 192 -21 27 51 -41 7 0 175 -336 130 -40 203 -79 107 87 -30 -68 -82 16 -141 -61
7386 -61 98 31 194 -119 -183 91 -244 -220 -18 376 167 -55 -107 -35 166 -147 65 157 73 -22 108 47 -60
7409 -60 289 121 30 38 -34 -163 130 -1 59 -122 -169 -322 -220 -114 -140 -13 25 25 -50 39 71 72 75 158 42 133 200
7436 200 -35 44 36 -99 -213 132 31 122 -46 -232 141 73 115 176 -48 204 25 157 164 137 -98 -124 67 -22
$$ packed form
7264h7M2J3k7O0J08k16o6K59k24R3R7J49l60K00p8J12r0o6P9Q0j43l2J83J6m5
7289E7o0j44o7K96l2J61n4j10k7pj20j24J60J00P8Q3j10j19K76j36Kn3l01L00
7313D9k3j66o0N9O4J32r2L3k88K33K58k92J2n5L03n29K24O5j30M10o3j59J35P4
7337A94l12J10J09k50M77l72r4q2J99L6J82k44j9jk54L76J6M0j72R1P0R8l5kj49
7362A2k13L69r9J23k13M8K4r2M8pJ75n11M66j70K43k82J86k0j17l8j4R8j57Q0
7386f1J59o7J63l13o4K74l35K4K02L94k09k22n2P2K01l13K12R2q4r5J30o1j07
7409f0L49j68r1Qp2j29K93j31O0j81m7j53J02J06k6J27L8%p5Q9L2JLQ3j16R1O7
7436B00k35P9qj35j14L45j01R1j68j86L73o8M2O1k24K52j79J32Pk7k35k6J91q9
$$ plain form
7460 -22 -114 -144 58 -147 128 -429 -36 137 -187 -42 -263 -82 -91 -113 244 -82 158 89 67 -141 -97 -43 -103 185
7484 185 -158 140 -46 -106 -75 27 -66 -161 133 69 44 164 -169 5 119 34 63 -120 -189 99 121 -59 285
7507 285 101 19 -56 -236 -59 -73 -206 68 -83 -7 208 21 108 107 23 -177 59 -106 64 78 73 -112 183 70
7531 70 -67 50 -80 130 -136 83 -42 -170 5 -176 112 24 160 0 -145 3 -29 180 -172 74 110
7552 110 60 -103 134 -101 -31 76 152 -61 78 51 62 -23 -246 12 95 -141 -42 19 -42 103 210 -147 130
7575 130 127 -37 70 32 37 216 -51 197 46 -141 71 -24 171 118 -103 -54 21 240 -57 283 149 -171 208
7598 208 -50 -131 -68 102 -131 73 -168 62 -46 -73 0 107 223 333 104 42 314 -240 10 -175 160 40
7620 40 -4 -225 -122 -6 39 -25 59 -222 -375 60 -29 -9 -117 -62 27 -82 23 -156 24 9 -137 -113 -141 254
$$ packed form
7460b2r2l0K02k05K75n57L93J73l24J45k21J81rk2L57l26K40o9k2k08M4N4o0K88
7484A85l43K98j86o0L1J02r3r5K94o4k5J20l33J74J14q5K9j83o9K88K2j80L44
7507B85j84q2p5j80J77j4j33K74j51P6K15j87Q7jq4k00K36j65J70J4nj85K95j13
7531G0j37J17j30K10k66K19j25j28J75j81K88q8J36j60j45J48l2K09l52K46L6
7552A10n0j63K37k35P0J07P6k13J39k7J1q5k23K58Q3k36R9O1o1J45J07l57K77
7575A30lj64J07l8NJ79k67K48j51j87K12r5J95n3k21M9P5K19k97L40j34l20L79
7598B08k58q1O3J70k33K04k41K30j08k7P3J07J16J10k29o2K72n54K50j85L35j20
7620D0m4k21J03J16M5o4Q4k81j53M35q9K0j08N5Q9j09J05j79J80j5j46K4k8L95
$$ plain form
7644 254 -9 -73 -372 -31 48 -119 -7 -66 -3 154 147 38 261 137 86 65 118 -59 42 41 -123 -19 -95 -135
7668 -135 -23 99 -82 -69 -220 -47 -91 7 -33 -39 98 -248 393 39 79 118 -140 -132 157 -86 195 49 -262
7691 -262 160 81 -49 -275 -216 -106 26 -115 192 -114 -12 30 249 122 -214 237 3 168 240 87 46 -172
7713 -172 -190 -198 93 -106 -74 41 -125 -121 -12 -147 178 -56 43 -140 37 273 111 245 -82 -125 -232 218 211
7736 211 -179 64 57 172 -70 -4 226 -214 19 -4 133 86 131 82 179 -85 186 218 234 -174 -154 -86 -47 -74 -160
7761 -160 -259 -231 -49 264 4 -118 -146 87 212 -76 9 -60 420 -234 9 -130 167 48 2 154 25 251
7783 251 48 75 -249 174 -11 119 -70 -89 7 -175 164 303 275 -281 -310 336 -13 66 135 78 -293 -181 -4
7806 -4 -106 -216 68 66 -143 -153 176 204 -121 -81 -137 301 -215 -166 259 41 -16 -10 104 -317 -31 171 82 -95
$$ packed form
7644B54k63o4k99L41P9j67J12n9O3J57pj09K23j24n1k1N3j77J01jj64J04p6m0
7668a35J12J22j81J3j51J73m4R8m0oJ37l46O41l54M0L9k58QK89k43K81j46l11
7691b62M22p9j30k26N9J10J32j41L07l06J02M2K19j27l36M51k34J65P2j53m1k18
7713a72j8qK91j99L2J15j66MJ09j35L25k34R9j83J77K36j62J34l27m3j07M50p
7736B11l90K43pJ15k42O6K30m40K33k3J37m7M5m9R7k64K71L2J6m08K0O8L9k7q6
7761a60r9K8J82L13k60j22k8K33J25k88Q5o9M80o54K43j39K97j19m6J52j29K26
7783B51k03K7l24M23j85J30j89j9R6j82L39J39k8n56k9O46l49P9O9n7l71J12J77
7806dj02j10K84kk09j0L29K8l25M0n6M38n16M9M25k18n7OJ14m21K86K02q9j77
$$ plain form
7830 -95 -121 183 -109 -156 -173 134 -264 193 -132 -242 54 232 122 -118 147 16 -153 -54 -22 -32 133 32
7852 32 -115 -314 50 32 -12 -50 342 73 39 -106 155 48 46 240 -265 -88 232 -112 219 115 -131 -56 34
7875 34 -148 265 60 128 -100 -167 89 -111 234 -165 -32 145 162 12 234 130 239 -58 -80 145 -51 -221
7897 -221 -115 -263 143 -361 266 187 43 157 -126 91 -39 86 -15 145 -53 17 -170 149 40 20 -84
7918 -84 -55 -152 -129 182 -184 -108 -51 158 21 -118 -72 120 -52 -126 -67 -386 -49 -10 123 92 -76 -31 -35 -27 154
7943 154 133 256 17 102 9 -134 45 249 -9 272 -15 84 21 -80 -58 -154 -206 29 -89 -96 -279 60 -151
7966 -151 32 -24 -22 194 67 -325 10 -109 -320 43 2 -151 -297 -194 -99 -157 124 276 139 152 -212 -210 53
7989 53 -102 46 59 -11 32 119 117 -106 152 -94 -197 155 101 129 122 216 -209 -188 -136 -88 -309 82 97 -50 -105 210
$$ packed form
7830i5k6L04k92m7j7L07l98M57l25j10K96J78j10k40K65j31j69R9L2j0J65j01
7852C2j47j99L64j8m4l8L92k69l4j45K61j07kJ94n05J77L20l44L31j04k46P5R0
7875C4j82M13k05O8k28o7K56k00L45l99J33J77J7j50K22j04J09k97k2K25j96j70
7897b21J06j48M06n04O27p9j44J14k83K17j30J25j01J60j98P0j87L19j09k0j04
7918h4K9r7K3L11l66P6N7K09j37j39M6J92j72p4N9l19L37L9J33l1j68M5mQJ81
7943A54k1J23k39Q5r3j43J79K04k58K81k87R9o3j01K2r6n2K35j18pj83L39k11
7966a51J83n6KK16j27l92L35j19k11L63m1j53j46J03R5n8K81J52j37J3l64KK63
7989E3j55J48J3p0M3Q7kk23K58k46j03L52n4K8pR4m25K1N2M8k21L91J5j47n5L15
$$ plain form
8015 210 -81 -185 111 -32 39 165 35 25 -91 -332 -1 -14 -19 -142 -132 226 20 -18 44 -152 -65 -24 101
8038 101 79 28 161 21 47 -440 83 28 131 208 -177 72 -40 -106 -63 0 -160 -469 -113 223 146 -276 -92
8061 -92 98 69 94 -53 114 -126 -191 85 50 -61 -3 -9 -58 17 6 161 172 -121 221 41 -160 75 22 -263
8085 -263 -164 -216 138 183 55 447 240 64 -12 110 -147 15 37 -8 46 5 166 -59 100 278 -57 36 -49
8108 -49 -163 -42 -127 -98 -72 -46 -110 37 34 -129 -43 120 145 77 -16 -110 73 103 214 -4 -31 -39 248 190 42 -7
8134 -7 20 121 -12 20 113 -142 2 102 -13 -164 170 138 87 25 -39 -107 110 65 9 75 132 -352 401 -115 20
8159 20 148 139 242 133 -97 193 117 -115 -154 64 83 -176 -103 -207 -2 -25 -212 137 140 -96 -29 138 316 -145
8183 -145 60 -100 187 100 78 -243 133 88
$$ packed form
8015B10k91j04K96j43P1J26j30j0j16k41L31j3nj23J0L58k06l8O2j96Q7M1J25
8038A01k2n1J33j40K6m87N23n5J03P7l85K49j12o6M3O3j60l09L56L36p7m22J84
8061i2J90k9K5j47J67k40o5K76l5j11N8om9P5j1J55J1k93L42j80k01K35n3k85
8085b63R9n2L54M5j28L92k07j76p6J22k57J62K2m5N4m1J61k25J59J78l35R3q5
8108d9j14J21q5K9K6K6o4J47lj63Q6J63K5o8r3r4J83L0J11k18k7qK87n8j48m9
8134gK7J01j33L2R3k55J44J00j15j51L34l2n1o2o4o8K17m5n6O6N7m84P53n16J35
8159B0J28rJ03j09k30K90p6k32l9K18J9k59P3j04K05k3j87L49Lk36O7J67J78m61
8183a45K05j60K87q7k2l21L76m5
8191H8
$$ Imaginary data points
##PAGE= N=2
##DATA TABLE= (X++(I..I)), XYDATA
$$ plain form
0 0 0 0 0 0 0 0 0 0 8 0 8 -8 8 -16 16 -17 24 -32 33 -40 48 -61 72 -85 97 -113 133 -152 174 -199 229 -260
32 -260 295 -332 376 -420 473 -527 589 -654 728 -807 894 -991 1093 -1206 1329 -1464 1613
49 1613 -1775 1955 -2153 2374 -2620 2899 -3213 3572 -3989 4476 -5059 5764 -6640 7762 -9252
64 -9252 11328 -14411 19440 -28965 52932 -224238 -372338 121850 -429279 -257347 -48634
75 -48634 -201620 -33287 28777 104418 64594 72857 250755 -48176 -12674 215096 -136723
86 -136723 -101223 219307 -119433 11311 218389 -17982 91609 134705 -29865 -24221 -66841
97 -66841 -93922 -237772 -157025 -92937 -227399 -51806 23698 28169 96044 146331 220979 86161
109 86161 155967 152518 -80872 88932 -34319 -165764 7678 -50424 -121684 6208 12970
$$ packed form
0@%%%%%%%%QqQj6J6k4L2l3M1n6O5p3Q8j09J33j57J82k10K46k85L26l73M28m89
32b60N55o27P08p96Q93j000J116j243J382j535J701j885K084k299K535k793L077
49A613l388L730m108M527m994N519o112O785p561Q465r535J0823j2404J4402j7014
64i252K0580k5739L3851m8405Q1897k77170j48100M94188n51129J71932K08713
75d8634j52986J68333O2064P5641l9824Q263J77898k98931L5502K27770l51819
86a36723L5500L20530l38740J30744K07078k36371J09591M3096j64570N644m2620
97f6841k7081j43850Q0747O4088j34462J75593P5504M471O7875N0287P4648j34818
109H6161O9806l449k33390J69804j23251j31445J73442n8102p1260J27892O762
$$ plain form
120 12970 -21487 -13960 10558 2841 -94490 -39933 -3106 -186229 44857 11908 -133135 210519
132 210519 70946 15946 251734 86190 70049 98495 5063 -18256 -106932 -54355 -138239
143 -138239 -153927 -18172 -123401 -83493 99395 -48225 6832 131198 -10442 19209 73328
154 73328 -37091 20953 9128 2276 22302 31278 89492 4842 70768 90601 -50380 30895
166 30895 -28737 -107871 -50019 -126313 -85821 -76086 -57733 -6637 4867 62979 78400 56014
178 56014 109217 62728 35188 36215 143 -20743 -22956 -41860 -11076 -27070 -9889 19421
190 19421 -19181 26609 -2564 -44143 7974 -56633 -56816 -22682 -55419 1457 -14028 39573
202 39573 56292 42145 102969 53829 40922 80769 -29637 -6321 -4962 -84918 -47413 -34721
$$ packed form
120A2970l4457P527K4518p717r7331N4557L6827j83123K31086l2949j45043L43654
132B10519j39573n5000K35788j65544j6141K8446r3432k3319q8676N2577q3884
143a38239j5688J35755j05229L9908J82888j47620N5057J24366j41640K9651N4119
154G3328j10419N8044j1825o852K0026Q976N8214q4650O5926J9833j40981Q1275
166C0895n9632p9134N7852p6294M0492R735J8353N1096J1504N8112J5421k2386
178E6014N3203m6489k7540J027l6072k0886k213j8904L0784j5994J7181K9310
190A9421l8602M5790k9173m1579N2117o4607j83L4134l2737N6876j5485N3601
202C9573J6719j4147O0824m9140j2907L9847j10406K3316J359p9956L7505J2692
$$ plain form
214 -34721 -74833 -14603 -17133 -12255 19491 4974 27674 1710 7215 28211 -39166 16020 23927
227 23927 -45969 55381 18425 -2254 67362 14560 8776 36533 -21442 -13505 -32092 -36222
239 -36222 -45188 -50191 -24530 -22310 -26533 24226 9780 14514 50979 18558 23914 35234 1137
252 1137 5334 3298 -9553 -6531 -11348 3114 -11115 4459 -1389 -824 -1336 -9004 -7681 -12675 -23946
267 -23946 691 -29001 -3928 8545 -10510 20836 24726 7615 35746 14464 13335 15378 -9534
280 -9534 4322 -18246 -20963 -728 -32776 -9423 10124 -33091 22264 4840 -13385 27549
292 27549 -3200 -6942 20757 -18331 7780 -1366 -5005 10781 -3907 6882 15151 -10719 17709
305 17709 739 -14615 13859 -16104 -13753 8225 -20659 -2907 8093 -14427 14236 1757
$$ packed form
214c4721m0112O0230k530M878L1746j4517K2700k5964N505K0996o7377N5186P907
227B3927o9896J01350l6956k0679O9616n2802n784K7757n7975P937j8587m130
239c6222q966n003K5661K220m223N0759j4446M734L6465l2421N356J1320l4097
252A137M197k036j2851L022m817J4462j4229J5574n848N65n12p668J323m994j1271
267b3946K4637k9692K5073J2473j9055L1346L890j7111K8131k1282j129K043k4912
280i534J3856k2568k717K0235l2048K3353J9547m3215N5355j7424j8225M0934
292B7549l0749l742K7699l9088K6111r146l639J5786j4688J0789Q269k5870K8428
305A7709j6970j5354K8474k9963K351K1978k8884J7752J1000k2520K8663j2479
$$ plain form
317 1757 1478 10995 1116 1608 7359 -8140 5736 -4987 -3405 102 -2001 -6546 6286 -6704
331 -6704 876 3793 -4547 4311 4063 -2848 10198 1057 -85 10117 -6965 191 2250 -12523
345 -12523 -3494 2080 -18816 7418 -3311 -6661 10814 -1035 -1063 11954 -9502 9673 -5585
358 -5585 -3188 7958 -10368 5727 11972 -10537 18675 5505 -7936 14935 -7863 -12352 975
371 975 -18675 -13522 -3177 -17188 5705 -3743 5536 17743 1625 14634 17497 -9880 17375
384 17375 -5219 -10819 3620 -9790 -11123 4052 -7313 950 1344 -1631 2176 -5761 -7806 -93
398 -93 -16779 -6449 3313 -16815 13313 9443 335 25663 16639 5496 20469 2132 2067 -7281
412 -7281 -8451 -14204 -16133 -16771 -8033 -16300 -2530 2708 -10238 8401 11359 -14520 14482 2707
$$ packed form
317A757k79R517r879M92N751j5499J3876j0723J582L507k103m545J2832j2990
331f704P580K917q340Q858k48o911J3046r141j142J0202j7082P156K059j4773
345a2523R029N574k0896K6234j0729l350J7475j1849k8J3017k1456J9175j5258
358e585K397J1146j8326J6095O245k2509K9212j3170j3441K2871k2798m489J3327
371I75j9650N153J0345j4011K2893r448R279J2207j6118J3009K863k7377K7255
384A7375k2594n600J4439j3410j333J5175j1365Q263L94k975L807p937k045P713
398i3j6686J0330R762k0128L0128l870r108K5328r024j1143J4973j8337o5r348
412g281j170n753j929o38Q738q267J3770N238j2946J8639K958k5879K9002j1775
$$ plain form
426 2707 -10005 11189 -3570 4603 7431 5158 10461 9329 10021 8221 -2772 4825 -6170 -16911
440 -16911 -14272 -7241 -30137 -6580 -10224 -11434 9089 -872 9448 20652 4731 19342 5168
453 5168 8827 6102 -10127 2393 -4630 -8563 -4525 -500 -2070 194 -1100 -1054 1050 -6908 -11448
468 -11448 323 -18069 -69 -11283 -2077 13124 -658 15474 20624 13240 19573 3123 15532
481 15532 -1842 -11181 -7903 -15109 -14475 -17208 -8753 -11719 3403 -822 -5283 17537 461 -1127
495 -1127 7271 -5576 10644 -15166 8280 11558 -5156 17555 12669 4726 19606 1823 -4479
508 -4479 4688 -3744 -30526 -3171 -11472 -23530 -3840 -9714 9932 -3018 5419 23737 -6179
521 -6179 21453 8856 -16816 28161 -7642 -15546 13584 5441 -14077 9829 7059 -4664 7370
$$ packed form
426B707j2712K1194j4759Q173K828k273N303j132O92j800j0993P597j0995j0741
440a6911K639P031k2896K3557l644j210K0523r961J0320J1204j5921J4611j4174
453E168L659k725j6229J2520p023l933M038M025j570K264j294M6K104p958m540
468a1448J1771j8392J8000j1214R206J5201j3782J6132N150p384O333j6450J2409
481A5532j7374r339L278p206O34k733Q455k966J5122m225m461K2820j7076j588
495a127Q398j2847J6220k5810K3446L278j6714K2711m886p943J4880j7783o302
508d479R167q432k6782K7355q301j2058J9690n874J9646j2950Q437J8318k9916
521f179K7632j2597k5672M4977l5803p904K9130q143j9518K3906k770j1723J2034
$$ plain form
534 7370 -5386 -4054 -481 -15929 1059 -24632 7465 4373 -28621 32389 8702 -10282 30011
547 30011 9382 1504 13160 2290 -5787 2819 -3864 -18298 3953 -8209 -2119 -12359 5727
560 5727 13977 -24938 13336 14848 -26249 18115 -3250 -10044 14172 -1149 -6322 15298 11821
573 11821 -6028 11303 11631 3049 -4757 -3377 11302 -25583 -8751 9896 -36717 14382 -3009
586 -3009 -21659 26429 2952 -8954 19396 10559 -831 -1322 10664 -2121 -4461 -4029 5959 -7842
600 -7842 1948 10441 -18488 19321 6313 -27670 19950 -2627 -20640 3863 -6631 -2531 -5787
613 -5787 3630 1939 6975 8969 4882 4564 11159 4445 -10597 3052 8905 -26745 6441 -141
627 -141 -13721 7443 -5217 2128 5086 -2945 2183 -1839 3994 -3660 -6424 4798 1827 -5633
$$ packed form
534G370j2756J332L573j5448J6988k5691L2097l092l2994O1010k3687j8984M0293
547C0011k0629p878J1656j0870q077Q606o683j4434K2251j2162O090j0240J8086
560E727Q250l8915L8274J512m1097M4364k1365o794K4216j5321n173K1620l477
573A1821j7849J7331L28q582p806J380J4679l6885J6832J8647m6613N1099j7391
586c009j8650M8088k3477j1906K8350q837j1390m91J1986j2785k340M32R988j3801
600g842R790Q493k8929L7809j3008l3983M7620k2577j8013K4503j0494M100l256
613e787R417j691N036J994m087l18O595o714j5042J3649N853l5650L3186o582
627a41j3580K1164j2660P345K958q031N128m022N833p654k764J1222k971p460
$$ plain form
641 -5633 -1131 16030 -10376 5489 8116 -8347 9354 -4362 -7524 8074 -9556 489 -6781
654 -6781 3531 2733 -9624 5955 5819 -6307 3104 4612 -4575 4409 1756 -8266 10344 -2171
668 -2171 -9303 9810 -7382 1864 -4475 -1958 6335 -8177 2682 5218 -5706 9845 -4722
681 -4722 1552 5547 -3197 -5303 5487 -3494 -5599 3391 -4523 2134 2489 -6533 8513 -1629 -2566
696 -2566 3492 -6547 5492 -4762 -2819 5024 -891 239 6416 179 5107 2771 -1007 391
710 391 2401 -11237 1028 -6126 -7536 1141 -8021 1336 4416 -5491 9721 2266 1119 8273 -2401
725 -2401 3845 2454 -3369 828 2628 -5237 3767 -1422 -737 3346 -4589 -504 2609 -11568 3928
740 3928 -7779 -6039 2866 -7701 823 7034 -3173 9401 7920 3320 10057 4008 1523 4117
$$ packed form
641e633M502J7161k6406J5865K627j6463J7701j3716l162J5598j7630J0045p270
654f781J0312p98j2357J5579j36j2126R411J508r187Q984k653j0022J8610j2515
668b171p132J9113j7192R246o339K517Q293j4512J0859K536j0924J5551j4567
681d722O274L995q744k106J0790q981k105Q990p914O657L55r022J5046j0142r37
696b566O058j0039J2039j0254J943P843n915J130O177o237M928k336l778J398
710C91K010j3638J2265p154j410Q677r162R357L080r907J5212p455j147P154j0674
725b401O246j391n823M197J800p865R004n189O85M083p935M085L113j4177J5496
740C928j1707J740Q905j0567Q524O211j0207J2574j481m600O737o049k485K594
$$ plain form
754 4117 -4266 -3788 -2310 -11187 -1585 -8406 -5662 2149 -5590 752 6624 -5684 7179 -97 -2346
769 -2346 4499 -792 -2273 6900 -1023 5519 7888 2880 7951 4828 -1341 3346 -7553 -7761 -5544
784 -5544 -16409 -5805 -8598 -8640 2855 282 2249 13128 2597 10272 8266 860 4229 1042
798 1042 -6406 3810 -5833 -1100 3203 -3183 3169 3102 -5209 3079 -6214 -8508 -3196 -12650 -6161
813 -6161 -3407 -6028 4981 5922 4972 16536 6885 11373 10720 150 2575 -272 -12454 -1781 -11008
828 -11008 -8886 -2749 -6642 -2155 3019 -3574 4592 -512 -2303 2612 -5175 -1453 2113 -4015 5213
843 5213 6150 1508 12594 5631 5579 8118 -502 -2394 -1176 -12591 -5218 -11868 -10875 -4378 -7219 -3585
859 -3585 5560 -2230 7342 7641 1470 7776 4743 -1092 5356 -2462 -542 2450 -4270 3578 -97
$$ packed form
754D117q383M78J478q877R602o821K744P811p739O342N872j2308J2863p276k249
769b346O845n291j481R173p923O542K369n008N071l123o169M687j0899k08K217
784e544j0865J0604k793m2J1495k573J967J0879j0531P675k006p406L369l187
798A042p448J0216r643M733M303o386O352o7q311Q288r293k294N312r454O489
813f161K754k621J1009R41r50J1564r651M488o53j0570K425k847j2182J0673r227
828a1008K122O137l893M487N174o593Q166n104j791M915p787L722L566o128R228
843E213R37m642J1086o963n2K539q620j892J218j1415P373o650R93O497k841L634
859c585R145p790R572K99o171O306l033n835O448p818J920K992o720P848l675
$$ plain form
874 -97 -1625 5097 -3268 -3005 3333 -10870 -2438 -3308 -10003 -1735 -722 -5193 7269 1211 6210 8760
890 8760 4173 7833 4528 -1765 5864 -7053 -4471 809 -11778 -1738 -715 -7171 2631 1453
904 1453 -2184 5016 -1401 749 206 -1489 113 -90 -2752 6830 -2116 2820 8260 -776 3102 5225
920 5225 -5470 2519 -3847 -5578 -2689 -4502 -3447 -2443 -144 1543 1046 1659 5698 1296 19
935 19 5283 -1151 -1410 5021 -7061 3066 785 -4002 1726 858 -1729 504 -2540 2126 -2952 -767
951 -767 721 217 -1344 3230 -1368 894 5498 -5277 2835 2863 -5582 3335 -1817 -417 2776 -5824
967 -5824 5634 -2566 -901 1358 -3359 1552 1303 -4226 4446 2724 -41 2355 5244 -753 4037
982 4037 -3731 -394 271 -9495 -854 -5927 -4478 1844 -6049 6112 4593 -606 8594 1807 5020
$$ packed form
874i7j528O722q365K63O338j4203Q432q70o695Q268J013m471J2462o058M999K550
890H760m587L660l305o293P629j2917K582N280j2587J0040J023o456R802j178
904A453l637P200o417K150n43j695J602k03k662R582q946M936N440r036L878K123
920E225j0695P989o366j731K889j813J055J004K299J687m97O13M039m402j277
935A9N264o434k59O431j2082J0127k281m787N728q68k587K233l044M666n078K185
951g67J488n04j561M574m598K262M604j0775Q112K8q445Q917n152J400L193q600
967e824J1458q200J665K259m717M911k49n529Q672j722k765K396K889n997M790
982D037p768L337O65r766Q641n073J449O322p893J2161j519n199R200o787L213
$$ plain form
997 5020 91 446 -338 116 -4150 -1718 2693 -1700 446 2943 -2019 6415 -6919 -1041 -108 -9113
1013 -9113 -3051 -6030 -3205 1505 -2354 4662 9024 6433 5671 10662 5648 1382 4111 -8905 1952
1028 1952 -8629 -12352 -146 -9163 -1774 -819 -4913 10992 -3995 1211 5928 -2081 -675 300
1042 300 -3430 2875 3585 -3239 10052 9188 959 11935 1222 4750 159 -14138 2277 -15923
1056 -15923 -13959 -6840 -15053 -1470 -1829 -3892 12393 8768 8172 9646 12860 4373 4773 -1591 -1120
1071 -1120 832 -9601 623 -461 -3170 6152 -5588 3966 1875 -11283 -2799 -8306 -10413 -12250
1085 -12250 -5463 -4543 479 5537 7750 18726 14626 12135 17915 3543 9725 -7870 -9148 -2615
1099 -2615 -20505 -11907 -7305 -10865 -569 -2829 1460 6252 2313 -889 2579 -894 -4837 -181
$$ packed form
997E020m929L55p84M54m266K432M411m393K146K497m962Q434j3334N878R33r005
1013i113O062k979K825M710l859P016M362k591p62M991n014m266K729j3016J0857
1028A952j0581l723J2206r017P389R55m094J5905j4987N206M717q009J406R75
1042C00l730O305P10o824J3291q64q229J0976j0713L528m591j4297J6415j8200
1056a5923J964P119q213J3583l59k063J6285l625n96J474L214q487M00o364M71
1071a120J952j0433J0224j084k709R322j1740R554k091j3158Q484n507k107j837
1085a2250O787R20N022N058K213J0976m100k491N780j4372O182j7595j278O533
1099b615j7890Q598M602l560J0296k260M289M792l939l202L468l473l943M656
$$ plain form
1113 -181 -5313 8374 2695 4037 20447 7839 12841 13887 -2512 7751 -11729 -14667 -12278 -20711
1127 -20711 -16972 -15756 -9227 -118 -58 7284 14496 13399 9385 13596 4892 4368 2916 -8391 4574
1142 4574 -3028 -3336 4378 773 5768 1601 -1944 1949 -9575 -9803 -14777 -13101 -14372 -10912 -6557
1157 -6557 264 9718 8952 17257 23282 13305 18413 8879 4214 1823 -11760 -8082 -11960 -13963 -9584
1172 -9584 -8166 -4027 482 -1794 1750 3756 -2712 -3422 631 -9405 1474 -3201 416 12056
1186 12056 5422 14529 18125 10478 16533 3351 1276 -2015 -16232 -14790 -17695 -21076 -14836 -11647
1200 -11647 -8322 4281 3560 8639 15240 9420 10215 9542 170 6356 -4392 -1204 2034 -1942 4475
1215 4475 5125 3577 8061 -501 -1701 -4780 -11498 -15545 -15104 -16283 -13313 -6714 -4176 7513 10778
$$ packed form
1113a81n132J3687n679J342J6410j2608N002J046j6399J0263j9480k938K389q433
1127b0711L739J216O529R109O0P342P212j097m014M211q704n24j452j1307J2965
1142D574p602l08P714l605M995m167l545L893j1524k28m974J676j271L460M355
1157f557O821R454p66Q305O025r977N108r534m665k391j3583L678l878k003M379
1172i584J418M139M509k276L544K006o468p10M053j0036J0879m675L617J1640
1186A2056o634R107L596p647O055j3182k075l291j4217J442k905l381O240L189
1200a1647L325J2603p21N079O601n820P95o73r372O186j0748L188L238l976O417
1215D475O50j548M484q562j200l079o718m047M41j179K970O599K538J1689L265
$$ plain form
1230 10778 14226 20338 17311 15373 12719 2080 2391 -6304 -9962 -9317 -9551 -9664 -3417 -4359 -316 2192
1246 2192 -1226 -379 -840 -7792 -3228 -8160 -5825 666 -2011 8954 11634 11347 19007 14042 10913
1261 10913 11182 -1563 -2815 -8925 -16413 -14651 -15208 -16476 -6464 -8138 139 5519 3724 9639 8394
1276 8394 3263 8279 -375 569 2685 -2587 3233 4252 2744 8153 5441 3470 4763 -3903 -4149
1291 -4149 -8563 -13656 -12547 -12789 -13391 -4590 -4546 2727 8534 9442 12946 14771 9366 11103 4581 565
1307 565 -567 -5224 -6184 -4213 -6678 -3184 -1047 -2632 1927 -1018 -2211 -1305 -5892 -6252 -3706 -7768
1323 -7768 -936 527 2211 8914 9648 10120 14648 7294 8344 3281 -3230 -3998 -9222 -12429 -7796 -12118
1339 -12118 -6521 -2248 -3519 3873 3667 2657 6889 2013 1656 3080 -3129 1648 -32 -59 4607 3626
$$ packed form
1230A0778L448O112l027j938k654j0639L11q695l658O45k34j13O247r42M043K508
1246B192l418Q47m61o952M564m932K335O491k677J0965K680k87P660m965l129
1261A0913K69j2745j252o110p488J762n57j268J0012j674Q277N380j795N915j245
1276H394n131N016q654R44K116n272N820J019j508N409k712j971J293q666k46
1291d149m414n093J109k42o02Q801M4P273N807R08L504J825n405J737o522m016
1307E65j132m657r60J971k465L494K137j585M559k945j193R06m587l60K546m062
1323g768O832J463J684O703P34M72M528p354J050n063o511p68n224l207M633m322
1339a2118N597M273j271P392k06j010M232m876l57J424o209M777j680k7M666r81
$$ plain form
1355 3626 3863 8579 1497 4045 896 -4729 -4501 -7754 -11032 -6508 -9826 -5062 -978 -453 5336 6761
1371 6761 6162 9731 5870 3668 4971 -1341 -464 -1563 -3929 -1455 -744 -2881 2791 -1074 73 471
1387 471 -2943 -1965 -2359 -6392 -1110 -4200 -2365 1924 723 3717 6779 3849 6918 5555 1657 3370
1403 3370 -1159 -3144 -1504 -6195 -4061 -2112 -6208 724 -2005 -874 2551 -509 1098 2857 -2384
1418 -2384 2207 193 -478 1367 628 194 3654 145 2183 2955 -1107 1762 -691 -2940 529 -5101
1434 -5101 -3166 -284 -4500 484 -818 11 2269 1408 1410 3560 552 1500 1169 -728 -172 157 -3635
1451 -3635 2533 -2390 -745 1875 -2122 1722 217 -1583 2182 -1808 -702 334 -1487 708 -910
1466 -910 -134 848 1273 -1518 2577 -108 -468 1680 -2096 563 611 -4104 2852 -1554 183 509 -949
$$ packed form
1355C626K37M716p082K548l149n625K28l253l278M524l318M764M084N25N789J425
1371F761n99L569l861k202J303o312Q77j099k366K474P11k137N672l865J147L98
1387D71l414R78l94m033N282l090J835M289j201K994L062k930L069j363l898J713
1403C370m529j985J640m691K134J949m096O932k729J131L425l060J607J759n241
1418b384M591k014o71J845p39m34L460l509K038P72m062K869k453k249L469n630
1434e101J935K882m216M984j302Q29K258q61KK150l008R48l31j897N56L29l792
1451c635O168m923J645K620l997L844j505j800L765l990J106J036j821K195j618
1466i10P76R82M25k791M095k685l60K148l776K659M8m715O956m406J737L26j458
$$ plain form
1483 -949 2444 -342 -662 1761 -343 -265 -21 437 -845 573 -2299 -800 1555 -4769 1204 -1298
1499 -1298 -976 1644 -2113 2826 2036 -1150 3976 86 2417 -363 -825 -229 -40 -2654 -1493 790
1515 790 -2253 -59 165 -1336 3400 -3762 -20 1611 -4355 1540 -2709 537 2358 -1137 3655
1530 3655 3825 1689 3180 1482 1483 -778 -1376 -4663 -258 -5449 -4509 -34 -3994 1638 91 -282 5993
1547 5993 -1971 2523 1704 -997 2010 -2618 740 1134 309 107 3363 2295 212 2277 -977 -710
1563 -710 -1753 -7615 143 -5992 -3710 -1189 -3139 3489 684 1874 7081 2614 3748 2500 2441 506
1579 506 -615 -2209 -1830 535 -4998 889 346 -1582 1992 -3335 1396 428 -6071 1414 -3432 -1194
1595 -1194 -925 -1720 2929 2974 1915 4348 5664 2939 2235 2312 -1526 1124 -5716 -3630 -872 -7674 -696
$$ packed form
1483i49L393k786l20K423k104P8K44M58j282J418k872J499K355o324N973k502
1499a298L22K620l757M939p90l186N126l890K331k780m62N96J89k614J161K283
1515G90l043K194K24j501M736p162L742J631n966N895m249L246J821l495M792
1530C655J70k136J491j698Jk261n98l287M405n191R40M475l960N632j547l73O275
1547E993p964M494q19k701L007m628L358L94q25k02L256j068k083K065l254K67
1563g10j043n862P758o135K282K521j950O628k805J190N207m467J134j248n9j935
1579E06j121j594L79K365n533N887n43j928L574n327M731r68o499P485m846K238
1595a194K69p95M649M5j059K433J316k725p04P7l838K650o840K086K758o802O978
$$ plain form
1612 -696 -3555 -1283 2570 -2378 3080 3166 -336 2571 -241 1246 -486 -97 -66 2958 299 944 3934
1629 3934 383 2098 514 -2561 1377 -6178 -3978 -2535 -5994 -1589 -3413 214 2698 1761 3626
1644 3626 4837 3791 2375 2098 789 -499 -239 -4307 1555 -2299 -1995 1769 -1290 1988 237 -2303
1660 -2303 2069 -3267 -2500 -2179 -2650 -1450 -773 135 2632 3946 1623 5625 4025 1560 3154 -1924
1676 -1924 -495 -677 -6517 -444 -4098 -2485 -280 -2056 1440 1276 -688 2532 142 173 216 -32 -653
1693 -653 1335 -1200 1490 3446 -453 3622 1474 520 2142 -2613 -722 -1365 -4762 -1121 -3548 -1514
1709 -1514 -859 -802 643 2272 937 1986 2658 783 1473 1439 -1286 1965 -2092 -816 900 -2097 951
1726 951 -372 -581 1100 -1356 -525 176 -1911 -814 -783 -1214 -163 768 -1021 3049 702 1596 3009
$$ packed form
1612f96k859K272L853m948N458Q6l502K907k812J487j732L89L1L024k659O45K990
1629C934l551J715j584l075L938p555K200J443l459M405j824L627K484r37J865
1644C626J211j046j416k77j309j288K60m068N862l854L04L764l059L278j751k540
1660b303M372n336P67L21m71J200O77R08K497J314k323M002j600k465J594n078
1676a924J429j82n840O073l654J613K205j776L496j64j964L220k390L1M3k48o21
1693f53J988k535K690J956l899M075k148r54J622m755J891o43l397L641k427K034
1709a514O55N7J445J629j335J049O72j875O90l4k725L251m057J276J716k997L048
1726I51j323k09J681k456Q31P01k087J097L1m31J051R31j789M070k347Q94J413
$$ plain form
1743 3009 52 1749 987 -2099 1381 -2767 -1520 -610 -2560 -322 -376 -1344 1247 596 -253 2183 -158
1760 -158 -142 1190 -1308 441 697 -1808 2181 -659 520 1860 -669 1134 866 -2004 650 -1569
1776 -1569 -1457 -295 -1401 -720 860 -970 1205 1127 -72 2255 324 -13 1346 -1502 -340 350
1792 350 -1997 849 -1014 -294 691 -450 -208 1059 -1175 838 356 -767 855 3 -807 1513 -822
1809 -822 579 1086 -721 788 -85 -1125 1050 -934 -543 964 -1530 516 369 -882 756 16
1825 16 -875 1720 -991 578 1017 -332 1293 722 -851 1610 -1340 -376 11 -1735 -436 -101 -1421
1842 -1421 1238 -199 -226 1923 -420 650 932 -541 709 31 -1330 1375 -1354 240 765 -603
1858 -603 662 970 -1272 873 -1305 -763 -158 -1530 -546 244 -1261 1080 830 262 2131 565 816
$$ packed form
1743C009k957J697p62l086L480m148J247R10j950K238n4r68K591o51q49K436k341
1760a58J6J332k498J749K56k505L989k840J179J340k529J803k68k870K654k219
1776a569J12J162j106O81J580j830K175p8j199K327j931l37J359k848J162O90
1792C50k347K846j863P20R85j141K42J267k234K013m82j123J622q52q10K320k335
1809h22J401N07j807J509q73j040K175j984L91J507k494K046j47j251J638p40
1825A6q91K595k711J569M39j349J625n71j573K461k950R64L87j746J299L35j320
1842a421K659j437k7K149k343J070K82j473J250o78j361K705k729J594N25j368
1858f03J265L08k242K145k178N42O05j372R84P90j505K341k50n68J869j566K51
$$ plain form
1875 816 1807 -633 91 -50 -1995 285 -1149 -1103 385 -853 -541 1360 -1450 1037 -109 -784 903
1892 903 -146 -1136 1630 -995 720 1207 -151 1580 1076 -42 1870 -481 -201 414 -2483 -70
1908 -70 -1497 -1759 23 -1134 -568 1356 -683 1530 1217 207 1187 1240 -636 1681 -1391 -109 620
1925 620 -1720 435 -39 -1175 1231 -771 -166 310 -1326 -441 -407 -1525 -596 255 -972 1651 128
1942 128 1170 2595 622 1881 1769 -609 1455 -1839 -784 -373 -2040 -1017 -374 -1181 364 167
1958 167 336 1129 1 -553 855 -864 -544 681 -1522 1720 266 504 2493 175 1204 1077 -937
1975 -937 468 -2083 -1535 -1545 -1341 -1991 200 -524 101 1375 118 2051 1380 -782 1942 -888 -475
1992 -475 302 -1522 1362 -558 -16 820 -30 297 107 -318 64 -913 -1310 -756 -28 -2279 641 -439
$$ packed form
1875H16R91k440P24j41j945K280j434M6J488j238L12J901k810K487j146o75J687
1892I03j049r90K766k625J715M87j358J731n04j118J912k351K80O15k897K413
1908g0j427k62J782j157N66J924k039K213l13j010R80N3j876K317l072J282P29
1925F20k340K155m74j136K406k002O05M76j636Q85L4j118R29Q51j227K623j523
1942A28J042J425j973J259j12k378K064l294J055M11j667J023O43q07J545j97
1958A67J69P93j128n54J408j719L20J225k203L242j454K38J989k318J029j27k014
1975i37J405k551N48j0K04o50K191p24O25J274j257J933o71k162K724k830M13
1992d75P77j824K884j920N42Q36q50L27j90m25L82r77l97N54P28k251K920j080
$$ plain form
2010 -439 614 1872 -509 2302 1391 -362 1810 -990 694 -592 -1531 235 -963 -974 -532 296 -439
2027 -439 122 -367 -232 807 -1163 301 1115 -1768 1446 -1210 1098 901 -935 1609 660 309 656
2044 656 -743 765 -433 -1126 -840 92 -1057 -1462 561 -1034 913 -257 27 2393 -697 697
2060 697 705 -836 1359 -1820 587 265 -589 -84 613 348 76 8 -450 397 -367 -1962 1009 -1241 -616
2079 -616 427 -1243 2076 -442 165 2054 -514 765 150 -62 833 -1405 -832 -179 351 -1294 761
2096 761 -46 251 634 -1171 1302 120 -1821 1547 -1333 577 114 -1249 1917 -286 -229 379 104
2113 104 223 -430 -92 301 331 -650 71 1252 -1325 1528 -1068 618 909 -1601 781 69 -565 922
2131 922 -871 631 -16 -621 64 394 -537 -503 413 -671 346 -1 -272 1981 -653 721 1389 -894
$$ packed form
2010d39J053J258k381K811r11j753K172k800J684j286r39J766j198j1M42Q28p35
2027d39N61m89J35J039j970J464Q14k883L214k656K308j97j836K544r49l51L47
2044F56j399J508j198o93K86R32j149m05K023j595J947j170K84K366l090J394
2060F97Qj541K195l179K407l22q54N05O97k65k72o8m58Q47p64j595K971k250O25
2079f16J043j670L319k518O07J889k568J279o15k12Q95k238N73O53N30j645K055
2096G61q07K97L83j805K473j182j941L368k880J910m63j363L166k203N7O08k75
2113A04J19o53L38L93L0r81P21J181k577K853k596J686K91k510K382p12o34J487
2131I22j793J502o47o05O85L30r31L4R16j084J017l47k71K253k634J374O68k283
$$ plain form
2149 -894 1411 -1012 -136 242 -1581 -724 -146 -739 181 -17 285 591 336 -928 1541 -815 -149 602
2167 602 -1138 1231 -437 -171 2385 -567 923 392 -491 990 -1264 -931 -719 -1405 -1944 -393 -856
2184 -856 -172 231 -20 1601 1401 -100 2229 -11 754 430 -1060 909 -708 -828 394 -682 288
2201 288 -194 -155 200 -464 -920 -1100 -398 -1907 -124 -816 105 1132 218 1742 2474 693 2593 332
2219 332 979 300 -1414 -1224 -1419 -2089 -1235 -1158 -1424 -249 -337 401 1292 -348 457 648 -853 818 -798
2238 -798 320 1115 105 1493 1576 747 2083 400 124 -336 -1594 -2100 -1768 -3324 -2026 -1747 -1788 789
2256 789 502 1500 3066 1687 2196 2095 -30 1205 -746 -602 -388 -787 -534 375 -301 617 25 -448
2274 -448 -325 -1219 -2206 -1250 -2709 -1787 -963 -572 1129 1950 2370 3998 2960 2789 2314 591 453 -1124
$$ packed form
2149h94K305k423Q76L78j823Q57N78n93R20j98L02L06k55j264K469k356O66P51
2167F02j740K369j668K66K556k952J490n31q83J481k254L33K12o86n39J551m63
2184h56O84M03k51J621k00j501K329k240P65l24j490J969j617j20J222j076R70
2201B88m82L9L55o64m56j80P02j509J783o92R21J027r14J524P32j781J900k261
2219C32O47o79j714J90j95o70Q54P7k66J175q8P38Q91j640Q05J91j501J671j616
2238g98J118P95j010J388Q3q29J336j683k76m60j258n06L32j556J298K79m1K577
2256G89k87R98J566j379N09j01k125J235j951J44K14l99K53R09o76R18n92m73
2274d48J23q94r87R56j459R22Q24L91J701Q21M20J628j038j71m75j723j38j577
$$ plain form
2292 -1124 -2254 -2010 -2314 -2402 -981 -1342 98 606 -84 970 478 -653 720 -1121 -545 230 -295 1004
2310 1004 1871 1526 2952 1930 1843 1966 -91 -893 -1824 -3350 -2717 -3313 -3640 -1474 -1655 -88 1167 1463
2328 1463 2111 2478 1597 2478 757 260 323 -733 -368 125 -734 827 373 550 1001 -520 -693 -1107 -2611
2347 -2611 -2416 -2177 -2838 -953 -924 492 2089 2394 3134 3749 2624 2879 1283 49 -381 -1933 -2685 -1670
2365 -1670 -2788 -1018 -859 -872 690 142 -59 646 -820 -471 -467 -1422 90 60 554 2014 2042 2396 3615
2384 3615 1687 2488 687 -918 -1302 -2546 -3642 -2671 -3713 -2234 -1085 -661 824 1480 1384 2849 1466
$$ packed form
2292a124j130K44l04q8J421l61J440N08o90J054m92j131J373j841N76P75n25J299
2310A004Q67l45J426j022q7J23k057q02r31j526O33n96l27K166j81J567J255K96
2328A463O48L67q81Q81j721m97O3j056L65M93q59J561m54J77M51j521j73m14j504
2347b611J95K39o61J885K9J416J597L05P40O15j125K55j596j234m30j552p52J015
2365a670j118J770J59j3J562n48k01P05j466L49Mr55J512l0M94J460K8L54J219
2384C615j928Q01j801j605l84j244j096R71j042J479J149M24J485O56r6J465j383
$$ [...]
8191b15
##END NTUPLES=NMR FID
##END=
