##TITLE=1H_Pr 5-1
 D2O
 8 sc, 
 14.3.2024
##JCAMPDX= 6.0         $$ Bruker NMR JCAMP-DX V2.0
##DATA TYPE= NMR FID
##DATA CLASS= NTUPLES
##ORIGIN= UXNMR, Bruker Analytische Messtechnik GmbH
##OWNER= root
$$ XWIN-NMR		Version 3.5
$$ Thu Mar 14 16:19:05 2024 Russian Standard Time (UT+4h)  she@DPX200
##.OBSERVE FREQUENCY= 200.1313
##.OBSERVE NUCLEUS= ^1H
##.DELAY= (6, 6)
##.ACQUISITION MODE= SIMULTANEOUS
##.ACQUISITION SCHEME= undefined
##.AVERAGES= 8
##.DIGITISER RES= 18
##SPECTROMETER/DATA SYSTEM= spect
##.PULSE SEQUENCE= zg30
##.SOLVENT NAME= D2O
##.SHIFT REFERENCE= (INTERNAL, D2O, 0, 15.7039)
##AUDIT TRAIL= $$ (NUMBER, WHEN, WHO, WHERE, WHAT)
$$ ##TITLE= Audit trail, XWIN-NMR		Version 3.5
$$ ##JCAMPDX= 5.01
$$ ##ORIGIN= Bruker BioSpin GmbH
$$ ##OWNER= she
$$ F:/spectra/data/she/nmr/H-F/1/audita.txt
$$ ##AUDIT TRAIL=  $$ (NUMBER, WHEN, WHO, WHERE, WHAT)
(   1,<2024-03-14 16:18:06.28 +0400>,<she>,<DPX200>,
      <created by zg, POWCHK disabled, PULCHK disabled
       configuration hash MD5:
       00 E9 B6 7A A2 85 ED C7 34 08 36 98 17 FE 4E 26
       data hash MD5: 16K
       FD 0F B2 96 B1 CE A2 0B A0 3D 4A AA 97 3C 72 00>)
$$ ##END=
$$ 
$$ hash MD5
$$ F2 06 E2 F7 68 8A 61 66 D1 37 B1 7A 8D A6 30 47
##$RELAX= 
##$RELAX= 
##$RELAX= 
##$RELAX= 
##$RELAX= 
##$RELAX= 
$$ Bruker specific parameters
$$ --------------------------
##$DU= <F:/spectra>
##$EXPNO= 1
##$NAME= <H-F>
##$PROCNO= 1
##$TYPE= <nmr>
##$USER= <she>
##$AMP= (0..31)
100 100 100 100 100 100 100 100 100 100 100 100 100 100 100 100 100 100 
100 100 100 100 100 100 100 100 100 100 100 100 100 100 
##$AQSEQ= 0
##$AQ_mod= 1
##$AUNM= <au_zg>
##$AUTOPOS= <>
##$BF1= 200.13
##$BF2= 200.13
##$BF3= 200.13
##$BF4= 200.13
##$BF5= 200.13
##$BF6= 200.13
##$BF7= 200.13
##$BF8= 200.13
##$BYTORDA= 1
##$CFDGTYP= 0
##$CFRGTYP= 5
##$CHEMSTR= <none>
##$CNST= (0..31)
1 1 145 1 1 1 1 1 1 1 1 1 1 1 1 1 1 1 1 1 1 1 1 1 1 1 1 1 1 1 1 1 
##$CPDPRG= <>
##$CPDPRG1= <>
##$CPDPRG2= <>
##$CPDPRG3= <>
##$CPDPRG4= <mlev>
##$CPDPRG5= <mlev>
##$CPDPRG6= <mlev>
##$CPDPRG7= <mlev>
##$CPDPRG8= <mlev>
##$CPDPRGB= <>
##$CPDPRGT= <>
##$D= (0..31)
0 1.2 0 0 0 0 0 0 0 0.06 0 0.03 0 0 0 0 0.0002 0 0 0 0 0 0 0 0 0 0 0 0 
0 0 0 
##$DATE= 1710418685
##$DBL= (0..7)
120 120 120 120 120 120 120 120 
##$DBP= (0..7)
150 150 150 150 150 150 150 150 
##$DBP07= 0
##$DBPNAM0= <>
##$DBPNAM1= <>
##$DBPNAM2= <>
##$DBPNAM3= <>
##$DBPNAM4= <>
##$DBPNAM5= <>
##$DBPNAM6= <>
##$DBPNAM7= <>
##$DBPOAL= (0..7)
0.5 0.5 0.5 0.5 0.5 0.5 0.5 0.5 
##$DBPOFFS= (0..7)
0 0 0 0 0 0 0 0 
##$DE= 6
##$DECBNUC= <off>
##$DECIM= 32
##$DECNUC= <off>
##$DECSTAT= 4
##$DIGMOD= 1
##$DIGTYP= 9
##$DL= (0..7)
0 120 120 120 120 120 120 120 
##$DP= (0..7)
150 150 150 150 150 150 150 150 
##$DP07= 0
##$DPNAME0= <>
##$DPNAME1= <>
##$DPNAME2= <>
##$DPNAME3= <>
##$DPNAME4= <>
##$DPNAME5= <>
##$DPNAME6= <>
##$DPNAME7= <>
##$DPOAL= (0..7)
0.5 0.5 0.5 0.5 0.5 0.5 0.5 0.5 
##$DPOFFS= (0..7)
0 0 0 0 0 0 0 0 
##$DQDMODE= 0
##$DR= 18
##$DS= 0
##$DSLIST= <SSSSSSSSSSSSSSS>
##$DSPFIRM= 0
$$ [...]
##$SUBNAM2= <"">
##$SUBNAM3= <"">
##$SUBNAM4= <"">
##$SUBNAM5= <"">
##$SUBNAM6= <"">
##$SUBNAM7= <"">
##$SUBNAM8= <"">
##$SUBNAM9= <"">
##$SW= 18.0517328524113
##$SWIBOX= (0..15)
0 0 2 0 0 0 0 0 0 0 0 0 0 0 0 0 
##$SW_h= 3612.71676300578
##$TD= 16384
##$TD0= 1
##$TE= 0
##$TE2= 300
##$TE3= 300
##$TEG= 300
##$TL= (0..7)
0 120 120 120 120 120 120 120 
##$TP= (0..7)
150 150 150 150 150 150 150 150 
##$TP07= 0
##$TPNAME0= <>
##$TPNAME1= <>
##$TPNAME2= <>
##$TPNAME3= <>
##$TPNAME4= <>
##$TPNAME5= <>
##$TPNAME6= <>
##$TPNAME7= <>
##$TPOAL= (0..7)
0.5 0.5 0.5 0.5 0.5 0.5 0.5 0.5 
##$TPOFFS= (0..7)
0 0 0 0 0 0 0 0 
##$TUNHIN= 0
##$TUNHOUT= 0
##$TUNXOUT= 0
##$USERA1= <user>
##$USERA2= <user>
##$USERA3= <user>
##$USERA4= <user>
##$USERA5= <user>
##$V9= 5
##$VALIST= <valist>
##$VCLIST= <CCCCCCCCCCCCCCC>
##$VD= 0
##$VDLIST= <DDDDDDDDDDDDDDD>
##$VPLIST= <PPPPPPPPPPPPPPP>
##$VTLIST= <TTTTTTTTTTTTTTT>
##$WBST= 1024
##$WBSW= 4
##$XGAIN= (0..3)
0 0 0 0 
##$XL= 0
##$YL= 0
##$YMAX_a= 283112
##$YMIN_a= -162636
##$ZGOPTNS= <>
##$ZL1= 120
##$ZL2= 120
##$ZL3= 120
##$ZL4= 120
##$ABSF1= 10
##$ABSF2= 0
##$ABSG= 5
##$ABSL= 3
##$ALPHA= 0
##$AQORDER= 0
##$ASSFAC= 0
##$ASSFACI= 0
##$ASSFACX= 0
##$ASSWID= 0
##$AUNMP= <proc_1d>
##$AZFE= 0.1
##$AZFW= 0.1
##$BCFW= 1
##$BC_mod= 2
##$BYTORDP= 1
##$COROFFS= 0
##$CY= 11.3945322036743
##$DATMOD= 1
##$DC= 2
##$DFILT= <>
##$DTYPP= 0
##$F1P= 15.7292609196834
##$F2P= 12.9074282941183
##$FCOR= 0.5
##$FTSIZE= 0
##$FT_mod= 4
##$GAMMA= 1
##$GB= 0.15
##$INTBC= 1
##$INTSCL= 1
##$ISEN= 128
##$LB= 0.24
##$LEV0= 0
##$LPBIN= 0
##$MAXI= 10000
##$MC2= 0
##$MEAN= 0
##$ME_mod= 0
##$MI= 1.114404
##$NCOEF= 0
##$NC_proc= 0
##$NLEV= 6
##$NOISF1= 3.799351
##$NOISF2= 2.8
##$NSP= 1
##$NTH_PI= 0
##$NZP= 0
##$OFFSET= 15.70392
##$PC= 1
##$PHC0= -25461.02
##$PHC1= 5.18731
##$PH_mod= 1
##$PKNL= yes
##$PPARMOD= 0
##$PSCAL= 0
##$PSIGN= 0
##$REVERSE= no
##$SF= 200.130013532006
##$SI= 16384
##$SIGF1= 3
##$SIGF2= 2
##$SINO= 400
##$SIOLD= 16384
##$SREGLST= <1H.CDCl3>
##$SSB= 0
##$STSI= 0
##$STSR= 0
##$SW_p= 3612.71676300578
##$SYMM= 0
##$S_DEV= 0
##$TDeff= 0
##$TDoff= 0
##$TI= <>
##$TILT= no
##$TM1= 0
##$TM2= 0
##$TOPLEV= 0
##$USERP1= <user>
##$USERP2= <user>
##$USERP3= <user>
##$USERP4= <user>
##$USERP5= <user>
##$WDW= 1
##$XDIM= 8192
##$YMAX_p= 0
##$YMIN_p= 0
$$ End of Bruker specific parameters
$$ ---------------------------------
##NTUPLES= NMR FID
##VAR_NAME=  TIME,          FID/REAL,        FID/IMAG
##SYMBOL=    X,             R,               I
##VAR_TYPE=  INDEPENDENT,   DEPENDENT,       DEPENDENT
##VAR_FORM=  AFFN,          ASDF,            ASDF
##VAR_DIM=   8192,          8192,            8192
##UNITS=     SECONDS,       ARBITRARY UNITS, ARBITRARY UNITS
##FACTOR=    0.0002768,     1,               1
##FIRST=     0,             0,               0
##LAST=      2.2672688,     0,               0
##MIN=       0,             -162636,         0
##MAX=       2.2672688,     283112,          0
$$ Real data points
##PAGE= N=1
##DATA TABLE= (X++(R..R)), XYDATA
$$ [...]
2477A413k656j862k61J135J886J773J008l4p20r71j115j353j300k06J273K337
2493C47K305J190n01k003k327j445j73O37P93J107J185J227N27o22j761k469j815
2510c798M8J820K625J908M60n16j031j183j254j098p32J10J354K343J993N31j269
2527B311k239k097j052J53J194J638J292R31M74Nr91j894k050j177L76J806K415
2544A095J803J83j133j714j243p18m74k8O68J431J918J468K48j343k518k211p84
2561c352P50J541J467J073N43M9m93j011j455j651p81Q03K215K394J315j78j359
2578A870j945j527p72K2N23Q25J308J614J026j56j502k195j922o30J052K168J963
2595A722Q77j46n76r09j202j318j201l53R39K206K260J288o52j953k077j243r4
$$ plain form
2477 1413 -1243 -3105 -3366 -2231 -345 1428 2436 2402 1682 711 -404 -1757 -3057 -3263 -1990 347
2493 347 2652 3842 3341 1338 -989 -2434 -2607 -1970 -1177 -70 1115 2342 2869 2247 486 -1983 -3798
2510 -3798 -3750 -1930 695 2603 3063 2547 1516 333 -921 -2019 -2751 -2641 -1287 1056 3049 3580 2311
2527 2311 72 -2025 -3077 -2924 -1730 -92 1200 2131 2605 2610 1619 -275 -2325 -3502 -3126 -1320 1095
2544 1095 2898 3081 1948 234 -1009 -1727 -2201 -2229 -1561 -130 1788 3256 3504 2161 -357 -2568 -3352
2561 -3352 -2602 -1061 406 1479 2022 2071 1578 567 -888 -2539 -3320 -2517 -302 2092 3407 3229 1870
2578 1870 -75 -1602 -2374 -2352 -1829 -1004 304 1918 2944 2788 1286 -909 -2831 -3461 -2409 -241 1722
2595 1722 2599 2453 1877 968 -234 -1552 -2753 -3106 -2167 39 2299 3587 2935 982 -1095 -2338 -2432
2612b432N71R47J188J099R18M72o13j673k257j563p1J576K049J851O83l79j197
2629A169j184r75o93n82J97J140J884J720O52p90k047k230j305K41J140J354J120
2646H11Q25M93N3p15j402j816j357J19J813K371J617J88j065j455j287q98n06
2663b211K1N22J218J804J591K71j247k116j928r02M40J457J752J125L15j01n88
2680A423r70j392j439p38O38J752K279J619L2j430j920j407n24J12N67P36J155
2697D93J203Q69l1j299k215j879n25J099J908J771Q24J0n12q63r42j114r83l81
2715b567Q53J842J947R78m12j635j839j413l43P06R90J011J014Q91M08m08j295
2732G28j882j541l60J073K048J963N46m40j132j132r67o67m64K13Q92J687J880
$$ plain form
2612 -2432 -1861 -914 274 1373 2291 2763 2150 477 -1780 -3343 -3414 -1838 211 2062 2745 2366 1169
2629 1169 -15 -990 -1683 -2265 -2068 -928 956 2676 3328 2538 491 -1739 -3044 -2803 -1663 -309 811
2646 811 1636 2129 2182 1467 65 -1751 -3108 -2989 -1176 1195 2812 3000 1935 480 -807 -1705 -2211
2663 -2211 -2190 -1668 -450 1354 2945 3216 1969 -147 -2075 -2977 -2537 -1080 672 1797 2112 2011 1423
2680 1423 453 -939 -2378 -3116 -2478 -726 1553 3172 3204 1774 -146 -1553 -2077 -1965 -1398 -662 493
2697 493 1696 2565 2534 1235 -980 -2859 -3384 -2285 -377 1394 2218 2228 1716 853 -89 -1203 -2186 -2567
2715 -2567 -1714 128 2075 3053 2641 1006 -833 -2246 -2589 -1883 -893 118 1132 2023 2431 2023 728
2732 728 -1154 -2695 -3055 -1982 66 2029 2575 2135 1003 -129 -1096 -1763 -2227 -2014 -1122 565 2445
2749B445R22o94k016k126j188R6J022J293J162O97K64L4o42j384j761j173K78
2766b771J584K083J638M34p89j607j367q31l33J25M65J065J415J244K92q35j854
2783d2j978j007M73J580J665J035K62r6n65p57j153j297q93M24J606K117J402
2800B776j01j177j656j259o02P2N80P64J056J209R50p4j248j942j718o10O52J647
2818f81J768R91N5o84p92q71j025q20j97P36J520J846J231j98j550k086j457l04
2836b518O14J062R98Q42P53L09k49j093j796j591k66J239J983J679O36m21j008
2853A173j256r23o52m09J26Q36J690J543O45o70j486j825j251j6J080J336J096
2870A037O44K31j61o74j205j494j007o3J227J917J784M49p24j342j307q41k36
$$ plain form
2749 2445 3367 2673 657 -1469 -2657 -2561 -1539 -246 916 1613 1877 1911 1269 -115 -1876 -3049 -2771
2766 -2771 -1187 896 2534 2968 2179 572 -795 -1626 -1959 -1834 -1369 -304 1111 2355 2647 1812 -42
2783 -42 -2020 -3027 -2554 -974 691 1726 1988 1892 1327 570 -583 -1880 -2773 -2349 -743 1374 2776
2800 2776 2675 1498 -158 -1417 -2019 -1947 -1367 -603 453 1662 2612 2538 1290 -652 -2370 -2980 -2328 -681
2818 -681 1087 2078 2133 1449 657 -214 -1239 -2059 -2256 -1520 0 1846 3077 2879 1329 -757 -2214 -2518
2836 -2518 -1904 -842 156 998 1751 2060 1811 718 -1078 -2669 -2935 -1696 287 1966 2602 2181 1173
2853 1173 -83 -1006 -1658 -2067 -1941 -1105 585 2128 2773 2103 617 -1208 -2459 -2475 -1395 -59 1037
2870 1037 1681 1912 1751 1077 -128 -1622 -2629 -2692 -1465 452 2236 2685 1961 619 -688 -1529 -1765
2887a765J93M97Q72J256J171M92p33j913j956j069L52J385J606J102L50j11n06
2904A223p44j049j151p35M13J438J888J354J36j024j786j517o80K41O00Q32R78
2921D17R88P82M7r23j629j678r12O88J802J811Q42j09p66q61r39p84p12l40N79
2940a697J427J918J170j75j407j828j329l52O47R72R93P87N00L54k90j210j657
2957a177j288l11R50J705J759Q70l72r40j169r18n27l14J88Q18J134J436P61l84
2975B221j462k075j304L6R69J404J136O02K86k06n14r39j394j166j27J206J968
2992F41J600M17q07j413j306q55j62K37M32R90J337J096K96p97j559j654j046
3009b553K11J250J610J032L11k75o21p88j025r05n27L04J216J739J531L12j035
$$ plain form
2887 -1765 -1572 -1075 -203 1053 2224 2716 1983 70 -1886 -2955 -2603 -1218 388 1490 1840 1729 1223
2904 1223 479 -570 -1721 -2456 -2043 -605 1283 2637 2773 1749 -37 -1554 -2234 -1993 -1393 -561 417
2921 417 1405 2187 2234 1311 -318 -1996 -2908 -2220 -418 1393 2235 2126 1360 499 -440 -1224 -1936 -2276 -1697
2940 -1697 -270 1648 2818 2643 1236 -592 -1921 -2273 -1626 -654 339 1126 1626 1980 1690 480 -1177
2957 -1177 -2465 -2776 -1826 -121 1638 2508 2136 1196 27 -891 -1418 -1732 -1544 -726 408 1844 2605 2221
2975 2221 759 -1316 -2620 -2584 -1615 -211 925 1527 1813 1607 1093 154 -1240 -2406 -2533 -1327 641
2992 641 2241 2658 1851 438 -868 -1723 -1885 -1648 -1216 -226 1111 2207 2503 1706 147 -1507 -2553
3009 -2553 -2342 -1092 518 1550 1861 1586 965 177 -848 -1753 -2280 -1976 -760 979 2510 2822 1787
3026A787j681j494o34K85O24P69P58P42O90Q9p73j602j718p05P09J575J772R38
3044B131J8o37r07q40p14p49l24N46J352J519J001o5j160j802j353l89O26J097
3062f50R97P98N94J59l04r03j452j354o10Q26J777J774P34l87j048j199r17m02
3080a567j10K57O48J256J392Q59m50j497j864j262j11R51J357J033N31J31j74
3097A380n70r50j295q29P6J087J645J574N81o84j290j417q08k63J46O49Q25R66
3115H23Q60M24n11j384j704j035K00J316J602J102L43l60o77p80p73q88o64M5
3133b061J221J745J342K25r38j525j378n93K01P59Q00P80P94O32m0q55j486j533
3151a910p33M45J440J681J002k0o01q89q84p17l84p5M87J126J407J120O6j311
$$ plain form
3026 1787 106 -1388 -2022 -1737 -1113 -344 414 1156 1846 1935 1162 -440 -2158 -2863 -2154 -579 1193 2131
3044 2131 2149 1512 605 -235 -949 -1698 -2022 -1476 -124 1395 2396 2331 1171 -631 -1984 -2373 -1747 -650
3062 -650 347 1145 1739 1898 1594 691 -761 -2115 -2725 -1899 -122 1652 2386 1999 951 -248 -1165 -1567
3080 -1567 -1677 -1420 -772 484 1876 2735 2285 788 -1076 -2338 -2449 -1498 -141 892 1423 1554 1380
3097 1380 810 -140 -1435 -2264 -2188 -1101 544 2118 2699 2015 725 -692 -1500 -1763 -1617 -968 -143 823
3115 823 1683 2107 1596 212 -1492 -2527 -2327 -1011 591 1693 2036 1676 999 219 -554 -1442 -2106 -2061
3133 -2061 -840 905 2247 2472 1534 9 -1369 -1962 -1761 -1002 -202 578 1372 2004 1964 1109 -377 -1910
3151 -1910 -2643 -2198 -758 923 1925 1905 1304 415 -469 -1186 -1570 -1645 -1158 -32 1375 2495 2561 1250
3169A250j786j405l69N47J021J099O49L01J96j65p19j410j255l29P95J639J593
3186A652P34l09j035j217r01m51j39J56O96J157J209O85k48j195j734j169j34
3203b243Q54J358J091N54O8l56o16r10r67r01j87Q77J599J608O13n25j306j339
3221g28q25p2M10N43P03Q09Q59M80n81j441j682r61J42J232J510J086K77l41n46
3240H74o56q52p87l96K89J016J411J217L32r27j479j415p00K69O94Q60Q62O52
3258A264L52K5n64j189j481p63M16J392J591R38k2p59r58q81n22l82q6K86J116
3277b27J434J025oj113j471j341m29O28R31R53O52L00J78l08q86j179j027m01
3295b287O73J420J522Q95k63r47j154q19m71k0L89N65Q60R67P34j61j200j673
$$ plain form
3169 1250 -536 -1941 -2310 -1763 -742 357 1006 1307 1503 1338 619 -791 -2046 -2375 -1580 59 1652
3186 1652 2386 2077 1042 -175 -1076 -1527 -1666 -1510 -814 343 1552 2237 1989 794 -940 -2109 -2243
3203 -2243 -1389 -31 1060 1614 1682 1326 710 -200 -1167 -2068 -2255 -1378 221 1829 2442 1917 611 -728
3221 -728 -1553 -1625 -1215 -672 31 840 1699 2179 1598 157 -1525 -2486 -2344 -1112 398 1484 1761 1420 874
3240 874 218 -634 -1421 -1817 -1528 -512 899 2116 2448 1521 42 -1373 -2073 -1804 -1110 -250 612 1264
3258 1264 1616 1641 1077 -112 -1593 -2356 -1940 -548 1043 1981 1959 1200 242 -639 -1161 -1543 -1629 -1343 -227
3277 -227 1207 2232 2226 1113 -358 -1699 -2128 -1500 -569 384 1036 1336 1514 1206 320 -859 -1886 -2287
3295 -2287 -1614 -194 1328 2223 1960 1013 -141 -960 -1431 -1451 -1062 -497 363 1330 2064 1903 703 -970
3313i70j233j54R03J384J166N20j24l78m63p36r35p85k04Q72J502J367N33n34
3331A731j334j276p47J5L69N67P00Q69P67K29m79j157j440j028J33J077J422R63
3349A381L26l28o88p40p37n77k92R2Q87J411J226L71p64j400j360p12K31P13R05
3368e5N82M70M46Rn68j215j274o27M26J208J535J031K8p12r60p61o07m38j7N17
3388i82R42J151Q07J10r38j513j235l89M89R58J106P20K37j25m00n40j045j018
3406a665m07N26J376J412Q24j58j009j226q76k09J66L35M70Q33R72O33k41j121
3424F35j457j146j89Q17J294R45N02m8l24n54p25q32n51p5P07J275J370N73m99
3443A718j126j275q12j42M12O48P38O07N77K71k91j089j425r10J14R97J388J129
$$ plain form
3313 -970 -2203 -2357 -1454 -70 1096 1616 1492 1114 651 -85 -1020 -1805 -2009 -1137 365 1732 2265 1731
3331 1731 397 -879 -1626 -1611 -1242 -675 25 894 1661 1890 1411 254 -1186 -2214 -2081 -1004 418 1381
3349 1381 1707 1379 691 -49 -786 -1363 -1655 -1563 -676 735 1961 2332 1568 168 -1192 -1904 -1673 -960 -55
3368 -55 527 997 1443 1452 884 -331 -1605 -2232 -1806 -598 937 1968 1996 1284 324 -437 -1044 -1482 -1499 -982
3388 -982 -40 1111 1918 2028 1090 -423 -1658 -2047 -1558 -600 506 1226 1463 1338 938 398 -647 -1665
3406 -1665 -2072 -1546 -170 1242 2066 1908 899 -327 -1203 -1412 -1246 -911 -441 392 1364 1997 1756 635
3424 635 -822 -1968 -2157 -1340 -46 899 1401 1353 1029 475 -250 -1082 -1633 -1708 -1001 274 1644 2217 1718
3443 1718 592 -683 -1495 -1637 -1225 -577 161 768 1345 1616 1325 236 -1189 -2099 -1985 -988 400 1529
3461A529K84m45p50p43n16n87l76J09Q84J310J080L02o43j397j302n39K65P57
3479g78P55P04M37L70j12o52j030j097o87L09J192J395R63N8o85q88q97n66m9
3498a258J45L43O83J070Q81O3q44j420j253m61M77J118J002N88J38j25j91n92
3516C64r37r51l34N05J221J368P94k51r81j115p75k60L4L62O09P63Q54N01j55
3535A616r44j366j073k60P51J196J086M99o3n08o10o20o36n72j43O04J264J310
3553A531N69l70j179j310q06L9N55N84N51O33M64K17k68j067j272q57L4J000J358
3572D06J010K37l47o46p51n88n10j91J77P14J080J123K97p16j231j217n69J30
3590a592P11R72P02L02J83j19l76r34j120o23J69J127J343R71P8p02j037p68l57
$$ plain form
3461 1529 1813 1368 618 -125 -641 -1228 -1604 -1495 -611 699 1779 2081 1438 41 -1261 -1800 -1535 -778
3479 -778 -23 681 1118 1488 1376 724 -306 -1403 -2090 -1781 -589 806 1769 1827 1142 254 -643 -1209 -1258
3498 -1258 -1113 -770 -87 983 1864 1927 1083 -337 -1590 -2051 -1574 -456 546 1134 1272 1147 956 364
3516 364 -573 -1524 -1858 -1353 -132 1236 2030 1779 798 -317 -1092 -1352 -1318 -956 -347 416 1270 1771 1616
3535 1616 672 -694 -1767 -2027 -1276 -80 1006 1505 1442 934 324 -296 -932 -1504 -1647 -1043 221 1531
3553 1531 2100 1730 551 -759 -1565 -1526 -971 -387 164 797 1261 1478 1210 143 -1129 -1986 -1952 -952 406
3572 406 1416 1653 1306 660 -91 -679 -1189 -1380 -1203 -489 591 1714 2011 1295 64 -1153 -1722 -1592
3590 -1592 -881 91 793 1095 1278 1159 783 -151 -1271 -1894 -1725 -598 745 1716 1794 1092 55 -713 -1070
3609a070j39L1M44P37R59Q10J34q21j346j267m27M98R95R22N76J70j8l90o54q69
3629g25p22k61M48J180J256P46j60q75j121q91k35J02N19N01N93P35M28r5q74
3648E49j175j108k42P44J267J036M59j78n16n38n43o29n44r5N51J162J146N65
3666A911l22j164j215o60J2M37O92O39N85L68Q5l08r39j125q34L5R07J157J031
3685A292L48l67p98p54n30k68q4J30O08J013R80K96n59j141j303o96K61Q52Q69
3704A49N51K77J94j05m74q17r78n43K70R34J357Q77J2o94r30p76m13j29J99M11
3724f28O47Q04P01R6o90j239r83m37L13R60J007O73Q3k87m67n04o89o73l15L38
3744a290J106J144Q39r6r02j095p92k12K95M42M92N15N73L88r4p95j152j059j65
$$ plain form
3609 -1070 -1209 -1178 -734 3 962 1772 1906 1085 -261 -1528 -1955 -1457 -462 460 1036 1206 1188 798 144 -725
3629 -725 -1447 -1708 -1260 -80 1176 1922 1762 887 -234 -1125 -1360 -1258 -739 -238 355 1090 1518 1423 549
3648 549 -626 -1734 -1976 -1232 35 1071 1530 1352 836 298 -245 -874 -1418 -1513 -962 200 1346 1911
3666 1911 1589 425 -790 -1450 -1438 -1001 -309 330 915 1283 1368 1060 121 -1004 -1838 -1803 -896 261 1292
3685 1292 1640 1273 475 -279 -809 -1077 -1161 -1031 -423 590 1570 1866 1307 166 -1137 -1833 -1572 -720 149
3704 149 700 977 1171 1066 592 -225 -1203 -1746 -1476 -542 815 1692 1704 1010 80 -696 -1109 -1238 -1039 -628
3724 -628 19 823 1524 1620 930 -309 -1292 -1729 -1416 -456 551 1224 1307 1020 553 49 -640 -1313 -1628 -1290
3744 -1290 -184 960 1799 1703 801 -294 -1086 -1298 -1003 -561 -69 446 1019 1407 1313 518 -634 -1693 -1858
3763a858O72J141R03N28r8m69n39o34n05l35n1N18J026J005M74l75j004j110p53
3782a464p6N22P71N98M34L19J17k50p54j053p42m3O95J311R92K85m85q79o60m21
3802g83l08p0K16N97Q69Q48M06n44j153j142n23K52P50P43O12K80j1j70n19o70
3822c20p92n15K39R26J155P76J92n86r38q42l12K5K00L47N57O88N59Q2o33j126
3842c18j039m30M41R95J005M91L6k35m01m99n34o40k43K96R33J077P05j42r02
3861E96r94o91k25J85N22O05N01N24L12j19p65r88r04j16N11R97R60M88k11o01
3881E87n90m73l34l14M2M53Q50R66M40j95j003j062p63Q8N41O42M16M47K23J3
3901I74k57p17q77o82P5P45J198Q36J68l53o82o53n01k31k0K11N03P77P09J97
$$ plain form
3763 -1858 -1186 -45 858 1386 1288 819 280 -354 -859 -1194 -1245 -727 299 1304 1778 1403 399 -711 -1464
3782 -1464 -1540 -1018 -247 351 785 1104 1221 971 217 -836 -1578 -1621 -926 385 1377 1662 1177 298 -362 -783
3802 -783 -1091 -1161 -945 -348 521 1369 1775 1231 78 -1064 -1587 -1335 -585 158 770 1050 1039 869 350 -320
3822 -320 -1112 -1627 -1388 -462 693 1469 1661 1075 137 -705 -1017 -992 -792 -445 112 800 1359 1441 808 -318
3842 -318 -1357 -1787 -1346 -351 654 1145 1181 946 545 46 -488 -1128 -1371 -1075 -142 935 1640 1498 596
3861 596 -398 -1089 -1314 -1129 -607 -2 499 1023 1335 1216 451 -537 -1441 -1557 -1046 -49 911 1399 1188 587
3881 587 -3 -476 -810 -1124 -1082 -629 221 1187 1627 1432 429 -633 -1396 -1308 -767 -125 291 738 961 974
3901 974 717 0 -877 -1559 -1484 -739 459 1295 1463 1110 428 -225 -726 -957 -977 -766 -263 514 1223 1420
3921A420m19r43r70n87J42P28Q79O16J91j06j61l75o54o90m91K14P01J081Q10
3940A386J29o49r11o80l08P3K49L72N47N75M92P3n61j023j013l39L94Q71Q81M33
3960I91O8l46l59m81m13m73k05L80Q26R07N61p3o47j004p57k54L78M59M83M27
3980D68L35K54j28n72q79p36k26N01J032R46L46k51n50n67m58l13k03k1M21P63
4000A62Q56M06k42q96r36n92M8M73O10N62L55J08J5k33p28o87o37M6N63J004P84
4021A041L70l61p77o35m36n0N3K42M41O51N64K07l42q79j025n18J79P19P38N30
4041G12K20r9k13l81m94n39m11J04P73J039N86K3m81r04o61k74J09K24L66M44
4061A43M97M12M5m72q76p47l47K33Q46Q43M56ml55m81l77m00l07j68K41O95Q54
$$ plain form
3921 1420 1001 58 -912 -1499 -1357 -629 250 866 1057 951 790 415 -239 -929 -1420 -1206 -505 576 1386
3940 1386 1515 866 -45 -725 -1033 -960 -711 -339 208 783 1275 1348 787 -236 -1249 -1588 -1194 -323 558 991
3960 991 1059 713 354 -127 -540 -1013 -1218 -838 -12 895 1456 1383 736 -268 -1025 -1279 -901 -442 41 468
3980 468 803 1057 929 357 -522 -1258 -1484 -983 49 995 1341 1090 540 -27 -485 -798 -1001 -1022 -601 162
4000 162 1018 1424 1182 286 -650 -1242 -1194 -721 -111 451 806 914 929 696 -32 -719 -1356 -1310 -747 257 1041
4021 1041 1411 1050 273 -362 -798 -848 -795 -553 -112 539 1103 1310 968 89 -936 -1454 -1275 -556 182 712
4041 712 932 833 620 239 -255 -794 -1205 -1101 -328 711 1297 1320 839 -65 -726 -1000 -891 -667 -301 143
4061 143 640 1052 1097 625 -251 -998 -1345 -1112 -266 577 1033 1029 674 193 -184 -584 -891 -1059 -818 -123 731
4082G31O47q3p11q90o58r8L05M51M64K92K61K63j85m55q20p42j47N43Q49P90L66
4103A173j46n02n57m25k36j54P8L59O38O65L19k14o50r45o28O0M09O74N17K45
4123F80J18r8j90m53o56m63r4M88R24Q31J62l97n89o41l61k2M7K19L88N25N25
4144I43K35l14q08q71m18J71O16O31N55J06j26k73l24l98n04k87J53N73Q33O82
4164A175O6m64p96n99l06J31L32L60L57L47K93k6l19p73p78l17K87Q20P49L89
4184I28k0l06m10l70l59j49j54J52O25P48M70p7o32p76n49j45K59N50M26K73K59
4205G43M1j14m61n79o23j15L32P16Q00L37j50n33n13l88j73l2J36K38M86O33L89
4226A170j87o19q98n60J4N00N89M03K43pj08j67l80n21n07K2N25Q05O36J59k78
$$ plain form
4082 731 1378 1295 584 -306 -964 -1062 -757 -306 158 450 711 974 789 334 -486 -1228 -1375 -832 17 807 1173
4103 1173 1027 525 -32 -457 -693 -847 -769 -410 228 893 1212 998 348 -597 -1225 -1165 -756 -82 435 680
4123 680 798 700 510 57 -599 -1062 -1156 -668 256 1087 1249 852 263 -378 -739 -761 -714 -495 -107 418 943
4144 943 1178 864 56 -815 -1233 -1062 -446 185 740 846 720 447 123 -275 -779 -1066 -913 -340 493 1175
4164 1175 1241 777 -19 -618 -924 -793 -461 -101 256 603 896 870 551 -222 -1000 -1317 -1030 -210 539 928
4184 928 908 602 192 -178 -537 -686 -840 -688 -63 685 1155 1078 446 -330 -879 -1024 -765 -215 211 484 743
4205 743 784 670 209 -370 -993 -1108 -776 -60 740 1077 927 394 -119 -507 -680 -712 -576 -338 148 781 1170
4226 1170 983 364 -534 -1094 -1080 -580 9 412 655 648 540 373 -7 -528 -1035 -1013 -488 317 953 1112 834
4247H34o23n86k87p3J72J87L34M60M12J64k78o98o47m93J69N60P07M07Q2j22l05
4268C76l40l10l16k84M8M42Q20N94K1l92p28o08j37J56K98K93L19K88K38Q7l46
4289E19p19o53k41K50O50O43M27l1l22l55l27l16k20qJ87N25O11L64M5n44p52
4310b67n31j83K94M49M31K62J84Mj37l15n34n23k21L60P91O65K22j75m38n11k75
4331d48j78KJ05J76M98N77K64k02n37p25m39p3M67N61L77K43q6p1k61l47m62l23
4353h82Q9L46O16O08J98k71n74n36k76O2J76K12J92L90L17J11j73n70o64l81J06
4374i04N53N95M36pj55k53j84l49k99j91N0M83O31M68P5l66o94m81k07J47K53
4395c99L21L28K37J58L6k94n59m61l17J64N89O67L49q2l21l76l42k16p9L5J24
$$ plain form
4247 834 211 -375 -662 -735 -563 -376 -42 418 830 994 716 18 -629 -1122 -953 -393 314 721 803 681 376
4268 376 36 -274 -590 -874 -826 -384 436 1030 1051 659 -69 -677 -814 -658 -360 -67 252 540 778 865 519
4289 519 -200 -853 -1094 -844 -194 449 876 845 523 168 -159 -475 -695 -703 -516 9 620 984 1029 485 -267
4310 -267 -798 -981 -687 -238 193 455 639 643 506 191 -343 -866 -1087 -727 64 729 951 776 338 -173 -448
4331 -448 -626 -624 -519 -343 155 732 996 794 257 -468 -907 -980 -513 48 425 668 582 511 250 -97 -559 -882
4353 -882 -793 -447 169 777 975 704 130 -406 -682 -620 -444 -232 -40 350 667 778 605 35 -629 -1010 -904
4374 -904 -351 244 680 673 518 265 81 -268 -567 -758 -708 -225 406 874 949 583 -111 -592 -799 -652 -399
4395 -399 -78 250 487 645 681 387 -172 -633 -950 -786 -197 470 819 737 416 40 -302 -518 -597 -562 -438
4416d38L52O19L95l8m46o72n51m8K81L38M48J37J32L0j27k72n17m30n1K91O15
4437D8N43L05j49m48m97k28j45J5J14K66L70M06K04j47m55n98m35k8L85N12M35
4458D73J32m2j32k00l12l16l16l1L25O23N48Q5k55n13m82j30m1J67K73J29K87
4479B72L85R6k83n35m93l45J41M11O08L26M0j17l13k79k02k13q4Q7L86M28M60
4500G76N5k75o17n03j36J25K77L33K06J38J59n9j25m86m74k02J92N46N11K83j1
4521G13l35l34l29n1j13pQ7L50N04K33n0l88m86m41j10K63M40L16J00J15m2o0
4543C75l27l34l28j08J83N35N24J92j03l89m10k14q0Q4J36J72K47L09K67j55m16
4564A60n14l96j2L39M66L62J20q6j00j88k63k75j95N5K41M79M25J70k33m69m27
$$ plain form
4416 -438 -86 533 928 890 444 -228 -779 -827 -546 -208 240 377 509 539 412 140 -377 -807 -858 -567 48
4437 48 591 896 747 299 -198 -426 -571 -556 -442 -176 194 600 804 657 202 -396 -831 -859 -474 38 473
4458 473 605 563 431 231 -81 -397 -713 -744 -419 204 752 837 582 69 -413 -543 -584 -417 -144 -15 272
4479 272 657 753 470 -65 -558 -903 -762 -351 257 583 623 506 193 -86 -288 -501 -585 -498 -112 316 776
4500 776 831 556 -61 -564 -700 -575 -298 35 241 379 538 479 354 -132 -606 -808 -616 -70 441 724 713
4521 713 378 44 -285 -336 -449 -456 -369 -19 485 718 668 280 -206 -647 -757 -494 -54 262 362 477 435 375
4543 375 48 -286 -614 -722 -539 -4 520 712 609 220 -190 -404 -484 -400 -264 -92 155 464 731 576 160
4564 160 -354 -750 -762 -423 43 405 525 439 339 151 -112 -387 -582 -527 -286 193 618 788 555 86 -341
4585c41k29P0J68J72K67K35J31P5j53m10m09k93O3M28M21L16O7j40k90k67j01
4606b20j52j42P2K74M36L37J35l21n16l44j40Q0L29K29J31J50Q1J1j88l80l56
4627d94j78J37L87M69K46N7l42k79j77j49m7NJ21K69K92K63L2l62m79l66p0K30
4649d35L57L39J96j10k6j01j45k73k73j18K16M08M22K02j91l08l96j41%M9N5K43
4671c0K53J92J89j09l56m32k59n3K65M40J99J35m7j66j30k33j49k07N7K08L64
4692A31L60J28j86l70l45j91O3J75K09J40J01J50Q1j26l45l83j63K0L47M37J98
4713D31N9j55k45j95j19j00p6L9K64L78K43K0j91m04l84m0R3J88K44K31M9nj4
4736C11j72k34k92j59Q1L94M07K16r8j63l44j40j40K4O4N8K10L01K01k9k63l71
$$ plain form
4585 -341 -570 -500 -332 -160 107 342 473 548 395 -15 -424 -717 -654 -226 195 511 578 438 148 -119 -220
4606 -220 -372 -514 -442 -168 268 605 740 419 -97 -441 -581 -501 -172 57 188 338 419 430 242 -138 -494
4627 -494 -672 -535 -148 321 567 624 282 3 -174 -323 -370 -365 -244 25 317 580 612 250 -229 -595 -665 -435
4649 -435 -78 261 457 347 321 220 75 -198 -471 -589 -373 35 457 659 468 160 -236 -377 -377 -328 -273 -30
4671 -30 223 415 604 495 139 -293 -552 -605 -340 100 299 434 387 221 91 -142 -291 -498 -441 -233 131
4692 131 491 619 433 63 -282 -473 -410 -235 -26 114 215 365 446 320 -25 -408 -571 -551 -204 233 431
4713 431 490 335 90 -105 -224 -324 -400 -361 -97 281 524 544 353 -51 -435 -475 -382 -194 50 281 330 325 311
4736 311 139 -95 -387 -546 -465 -71 336 552 454 291 -53 -193 -333 -309 -245 -187 23 324 525 496 233 -138
4758a38l78J5J55K91K66J09nr4m5j74j57k22p6J68L11L32J64o4l23l10j55n0O4
4781c16J56J86J12J78L1l1j55l88k18j6K53L05K29P4r8j67r2j83o3j94JK28K41
4804G3L45J23j56l40l39q9K2J83R4J48R4J40L6j16k27l02j55N9J97L28K51j0j13
4827B46j82j40j03q4k1Q3J04K68K58K4j88l16k44j51P1K65J90J62%O9j43n9j43
4850c4k86r7P5K81L01J88m7k14j99j26q2j4N8Q8J31J58J45N9j72l01k47o5J72
4873b28K14J16J48Jk9j12j44o9j25j28J20K76K51J20q3k28j81j77RP6J35N4J17
4896A33Q4J11n3j88k63j90l6J55K29K61O1n4j58n1r7j04k9o6J43J81K11R0o8k07
4920I5l02r6M1J25P4J61N3Q6oj24r0k12j19PK14K26J40N2o9k00j21p0m9n2J5J65
$$ plain form
4758 -138 -516 -501 -346 -55 211 320 315 221 176 2 -155 -377 -453 -285 26 358 522 458 135 -175 -330 -380 -316
4781 -316 -160 26 138 316 347 316 161 -227 -445 -461 -208 97 326 400 302 135 43 -140 -203 -397 -396 -168 73
4804 73 418 541 385 45 -294 -383 -361 -178 -84 64 158 298 334 218 -9 -311 -466 -407 -210 118 369 359 246
4827 246 64 -76 -179 -263 -284 -201 -97 171 429 453 265 -51 -295 -446 -375 -110 80 242 242 311 168 109 -34
4850 -34 -320 -417 -342 -61 240 428 381 167 -32 -158 -240 -254 -196 -108 23 181 326 385 213 -88 -335 -400 -228
4873 -228 -14 102 250 251 222 110 -34 -103 -228 -356 -236 40 291 411 328 100 -81 -258 -249 -173 -38 16 133
4896 133 217 328 275 87 -176 -366 -402 -247 -18 243 304 250 92 41 -56 -160 -189 -255 -112 69 280 370 302 95
4920 95 -207 -303 -262 -137 -63 98 151 237 231 107 17 -195 -314 -307 -93 133 273 325 256 56 -65 -135 -184 -236 -221 -56
4946e6J65J98J2q0k73k13q3J33J44J56K6PRL5o6j37j92r5K0J88K89P5j6l5k29
4971a8r4o3o5M8J23O7J33J25mr2k03k10o7J20J59J34J17on1j20M4j97j08k4n0
4996c02K53K17J41J2k73j35r3j5L7Q0J14K1J08K6Nj09j99j35n6J64J43J30Q0l5
5020A79p2n5j03o8n8j9R0J00J88J03p5q9k22j16m6J56P2P3P3O7M3p0j26j30j55
5045b60K8N4K56J48K5j05j16j04l1nrn5O1J93R5P5o1j98r4j59R5P3J08J20Rj7
5071A26K2l7r1j48r8k3J52J72J36M1j36p3j81NPN6m4P9J09J11N3p2j45j54q3j8
5097b34J96R5M4J4l8kk8p5j10o0PJ28J14J14L2m4j32j37om8R7Q9K1N6L9Rm9j44
5125e2l4q2L7R0J77M6J9j08n7l7p6k4o2J17m5J93J18l9r0j55j03L3N7j1O8N2N4
$$ plain form
4946 -56 109 307 319 239 -34 -247 -330 -197 -53 103 129 136 145 180 114 -23 -215 -310 -290 -102 187 262 246 211 -18
4971 -18 -112 -175 -240 -192 -69 -2 131 256 252 160 -43 -253 -320 -200 -41 93 210 204 153 33 77 -120 -228 -252 -302
4996 -302 -49 168 309 321 48 -87 -180 -195 -158 -78 36 57 165 191 196 87 -112 -247 -303 -139 4 134 214 179
5020 179 107 52 -51 -119 -177 -196 -106 -6 182 285 210 121 -101 -217 -263 -107 -35 38 111 178 221 151 25 -105 -260
5045 -260 -232 -178 78 226 251 146 30 -74 -105 -110 -119 -174 -113 80 175 250 189 -9 -103 -262 -167 -94 14 134 143 126
5071 126 148 111 20 -128 -226 -249 -97 75 211 252 116 43 -138 -133 -126 -70 -114 -35 74 185 238 166 21 -133 -216 -234
5097 -234 -38 57 101 115 77 75 47 -28 -138 -198 -191 -63 51 165 197 153 21 -116 -122 -170 -73 16 37 93 132 141 92 -52
5125 -52 -86 -168 -131 -41 136 182 201 93 36 -1 -77 -101 -163 -46 -91 102 220 181 91 -64 -167 -134 -77 -88 -20 32 86
5152H6K2P7r9j07j39o2P3J94M8R5j5p6p6j36K9ql2NJ30Q7J37q9j4k14r1o5J92
5179d8N9J6Q2m0J5l5j9r9p5l7M5O2J72Q0n0r7q2l8qM1n2PQ8J23k3Mo6q1n8n7O2
5210a09J14J08oj7j4j5k4n3j20j0N8R4J44Lj7r9r6o0L3M4l7J06J4O7jk4r4j1j58
5239a80K5O2R4R7LJ3j33K6j0r0Lo7N2J24J11K4p6o0j09Nk9Q5%O9J7L2L1L5j32
5268B2q0n4o0R4J15O2K8k0j12Kj01pM6m4N3Q2J06K7l6j33p1n2j0N7N5P5L9K8j7
5297I4Ko8j58j1j8J46J24J1OL7j49n7l9pl8O0M8P7L0Q4o5n2j13p6PP8P4J7O7k1
5327I0Nj28Qr1k3JJ11J24K5J0n3q2J3j13K6J1L0L0Q6J8L8k9j44k9j35Q8J45pK9
5356E4N2pk7p8p2mo1M1P6J26lK1oj41n1kpO1R%N7M3L1o8m2r8j2n3J51M9J03l2
$$ plain form
5152 86 108 185 86 -21 -160 -222 -149 45 93 188 173 97 21 -115 -86 -94 -126 -121 9 96 233 144 130 -84 -175 -240 -48
5179 -48 11 27 109 69 84 49 30 -69 -144 -181 -136 -74 98 178 128 31 -51 -89 -97 -56 -108 -101 -13 110 87 91 25 -56 -114 -171 -109
5210 -109 5 113 107 90 76 61 37 -16 -136 -146 -88 6 150 153 136 37 -59 -119 -86 -42 -79 27 41 108 107 83 -11 -22 -180
5239 -180 -155 -93 1 98 101 114 -19 7 -3 -93 -90 -157 -105 19 130 154 78 18 -91 -86 -115 -30 -30 39 56 88 119 154 22
5268 22 -58 -112 -172 -78 37 99 127 107 -5 -3 -104 -111 -65 -109 -56 26 132 159 123 -10 -81 -133 -143 -86 -31 44 83 111 94
5297 94 96 28 -130 -141 -159 -13 111 122 128 165 16 -41 -80 -87 -125 -65 -17 60 90 174 109 57 -56 -132 -125 -47 27 44 111 90
5327 90 95 -33 -25 -116 -139 -138 -27 97 122 132 79 -3 10 -103 -77 -66 -36 -6 80 98 136 107 -37 -66 -201 -113 32 25 54
5356 54 106 99 72 -6 -78 -82 -143 -102 -26 100 97 118 112 -29 -80 -82 -89 -28 -19 -19 38 81 112 44 2 -96 -108 -161 -10 39 142 110
5388A10j00M6r9K3n6o8K5J00R7N2N0j16r9j00M6k1K4Q4k5J54q7M2m7q6q2J6j4
5415a31J01J02Nl7P6j08l9m2J5l0K3L6J36pK9o2m4j75nL4O3N1J04N9n2L5p8r0
5443c1j21j0M9J21P2O2j5p4l4r0k9Qj8L6J01M2J01m0o9q2j81L7L5R1J04l9R6j0
5471A12m8p3l0r8l7M3J61J30K1k5j13p0p3o0N9L5O6O1L0Q0l9j25j42o8M4K5J72
5498C8L8J26jj29n6p4l2k7j8P0J20J09M1n3r3j25j05O2nJ07P6L0M9j9o8n4q8j17
5526a98m4R6J83J50O6j57m5n7j16L1m3M9R5R1J04oo6j39j34n4%P0J59K8K5K3J6
5553A27j09m7q8j29O7J54J22J10m7jj41q1j04k1R5L7L2J46Q7l6o3j49j57l3N5
5578a74J27Q2J16J6q2k6q3q8l6pj1J35J40J22Qp8j36j88pJ1L3J15N0Q7O2oj42
$$ plain form
5388 110 10 56 -43 -20 -76 -144 -119 -19 78 130 180 64 -35 -135 -89 -110 -86 -2 -27 127 40 82 35 -51 -133 -117 -131
5415 -131 -30 72 77 40 116 8 -31 -73 -58 -88 -65 -29 107 100 129 67 23 -152 -157 -123 -60 -9 95 154 102 137 59 -31
5443 -31 -152 -162 -113 8 80 142 127 53 19 -71 -100 -92 -110 -74 27 69 170 130 61 -21 -202 -165 -130 -39 65 26 122 112
5471 112 64 -9 -39 -137 -174 -131 30 160 181 156 43 -27 -100 -160 -101 -66 0 61 91 171 132 7 -135 -203 -159 -134 38
5498 38 76 202 201 72 16 -58 -90 -117 -135 -65 55 164 205 152 59 -66 -171 -109 -114 -7 69 99 148 129 61 7 -81 -198
5526 -198 -242 -146 37 187 253 96 51 -6 -122 -91 -134 -85 10 101 205 199 133 -6 -140 -194 -194 -124 35 63 88 111 127
5553 127 18 -29 -117 -246 -179 -25 97 207 160 159 18 -63 -167 -188 -93 -56 -24 122 209 173 110 -39 -196 -229 -174
5578 -174 -47 35 151 167 85 59 -24 -112 -148 -155 -166 -31 109 231 239 161 25 -163 -170 -159 -126 -11 39 126 188 182 40
5605D0j18j26k6L6J63J48J03l0o6r3j21j7m6q6J04J76J35R0m5j30j76j79L6M6
5629a82J65K4R1R8Jr6q3r1j41j6Q2J97J07P5r5K9k01j08m5M2k7R3J89P0M6n0j13
5656F1k46o5k3J78J24P3M9L3n5l1r6j51n6n3R9K57J72j1j32j16q8r2m8J56o2J22
5682aJ42P3N1j72j56j38j32J15J56J31J53J1p5j06j10n3r1l9K5J02K58J57L3j57
5706A77k45j09j02R0J02N5J08Q9K0l0m6j90j10j59J16J90K04N3oo6j25r9j12j6
5730b11J7Q3J81J27Q7l9j54j89j59p5J21J51J26R4M5K3j03j36o6k11K4R4K22J53
5754B05J09pk10k10o1k4M2K9N7J83J17N1j5k23j92j30k1J05K03J34J05Nj17n5
5778H0j32j14j89J03J33K26J48P0q3j51k78k9n2Q0P4J53J05J32k4o3k32j94q7
$$ plain form
5605 40 -78 -204 -230 -194 -31 117 220 190 124 31 -90 -107 -153 -239 -135 41 176 266 221 91 -85 -264 -228 -182
5629 -182 -17 7 98 196 197 101 18 -73 -214 -230 -148 49 156 231 136 165 -36 -144 -189 -147 -174 -81 108 178 224 174 61
5656 61 -185 -250 -273 -95 29 102 151 184 129 98 2 -149 -205 -258 -159 98 270 259 127 11 -77 -169 -217 -61 -123 -1
5682 -1 141 214 265 93 -63 -201 -333 -218 -62 69 222 233 158 52 -58 -111 -202 -241 -216 -114 144 301 334 177
5706 177 -68 -177 -279 -189 -87 -32 76 165 185 155 109 -81 -191 -350 -234 -44 160 213 207 141 16 -83 -195 -211
5730 -211 -194 -111 70 197 284 245 91 -98 -257 -332 -211 -60 66 160 205 228 125 -11 -77 -288 -264 -170 52 205
5754 205 314 307 97 -113 -174 -198 -156 -127 -70 113 230 281 266 43 -149 -279 -300 -195 8 142 247 252 135 80
5778 80 -52 -166 -355 -252 -119 107 255 325 242 91 -187 -216 -268 -188 -114 39 144 276 252 189 -43 -237 -324
5801c24kJ99K40J79m3l9j20p0j37r9j0mJ64K28J55J3j08k31k33j05Q9J03J28J02
5825G5J11Q7k5j44j53j89p9O0J99K44J22j5j19j91j05j69L6J20j0J53K28J08q7
5848B57j23k56j71l5J22J28K73j5Q5n4j31p1k08r9l8J06K77K39M9m0j57k42q1
5871a85k5J1M6P2J78J39N2o1j12k40k26j1J78K85Q2J07n6l5r7k12r3n4q2J76K48
5896H5K27R8j23k66k65j40O6J99R8N3J03J94m1j46j67l13o2N2K15K24J84R4j78
5919A91j45j21r6m9p2O5K19J97J40L4j88k09k10j29L9K10J37J41Q2K0k8j36k00
5942a08k46m2O9K42L18P2K3j28k62j24q9O3m5J17J71K41R9m5j72l01j61r2J43
5965b57K10K14J58p1K2r0j61j99k02M8J29J62L45J29p0k31k38j28j7k2J38J56
$$ plain form
5801 -324 -326 -127 113 292 249 210 90 20 -117 -216 -226 -230 -66 162 317 330 222 -9 -242 -347 -258 -155 -27 75
5825 75 186 273 248 104 -49 -238 -317 -257 -58 186 308 293 174 -17 -122 -291 -255 -135 -145 8 236 344 257
5848 257 134 -122 -293 -328 -206 -78 195 180 265 211 80 9 -199 -298 -336 -230 47 286 335 295 138 -104 -185
5871 -185 -210 -199 -153 -81 97 236 288 227 115 -125 -351 -362 -184 101 183 290 234 199 102 -110 -203 -257 -339 -163 85
5896 85 312 410 287 21 -244 -384 -318 -119 -21 32 135 329 288 142 -25 -338 -400 -348 -133 91 275 369 191
5919 191 46 -75 -171 -220 -292 -227 -8 189 329 363 175 -34 -244 -373 -334 -124 13 154 236 256 228 92 -108
5942 -108 -354 -396 -327 -85 233 305 328 200 -62 -186 -275 -212 -257 -140 31 272 371 326 154 -147 -308 -400 -257
5965 -257 -47 167 325 254 276 186 25 -174 -376 -328 -199 -37 308 437 367 136 -102 -230 -247 -269 -131 25
5987B5R8J10J59j19j91l29j39J0J27K78K63K7n0j30j38o3j76r4O0J63K70J96P5
6010D32j65k65k62q4mJ62J65J37J14R5lj19k18k86j11Q0J64L14K29l7m3k45j89
6033a39q3k5l8P3J13K46K29M2j49k94l04o9N3K70K44K6R9jl9j81j82j79j04J11
6057b81K69K37J17K2k70j43j20l0p1R0J00J53K05O1l5j45l08k92mJ27K77K39Q1
6080B79L5j36n6j26j89r8n3J08L37K20J35j26k06k70k19K3J19J33J21J14J21J03
6102C69j03k42k75j76j2K03K97J99R0r8j59p5j60j21p6K8J56K95K14O4j16k86
6124A6k39j29mJ71J86J50Q6N3Qj38k05k63j70J12K92K51K03M4j62k16k15p3q1
6147c23J01oK22K00K28Qk17k90k94o0L8K59K54R5R2l3p6j20j70k64jN3K97K75
$$ plain form
5987 25 123 233 392 273 82 -247 -386 -376 -249 29 292 319 269 139 1 -62 -238 -332 -272 -109 161 357 432
6010 432 267 2 -260 -344 -348 -186 -21 116 230 325 322 203 -15 -301 -412 -332 -168 146 375 338 295 50 -139
6033 -139 -222 -247 -285 -212 -99 147 376 418 269 -25 -329 -398 -345 -75 169 195 294 293 254 73 -109 -288 -392 -281
6057 -281 -12 225 342 364 94 -49 -169 -199 -270 -180 -80 73 278 339 304 159 -149 -441 -445 -318 -41 198 279
6080 279 314 178 122 -4 -193 -291 -344 -236 101 321 456 330 124 -146 -365 -342 -223 -90 31 145 266 369
6102 369 266 24 -251 -427 -439 -236 61 260 350 252 93 18 -142 -263 -339 -311 -155 140 354 418 302 16
6124 16 -223 -352 -356 -185 1 151 237 290 298 160 -45 -308 -478 -366 -74 177 380 424 262 46 -169 -242 -323
6147 -323 -222 -228 -6 194 422 430 213 -77 -371 -431 -393 -134 120 215 307 274 198 78 -92 -356 -357 -304 -7 268
6171B68J19Rk34j68k45r6kJ63J28J69J22J06Kk32l05k26p5J85L05K27J63p1o6
6194B46j94j50j33j13o0J58K78K85J88j20k97k77j72mJ18J60J64J59J03K8j30
6215B37k01k56k40J3K80K56K48P3r1k07j45j90j2o9O3J58K30K69L3j22l47k27
6237b47k11O8K18K49K8J27J17m0j62j85l13j21Q5K75L06K06J8k01j80j49j79j5
6259c06N2N4K20K06J92j5j52l14l04j22J27K09K91J61j9n1m5j39k02j94r7J58
6281b90K75L30J58l3k44l12j39o8N4O7R9J68K00J35Ml57k74k42j7K44K94K38Q4
6304C74jj95j54j70q8j75N1J35K90L30N3r5k77k77j82KQ7K04J96J05R5K1m3k92
6328fk65k05RK14L52K97K8j40k26j07j77l6n8L3K30K30K46M7j50l07l37j28P4
$$ plain form
6171 268 387 396 162 -6 -251 -347 -349 -186 -58 111 233 339 341 109 -196 -422 -497 -312 -7 220 383 312 246
6194 246 52 -98 -231 -344 -404 -246 32 317 505 385 88 -189 -361 -365 -247 -87 77 236 339 367 237
6215 237 36 -220 -460 -447 -167 89 337 410 319 112 -33 -223 -235 -304 -241 -83 147 416 449 327 -20 -247
6237 -247 -458 -390 -172 77 105 232 349 309 147 -38 -351 -472 -387 -112 194 400 418 217 37 -112 -291 -306
6259 -306 -254 -200 20 226 418 403 251 -63 -367 -489 -362 -153 138 299 280 229 184 45 -157 -351 -448 -290
6281 -290 -15 315 473 440 196 -116 -255 -323 -269 -202 -103 65 265 400 404 47 -227 -469 -486 -242 52 290 374
6304 374 373 178 24 -146 -234 -409 -358 -223 67 397 450 355 78 -199 -381 -379 -292 -88 108 213 308 329 286 -6
6328 -6 -271 -476 -467 -253 99 396 424 284 58 -49 -226 -262 -320 -287 -57 173 419 466 316 9 -328 -456 -382
6351c82J64K85J48J05m5L5j65k34k34j16O2K40L90K25j7j58l17j96j21N5J5J28
6373a33J89J98J54Nk43k70l12j09J78L01K25J29Ko3p0j42k35j83r4K22K55L15
6395C19J79p8k60k76j45r5P4J04J64J27J69M7L2k52l30k27nJ16L74K72J28p4k03
6418A60j27j58r6j15L7P9L31K79J36j59l41k56j69k3J82K35J27Q4J67n6p3k52
6440hk27k38j9L27L72K13j9j13k45k15q3j07M7P0K07K74K31j9j55l63k73j30L5
6463d38K59K91J86P7q0j18j03k36k12k8P9K73L10K04M1k01l58k08p9k2J40J28
6485i5J62J70K20j0k95l03k89r1K21K84K49J78n8q7j33j90j75j82PJ25L66K57
6507C31J74j01k76l19k26J4J51J55J83J44J10Q7o6k91k64k57o8K58L92K63M4j44
$$ plain form
6351 -382 -218 67 215 320 275 310 145 -89 -323 -439 -377 -137 253 478 461 303 -14 -210 -331 -276 -261 -133
6373 -133 56 254 408 413 170 -100 -412 -521 -343 -42 183 312 314 251 181 39 -196 -379 -473 -251 4 319
6395 319 498 420 160 -116 -261 -356 -282 -178 -14 113 282 329 361 109 -221 -448 -453 -337 37 309 437 363 160
6418 160 33 -125 -221 -336 -299 -220 111 390 526 367 26 -230 -399 -422 -240 -5 122 206 373 317 244 -8
6440 -8 -235 -473 -492 -165 207 420 401 288 43 -172 -255 -362 -315 -245 -38 236 467 448 293 -70 -343 -473 -438
6463 -438 -179 112 298 375 295 177 74 -162 -374 -402 -323 -50 260 464 505 304 -54 -262 -341 -363 -223 -95
6485 -95 67 237 457 447 152 -151 -440 -531 -310 -26 223 401 343 256 123 -67 -242 -424 -417 -292 74 331
6507 331 505 404 128 -191 -417 -403 -252 -97 86 230 340 427 361 70 -194 -451 -519 -261 131 394 438 294
6529B94j38k21j01j40q7Q5J76K68K70J38j34l57l10k05N2K24K23J52J42Jl8q2
6551B12l26k18j42L4L00L57K26J10k51k50k23p6n1K6N9J72K67K07O6k01l64l44
6573d10j44J59K48L21J20lM4j66j17k26j91p0M7L35M15J50j0l01k83k45qJ4J74
6596a47J12J64J49J54Nk92k58l29n5J06L57L22J15o3j16j70j71j36q8n5J55L04
6618F3L90R0p7l48l48k08M5J13J91J43J49J77J6m3k64l15l03RL20L32K82L3j10
6641C37j80k54j39p5q3J42J44K69L32J2k10k74l92j61Q0K69K24K03O4J2p4q4k40
6664g8k64j52R5K50M17K86m3k34k98j59j53K0M6J41J91K36J14O1k52k66l76j01
6686e19J18L36K06J84L0r5o7k11j75j43r3J1M11L43K02r7k24l76j68p6J11O6K26
$$ plain form
6529 294 156 -65 -166 -306 -393 -308 -132 136 406 544 410 53 -257 -462 -410 -186 37 189 331 332 294 212
6551 212 -114 -332 -474 -440 -140 217 443 553 302 52 -171 -247 -298 -272 -213 -41 226 433 499 298 -66 -410
6573 -410 -554 -395 -147 174 294 291 335 169 52 -174 -365 -435 -388 -53 362 512 502 201 -82 -327 -335 -321 -147
6596 -147 -35 129 278 432 437 145 -113 -442 -497 -391 -34 288 403 340 224 54 -117 -253 -341 -396 -241 63
6618 63 453 543 466 118 -230 -438 -393 -280 -89 54 203 380 396 353 89 -226 -529 -520 -200 132 414 447 337
6641 337 157 -97 -236 -311 -394 -252 -108 161 493 505 295 21 -371 -532 -452 -183 41 244 308 320 246 162 -78
6664 -78 -342 -494 -399 -149 268 554 511 277 -21 -180 -333 -313 -267 -126 65 301 415 476 224 -42 -418 -519
6686 -519 -401 -65 141 325 355 260 193 -18 -193 -336 -429 -418 -7 336 538 441 217 -159 -327 -403 -292 -226 0
6709@J52J39J26n0k18l83k44o8K61K92L54L9o1j73j82j08j75l1p4K12L12K92K18
6732F30k54k69l60j90K7K08J65J37J18J20lr0k64k93k23M3K85L35K78R2j55k90
6754D7j78j82m3J9R3J47K77K31J07j28l90m03j11O4K94K45J72L7J7j2k22j83k79
6777c81p7P3K41L63K80j8j92l31k38l3J1Q6Q1K26J65K03k5k50l00l37n9J28L21
6800f3L13R6K1j05j53j80j25j87n0J02L02L93K06q9l92k76k37L0J17J40J79J59
6822B01J04J24r6k40l66j81r0K90L04L42P6m7k60k25r1j64m3K7J67K59K96J52
6844E39k05k73l57j83M7J96K40J83N1R2k9j24k05k11k68J9K44M05K67O9j56l27
6866A4j71j25l2J9J31J51K82J52P7k34k75l84j19M8L09L09J18N1pj13j67j55k02
$$ plain form
6709 0 152 291 417 367 149 -234 -478 -546 -285 7 361 400 339 166 -16 -124 -299 -330 -404 -192 120 412 630
6732 630 376 107 -253 -443 -416 -208 -43 94 212 332 329 239 -25 -318 -541 -498 -213 122 400 492 337 47
6754 47 -131 -313 -356 -337 -244 -97 180 411 518 390 0 -403 -514 -450 -156 89 261 298 315 303 81 -102 -381
6777 -381 -458 -385 -144 219 499 481 289 -42 -280 -313 -302 -216 -135 91 256 459 434 184 -116 -453 -512 -384 -63
6800 -63 250 346 367 262 109 -71 -196 -383 -433 -331 -29 364 570 481 89 -187 -424 -394 -277 -137 42 201
6822 201 305 429 333 93 -273 -454 -544 -254 50 392 468 421 161 -64 -155 -319 -362 -335 -168 91 387 539
6844 539 334 61 -296 -479 -432 -236 4 187 238 330 301 177 -28 -239 -507 -488 -244 161 428 497 341 14
6866 14 -157 -282 -314 -295 -164 -13 269 421 498 264 -11 -395 -514 -466 -157 152 270 321 314 201 34 -121 -323
6889c23j24N8L41K57L07m7j94l52k12p4Q4P8Q4J52K48J10%k46k88l26o7J90L16
6912b8L01J18l8j35j19j29j77j89j1J20L04L86J18j33k29l49k06%J64J84J87P5
6934B14O3R7q8k53l32j90o2K72L60L14P9j17k35k14j38p1m5L6J63K24L06J40j50
6957C73l97l65j15J33J82J86K25Q1M6j7j03k51k58k20Q9K76L46K64J9j55l27k16
6979b04j05%K8Q6K22J82K32l2j78l08l24j32J38L40K59J53Po8j46j53j95j81j59
7002e38J97K79L21L38j41k50k78k78m5R8J18J95J78J38O2K5k76l51l50K1K08L12
7024a7L03J00k3j28j95k17j50m4PJ32K64L70J55j00l65l72k21P1J53K15J77N1
7046A66J53nk1k38l33j95l8K78L47L20O8j66l01j70j16o0jL6J76K66K60O6j12
$$ plain form
6889 -323 -447 -389 -48 209 516 469 275 -77 -289 -363 -279 -201 -117 35 283 393 393 147 -141 -467 -534 -344 -28
6912 -28 273 391 353 218 99 -30 -207 -396 -407 -287 17 403 521 388 159 -190 -396 -396 -232 -48 139 214
6934 214 277 374 286 33 -299 -489 -551 -279 81 395 474 357 122 -92 -230 -301 -346 -310 -147 77 383 523 373
6957 373 -24 -389 -504 -371 -189 -3 222 303 349 332 229 -22 -280 -500 -411 -135 211 475 494 339 12 -204
6979 -204 -309 -309 -281 -195 27 209 441 409 231 -77 -401 -533 -395 -55 204 357 364 296 150 -3 -198 -379 -538
7002 -538 -341 -62 259 597 456 206 -72 -350 -395 -297 -179 16 194 332 394 419 143 -208 -558 -537 -329 -17
7024 -17 286 386 363 235 40 -177 -327 -371 -364 -232 32 402 557 457 92 -280 -501 -430 -277 -62 115 166
7046 166 319 314 293 55 -278 -473 -511 -233 114 434 502 336 35 -135 -251 -311 -312 -276 -100 166 426 492 380
7069C80m30k99j29L4K33L23J50R4j06m6p1k51k10j30K5L01L67K71j2j88l79k43
7091c16qK0J27M7K20J54J76N1k71l50l38p5J53L27L19J16j8m3j77j68j99j31n4
7114d38J66K89L20J46r7k04l16k00n3N2J93J92Q5J72N2j7k23l15l02l4J66M37
7136G1K50J60j77j68j57j31j47o9N7J04K59L78R3j23l35l40j35JJ62K74J55O5
7158B47P9J3j05l26k38j48kK96L16K91N4j55k22k56j10p4N3P6K18K23K17M2j45
7181C44m11k99j71P2L08L25J14O7n3j16j26k02k34j25J04K86L57K67M1k63l31
7202d6k62l3J5J27J06J77K05J36lj97m02k70p9J83L19K73J41n8p4j91j17j59j32
7225c41m0J37K51K89K52r7k84k88l23j0K09J35J90J50Q8O7p7k64l32k99M9K88
$$ plain form
7069 380 -50 -349 -478 -444 -211 112 262 356 250 204 133 -118 -328 -458 -433 -132 235 506 494 306 -73 -316
7091 -316 -324 -304 -177 -130 90 244 420 471 200 -150 -488 -563 -410 -83 236 352 334 291 114 -54 -253 -384 -438
7114 -438 -272 17 337 483 386 182 -134 -334 -387 -335 -142 50 135 307 359 342 119 -196 -498 -532 -366 71
7136 71 321 481 304 136 -21 -152 -299 -368 -311 -207 52 430 523 400 65 -275 -410 -409 -247 27 182 247
7158 247 326 339 234 -92 -330 -478 -480 -184 132 423 477 322 100 -156 -266 -340 -287 -211 7 230 447 489 344
7181 344 -67 -366 -537 -465 -157 168 282 349 296 180 54 -148 -382 -507 -403 -117 240 507 548 285 -46
7202 -46 -308 -341 -326 -199 -93 84 289 425 422 225 -177 -447 -526 -343 -24 249 390 332 258 67 -50 -209 -341
7225 -341 -381 -244 7 296 548 451 167 -121 -444 -454 -245 -110 80 230 318 385 308 44 -288 -587 -538 -250
7247b50L37L03N3n4k44j71j38q0j16L6J76K49L45J02j94k88l92j54k0L02K55K20
7269B77N2m2Mj56j79k48j94QK61L67L26P6k39l25k23j04L9N1R3J41K19J68J39
7292E11j98m16l35j44K03K67L68O3N3q1j08j35j66k42q5J34K48L75J91j0k99l20
7314a26j61r8J13MK39J67J25R8J0k26l30k49j50K36L63K67J31m5j58j84j66q7
7336b27n6p0R6K96K88J93l9m15k97j75j9J57K39Q3J53J55kq8k41k98k44K7J92
7359b92L67K91J19j47k07k71j29l9n0R9J43K85K22Q5j22k98l97k12N1K99K97J38
7381B32P0ql7j41j45k55k76J15K70M09J84Q8k11l03k88j5RP3R0J45K12K16k3j80
7405B31l28l02j02J30K71L02J61lj00j17k51j61j16j8M3K96M13K38o9l21l10k28
$$ plain form
7247 -250 87 390 443 389 145 -26 -164 -244 -360 -324 -148 101 446 548 354 66 -326 -480 -500 -198 57 277
7269 277 329 287 291 135 -44 -292 -486 -478 -217 150 476 552 313 -12 -235 -339 -300 -249 -156 -15 204 372 511
7292 511 313 -103 -438 -582 -379 -112 256 319 372 291 183 48 -118 -360 -445 -311 -63 312 503 493 194 -126
7314 -126 -287 -385 -272 -268 -29 138 263 361 371 145 -185 -434 -584 -348 15 282 413 368 210 26 -140 -227
7336 -227 -283 -353 -257 39 327 520 481 66 -231 -406 -425 -268 -29 54 207 362 360 272 31 -267 -511 -484 -292
7359 -292 75 366 485 338 131 -140 -269 -308 -358 -259 -116 169 391 476 354 56 -341 -553 -502 -203 94 232
7381 232 302 294 257 116 -29 -284 -560 -445 -175 234 418 506 295 -8 -296 -311 -302 -229 -139 6 218 434 411 231
7405 231 -97 -399 -501 -371 -100 202 363 360 260 143 -108 -269 -385 -403 -360 -64 349 587 518 197 -113 -341
7427c41j06J34K05J19J66J14J01ok33l85k51p4K28L36L37Q2m7j82k09j24j46q7
7449c69L1J72K65K40J52j29k25l90k16L3J69K62J78P3J15j17j5j85k45k80j0K59
7471b32L25L08J16j41l08k25j17OJ0L6J19K42K88R1j90l49l04j91M2K71L41J29
7493B67L1l9p4j08j54k40j71J10K47L83K35j1k19k73k96n6lJ36J89J02J59J86
7515D01L7k04l37l08j28J55K82L68J23k6j15k38n5j55j40m1L9L07L15K00m7k48
7537A85l60k20l0N9K36J86R8J56Ll1k25k59k58p8K37L55K51J54n4k21k69j21n0
7560b56n0P7P4K07L03K03j83l30l46j25K2J40K92J77L5K8l0l8j74k93j90M1K07
7583b09L24L69N5k34k42k12j62N0j0J16J14K32K07Q8k07k65l49k01J40K03L33
$$ plain form
7427 -341 -447 -313 -108 11 177 291 392 386 153 -232 -483 -557 -329 7 344 426 379 197 -12 -136 -282 -369
7449 -369 -338 -166 99 339 491 362 137 -253 -469 -436 -267 -5 173 246 361 244 229 44 -201 -481 -491 -232
7471 -232 93 401 517 376 68 -157 -274 -268 -258 -222 -103 139 427 518 328 -21 -325 -516 -474 -203 138 267
7493 267 298 259 185 77 -77 -317 -488 -378 -131 252 487 476 257 -16 -312 -368 -371 -235 -46 56 215 401
7515 401 438 234 -103 -411 -539 -384 -102 266 389 363 248 10 -45 -200 -340 -381 -342 -35 280 480 433 185
7537 185 -175 -395 -425 -366 -130 56 154 310 313 282 57 -202 -460 -538 -301 54 305 459 405 184 -85 -206 -256
7560 -256 -306 -229 -155 52 355 558 375 45 -301 -426 -404 -264 28 205 240 268 238 200 26 -267 -457 -416 -209
7583 -209 115 484 539 305 63 -149 -311 -261 -271 -155 -41 191 398 486 279 14 -335 -536 -396 -193 140
7604A40J57M9p9j06j46j26j89k07J12K60L69J98R9k27l64k27r0Q2J01J50J24J17
7626A97J68M4k09k81k93j64J52L21L29J61q5j10j01j72j68j48l8J50K45L85J16
7647D99n6k72l21k38m9J31K51J72J16K2P8l2k22k69k40o2J65M01K46J29j31k21
7669I7j52k06l1o2J34J28K04L26P5j06l01l59k10N5J90K23J48J23rk9n5k18k24
7692b59j75M4J65L41K30J36j52k70k59j10k6P7J21J21K46J30M1j32k58l51j77
7713e17J15K62K94J60N5j37j16q1j67j44p9jK51L76J68L2j82k93l01o9P7J45J69
7736A7J09J56R8n5j79k38k88j05J09K88L36J26K7k03j16j81j09j14k3Q8K50L35
7758C28J53n0k37l99k29PJ73J98J67P3N5M7n3j55k61k51n0J83L88L25L6j04k27
$$ plain form
7604 140 297 346 267 161 15 -111 -300 -507 -395 -135 234 432 531 304 -60 -287 -377 -295 -194 -44 80 197
7626 197 365 409 200 -81 -374 -538 -386 -65 264 425 340 230 129 -43 -211 -359 -397 -247 -2 383 499
7647 499 443 171 -150 -388 -437 -306 -55 117 233 255 333 301 79 -190 -430 -492 -327 74 320 449 318 97
7669 97 -55 -261 -292 -354 -220 -92 112 438 513 407 106 -253 -463 -408 -218 5 153 276 267 238 183 -35 -259
7692 -259 -434 -390 -225 116 346 482 330 60 -199 -309 -335 -258 -137 -16 230 360 401 269 11 -340 -517
7713 -517 -402 -140 154 314 369 232 116 35 -132 -276 -355 -356 -105 271 439 471 289 -4 -305 -374 -297 -152 17
7736 17 126 282 380 325 146 -92 -380 -485 -376 -88 248 374 401 198 82 -99 -208 -322 -345 -257 -7 328
7758 328 481 431 194 -205 -434 -427 -254 -56 111 184 239 286 233 78 -183 -434 -484 -301 87 412 448 344 117
7781A17k45p5o5kKJ46K09K48J76j57l22k77j88LK06K51K58K2p9l6o0j99j91j50
7805d08MK29K84L40K8j45l22k31j09J4J38N1J22J56J36J01j26k96l63j13J06K50
7827a54K75K11j3p4q2r0k46j16n8L2J87L84J63J5j54l47k47k8N3J63J65P9J02
7850B20J23k2j38k75l31mL6L55K82J85p7j44k11j31q1r1KJ04J87L04J88o3k55
7873A63l25k54J0Q3K79J25J69ON3j25j53k49j53o9J73L13L19P0n3k13k80j25m7
7896b83J2P1J18J81J72J16m6k51k91k81J0K59K69J97J6j5q9o2j40j84j81M9J29
7919b24L64L17K5j79l02k30p8J5OK04Q7J96R1J39k15k55k41j92R6K48K37L05o5
7942C49q4j32j47k28l4q5J04J74K65K14N3j85l23k77q2J10J44K16Q0O7J28j5j67
$$ plain form
7781 117 -128 -203 -268 -270 -268 -122 87 335 511 354 32 -245 -433 -430 -224 27 285 307 228 192 132 -67 -258 -408
7805 -408 -404 -175 109 449 477 332 10 -221 -330 -316 -178 -127 -5 151 287 388 262 -34 -397 -510 -404 -154
7827 -154 121 332 319 245 163 73 -173 -289 -347 -315 -128 256 419 434 280 -67 -314 -342 -289 -126 39 118 220
7850 220 343 321 183 -92 -423 -427 -391 -36 246 431 354 210 -1 -132 -213 -304 -302 -198 -11 293 481 418 163
7873 163 -162 -416 -406 -323 -44 81 250 256 309 184 31 -218 -371 -440 -267 46 365 435 382 169 -111 -236 -283
7896 -283 -271 -200 -82 99 271 387 341 90 -201 -482 -472 -213 56 253 269 254 165 103 -37 -221 -402 -353 -224
7919 -224 140 457 482 303 1 -229 -307 -292 -286 -82 5 201 292 431 216 -39 -280 -472 -376 -128 109 414 349
7942 349 265 133 -14 -242 -276 -361 -257 -83 182 396 449 264 -59 -336 -418 -308 -164 52 132 199 327 312 145
7965A45l16j90m1P8K87K61J97r7j76j54j65l8l2m8P3K14K86J77j17j65l19j83
7987c23r8J73K01K07Q6M8l7j23j40j54j98p9J32L69K91J20j35k16k33j31j1M2
8009b09P9N3J74K33R6p5k78l23j98M6K02K70J55M2l7n7j33j08j47j10l5K08K96
8032A44K18N2j34k49k79p1l1J31J69Q8R0J76M0j00k58k68j57K2L14K97J36L4j27
8055B37k04o0j14n0j16O0J40K61L05m4j82l26j74j54J22J97J07J02J23M0rr9k59
8078i7k30j19J69K10K68J42k8j52k06r8p4n8J2J31J17K27K10l7k62k60k60k7J64
8101b58K42J96M7Pk7o6j10k08j97j3J24K65L27J09q7k82j41j62l1J1Q5J36J65
8124A32J22J35j33j81k80j85M0P9L46K14Op5q7j61n4r4p3o0J09L15K18Q4r1k92
$$ plain form
7965 145 -171 -361 -402 -324 -37 224 421 324 148 -6 -171 -209 -241 -289 -216 -2 284 461 344 179 -140 -323
7987 -323 -421 -248 -47 160 246 294 257 134 -6 -160 -358 -437 -305 64 355 475 340 124 -109 -240 -251 -209
8009 -209 -130 -77 97 330 426 351 73 -250 -448 -402 -200 70 225 267 230 173 40 -68 -215 -325 -360 -152 144
8032 144 362 414 280 31 -248 -319 -350 -219 -50 38 128 304 344 244 -14 -282 -439 -417 -103 194 330 364 237
8055 237 33 -27 -141 -191 -307 -247 -107 154 459 415 233 -93 -267 -421 -299 -102 5 107 230 270 261 162 -97
8078 -97 -327 -446 -277 -67 201 343 315 163 -43 -141 -215 -273 -261 -130 -13 214 424 387 125 -135 -395 -422 -258
8101 -258 -16 180 227 234 207 141 31 -177 -374 -387 -263 2 329 438 351 69 -72 -234 -265 -254 -169 -33 132
8124 132 254 389 256 75 -205 -390 -350 -271 75 289 295 220 133 -28 -82 -176 -249 -309 -200 115 333 417 326 34
8148C4k85p3O1R0J50J18M3J18O4j38k11k34j82Q1K39K59J61O2j18j60j77q8l1
8171b17j08J27J00L02J27Q0j12l47k08j76J25J54K16J02R5K4n1o4j94k62
$$ plain form
8148 34 -251 -324 -263 -173 -23 95 138 256 320 182 -29 -263 -445 -364 -125 134 295 357 239 79 -98 -186 -217
8171 -217 -325 -198 -98 204 331 411 299 -48 -256 -432 -307 -153 63 165 260 284 233 169 -25 -287
8191b87
$$ Imaginary data points
##PAGE= N=2
##DATA TABLE= (X++(I..I)), XYDATA
0@%%%%%%%%%%%Lj1J6j6J6k4L2l3M1n0N8p2Q8j04J20j37J56j80K10k42K75l10L52
34A88m00M48n04N68o34P08p89Q77r75J082j195J319j457J607j772J952k150K369
52A242k611K881l183L522l906M345m853N450o164P031q117R520j1410J4119j8349
67a0483K5941m3842J66593J44903k26599j47347p1802N5924M2300K7425q485K5288
79b0184L8403M4645r817m8287o5165k4296J0862M3797N6977P2502M6058q068o2664
92G4763o5305m8152l8295m0329q270M8626Q8239O3326j532n6216n5768j3221L0162
105b1972L0104j636j7178J5650N6586N0319l662m9687n9795n3725n0086k9388
117a34470K1482P4643Q3840M0852j8209n0277m1451j0262J1262Q129M56J6725
$$ plain form
0 0 0 0 0 0 0 0 0 0 0 0 0 3 -8 8 -8 8 -16 16 -17 24 -26 32 -40 48 -56 64 -73 83 -97 113 -129 146 -164 188
34 188 -212 236 -268 300 -334 374 -415 462 -513 569 -626 693 -764 843 -929 1023 -1127 1242
52 1242 -1369 1512 -1671 1851 -2055 2290 -2563 2887 -3277 3754 -4363 5157 -6253 7866 -10483
67 -10483 15458 -28384 138209 283112 56513 -90834 -162636 -106712 -64412 -36987 -45472 -20184
79 -20184 18219 62864 53047 4760 -60405 -84701 -73839 -30042 26935 99437 145495 137427 74763
92 74763 9458 -38694 -76989 -117318 -125588 -76962 11277 74603 73071 16855 -38913 -52134 -21972
105 -21972 8132 6496 -10682 4968 61554 111873 108211 58524 -1271 -54996 -105082 -134470
117 -134470 -112988 -38345 45495 86347 68138 17861 -23590 -33852 -22590 -14461 -14005 2720
129B720M5704M5306L494m0549n1754m3017m0849l6563l439N0557Q2190O3890J3625
142I1315l0888m7062l7560j8835m309R247L3942N9990N2340j963o1158p1925l6270
155f3136l456j374p026R493M1398N7955M3406P459l0967n3617m8797j9553J7992
168e0223M8240N9661L9506j0769n7234n9531k1514Q105o83j9869o146L6357O2103
181B8003M3527j92l2393l6396k0477m355P02K245J5359L4508L2664o75l7291m5268
195b0039k9248j5117q070Q980L6805M9667L1373M3j6301j3596q531j3959k5266
208b3259k4592K138M3018O0313K9520k6749o0108n0974k3298l274J1599L1926
220c3740M7357L9737J2972j0795k0517k3316k5871k4250j1353J3967M0601M7321
$$ plain form
129 2720 48424 93730 97224 56675 4921 -38096 -78945 -115508 -118947 -68390 13800 77690 91315
142 91315 60427 13365 -24195 -43030 -47339 -38092 -4150 55840 108180 106217 45059 -26866 -63136
155 -63136 -66592 -67966 -74992 -65499 -24101 33854 77260 84719 53752 135 -48662 -68215 -50223
168 -50223 -1983 57678 97184 86415 29181 -30350 -51864 -43759 -44442 -64311 -70457 -34100 28003
181 28003 71530 71338 38945 2549 -17928 -22283 -21581 -19336 -3977 30531 63195 62520 25229 -20039
195 -20039 -49287 -64404 -72474 -63494 -26689 22978 54351 54394 38093 24497 15966 2007 -23259
208 -23259 -47851 -45713 -2695 57618 87138 60389 281 -50693 -73991 -77265 -65666 -33740
220 -33740 13617 53354 66326 55531 35014 11698 -14173 -38423 -49776 -35809 4792 52113
232E2113K0409k4262m9398l8717j4009l631k555J2479M0408N2034L0920n780l1694
245C8317l7104k7897j2225M552J7264K4405K3291R993j1638k5118k0045q996j0511
258c5712j8297n891L0906N7790M4251J036l3281l7392k1258n337N89R04N196J6376
272a20K3408J3427q920k4210k2956j6066j3048m253J9847M3258M0729J2555j4693
285D8958k2511j8808j7980k0609j5861K808K7962M1643K8485o125l4941l6468
297b3447j8281l331K177J1882K9155L6758K3374kj5983k3797k9892l1264j7908
310f0559J0050L7323M4736K4556j1105l6392l2844j0578L648K26q16J6494L7565
323B2304L5404P823k1357l3524l0027j9569n552J0092K2029K4368J6071R94j2714
$$ plain form
232 52113 72522 48260 -1138 -39855 -53864 -57495 -60050 -47571 -7163 44871 75791 70011 38317
245 38317 1213 -26684 -38909 -34357 -17093 7312 30603 40596 28958 3840 -16205 -25201 -35712
258 -35712 -54009 -59900 -28994 28796 73047 74083 40802 3410 -17848 -23185 -22596 -21692 -16496 -120
272 -120 23288 36715 27795 3585 -19371 -35437 -48485 -52738 -32891 10367 51096 63651 48958
285 48958 26447 7639 -10341 -30950 -46811 -44003 -16041 25602 54087 47962 13021 -23447
297 -23447 -41728 -45059 -42882 -31000 -1845 34913 58287 58285 42302 18505 -11387 -42651 -60559
310 -60559 -50509 -13186 31550 56106 45001 8609 -24235 -34813 -31165 -30939 -31755 -15261 22304
323 22304 57708 65531 44174 10650 -19377 -38946 -44498 -34406 -12377 11991 28062 29056 16342
336A6342j6574j1719q757j1673p428J4855M0018L9001Q035k4269l1502j8152o221
349a8044n691p879j388J3411K6326K5329P548j5272k6634k2524j2196r70J4180
362b3804K9628L0882J2275r863j7001j2931j3912k2390k2472l095K4895M0136
374A2348L1034L963k1724k9389j8839o204j151L242J6333K9556K6100N868j3916
387C7221k2611k4936k5642j8165L298K8176L7699K5061N83j8711k2080j2905m692
400a7704n688o370P141K9357L6064J5140j6273l2668k8233j5913m915N510J5715
413a8837K0543J7275Q594j206r595j3999j4705j2971o875P997K6194L0887J2772
426D6074j3481k4457j6534o653p098r984k711J3203K5204K4587J1714o629k0363
$$ plain form
336 16342 -232 -11951 -20708 -32381 -39809 -24954 15064 54065 62100 37831 6329 -11823 -18044
349 -18044 -23735 -31614 -33002 -19591 6735 32064 39612 24340 -2294 -24818 -37014 -37984 -23804
362 -23804 5824 36706 48981 39118 22117 9186 -4726 -27116 -49588 -52683 -27788 12348
374 12348 43382 47345 25621 -3768 -22607 -28811 -29962 -26720 -10387 19169 45269 51137 37221
387 37221 14610 -10326 -35968 -54133 -50835 -22659 15040 40101 40684 21973 -107 -13012 -17704
400 -17704 -23392 -29762 -22621 6736 42800 57940 41667 8999 -19234 -35147 -40062 -34552 -18837
413 -18837 1706 18981 27575 26369 16774 2775 -11930 -24901 -31776 -23779 2415 33302 46074
426 46074 32593 8136 -8398 -15051 -22149 -32133 -34844 -21641 3563 28150 39864 33235 12872
439A2872k2692j5749n537N844J7998K4055J6455k77j1523j1991j1778j8927k2778
452d4028q397J9714L8824L3564J0042j4545k5241k0422r681l478j351O048J9407
465D56K6111J5319n811k0954k4215k1637j4997K95K1053L2515K4892O100r730
478B9397j5098j3230j0584j0454q678J701J9662L0248J9818o001k5202k4954j3816
491b7191m813J062R169J7539J8686J2504L908l758j1383j7656j8646j1570K790
504b9359J8927K6291J6864l830j8086j5503n949m827j0145p373Q745K4494K6328
517B6577J3892l119j6432k1504j8134r448O56J0247J7311J7512Q669l565r964
530A2698j1168j4649j9155j1804J0563L1985L3200J4739p870j9623j9258j3131
$$ plain form
439 12872 -9820 -25569 -31106 -25262 -7264 16791 33246 32969 21446 9455 -2323 -21250 -44028
452 -44028 -52425 -32711 6113 39677 49719 35174 9933 -10489 -20170 -23648 -24999 -18951 456
465 456 26567 41886 36075 15121 -9094 -30731 -45728 -45433 -24380 8135 33027 39127 29397
478 29397 14299 1069 -9515 -19969 -28647 -26946 -7284 22964 42782 36781 11579 -13375 -27191
491 -27191 -32004 -30942 -21773 -4234 14452 26956 30864 27106 15723 -1933 -20579 -32149 -29359
504 -29359 -10432 15859 32723 28893 10807 -4696 -10645 -15472 -25617 -32990 -24245 249 26577
517 26577 40469 37350 20918 -586 -18720 -28168 -27512 -17265 46 17558 26227 22662 12698
530 12698 1530 -13119 -32274 -44078 -33515 -1530 31670 46409 38539 18916 -342 -13473
542a3473p840m804M57J1250K2340K2112O576j3189k3448k2213j4770k218J4659
555b4561K6876K4315R110n192j0419j0803j2629j5367j2457r94J5141K5981K1592
568C0593K620j6609k1248j2770m093j271K336J1105J7621J5303O510k051q677
581A9369j5546j9658j5503k217J3538K2305J8584M227r960j2787n594k127q323
594a3692j2404j790J8130K8661K0398J171j5521k2512j9996j0800j21P405J1664
607i407J3714J2941O745k424j0268j5974j8727j3031N147K5201L0086J5093n187
620C3909j4970j3583j0875j1861j1354m352R344K2110K4776J2334p696k0879j9929
633a3026j1304k538O252J5368J8926J2738J853n289q255j2599j8272j6624l771
$$ plain form
542 -13473 -21313 -26117 -25660 -14410 7930 30042 36618 23429 -19 -22232 -37002 -39220 -24561
555 -24561 2315 26630 35740 30548 20129 9326 -3303 -18670 -31127 -32121 -16980 9001 30593
568 30593 33213 16604 -4644 -17414 -21507 -22778 -20442 -9337 8284 23587 30097 28046 19369
581 19369 3823 -15835 -31338 -33555 -20017 2288 20872 25099 15139 2352 -3242 -5369 -13692
594 -13692 -26096 -27886 -9756 18905 39303 40474 24953 2441 -17555 -28355 -28476 -21071 -9407
607 -9407 4307 17248 23993 21569 11301 -4673 -23400 -36431 -31284 -6083 24003 39096 33909
620 33909 18939 5356 -5519 -17380 -28734 -33086 -23742 -1632 23144 35478 27782 6903 -13026
633 -13026 -24330 -26868 -20616 -5248 13678 26416 28269 22980 14725 2126 -16146 -32770 -36541
646c6541J3400K3701K0996P238q526j5507j1258m699l250l295L152J4128J8068
659A7607J0641j192r090j3503j6223j4703n482P532J6613J7145J0307K92o674
672A3270p651o367q206j0468m480J0573K2379J9501N064r188j6441j7629j4463
685b4106o191M371J1557J3726J2864R619K862n879j3712j7907j5161k611J5902
698a4666K6632J9375M68j3099j3691r180r021j0909o770M553J7306K3049J7050
711C1097J179j4759k0472j4679m438L998J0068J3239J1087M107k046m301p657
724F423j4701j8518r713Q763K2541K2079R851m534j1690r664m033k843o228n444
738a7711M997J6701J7657O159p630j5156j6308j2519l936O524J2538J2166Q869
$$ plain form
646 -36541 -23141 560 21556 28794 20268 4761 -6497 -11196 -14446 -17741 -14589 -461 17607
659 17607 28248 27056 17966 4463 -11760 -26463 -31945 -24413 -7800 9345 19652 19944 13270
672 13270 5619 -748 -8954 -19422 -23902 -13329 9050 28551 33615 24427 7986 -9643 -24106
685 -24106 -30297 -25926 -14369 -643 12221 21840 24702 18823 5111 -12796 -27957 -30568 -14666
698 -14666 11966 31341 31809 18710 5019 -4161 -13182 -24091 -30861 -26308 -9002 14047 31097
711 31097 32276 17517 -2955 -17634 -22072 -18074 -8006 5233 16320 20427 18381 14080 6423
724 6423 -8278 -26796 -36509 -27746 -5205 16874 26725 22191 10501 837 -3196 -6039 -12267 -17711
738 -17711 -12714 3987 21644 27803 20173 5017 -11291 -23810 -27746 -21222 -8684 3482 12351
751A2351N858K275l442r709j3848j2959n193Q422J8914J7566N044p042j1119j0575
765c457j0863r811k719P804J4980J5406J1073L732m792j2003j5268j3361n851
778b5130N936J6889J8549Q318m767j0827r733r277j0402p015L304J4482J9231
791I558J5373N214o995j5590j6164r682j073N673J0273J1268P145O21l510n518
805F593r572j4385j1812J631J6874K1524J3365L59q507j0002p056m351m515n163
819a5017n84R089J5535J1464J4j0045j4382j3291p075L011J1415J2731Q234M399
833A5498L121P81o097j3613j5802r568L389J5660J8834R565l865j0707r049o110
847g963o368n495O88R523J4644J3988P988j442j1815j7630j5095n660N061J2829
$$ plain form
751 12351 18209 20484 17042 7333 -6515 -19474 -24667 -16245 2669 20235 25279 18237 7118 -3457
765 -3457 -14320 -24131 -26850 -19046 -4066 11340 22413 26145 21353 9350 -5918 -19279 -25130
778 -25130 -19194 -2305 16244 24562 19795 8968 -765 -10042 -20444 -27459 -24155 -9673 9558
791 9558 24931 30145 23150 7560 -8604 -18286 -19359 -13686 -3413 7855 15000 15621 12111 6593
805 6593 -2979 -17364 -29176 -27545 -10671 10853 24218 24577 16070 6068 -988 -5339 -9854 -15017
819 -15017 -15601 -6512 9023 20487 20501 10456 -3926 -17217 -24292 -21281 -9866 2865 11099 15498
833 15498 18619 19400 13303 -310 -16112 -25680 -22291 -6631 12203 21768 17903 7196 -1853 -7963
847 -7963 -14331 -19826 -19138 -9615 5029 19017 27005 25563 13748 -3882 -18977 -24637 -19576 -6747
861f747J4189Q579m30n756n641n857r305j0617l002J0580J9334J6895O131n614
875B2739j3278j4212r249k523J800M291P398R691Q113K076n126j0959j3696j0325
889b3260N32J2875J7036J0525P33m017m026m569p526r890p799m93R524J5471J2174
904A7290J568p809j0686q880o072j937M353R511R699O625L573R16m581j1644j4770
919a2844j0234J4J0588J5574J1927K542n730p675o155o079o813l029N716J3083
933H85J3881Q503Q7q615j5093j4852p432K433R239J1102Q957M552l15l639o050
948C643r142j0551n361O249J6040J5695O787l362r365j1175r587n543l70L305
962a2737O114Q420Q946N276j310p941j1614j0719m083O673J3768J1914L485k996
$$ plain form
861 -6747 7442 16021 15591 9835 4194 -1663 -10968 -21585 -24587 -14007 5327 22222 28353 22739
875 22739 9461 -4751 -14000 -16523 -14723 -10432 -3034 6657 14770 16846 11720 761 -12935 -23260
889 -23260 -22728 -9853 7183 17708 18441 14424 10398 5829 -1697 -11587 -19386 -19879 -10355 5116 17290
904 17290 18858 11049 363 -8517 -14589 -16526 -12173 -2662 7037 13662 17235 18151 13570 1926 -12844
919 -12844 -23078 -23064 -12476 3098 15025 17567 11837 4162 -1993 -8072 -14885 -17914 -12198 885
933 885 14766 23269 23356 14741 -352 -15204 -22636 -20203 -10964 138 9095 13647 13332 9693 3643
948 3643 -5499 -16050 -21411 -15162 878 16573 23360 19998 10633 -542 -10129 -15672 -16042 -12737
962 -12737 -6623 1797 10743 16019 14709 6768 -4846 -15565 -19648 -12975 793 12707 16192 13196
976A3196l548l124n719r549r138k781O455J3514J3583O123m051r845q881n593
990i358k589P31M828P651P507N384K602k269r840j4598j1589j366Q891J3335J1066
1005A0386M792j765n036n321n575p137o003Q03R854J3739J0065K012o115j2086
1019B613j3504q692lP122R057P894O075L707m4n166r665j1332p320K771J2656
1034c831J4705P403k142o808p399o945o439m031N80N351Q899R875P116M49o895
1049I888j0592r507m858K088Q290R951N552J21k100j951m003q175r495m340M259
1064a4872J1042J2551Q117J98o847r054o678l669j515J281N024P491P061M362
1078A4492l96p151j2651j1917l463O692J1727R909N369J274j980m349o416q062
$$ plain form
976 13196 9648 6524 805 -8744 -17882 -20663 -14208 -694 12889 19012 14961 5116 -3765 -9358
990 -9358 -11947 -11216 -6388 1263 8770 14154 16756 14487 4647 -9951 -21540 -22906 -14015 -680 10386
1005 10386 15178 13413 8377 3056 -2519 -9656 -15659 -14856 -5002 8737 18802 20814 14699 2613
1019 2613 -10891 -19583 -19586 -12464 -3407 4487 10562 14269 14225 9059 -606 -11938 -19258 -16487 -3831
1034 -3831 10874 18277 16135 9327 1928 -5017 -11456 -15487 -14907 -9556 -657 9218 16334 16783 9888
1049 9888 -704 -10211 -15069 -12981 -4691 5260 10812 10933 8833 6882 2879 -5296 -14791 -19131 -14872
1064 -14872 -3830 8721 16838 17036 10189 1135 -5543 -9212 -10727 -9446 -4422 3069 10130 14492
1078 14492 14096 6945 -5706 -17623 -21086 -14394 -2667 7242 12611 13885 11905 7556 1140 -6922
1092f922p327j957O634J2369J0780L660m007q693j0371q473k684M178P798P407
1106B392N905M866K137k968q661j1228q733j256Q295J2882R299R10n041n832m586
1121a619m661n000k537K577P621J0090Q874K757n190j0715j0145n036P16M847
1135g421O530N459K956J009j27k646p149r834n939K797R863J1008P230J530l849
1150A1417o793o778m950l188j060K636O663Q305O212J206m498r835j1075n823
1164a7561L242R667R386N206J899J09k246n551q479q609m303L822J0998J1923
1178I503N943k241p104p948o584l769N62M666O361O299N678L594j727q070j1118
1193e955q408k054N402R602Q699L556j667l628l330l987n436m487M28O022Q874
$$ plain form
1092 -6922 -14249 -16206 -9572 2797 13577 17237 13230 4537 -5834 -14307 -16991 -12813 -5015 2392
1106 2392 8297 13163 15300 12332 3671 -7557 -16290 -17546 -9251 3631 12930 13840 8799 2967 -1619
1121 -1619 -6280 -11280 -13817 -11240 -3619 6471 15345 18102 12912 2197 -7948 -12984 -12268 -7421
1135 -7421 -891 4568 7524 8533 8406 5760 -1389 -11223 -17162 -14365 -4502 6506 13736 15266 11417
1150 11417 4624 -2154 -7104 -10292 -11352 -8716 -2053 6252 12464 13670 9172 -663 -11738 -17561
1164 -17561 -14319 -4652 4734 9940 11839 11948 9702 4151 -4328 -12937 -17240 -13418 -2420 9503
1178 9503 15446 13205 6101 -1847 -8431 -12200 -11638 -6972 -611 5688 11366 14960 13233 5163 -5955
1193 -5955 -14363 -16417 -11015 -1413 7286 10842 9175 5547 2217 -1770 -7206 -11693 -11265 -5243 3631
1208C631Q113L882k513q283r893o367p58L183M578M685M249L478J905j096n673
1223C121r501p853o1Q001J0379O725J616k153m281n482n496m749k630J058N922
1238e384R093P768K526l603p760r007o272N8O021P794N333K497J312m69m156p918
1254b167q821n191J686Q318J1267P940O48n252o822n548l756j627J323M133N671
1269A802N994M825N52n960j0505r321k941M102P565P259M420J071j097k057l564
1284B145n795o153k008M547Q431P493L523j250n300p411o248k607J028K980L970
1299b655N018N324L240m65m832q088p838k800M537Q556O958K526p09k318l861
1314B593n245n338l394L5M256P945Q414M561j608o603q124o565k318K841O161
$$ plain form
1208 3631 11744 15626 13113 4830 -5063 -11430 -12188 -9005 -4427 258 4507 7985 9890 8794 3121
1223 3121 -6380 -14233 -14294 -6293 4086 10811 12427 10274 5993 511 -4985 -9734 -12364 -11306 -5384
1238 -5384 3709 11477 14003 10400 2640 -6367 -12639 -12581 -6560 1234 6567 9064 10376 9907 5751 -2167
1254 -2167 -10988 -16179 -14493 -6175 5092 13032 13680 8428 1606 -3942 -7698 -9325 -8002 -3869 1802
1269 1802 7796 12621 13173 7213 -3292 -12613 -15554 -11452 -3887 3372 7792 8863 7766 5709 2145
1284 2145 -3650 -9803 -11811 -7264 1167 8660 12183 10933 5633 -1778 -8026 -10633 -9605 -6625 -2655
1299 -2655 2363 7687 10927 10462 5630 -2458 -10296 -13096 -8559 -3 6955 9481 8772 6454 2593
1314 2593 -2652 -7990 -11384 -11349 -7093 852 9266 13827 12219 5616 -2508 -9073 -11391 -8550 -2389
1329b389N679L254J806N54k320o395q341n676K89O137R283Q134L031k784n838
1344D424n434l727k557r45J714M367N884N617K799l054q780r962m825K924P234
1359d321O612L700J339K88m35j940m963p190n167J255P594Q730M744n57m092n492
1375A05m996k913m43J247K564M662O291M968M26m890p812p165l270K128N923N921
1391B746K907O98j05j290l822o059n100j441L435P218Q390N560m23n791p493n827
1407f397k710O44L103M108M045L374K409l75m992q344o649o73N118P678O727L547
1423A0613l37l466m693m672m109k765O20M431O464N394K144j695n458p230n094
1438i853K5M188N161L864K698J870L95k003m931o581n586p78N088Q138N968J260
$$ plain form
1329 -2389 3290 6544 8350 8904 6584 189 -8152 -13828 -13539 -7402 1881 10015 13046 10262 4424
1344 4424 -1010 -4737 -7294 -8239 -6525 -2158 3726 9343 12142 9088 308 -9654 -14479 -11555 -4321
1359 -4321 2291 5991 7330 7618 7183 5243 280 -6910 -12077 -10822 -3228 5502 10246 9689 5597 105
1375 105 -4891 -7804 -8247 -7000 -4436 226 6517 11485 11911 7021 -791 -7956 -11226 -9098 -3175 2746
1391 2746 5653 6351 6246 4956 1134 -4925 -10025 -11466 -8031 -813 7577 13137 12714 6923 -570 -6397
1407 -6397 -9107 -8463 -5360 -1252 2793 6167 8576 8201 3209 -5135 -11784 -12457 -7339 339 7066 10613
1423 10613 10276 6810 2117 -2555 -6664 -9429 -8809 -4378 2086 7480 9624 7929 2471 -4759 -9853
1438 -9853 -9828 -5640 -479 3385 6083 7953 8348 6345 1414 -5167 -10753 -11531 -6443 1695 7663 8923
1454H923k696m097m107l093j369K31J506L061N133N632K609k894p230p659m413
1469a0463L03M283N632M084J772N33l05k363n222n799k709K278N872P078N259
1484A0233J065l899o238n454k958p90R65K718M199M766L766J107l487p508p630
1499i145k466L844P003N983K852J29j867l073l754m118l790j522K721O366O756
1514E919L644p93m392n884m856j639K009L648L393K934K818J541j508m952o456
1529d574m711j090L314O221N637K420p83k240k617l208l007j818M63K685M778
1544A470N531L505j351o160p464m725l47L106M350L819K460J634R05r29m286o311
1560d793m461M50M968O427M965J811j800m563n146l774j887o9K028M429N338M048
$$ plain form
1454 8923 6227 2130 -1977 -5070 -6439 -6208 -4702 -1641 3492 9124 11733 8839 1609 -6050 -10463
1469 -10463 -10160 -5877 -245 3839 5611 6144 5839 3476 -1746 -7545 -10254 -7976 -2104 4974 10233
1484 10233 11298 7399 1161 -4293 -7251 -8041 -7076 -4358 -159 4607 8373 9480 5993 -1515 -9145
1499 -9145 -11611 -7767 -764 5219 8071 8200 6333 3260 -494 -4612 -8402 -9924 -7203 -837 5919
1514 5919 9563 8770 4378 -1506 -6362 -8001 -5992 -2344 1049 3983 6801 8342 6834 1882 -4574
1529 -4574 -9285 -10375 -7061 -840 4797 7217 6434 4194 1577 -1631 -4638 -6456 -5993 -3308 1470
1544 1470 7001 10506 9155 2995 -4469 -9194 -9541 -6435 -2085 1734 4194 5828 6733 5804 1518 -4793
1560 -4793 -9254 -8804 -3836 2591 7556 9367 7567 3004 -2142 -5916 -7803 -7872 -5844 -1415 3923 7971
1576G971J006k547n487o334l551J203M702N092L253J246j88j828l467m301l798
1591g028k142J184M874O780N003O59l415n323m792k184P26K540K491K197K422
1606C992K781O73l281o262n760k180K223N290N556L278K78j482j976k581l292
1621b743l059q90J967M372N147L650lm315o402m757j127J865K938L015K912K657
1637E227J973r1l235o055n812j547L659O415N135K002j114l175l892l220j962
1652e692j035L09K752N218N480K665j777n220o044m018j21L289M034K895J608
1667D343R88p6k165m429m611k528P86M068N847M738J403k092l902l767k652j079
1683e128L84J657K392L111L211J596j996n540n733k704J456M181M511L202J261
$$ plain form
1576 7971 8977 6430 943 -5391 -8942 -7739 -3037 2055 5308 6554 6366 4538 1071 -3230 -7028
1591 -7028 -9170 -7986 -3112 3668 8671 9330 5915 592 -4200 -6384 -5658 -3118 -627 1570 3992
1606 3992 6773 7446 4165 -2097 -7857 -10037 -7814 -2524 3032 6310 6588 5106 3130 549 -2743
1621 -2743 -5802 -6692 -4725 -353 4794 8444 8441 4126 -2276 -7033 -8160 -6295 -3357 -342 2570 5227
1637 5227 7200 7109 3874 -2181 -7993 -9540 -5881 534 5669 7671 6557 3382 -510 -3730 -5692
1652 -5692 -6727 -6418 -3666 1552 7032 9697 7920 2700 -3344 -7362 -7483 -4194 -160 2735 4343
1667 4343 5331 5255 3090 -1339 -5950 -8478 -7692 -3624 2223 6961 8364 6272 2370 -1397 -4049 -5128
1683 -5128 -4744 -3087 -695 2416 5627 7223 5227 -313 -6046 -8750 -7294 -3113 1398 4600 5861
1698E861l81j113j978l266l939k547R34M185N154L759P54k708m792m508j887O21
1714e851J838K267L085L444K480J20k928n243n227k486J838M760M822K549K09
1729E677j498k647l045k730j649k63J849M214N347L568l92m312n701m242j219
1744g043J851L240K779J754J381J061n53l305m832l601k58L104N060M705K140
1759G483j110l125l205k640j735r44O51K113L417L525K138p75m059n319l276L67
1775f494K994L505K759J739P73l92j566k990m007l322l87L394N212M160J343j574
1791E147l554l768k219m15P60J329K254L540L425J133k468m976n156k780P92L638
1807c318M349K834R18l59j235k363l155k564r60J337L323M593L708N19l014m801
$$ plain form
1698 5861 5480 4367 2389 -877 -4816 -7363 -6429 -2244 2910 6669 7423 4715 -77 -4585 -6472 -5851
1714 -5851 -4013 -1746 1339 4783 7263 7383 4455 -788 -6015 -8501 -6663 -1903 2919 5468 5677
1729 5677 4179 1532 -1513 -4243 -5892 -6155 -4306 -92 5255 8823 8431 4119 -1582 -5824 -7043
1744 -7043 -5192 -1952 827 2581 3962 5023 4470 1165 -3667 -7268 -7526 -4422 638 5343 7483
1759 7483 6373 3248 43 -2597 -4332 -5276 -4625 -2512 905 4430 6568 5793 1734 -3585 -6861 -6494
1775 -6494 -3500 5 2764 4503 5276 4884 3318 328 -3679 -7001 -7388 -3994 1218 5378 6721 5147
1791 5147 1593 -2175 -4394 -4809 -4049 -2720 -466 3074 6499 7632 5164 188 -4968 -7748 -6956 -3318
1807 -3318 1031 3865 4783 4424 3189 826 -2329 -4893 -5853 -4516 -1193 3400 7108 7627 4613 -188
1823a88m039j754M80K073K438K269J947J711M36k119m480m277j481K106M229M114
1839C465K264j29j970k642k285j975j682n68J541L523M139K703j54k999m551l547
1855d867o56J745K511K147J882J592N94j107k878l809l252j017K223M486M270
1870C864K183n17k416l040k640j289j52P05J533K843L538K275j106m325n071l161
1886f776k3K820L742K922J340L15l15j274k822l568k197L93K927M215L658J185
1902F542j903l869l576j686k49Q15J545K424K694K252P45j533l775m295k266R28
1918e207L131L470K339P08p67j713k063k013j840j255N76K956M230L377O36k274
1934D291l922l701j514P58J763J613J514J968J740J36k271l916l438j430J399
$$ plain form
1823 -188 -4227 -5981 -5501 -3428 -990 1279 3226 4937 5373 3254 -1226 -5503 -6984 -4878 -649 3465
1839 3465 5729 5600 3630 988 -1297 -3272 -4954 -5522 -3981 -458 3681 6384 6230 3231 -1320 -4867
1855 -4867 -5523 -3778 -1267 880 2762 4354 4948 3841 963 -2846 -6098 -7115 -4892 -406 3864
1870 3864 6047 5530 3114 74 -2566 -3855 -4007 -3302 -1769 1074 4612 6887 5781 1456 -3615 -6776
1886 -6776 -6799 -3979 -237 2685 4025 4340 4025 2751 -71 -3639 -5836 -5443 -2516 1699 5357 6542
1902 6542 4639 770 -2806 -4492 -4741 -3926 -2381 43 2737 4989 5734 4201 426 -3869 -6135 -5207
1918 -5207 -2076 1394 3733 4441 3674 1961 -102 -2115 -3955 -5210 -4634 -1678 2552 5929 6565 4291
1934 4291 369 -3332 -4846 -4088 -2325 -712 802 2770 4510 4646 2375 -1541 -4979 -6409 -5010
1949e010L698M068K353J17j431k183k413k203j358m8J360K744L472K506n6l034
1965B582m354l200o55J499K720K763J924Q21J89p37k226l592l079p74K151L861
1981a07L747J843p15k797l138j934n09R9O32J648K807K791J494j013l304m220
1997b676k869lK357L005K229J211L05n63j479k211k204j644m8K115L801L549J143
2014F018j512l162l318j953k07R24J227J393K069K357J283j200l580l894k133
2029e688P62K829L582K571M50r14j421j725k182k196j148P69K693L736K915N42
2045E575k024l661l115j089O85J481J802K091J743Q73n13j983l280l251j264J401
2061d529L213L466K090L05j323k402k233j251n53J05R05K302L009K032k83k556
$$ plain form
1949 -5010 -1312 2756 5109 5226 3795 1612 -801 -3004 -4362 -4410 -3050 -306 3166 5672 5616 2582
1965 2582 -1772 -4972 -5627 -4128 -1408 1355 3279 4100 4289 3552 1326 -2266 -5345 -6119 -3968 -107
1981 -107 3640 5483 4768 1971 -1167 -3101 -3610 -3511 -2879 -1231 1576 4367 5861 4848 1544 -2676
1997 -2676 -5545 -5548 -3191 -186 2043 3254 3559 2996 1517 -694 -2898 -4542 -4590 -2475 1326 4875 6018
2014 6018 4506 1344 -1974 -3927 -4134 -3210 -1983 -590 1479 3836 5119 3919 339 -3555 -5688
2029 -5688 -4926 -2097 1485 4056 4506 3592 2171 446 -1736 -3932 -5080 -4311 -1618 2118 5033 5575
2045 5575 3551 -110 -3225 -4314 -3629 -2148 -346 1745 3488 4361 3848 1865 -1415 -4666 -5930 -4529
2061 -4529 -1316 2150 4240 4545 3222 820 -1413 -2664 -3217 -3112 -2207 95 3104 5136 4853 2297
2077B297l729l084q60J436K623K330J369Q44L22n59k030k629k157o95J300L093
2093a29L352J755o58k439k689j993r45O6Q79J492K132K487J680l37k700l824k548
2110d419l17J780K869K442J129j56r38j329j709k209j787j97K130L640L335J413
2126E677j141l086l284j662J39R10J033J401J892J802M00j281l035l339j846N73
2142d847K781L299K264O78o39j408j904j851j182n97L26J765K888K530N89j879
2158B813l228k889j127O21J936K063J434R99R15J85j293k756l030j452P93K627
2174a389L229K110m7j734k076j481j025p04j89J084K285K717K145O5k225l616
2190h51k817o97J046J955J915J518Q39J9r06j694k206j983o69J483L161L152J679
$$ plain form
2077 2297 -1432 -4516 -5376 -3940 -1317 1013 2382 3226 3548 2989 959 -1670 -3827 -4522 -3222 -129
2093 -129 3223 4978 4320 1881 -808 -2801 -3746 -3680 -2801 -1309 823 3310 4990 4653 1953 -1871 -4419
2110 -4419 -4736 -2956 -87 2355 3484 3328 2390 1061 -648 -2857 -4644 -4841 -2711 929 4264 5677
2126 5677 4536 1450 -1834 -3496 -3357 -2447 -1414 -13 1879 3681 4081 2800 -235 -3574 -5420 -4847
2142 -4847 -2066 1233 3497 4175 3536 2128 224 -1627 -2809 -3406 -3080 -1315 1573 4103 4692 2813
2158 2813 -415 -3304 -4431 -3810 -1874 189 1623 2622 3537 3722 2429 -327 -3357 -4809 -4016 -1389
2174 -1389 1840 3950 3903 2169 93 -1388 -2413 -3117 -3306 -2222 63 2780 4925 4990 2765 -851
2190 -851 -3668 -4365 -3319 -1364 551 2069 2908 2927 2021 327 -1879 -3862 -4531 -3048 113 3265 4944
2207D944l79k153k819k115p27K71P03R85J860K148J352o24k438l156k180k21J999
2224b550K934K351Q36k58p09j337j781j918j368r1J513K734K888J098j026k616
2240G00k499j365j7R11J379J620J423J184M75r21k536l028j912K20J980K708K343
2257B665Q68o98j622j526j072r45p69L80J719K814K350O97j474l266l040j346
2273d265O11J604J576J394J198R19m6j277k310k417j262P85K704L116J765o3j461
2290B571k113j968j200m77J92Q56J699K463J936O4j889k886k437p35J105K142
2306f77K192J088K21k31p45j447k149j884o92J206K595K908J755l41k063k326
2322e90j395l96J09N64J143J595J770R01m84k098l021k179k46J511K390K065J262
$$ plain form
2207 4944 4565 2412 -407 -2522 -3249 -2978 -2275 -1290 570 2718 4070 3446 1008 -2148 -4328 -4549 -2550
2224 -2550 384 2735 3571 3313 2604 1267 -514 -2432 -3800 -3891 -2378 356 3244 4342 3316 700
2240 700 -1799 -3164 -3181 -2270 -891 729 2152 3336 3811 2890 354 -2674 -4586 -4366 -2386 322 2665
2257 2665 3533 2835 1213 -313 -1385 -2330 -3099 -2719 -1000 1814 4164 4861 3387 121 -2919 -4265
2273 -4265 -3654 -2050 -474 920 2118 3037 2991 1714 -596 -3013 -4275 -3490 -786 2330 4095 4032 2571
2290 2571 458 -1510 -2710 -3187 -2995 -2139 -440 2023 3959 4023 2134 -752 -3189 -3924 -2819 -677
2306 -677 1515 2603 2824 2593 1848 401 -1748 -3632 -4324 -3118 -523 2385 4140 3799 1736 -590
2322 -590 -1985 -2381 -2272 -1708 -565 1030 2800 3701 3217 1119 -1902 -4081 -4327 -2816 -426 1639 2901
2339B901K20q05j322j395j359j177k05J368K458K432J105q89k284k848j722j03
2355c625J060J453J347J354J355N31q17k133k565j733pJ885K842K114M83r57j582
2372A005j530j333r31l59N24J523K490K229P50j387k676k534j110M25J375J664
2388A25J355P85K07l28j079j903k040j088N67K045K793K092M17j358k075j747
2404a232o64k53j1N53J386J979J473K68j526k730k604p69J119K076J913J260N06
2421B744j09o53j320j701j643q70P73K328K700J439l84j790k208j644o84M42R07
2438a673J204J440J527J137l76j916k550k122m33J107K271K251R94l02j046j122
2454C91j168j214r46j1J215K297K459J188p07k347k519j480L8P03J195J133J157
$$ plain form
2339 2901 3121 2316 994 -401 -1760 -2937 -3142 -1774 684 3116 4221 3332 1048 -1800 -3522 -3625
2355 -3625 -2565 -1112 235 1589 2944 3475 2658 525 -2040 -3773 -3780 -1895 947 3061 3544 2587 1005
2372 1005 -525 -1858 -2789 -3148 -2624 -1101 1389 3618 4368 2981 305 -2229 -3339 -2914 -1539 125
2388 125 1480 2265 2472 2144 1065 -838 -2878 -3966 -3399 -1354 1439 3531 3948 2590 515 -1232
2404 -1232 -1896 -2149 -2160 -1607 -221 1758 3231 3499 1973 -757 -3361 -4130 -3011 -935 978 2238 2744
2421 2744 2635 1982 662 -1039 -2682 -3552 -2779 -451 2249 3688 3304 1514 -694 -2338 -3022 -2580 -1673
2438 -1673 -469 971 2498 3635 3259 1343 -1207 -3329 -3762 -2655 -384 1867 2861 2559 1513 391
2454 391 -777 -1991 -2937 -2948 -1733 564 3023 4211 3504 1157 -1362 -2842 -2804 -2101 -906 227 1384
2471A384R00K73o02j771k260j506Q5J795K474J888P35n31j470j654j183o52l60
2488b455J25J186J966J909P69r59k174k394j313K60J574J827J139P51L56j59r32
2505A476j724k013j311J76J788K743K037J65j274j845j482q05k44K34P89J401
2521A11J704J565J95j557k518k310p93O96J697J888J375L95m09o84j157j284j359
2538b445n35P05J958K367J505l4j626k349j723m95L76O98R41J305J222R43k08
2555B605j323k242j980n83J197K291J925Q12j29q11j189j223j071q64k04P76K059
2572D6K331J183n77j845k148j402l44Q16J274J230R63O85L17n48j631k064j574
2589c288j42J250K268K181R41o90j405j373r74o51k71K58J067J743J781Q21q89
$$ plain form
2471 1384 2284 2557 1955 184 -2076 -3582 -3497 -1702 772 2660 3395 2864 1394 -260 -1443 -2095 -2455
2488 -2455 -2330 -1144 822 2731 3500 2541 367 -2027 -3340 -3080 -1506 321 1460 2211 2567 2408 1476
2505 1476 -248 -2261 -3572 -3396 -1608 1135 3172 3337 2063 218 -1264 -2069 -2313 -2079 -1290 111
2521 111 1815 3380 3575 2018 -500 -2810 -3603 -2907 -1210 678 2053 2448 2039 1355 198 -1086 -2445
2538 -2445 -2980 -2275 -317 2050 3555 3521 1895 -454 -2177 -2672 -2296 -1598 -657 648 1870 2813 2605
2555 2605 1282 -960 -2940 -3523 -2326 -35 1890 2702 2573 1762 573 -650 -1721 -2585 -2789 -2013 46
2572 46 2377 3560 2983 1138 -1010 -2412 -2756 -1940 -666 564 1527 2212 2529 1981 350 -1714 -3288
2589 -3288 -3430 -2180 88 2269 3210 2520 1115 -258 -1232 -1883 -2154 -1896 -829 914 2695 3516 2627
2606B627k283k432j247L12J395J568J286Q02K69k57q31j422j722j114K56J724
2622a069K245J678K24r43j779j659r45p3L74O77J158J516J368K34r99k005k128
2639b126j050M55J704J931J138J44l99o43r73j235j153p14L91J711K381J771L9
2656C372j592k047j420o27K46O75R36J125J078Q27r0j315k151j844n38R16K024
2673d25J947J150j3q95j248j039r77o92j56P62J653J915J192l03j709k289j571
2690b698j43R17J357J116R48O44K32n16j350j746j550l99J222K204J907O88o50
2707B183j284j303r92n23o9K43Q94J652J653P88p97j890k015j301l0J118J573
2724a00J277O31M0k12o82j280j420r90J73J223K130J860O34r22j778j638q68j55
$$ plain form
2606 2627 344 -2088 -3335 -3023 -1628 -60 1226 2028 2297 2040 1209 -213 -1935 -3049 -2793 -1069
2622 -1069 1176 2854 3078 2135 356 -1303 -2248 -2321 -1947 -1270 -112 1404 2772 3006 2007 2 -2126
2639 -2126 -3176 -2721 -1017 914 2052 2196 1797 1154 181 -1054 -2207 -2921 -2530 -819 1562 3333 3372
2656 3372 1780 -267 -1687 -2314 -2068 -1393 -457 668 1746 2573 2483 1168 -983 -2827 -3365 -2449 -425
2673 -425 1522 2672 2659 1764 516 -523 -1500 -2192 -2348 -1586 67 1982 3174 2871 1162 -1127 -2698
2690 -2698 -2841 -1924 -567 549 1497 2141 2373 1857 507 -1239 -2789 -3188 -1966 238 2145 2833 2183
2707 2183 899 -404 -1396 -1919 -1988 -1745 -851 801 2454 3242 2445 555 -1460 -2761 -2791 -1673 -100
2724 -100 1177 1808 1848 1636 954 -326 -1746 -2736 -2563 -1340 790 2650 3284 2362 584 -1054 -1922 -2077
2742b077K83O16R89J223J189M64o82k025k149r29N38J600J782J210L35l85q02
2759A180r65j064j096p19L62J562K097J450J69j257j857j621o45L95Q42R99R89
2776H21R21O54j31j115j764j723p95O60J878J955J053j59q20j093q67p88n08k10
2794b031N52J439J884J259k60j686k108j357k59O71J146J084Q48N87J76k89j091
2811E65j649j393k79J021J935J742Q90l46j370j466j059m63j51K86Q41J444J396
2828A944P62k90j583k050j479k1J166J663J249N88j2m05o90j135j306j051j01
2845b751J263K152J858M45q72j589j518p78j35M61N95R69J077J091K39r00j767
2862a60j750j020K79J396J776J360L01m05p16q11j028r15m14K81J238J719J472
$$ plain form
2742 -2077 -1794 -1178 -189 1034 2223 2687 2005 -20 -2169 -3098 -2560 -960 822 2032 2367 1982 1180
2759 1180 215 -849 -1945 -2664 -2302 -740 1357 2807 2976 1719 -138 -1759 -2404 -2009 -1167 -168 821
2776 821 1742 2396 2265 1150 -614 -2337 -3132 -2472 -594 1361 2414 2255 1435 342 -525 -1313 -1821 -2031
2794 -2031 -1479 -40 1844 3103 2843 1157 -951 -2308 -2567 -1896 -750 334 1182 1769 1945 1656 565
2811 565 -1084 -2477 -2756 -1735 200 1942 2832 2486 1116 -350 -1409 -1872 -2023 -1737 -896 548 1944
2828 1944 2706 2416 833 -1217 -2696 -2717 -1551 112 1361 1949 1937 1532 842 -293 -1599 -2650 -2751
2845 -2751 -1488 664 2522 2967 2095 506 -1012 -1790 -1925 -1464 -869 100 1177 2268 2507 1607 -160
2862 -160 -1910 -2930 -2651 -1255 521 1881 2182 1777 1061 250 -778 -1693 -2107 -1826 -588 1131 2603
2879B603L09j132j982j560o58L34Q05J009R21Q17N74O6p34j641j773q40O54J649
2897e79J799J073O4q80j147j063p37m74j25N03J512J715J154j54j213j997j537
2914b086m32N93J342J165P25M04Ol99j024j412j207m71Q10J903J988R64m45j282
2932A142j387r75m74P6K53O62J120J284Q65l95j598j969j151q8J025J585J266
2949A241O19Rl45o15r52j281r72K4J062J745J545N48n99j572j569q34j4M32O82
2968h46R22J093Q61K91n53j426j805j250J08J395J758J197K72m15p87r45p28p44
2986a602n32K06J210J809J597K31j084j737j565p37K10Q68R39Q06P27N20m9q43
3004I74j576j459o05N18J526J860J182M2r28j152r98p01m86P5N18J126J321J089
$$ plain form
2879 2603 2912 1780 -202 -1762 -2420 -2086 -1281 -272 649 1466 2040 2106 1372 -269 -2042 -2882 -2228 -579
2897 -579 1220 2293 2357 1477 330 -733 -1470 -1944 -2069 -1566 -54 1661 2815 2661 1448 -549 -2086
2914 -2086 -2518 -1925 -583 582 1307 1711 1717 1318 294 -1118 -2325 -2796 -1986 -83 1905 2869 2424 1142
2932 1142 -245 -1220 -1694 -1618 -1365 -703 417 1701 2566 2171 573 -1396 -2547 -2635 -1610 -25 1241
2949 1241 1860 1869 1524 909 -43 -1324 -2296 -2272 -1210 535 2080 2628 2029 457 -1112 -1946 -1960 -1528 -846
2968 -846 76 1169 2030 2321 1768 342 -1463 -2713 -2605 -1210 548 1745 2017 1602 815 -130 -858 -1602
2986 -1602 -2134 -1928 -718 1091 2688 2919 1835 98 -1467 -2204 -1994 -1126 -187 619 1346 1866 1817 974
3004 974 -602 -2061 -2666 -2148 -622 1238 2420 2462 1534 382 -616 -1317 -1803 -1728 -1210 -84 1237 2326
3022B326N9j124j878j488m46P37J298J254P44K76q6k88q40j328j351n36Q01J677
3040a93J794Q55l03j175j443q61l26P1L42O52J182J242P02m05j338j854j339k85
3058b682J005J484J277N98n7l99p12p97r91p56o5Q12J802J676P24p63j596j528
3076i68r76m3M87P21Q44Q06Q37M00m53j480j774r89K44J335J727J113M18n21q66
3095H62r08q13p48n44L35J107J588J260L12p43j712j475o29L27Q11R73R43N75
3113A521K88k05o92j260j468q33L36J514J826J125N7q39j117r54n45k48pM55R90
3132e6J438J035k8j133j855j479m53N94J200J268O86L65rl60p86j279j062k76
3150b190N72J534J650R89k92j280j347j051l52L2N14P64R74R98N84j06j118j809
$$ plain form
3022 2326 2385 1261 -617 -2105 -2551 -1814 -516 738 1482 1758 1672 1384 544 -784 -2135 -2671 -1870 -193
3040 -193 1601 2456 2153 978 -465 -1326 -1652 -1581 -1239 -587 595 1837 2539 2134 796 -1058 -2397 -2682
3058 -2682 -1677 -193 1084 1682 1625 1226 514 -283 -1274 -2030 -2095 -1283 519 2195 2919 2156 560 -968
3076 -968 -1944 -1987 -1500 -779 65 871 1708 2108 1655 175 -1599 -2588 -2344 -1009 718 1831 2249 1728 862
3095 862 -46 -859 -1607 -2151 -1816 -709 879 2139 2451 1708 -4 -1479 -2108 -1781 -970 3 946 1521
3113 1521 1809 1604 912 -348 -1816 -2649 -2313 -799 1027 2152 2209 1370 253 -701 -1246 -1494 -1501 -1046 -56
3132 -56 1382 2417 2389 1256 -599 -2078 -2531 -1937 -737 531 1217 1582 1573 1213 427 -852 -1914 -2190
3150 -2190 -1618 -84 1566 2555 2263 983 -364 -1415 -1767 -1735 -1221 -457 517 1515 2099 1993 875 -934
3168i34j317j76R62J516J267N43j75n77o71p70r13p84j92Q92J674J602O41n60
3186B028j390j491q06k1N12O80O96P54P27K21o09j245j458j075M6J200J662J246
3204A677L41l82q53p96p69n71k45J93Q04J381J252M52q51j610j572p77L30Q89
3222a107J124P46N89K64m1n40j208j382q24L85J309J714J070J9q80j165r43m56
3240a326k85N4M92J068J231R17N4r41j554j528m87O54J167J117O97K01j90n30
3258H11o70j010q69m66N02J426J747Q73j65j072j389r61l19J81M86N45P45R49
3276A344O32k53j157j525j183l17R94J394J273N67j55m65n67p96q70p13K2P64
3294a011J287J335P30m88j366j429q30mM46Q77Q01P60M58J36l56j025j491j112
$$ plain form
3168 -934 -2251 -2427 -1465 51 1318 1861 1686 1109 438 -332 -1245 -2029 -2221 -1329 345 1947 2588 2028
3186 2028 638 -853 -1659 -1680 -1168 -488 208 962 1689 1910 1301 56 -1402 -2477 -2431 -1231 431 1677
3204 1677 2018 1636 783 -13 -782 -1353 -1598 -1405 -601 780 2032 2484 1633 23 -1549 -2326 -1996 -1107
3222 -1107 17 763 1352 1616 1575 1035 -173 -1555 -2379 -1994 -685 1029 2099 2118 1238 73 -870 -1326
3240 -1326 -1611 -1557 -1065 3 1234 2151 2205 1264 -290 -1818 -2305 -1651 -484 633 1330 1531 1341 811
3258 811 141 -869 -1738 -2204 -1702 -276 1471 2344 2179 1107 -282 -1243 -1562 -1381 -895 -350 395 1344
3276 1344 1976 1723 566 -959 -2142 -2459 -1465 -71 1202 1769 1614 1149 582 -214 -1084 -1797 -1775 -1011
3294 -1011 276 1611 2341 1853 487 -942 -1772 -1776 -1330 -453 348 1108 1566 1702 1346 321 -1170 -2282
3312b282M7J043J598J173L79n43q95q77n28m07k60J91Q14J350J302K19p34j464
3330A26j555o28K70Q87R48P22M18K48j00o77j081j106n50K48J223J539J135J22
3348B189r26j089r03o04j73K79M38P66R67Q77J49q01j514j350n08M95J198J219
3366G09P47Q3k54m36o24r17r84m00N36J336J453Q62j27j042j309r38k30J68M70
3385h97O26Q56Q50M43j97r85j466j185k88Q07J325J175O28j21o42p18p30n49m17
3404a485j20O53J244J366O27m43j240j460r45pO79P85O86N19M66K11l25j021j279
3423a089j001M4J053J488J066L33m67q22q06o40n02j77L20P68J060J057L77o06
3441A456j258j406p17K06Q15J043P83L87J9k26m99q26j084p49K22J131J511J035
$$ plain form
3312 -2282 -2235 -1192 406 1579 1958 1415 520 -357 -885 -1292 -1552 -1361 -547 803 2105 2324 1590 126
3330 126 -1429 -2057 -1787 -900 48 770 1188 1436 1336 659 -422 -1528 -2078 -1830 -607 932 2067 2189
3348 2189 1263 174 -729 -1333 -1506 -1227 -789 -23 944 1821 1970 1169 -345 -1695 -2203 -1708 -510 709
3366 709 1456 1539 1285 849 225 -692 -1676 -2076 -1540 -204 1249 2111 1984 942 -367 -1305 -1535 -1367 -897
3385 -897 -271 585 1435 1878 1681 696 -770 -1955 -2243 -1436 -111 1064 1692 1571 929 211 -519 -1068 -1485
3404 -1485 -1605 -952 292 1658 2285 1842 602 -858 -1803 -1810 -1131 -346 340 859 1325 1536 1211 190 -1089
3423 -1089 -2090 -2046 -993 495 1561 1894 1427 605 -201 -841 -1343 -1520 -1200 -432 628 1685 2062 1456
3441 1456 198 -1208 -1925 -1719 -904 139 922 1309 1328 1102 603 -223 -1307 -2056 -1834 -703 808 1843
3459A843J90p17j186j017m17M6K66K79P59J009Q19Nq58j361j346m67N18J138J161
3478F64N94K07k14m55o98q52p46k17M33J120J368Q56j98r90j275r22k99K38O36
3497g50O59O73O24L99q2q53j325j223j84O85J342J201N23k07o44o96n76n92m56
3516a482p5N92J175J247O48k94j251j422q17L5N73O82O97O02L66P3l71q59j109
3535i90r31QQ26J488J073M37l85r21q89o73k52l1K01N93R57J062L71n50j268j339
3555a213p63K57Q71J096P30K58p3j44m26q74r74n69J76J004J457R57J55p56j106
3574F3r17l68n7K22N32P12Q35N74J63p58j265j264m64L84J120J113O33J49l59
3593A048n22n65n72o73l44L51J078J313Q22m7r15j361r62k17L41N69N43O41N84
$$ plain form
3459 1843 2033 1316 130 -887 -1304 -1258 -992 -713 46 1055 1874 1879 1021 -340 -1686 -2153 -1635 -497 664
3478 664 1258 1465 1251 796 98 -754 -1500 -1717 -1284 -164 1204 2060 1862 872 -403 -1325 -1624 -1386 -750
3497 -750 -91 582 1206 1605 1523 670 -655 -1878 -2062 -1377 -35 1166 1689 1482 838 142 -434 -1026 -1482
3516 -1482 -1557 -965 210 1457 2105 1811 560 -862 -1679 -1644 -1071 -389 308 910 1276 1349 978 119 -990
3535 -990 -1921 -1913 -1087 401 1474 1911 1526 605 -284 -957 -1209 -1240 -1039 -446 511 1573 1944 1394 126 -1213
3555 -1213 -1976 -1719 -848 248 978 1236 1163 1019 593 -281 -1255 -1824 -1648 -644 813 1770 1925 1169 63
3574 63 -854 -1222 -1279 -1057 -525 187 1022 1596 1759 1001 -264 -1528 -1992 -1608 -488 625 1258 1407 1048
3593 1048 526 -39 -611 -1284 -1628 -1277 -199 1114 1936 1889 974 -387 -1349 -1566 -1225 -656 -113 528 1112
3612A112L87j73p20j259j102k31O87J302J132M68j54n95o94o69n44l34L6M66J089
3631B04J103N73k93j036j253q51j17N62R00P34M99J72J4l15o98j137q26r5P84
3650a076J340J191L93m81r32q78m87j45k0J91O55Q97Q11L79n18j205j331o57K04
3669a669R09R03P33L24r3j95m97p41p97m58J35Q96J251R59J34o64j074r45n05
3688a394R3L43N18N66O61O58J41o02j154j162n24L17J107J191O19n9l71m81n48
3707h1n99o22k33L11J025J231P77Mr99j174p90k91L33N40O08N81M80J81j21p54
3727D07j104r15k36O48J117J100N83j33o84p85n84l03k41M9L84R58R16N76j96
3746A557j061j311p88o3O89Q77N66L88K38N3l51o55r95p41m0P74J232J077K26
$$ plain form
3612 1112 1499 1326 606 -653 -1755 -1986 -1299 3 1135 1603 1449 854 160 -509 -1053 -1387 -1351 -885 204
3631 204 1307 1880 1587 551 -702 -1553 -1670 -1108 -208 526 1025 1197 1211 896 198 -939 -1765 -1860 -1076
3650 -1076 264 1455 1848 1367 435 -443 -930 -1075 -1095 -904 -249 648 1459 1838 1320 115 -1216 -1873 -1669
3669 -1669 -760 143 876 1200 1107 912 415 -326 -1123 -1581 -1446 -550 701 1660 1794 1130 56 -889 -1394
3688 -1394 -1301 -958 -440 126 787 1445 1586 984 -170 -1332 -1856 -1539 -432 759 1378 1319 948 467 -81
3707 -81 -680 -1302 -1535 -1224 -199 1032 1809 1813 814 -360 -1150 -1441 -1108 -568 40 621 1101 1282 1161 407
3727 407 -697 -1612 -1848 -1200 -83 1017 1600 1467 783 -2 -586 -889 -1130 -1081 -697 261 1177 1753 1557
3746 1557 496 -815 -1603 -1666 -977 -100 466 854 1092 1145 794 139 -856 -1597 -1637 -863 369 1446 1672
3765A672m67q04q69n27j93R5K85N80P76Q16L26m72j082j120p06J43P56J043P35
3784I87K62k29l53m08o58o03n37J48Q73J207R17K51o96j132r06l40J30L53L88
3803c46N44N69M66R4n11j062j163m47M85J062R61N88O3l68m99n61n18m08k41K65
3823a027Q97J033O79o5p39j160q09k94L77O95N81M39L82K48j72o36r49q59l72
3842a751N63J074J101N20k72o84o52n09l30j83J19M57Q23R27N26k64j020j219
3860g74o81PN50P29O91M06P0j05l45o03p33o91KP08J092R92L33l48r08q54n31
3881i93o0J57K99M43O31O61K27l21r24j106o23J00R39R70O27J03j04l87l75n72
3901c08o86l90J39P62J089Q59O4n56r93p75l74J50L85M96N01M57L66M9m97r87
$$ plain form
3765 1672 1205 401 -468 -995 -1188 -1093 -808 -228 548 1364 1690 1218 136 -984 -1690 -1547 -791 252 987
3784 987 1249 1020 667 259 -399 -1002 -1539 -1391 -518 689 1606 1857 1161 29 -877 -1217 -1087 -734 -346
3803 -346 198 767 1233 1327 816 -246 -1409 -1856 -1371 -309 652 1240 1303 935 436 -125 -643 -1051 -1292 -1027
3823 -1027 -130 903 1582 1517 778 -382 -1191 -1485 -1108 -413 168 607 989 1237 1065 429 -520 -1379 -1751
3842 -1751 -1188 -114 987 1507 1235 551 -101 -610 -940 -1123 -1004 -547 276 1203 1729 1465 445 -774
3860 -774 -1455 -1448 -898 -169 522 928 998 893 548 -55 -788 -1479 -1477 -769 323 1315 1648 1300 392 -462 -993
3881 -993 -1053 -896 -597 -154 477 1138 1365 1044 120 -986 -1609 -1509 -570 400 1027 1130 1026 639 264 -308
3901 -308 -994 -1384 -1245 -483 606 1465 1529 973 -20 -795 -1169 -1019 -634 -138 363 820 1186 1235 738 -249
3921b49r28m37L16Q38J033O22j0m01n92m07m22l25j22K99O86R66O22Oo75j215
3941c95q36j48M93M78N44M32K96J19j14n68p69q31j87N55J000R70M01k90n66o84
3961a00n25l00o2J22M21P27P16M41k74p60j021o89m5M94Q48O34K62k5q5k99n69
3982h9o12n59j04N97R68R52L92m79p76p45l55o0J70L15L33N34N94K78l66r53r91
4003i56n61K03P39Q74N18K53j68l75m16m49m67k91J12O59R03O91J74n28q82q98
4023h65l35J35M20N33L96M23L00J9m07p71p79m67K51Q80R11N73q7m40n20m78l61
4044f69k52m2J68P01Q40O64j12o23r85o84j52K36N84N12L86K15J03j95n04p33
4064e42o10j80M15Q38R68M43j99o03p06m58j66N8Q3L36N23O31L92j54p06j003
$$ plain form
3921 -249 -1177 -1614 -1298 -460 573 1195 1185 784 192 -215 -637 -962 -1084 -785 -99 867 1489 1495 820 -395
3941 -395 -1231 -1379 -886 -408 136 568 864 983 869 301 -468 -1299 -1486 -931 69 1039 1440 1150 584 -100
3961 -100 -625 -925 -987 -865 -444 283 999 1440 1166 406 -615 -1304 -1349 -855 -7 627 889 864 779 480 -89
3982 -89 -701 -1260 -1364 -767 201 1153 1545 1066 290 -455 -810 -870 -700 -385 -52 482 1076 1354 988 35 -956
4003 -956 -1517 -1314 -575 299 817 1070 902 527 111 -338 -805 -1096 -984 -325 578 1269 1443 915 33 -865
4023 -865 -1200 -1065 -645 -112 284 707 1007 1026 619 -152 -931 -1398 -1147 -267 644 1217 1130 690 170 -308 -669
4044 -669 -921 -963 -795 -94 746 1410 1298 675 -310 -994 -1146 -910 -326 186 572 787 890 695 191 -542
4064 -542 -1152 -1332 -917 -79 889 1332 1133 530 -176 -634 -800 -742 -659 -323 200 831 1223 1069 363 -640
4084f40o40lN78P53N39K91l2k09k36m48n46n25NM65R09P62K25l12p53o88l64p0
4106i39K37L01M14M97M29K24l41p50q10m82N9O09Q20O23J34l39l01l95l89l60
4126g59j87R1M65Q76O89J49m69r28p20j81J28L18M87L40L03K05Qk81p70p22k76
4147a234K29P90P62M62L8l66n71m23k63k33n5K46N78O65M87L9n81p92p67k00L58
4168h31N67N33L35J67o9j39l30o25n55k36K88Q04Q84M07k26n72o29l59j52M8J37
4189e53L42M49N58L45j32o79q50n64k5M58O74N05K70j26j19l04l32m93l37l5M34
4210e14P46O62L47l85o38p06l99M8K55K78K77M18L33J55k10o06p16n32J53N85
4230d49P32N64M5j69m07l47l54l19k01R8M88P00O58J15m34p54o57k67J54M71L68
$$ plain form
4084 -640 -1280 -1283 -705 48 587 878 846 637 401 -47 -593 -1118 -1113 -648 261 1023 1248 936 183 -505 -869 -939
4106 -939 -702 -401 13 510 939 1163 822 72 -738 -1220 -1161 -552 268 891 1025 686 385 -10 -399 -759
4126 -759 -946 -855 -390 486 1175 1324 855 -73 -793 -974 -846 -528 -41 299 602 807 815 534 -236 -958 -1234
4147 -1234 -1005 -215 547 1009 1047 681 110 -313 -576 -809 -864 -618 -40 625 1112 1151 570 -222 -989 -1189 -831
4168 -831 -264 269 604 771 702 563 233 -392 -947 -1183 -895 -91 793 1200 974 402 -227 -586 -738 -690 -553
4189 -553 -211 238 796 1141 1009 330 -520 -1084 -1109 -651 23 528 798 672 553 249 -83 -576 -913 -948 -514
4210 -514 232 894 1241 856 218 -488 -887 -839 -584 -306 -29 389 722 877 667 61 -655 -1187 -1034 -449
4230 -449 283 847 892 723 316 -31 -385 -704 -905 -807 -319 381 1039 1154 720 -34 -691 -958 -804 -333 35
4251C5L33K50J86k8l96o03n74l16J98O43P25M98L5m31m95m29k12n7jJ91M62N09
4273E23N04N2n60q36o49q7L51M67N64K47K9j5j15l14n23m95j48K99P60O21L51
4294A026j30m99n68m65m1M7J09L31M76L82K46j51m62p42m85j26M24O77M72K36
4314G57j54j67k60l27l52l08J7L12O60O82K47l38o30n83l38R6K45K49K67K99L06
4335F80J64k74n36o78l96J25N66N93N06R8k49l34l40k72k55j47J51M44N56M14
4355H16J70l40p09o36k20K17L43M67K61J75J01o3k53m58n40l43K13N98O85M18
4375I02j10l22m65l65j94K0oJ79M02M67M01k4n12o21n36j67K89M71N11J36J34
4396E90o2k09k87m44k93r2K26N54O39L20r0n62m52l96o3Q0K35K59K43L62K29j13
$$ plain form
4251 35 368 618 804 776 380 -223 -797 -1113 -915 -272 453 951 986 555 60 -369 -581 -638 -639 -448 14 523
4273 523 1027 1079 519 -317 -966 -1053 -702 -235 329 576 605 590 475 161 -362 -857 -1005 -706 54 675 1026
4294 1026 896 397 -171 -636 -677 -630 -521 -190 286 668 914 763 301 -441 -926 -1052 -628 49 521 757
4314 757 603 436 176 -151 -503 -811 -794 -482 178 860 1107 769 139 -444 -782 -686 -441 -192 75 374 680
4335 680 844 570 34 -644 -1040 -915 -349 244 750 848 599 265 -75 -347 -602 -749 -598 -154 402 816
4355 816 986 646 -63 -699 -919 -702 -359 108 369 544 645 582 329 -129 -669 -1012 -799 -201 484 902
4375 902 792 470 5 -360 -554 -534 -540 -361 41 508 909 885 373 -248 -784 -951 -662 -191 320 456 590
4396 590 528 319 32 -412 -705 -797 -571 -17 622 942 852 290 -162 -558 -621 -541 -306 -47 196 558 787 674
4418F74m26o51n29L4L77O34M36J41j12j92k96k90k40k32m8L36O24M56J62k22n06
4439A30n28l17Q8K29K54K53K71K81m4j31m88n08l45j6M88O00M48O7k18l24l11
4460a21k25j90m5L3M19M27M16J23l47n99m68k19J95L50L51K34P4R1o8j58m51n10
4482f88j53J93N09N85K95K1l96l99l16j65j8J05J71L34L91K60J2l68n68m85j11
4503g91J88M85M52K00Qj47j73k42k98k58j38J63M73O28K31j06l94n13k52q9J95
4524c78J00K49K23K60K23j31m09n44l58mK99N72L65J60j34k06j94k46k69j09j2
4545e43K73M87L77K01j56n01n13k81M6L28K71K07J44P1L1p6l58m47k58l4M66M99
4567B34L63K3k11l37j97j90j23q0O8L20M29L19J02l02m65m32j87J46K83L20K48
$$ plain form
4418 674 248 -403 -932 -898 -521 113 549 690 578 386 90 -200 -440 -672 -720 -384 240 696 858 636 130
4439 130 -398 -715 -627 -398 -144 109 380 661 617 486 -2 -510 -855 -871 -383 217 665 732 514 190 -121
4460 -121 -346 -536 -581 -548 -129 298 714 837 490 -109 -577 -796 -601 -251 100 334 408 499 431 273 -178 -688
4482 -688 -841 -648 -139 446 741 762 366 -33 -349 -514 -532 -427 -256 78 469 729 741 373 -195 -680 -791
4503 -791 -603 -118 334 534 542 395 222 -20 -318 -576 -714 -551 -78 550 781 675 281 -232 -484 -573 -378
4524 -378 -278 -29 194 454 677 546 137 -407 -765 -769 -470 102 467 627 493 287 93 -153 -422 -531 -543
4545 -543 -270 217 594 795 639 138 -375 -656 -610 -282 -11 196 340 411 442 366 8 -439 -697 -731 -265 234
4567 234 597 620 409 72 -125 -315 -438 -518 -450 -130 299 618 720 418 -47 -479 -666 -520 -237 83 331
4588C31J05K1j22k05k80l54j38Q1L94N25L13ml55l86k36j38RJ14J66K20K31K99
4610E91M1l57m95l82r8K67L31L90J86j01kj69k07k39k81mJ37M40L42K94j19l95
4632A70l91k96k4J37K08J53K63J87J26j22k12m72l60l9L01M48L76J14j55k10k21
4653a9j82r8j18l2K25L74L59J50j25m28m68k00Q2K46K13K17Q1J45k3j45k74m01
4675d21k26Q2L04M92K80O8j70k96k46j86l5J0N5K13L08K94M7j79m09n09m4L3L64
4698a71K99J62J10q7j7j35k45l10j75J25L43M11K89o4k46l71j81p0j6M8J78J38
$$ plain form
4588 331 436 457 335 130 -150 -504 -642 -561 -167 358 671 667 312 -74 -310 -448 -439 -325 -159 61 292 591
4610 591 632 275 -220 -602 -700 -433 -102 288 474 373 371 202 -5 -244 -525 -529 -392 48 390 684 565 170
4632 170 -221 -517 -541 -404 -196 -43 220 407 533 411 199 -273 -633 -672 -371 77 453 567 412 202 -19
4653 -19 -201 -299 -417 -449 -224 150 509 659 534 106 -362 -562 -480 -234 -21 196 277 422 399 254 -20 -421
4675 -421 -647 -565 -261 231 511 579 409 113 -133 -319 -354 -344 -289 -76 232 526 573 394 -15 -524 -568 -535 -171
4698 -171 128 290 400 313 296 161 -84 -394 -569 -444 -101 310 599 535 289 -82 -263 -333 -349 -301 -123 15
$$ [...]
8191b64
##END NTUPLES=NMR FID
##END=
