##TITLE=1H_Pr 4exD
 DMSO
 8 sc, 
 15.03.2022
##JCAMPDX= 6.0         $$ Bruker NMR JCAMP-DX V2.0
##DATA TYPE= NMR FID
##DATA CLASS= NTUPLES
##ORIGIN= UXNMR, Bruker Analytische Messtechnik GmbH
##OWNER= root
$$ XWIN-NMR		Version 3.5
$$ Tue Mar 15 12:53:24 2022 Russian Standard Time (UT+4h)  she@DPX200
##.OBSERVE FREQUENCY= 200.131346
##.OBSERVE NUCLEUS= ^1H
##.DELAY= (6, 6)
##.ACQUISITION MODE= SIMULTANEOUS
##.ACQUISITION SCHEME= undefined
##.AVERAGES= 8
##.DIGITISER RES= 18
##SPECTROMETER/DATA SYSTEM= spect
##.PULSE SEQUENCE= zg30
##.SOLVENT NAME= DMSO
##.SHIFT REFERENCE= (INTERNAL, DMSO, 0, 15.7039)
##AUDIT TRAIL= $$ (NUMBER, WHEN, WHO, WHERE, WHAT)
$$ ##TITLE= Audit trail, XWIN-NMR		Version 3.5
$$ ##JCAMPDX= 5.01
$$ ##ORIGIN= Bruker BioSpin GmbH
$$ ##OWNER= she
$$ F:/spectra/data/she/nmr/H-F/1/audita.txt
$$ ##AUDIT TRAIL=  $$ (NUMBER, WHEN, WHO, WHERE, WHAT)
(   1,<2022-03-15 12:51:51.78 +0400>,<she>,<DPX200>,
      <created by zg, POWCHK disabled, PULCHK disabled
       configuration hash MD5:
       00 E9 B6 7A A2 85 ED C7 34 08 36 98 17 FE 4E 26
       data hash MD5: 16K
       43 ED 70 D0 F5 7E 13 67 B2 F2 6F 94 39 E9 96 A1>)
$$ ##END=
$$ 
$$ hash MD5
$$ 14 5E B3 DF AC 04 88 8A 27 92 A6 0E A4 AE A9 59
##$RELAX= 
##$RELAX= 
##$RELAX= 
##$RELAX= 
##$RELAX= 
##$RELAX= 
$$ Bruker specific parameters
$$ --------------------------
##$DU= <F:/spectra>
##$EXPNO= 1
##$NAME= <H-F>
##$PROCNO= 1
##$TYPE= <nmr>
##$USER= <she>
##$AMP= (0..31)
100 100 100 100 100 100 100 100 100 100 100 100 100 100 100 100 100 100 
100 100 100 100 100 100 100 100 100 100 100 100 100 100 
##$AQSEQ= 0
##$AQ_mod= 1
##$AUNM= <au_zg>
##$AUTOPOS= <>
##$BF1= 200.13
##$BF2= 200.13
##$BF3= 200.13
##$BF4= 200.13
##$BF5= 200.13
##$BF6= 200.13
##$BF7= 200.13
##$BF8= 200.13
##$BYTORDA= 1
##$CFDGTYP= 0
##$CFRGTYP= 5
##$CHEMSTR= <none>
##$CNST= (0..31)
1 1 145 1 1 1 1 1 1 1 1 1 1 1 1 1 1 1 1 1 1 1 1 1 1 1 1 1 1 1 1 1 
##$CPDPRG= <>
##$CPDPRG1= <>
##$CPDPRG2= <>
##$CPDPRG3= <>
##$CPDPRG4= <mlev>
##$CPDPRG5= <mlev>
##$CPDPRG6= <mlev>
##$CPDPRG7= <mlev>
##$CPDPRG8= <mlev>
##$CPDPRGB= <>
##$CPDPRGT= <>
##$D= (0..31)
0 1.2 0 0 0 0 0 0 0 0.06 0 0.03 0 0 0 0 0.0002 0 0 0 0 0 0 0 0 0 0 0 0 
0 0 0 
##$DATE= 1647334311
##$DBL= (0..7)
120 120 120 120 120 120 120 120 
##$DBP= (0..7)
150 150 150 150 150 150 150 150 
##$DBP07= 0
##$DBPNAM0= <>
##$DBPNAM1= <>
##$DBPNAM2= <>
##$DBPNAM3= <>
##$DBPNAM4= <>
##$DBPNAM5= <>
##$DBPNAM6= <>
##$DBPNAM7= <>
##$DBPOAL= (0..7)
0.5 0.5 0.5 0.5 0.5 0.5 0.5 0.5 
##$DBPOFFS= (0..7)
0 0 0 0 0 0 0 0 
##$DE= 6
##$DECBNUC= <off>
##$DECIM= 32
##$DECNUC= <off>
##$DECSTAT= 4
##$DIGMOD= 1
##$DIGTYP= 9
##$DL= (0..7)
0 120 120 120 120 120 120 120 
##$DP= (0..7)
150 150 150 150 150 150 150 150 
##$DP07= 0
##$DPNAME0= <>
##$DPNAME1= <>
##$DPNAME2= <>
##$DPNAME3= <>
##$DPNAME4= <>
##$DPNAME5= <>
##$DPNAME6= <>
##$DPNAME7= <>
##$DPOAL= (0..7)
0.5 0.5 0.5 0.5 0.5 0.5 0.5 0.5 
##$DPOFFS= (0..7)
0 0 0 0 0 0 0 0 
##$DQDMODE= 0
##$DR= 18
##$DS= 0
##$DSLIST= <SSSSSSSSSSSSSSS>
$$ [...]
##$SUBNAM2= <"">
##$SUBNAM3= <"">
##$SUBNAM4= <"">
##$SUBNAM5= <"">
##$SUBNAM6= <"">
##$SUBNAM7= <"">
##$SUBNAM8= <"">
##$SUBNAM9= <"">
##$SW= 18.0517287032376
##$SWIBOX= (0..15)
0 0 2 0 0 0 0 0 0 0 0 0 0 0 0 0 
##$SW_h= 3612.71676300578
##$TD= 16384
##$TD0= 1
##$TE= 0
##$TE2= 300
##$TE3= 300
##$TEG= 300
##$TL= (0..7)
0 120 120 120 120 120 120 120 
##$TP= (0..7)
150 150 150 150 150 150 150 150 
##$TP07= 0
##$TPNAME0= <>
##$TPNAME1= <>
##$TPNAME2= <>
##$TPNAME3= <>
##$TPNAME4= <>
##$TPNAME5= <>
##$TPNAME6= <>
##$TPNAME7= <>
##$TPOAL= (0..7)
0.5 0.5 0.5 0.5 0.5 0.5 0.5 0.5 
##$TPOFFS= (0..7)
0 0 0 0 0 0 0 0 
##$TUNHIN= 0
##$TUNHOUT= 0
##$TUNXOUT= 0
##$USERA1= <user>
##$USERA2= <user>
##$USERA3= <user>
##$USERA4= <user>
##$USERA5= <user>
##$V9= 5
##$VALIST= <valist>
##$VCLIST= <CCCCCCCCCCCCCCC>
##$VD= 0
##$VDLIST= <DDDDDDDDDDDDDDD>
##$VPLIST= <PPPPPPPPPPPPPPP>
##$VTLIST= <TTTTTTTTTTTTTTT>
##$WBST= 1024
##$WBSW= 4
##$XGAIN= (0..3)
0 0 0 0 
##$XL= 0
##$YL= 0
##$YMAX_a= 108496
##$YMIN_a= -83909
##$ZGOPTNS= <>
##$ZL1= 120
##$ZL2= 120
##$ZL3= 120
##$ZL4= 120
##$ABSF1= 10
##$ABSF2= 0
##$ABSG= 5
##$ABSL= 3
##$ALPHA= 0
##$AQORDER= 0
##$ASSFAC= 0
##$ASSFACI= 0
##$ASSFACX= 0
##$ASSWID= 0
##$AUNMP= <proc_1d>
##$AZFE= 0.1
##$AZFW= 0.1
##$BCFW= 1
##$BC_mod= 2
##$BYTORDP= 1
##$COROFFS= 0
##$CY= 11.3945322036743
##$DATMOD= 1
##$DC= 2
##$DFILT= <>
##$DTYPP= 0
##$F1P= 2.36226072786647
##$F2P= -0.459571619588291
##$FCOR= 0.5
##$FTSIZE= 0
##$FT_mod= 4
##$GAMMA= 1
##$GB= 0.15
##$INTBC= 1
##$INTSCL= 1
##$ISEN= 128
##$LB= 0.24
##$LEV0= 0
##$LPBIN= 0
##$MAXI= 10000
##$MC2= 0
##$MEAN= 0
##$ME_mod= 0
##$MI= 1.114404
##$NCOEF= 0
##$NC_proc= 0
##$NLEV= 6
##$NOISF1= 3.799351
##$NOISF2= 2.8
##$NSP= 1
##$NTH_PI= 0
##$NZP= 0
##$OFFSET= 15.70392
##$PC= 1
##$PHC0= -16951.25
##$PHC1= 14.20078
##$PH_mod= 1
##$PKNL= yes
##$PPARMOD= 0
##$PSCAL= 0
##$PSIGN= 0
##$REVERSE= no
##$SF= 200.130013532006
##$SI= 16384
##$SIGF1= 3
##$SIGF2= 2
##$SINO= 400
##$SIOLD= 16384
##$SREGLST= <1H.CDCl3>
##$SSB= 0
##$STSI= 0
##$STSR= 0
##$SW_p= 3612.71676300578
##$SYMM= 0
##$S_DEV= 0
##$TDeff= 0
##$TDoff= 0
##$TI= <>
##$TILT= no
##$TM1= 0
##$TM2= 0
##$TOPLEV= 0
##$USERP1= <user>
##$USERP2= <user>
##$USERP3= <user>
##$USERP4= <user>
##$USERP5= <user>
##$WDW= 1
##$XDIM= 8192
##$YMAX_p= 0
##$YMIN_p= 0
$$ End of Bruker specific parameters
$$ ---------------------------------
##NTUPLES= NMR FID
##VAR_NAME=  TIME,          FID/REAL,        FID/IMAG
##SYMBOL=    X,             R,               I
##VAR_TYPE=  INDEPENDENT,   DEPENDENT,       DEPENDENT
##VAR_FORM=  AFFN,          ASDF,            ASDF
##VAR_DIM=   8192,          8192,            8192
##UNITS=     SECONDS,       ARBITRARY UNITS, ARBITRARY UNITS
##FACTOR=    0.0002768,     1,               1
##FIRST=     0,             0,               0
##LAST=      2.2672688,     0,               0
##MIN=       0,             -83909,          0
##MAX=       2.2672688,     108496,          0
$$ Real data points
##PAGE= N=1
##DATA TABLE= (X++(R..R)), XYDATA
$$ plain form
0 0 0 0 0 0 0 0 0 0 0 0 0 0 0 0 -8 8 -8 8 -8 13 -16 16 -23 24 -29 32 -40 45 -51 58 -67 77 -89 99 -113 127
36 127 -142 159 -177 198 -220 244 -273 299 -331 367 -404 445 -491 541 -597 657 -725 799 -886
55 -886 979 -1087 1209 -1354 1526 -1731 1982 -2298 2713 -3282 4115 -5456 7972 -14409 71604
70 71604 108496 23225 39675 41435 14219 -27612 -3361 18787 -9179 -53318 -20741 39319
82 39319 35341 -44147 -83909 -55092 -30194 -47683 -43495 -1085 22595 -8016 -20029 30580 74603
95 74603 39199 -21384 -23188 20452 28226 642 635 25274 14634 -21844 -17299 33715 47010 -5459
109 -5459 -44558 -19444 15658 4490 -22851 -10282 14357 1210 -17339 9552 47071 26765
121 26765 -35361 -54620 -18442 -141 -22299 -33398 -5781 15842 781 -6221 25070 39795
$$ packed form
0@%%%%%%%%%%%%%%qJ6j6J6j6K1k9L2l9M7n3O1p2Q5r6J09j25J44j66J88k12K40
36A27k69L01l36L75m18M64n17N72o30O98p71Q49r36J032j138J254j382J524j685
55h86J865k066K296k563K880l257L713m280N011n995P397r571J3428k2381Q6013
70G1604L6892q5271J6450J760k7216m1831K4251K2148k7966m4139L2577O0060
82C9319l978p9488l9762K8817K4898j7489M188M2410K3680l0611j2013N0609M4023
95G4603l5404o0583j804M3640P774k7584pK4639j0640l6478M545N1014J3295n2469
109e459l9099K5114L5102j1168k7341J2569K4639j3147j8549K6891L7519k0306
121B6765o2126j9259L6178J8301k2158j1099K7617K1623j5061p002L1291J4725
$$ plain form
133 39795 -675 -43130 -25809 23194 33136 11038 14626 39665 36741 7550 -506 17923 7736
146 7736 -39043 -54945 -15932 20111 6618 -20087 -12084 4580 -10142 -29741 -15418 8863
158 8863 -2041 -29244 -15568 30363 41751 9898 -9385 7569 18713 260 -8066 14890
170 14890 24575 -2444 -24266 -2580 27982 13421 -21150 -19524 7599 10477 -9136 -8377 12547
183 12547 6135 -26538 -29728 4612 21727 -1875 -23254 -4238 17733 4471 -15187 -6029 10128
196 10128 -2795 -22402 -3990 32363 30609 -881 -9809 11700 18333 -4976 -16796 1888 11636
209 11636 -6137 -16577 5855 23718 -176 -31488 -23722 1907 1891 -15076 -8727 17035 18302
222 18302 -3407 -4410 17969 20334 -8450 -23604 1534 23771 10710 -7189 2354 15225 -1268
$$ packed form
133C9795m0470m2455J7321M9003R942k2098L588K5039k924k9191q056J8429j0187
146G736m6779j5902L9013L6043j3493k6705Q003J6664j4722j9599J4323K4281
158H863j0904k7203J3676M5931J1388l1853j9283J6954J1144j8453q326K2956
170A4890R685k7019k1822K1686L0562j4561l4571J626K7123K878j9613P59K0924
183A2547o412l2673l190L4340J7115k3602k1379J9016K1971j3262j9658R158J6157
196A0128j2923j9607J8412L6353j754l1490q928K1509O633k3309j1820J8684R748
209A1636j7773j0440K2432J7863k3894l1312P766K5629j6j6967O349K5762J267
222A8302k1709j003K2379K365k8784j5154K5138K2237j3061j7899R543J2871j6493
$$ plain form
235 -1268 -25664 -17658 4444 -1605 -24146 -18369 13102 23019 72 -10687 6995 14572 -3683
248 -3683 -13591 7587 25262 8650 -10601 1571 21311 9852 -17012 -17820 2824 2001 -17683
261 -17683 -16397 6176 10790 -11760 -20627 2186 16900 1247 -12381 3019 22111 11164 -8625
274 -8625 -1680 16098 6954 -14755 -10913 13103 15321 -7867 -14881 2928 7849 -12385 -24116
287 -24116 -5562 11499 -80 -11295 5683 24562 13376 -9909 -7671 10545 5608 -14410
299 -14410 -12063 11324 17154 -1819 -10315 6027 10890 -9741 -23289 -8363 8789 -342 -12810
312 -12810 1595 20746 13035 -7257 -6759 9684 8014 -10730 -11188 9169 14070 -3677 -12323 3211
326 3211 12159 -4873 -18727 -5818 9756 2844 -10813 -3049 13718 6765 -11392 -8154 10873
$$ packed form
235a268k4396Q006K2102o049k2541N777L1471R917k2947j0759J7682P577j8255
248c683r908K1178J7675j6612j9251J2172J9740j1459k6864q08K0644q23j9684
261a7683J286K2573M614k2550q867K2813J4714j5653j3628J5400J9092j0947j9789
274h625O945J7778r144k1709L842K4016K218k3188p014J7809M921k0234j1731
287b4116J8554J7061j1579j1215J6978J8879j1186k3285K238J8216m937k0018
299a4410K347K3387N830j8973q496J6342M863k0631j3548J4926J7152r131j2468
312a2810J4405J9151p711k0292M98J6443j670j8744m58K0357M901j7747q646J5534
326C211Q948j7032j3854J2909J5574o912j3657P764J6767o953j8157L238J9027
$$ plain form
339 10873 13504 -4433 -8958 8694 14629 -1662 -12357 -1871 6734 -5851 -17123 -2607 14708
352 14708 7107 -9893 -6961 9161 6850 -10323 -10653 5709 9333 -3516 -6008 10988 17523 -1199
366 -1199 -15412 -4969 7469 -545 -12699 -4298 10835 5734 -7516 -2530 12217 9208 -9463
379 -9463 -11886 6846 14773 1467 -7143 2905 9082 -4491 -15086 -4029 7011 -3378 -17326
392 -17326 -9066 9681 7272 -9613 -10817 3203 5888 -4841 -3310 15099 20814 4527 -4198
405 -4198 9136 18461 4345 -12730 -7246 5753 552 -10552 -4730 7350 -163 -19549 -19514 -1223
419 -1223 2964 -11116 -15304 1282 13606 5622 -239 10827 17434 4291 -8461 1552 17847
432 17847 11545 -6151 -5843 7067 6851 -7572 -11269 -336 240 -14275 -16061 772 10558 -1995
$$ packed form
339A0873K631j7937m525J7652N935j6291j0695J0486Q605j2585j1272J4516J7315
352A4708p601j7000K932J6122k311j7173l30J6362L624j2849k492J6996O535j8722
366a199j4213J0443J2438q014j2154Q401J5133n101j3250M986J4747l009j8671
379i463k423J8732P927j3306q610J0048O177j3573j0595J1057J1040j0389j3948
392a7326Q260J8747k409j6885j204J4020K685j0729J531J8409N715j6287q725
405d198J3334R325j4116j7075N484J2999n201j1104N822J2080p513j9386L5J8291
419a223M187j4080m188J6586J2324p984n861J1066O607j3143j2752J0013J6295
432A7847o302j7696L08J2910k16j4423l697J0933N76j4515j786J6833R786j2553
$$ plain form
446 -1995 -14880 -4403 10036 6141 -3478 2221 13288 8111 -5963 -2709 11555 8708 -9864
459 -9864 -15247 -38 9469 -745 -8008 627 5282 -5543 -14167 -2889 10200 2620 -10315 -3033
473 -3033 14629 16375 2648 -2454 5570 4187 -8629 -10222 3715 8767 -4879 -13885 -2352 9068
487 9068 860 -12274 -10032 659 -1239 -8717 -1382 12917 11040 -3553 -4884 9979 15170 1797
501 1797 -6746 1814 8470 605 -6080 1485 8301 -2959 -16174 -8746 6379 4327 -9059 -10568
515 -10568 1915 4686 -4886 -5705 5679 8243 -3161 -7592 6789 17282 6597 -6406 -2655
528 -2655 6960 2800 -7214 -3231 6540 2454 -9318 -7447 6389 7459 -7916 -14389 -3603 4385
542 4385 -1623 -6051 2132 9122 178 -7646 1402 12187 6191 -7391 -5378 8120 9557 -575
$$ packed form
446a995j2885J0477J4439l895r619N699J1067n177j4074L254J4264k847j8572
459i864n383J5209R507j0214p263Q635M655j0825q624J1278J3089p580j2935P282
473c033J7662J746j3727n102Q024j383j2816j593J3937N052j3646r006J1533J1420
487I068q208j3134K242J0691j898p478P335J4299j877j4593j331J4863N191j3373
501A797q543Q560O656p865o685P565O816j1260j3215P428J5125k052j3386j509
515a0568J2483K771r572q19J1384K564j1404m431J4381J0493j0685j3003L751
528b655R615m160j0014L983R771m086j1772J871J3836J070j5375o473J0786P988
542D385o008m428Q183O990q944p824R048J0785n996j3582K013J3498J437j0132
$$ plain form
556 -575 -2363 5074 4933 -6457 -9060 3110 8314 -3488 -12198 -4150 6399 1227 -8701 -5737 2741
571 2741 -673 -7792 -2380 10458 9285 -4110 -6657 4938 9966 747 -5704 1795 8080 1005
585 1005 -3698 3506 9944 997 -11739 -8438 3836 3124 -7030 -7244 2203 4444 -3547 -4899 4589
600 4589 6258 -4575 -10041 -243 9909 4005 -5419 -1132 6944 3693 -4422 -2370 6043 3008 -8289
615 -8289 -7667 4200 7857 -1992 -7621 603 7391 734 -4086 2155 7719 554 -8318 -2456 8247
630 8247 4786 -6250 -6028 3946 5420 -3648 -6253 1585 2203 -7414 -10708 -436 7609 734 -6777
645 -6777 16 9303 5851 -2977 -1360 6213 3386 -5260 -2531 8229 9428 -1408 -5904 2241 6011
660 6011 -2957 -9296 -3685 1488 -3555 -8733 -1466 7425 2935 -6502 -4422 4570 4695 -4237 -4957 3864
$$ packed form
556e75j788P437j41j1390k603J2170N204j1802q710Q048J0549n172r928K964Q478
571B741l414p119N412J2838j173j3395k547J1595N028r219o451P499O285p075
585A005m703P204O438q947j2736L301J2274p12j0154k14R447K241p991j352R488
600D589J669j0833n466R798J0152n904r424M287Q076l251q115K052Q413l035j1297
615h289O22J1867L657r849n629Q224O788o657m820O241N564p165q872N862J0703
630H247l461j1036K22R974J474r068k605P838O18r617l294J0272Q045o875p511
645f777O793R287l452q828J617P573k827q646K729J0760J199j0836m496Q145L770
660F011q968o339N611N173n043n178P267Q891m490r437K080Q992J25q932p20Q821
$$ plain form
676 3864 6315 -720 -2519 5640 9390 526 -6835 -747 5959 916 -6818 -3798 4175 1923 -5517
691 -5517 -3009 5087 4107 -5253 -6888 1969 5156 -2434 -6476 410 6133 1418 -4204 1548 7422
706 7422 1873 -6186 -3052 4462 3219 -5122 -4550 4002 4938 -1717 -4008 2718 5107 -3264 -7650 -1015
722 -1015 4804 286 -5463 -1198 6661 3858 -3539 -1906 4481 3117 -5030 -5360 3739 6182 -1225
737 -1225 -3739 3014 6718 58 -5936 -1250 3670 -1637 -7458 -3052 4883 2985 -4790 -3045 4181
752 4181 3854 -3752 -5286 1641 4520 -2221 -4556 2804 7564 1895 -3482 384 6078 1359 -6053
767 -6053 -3311 3247 2029 -4717 -3861 3839 4748 -2704 -4548 1404 3927 -2657 -6382 65 5357 982
783 982 -3978 264 6249 3025 -4149 -2659 3328 1654 -5265 -5218 2479 4138 -2237 -4356 1694 4809
$$ packed form
676C864K451p035j799Q159L750q864p361O088O706n043p734L020P973k252p440
691e517K508Q096r80r360j635Q857L187p590m042O886N723m715n622N752N874
706G422n549q059L134P514j243q341N72Q552R36o655k291O726K389q371m386O635
722a015N819m518n749M265P859k803p397J633O387j364q147l30R099K443p407
737a225k514O753L704o660n994M686M920n307n821M406P935j898p775J745P226
752D181l27p606j534O927K879o741k335P360M760n669n377L866N694m719p412
767f053K742O558j218o746Q56P700R09p452j844N952K523o584l725O447N292m375
783I82m960M242N985l224p174J490N987j674o919M7P697J659o375k119O050L115
$$ plain form
799 4809 -754 -5409 -442 4857 628 -3940 192 6460 4749 -1916 -1397 5251 4371 -2737 -4754 636
815 636 2339 -3318 -6002 -131 3466 -1812 -6382 -2935 2566 -335 -6149 -3336 2768 2616 -1864 -647
831 -647 6242 6845 356 -1775 3544 5932 453 -3374 796 5155 1280 -3718 -507 3843 341 -6826
847 -6826 -5822 637 -118 -5852 -5613 1117 3444 -1502 -3505 2059 4645 -545 -4004 334 5811 2962
863 2962 -2490 17 5152 3225 -2463 -2043 2668 2095 -4281 -4509 1839 3958 -965 -4296 592 4427
879 4427 516 -3270 -201 4151 613 -4256 -1683 4073 2572 -3702 -4031 1084 2260 -3623 -5062
894 -5062 -327 1230 -3178 -5216 -117 4521 1499 -2854 771 6414 4553 -197 614 5044 4292 -1099
910 -1099 -247 4708 4979 -1228 -4659 -606 1299 -3683 -7598 -4383 -681 -3257 -6317 -2525 2836 759
$$ packed form
799D809n563m655M967N299m229m568M132O268j711o665N19O648q80p108k017N390
815F36J703n657k684N871L597n278m570L447N501k901n814K813O104j52m480J217
831f47O889O03o489k131N319K388n479l827M170M359l875m998L211M350l502p167
847f826J004O459p55n734K39O730K327m946k003N564K586n190l459M338N477k849
863B962n452K507N135j927n688M20M711n73o376k28O348K119m923l331M888L835
879D427l911l786L069M352l538m869K573N756j501o274l29N115J176n883j439
894e062M735J557m408k038N099M638l022m353L625N643j861m750Q11M430p52n391
910a099Q52M955K71o207l431M053J905m982l915L215L702k576l060L792N361k077
$$ plain form
926 759 -4320 -2980 2843 4091 -418 -612 4810 6719 2866 1019 4984 6573 994 -3810 -1022 2867
942 2867 616 -4173 -3185 1136 365 -4424 -3667 147 356 -4467 -5247 478 3349 -345 -2473 816
958 816 4004 1473 -2420 653 4367 1187 -3350 -1698 3385 3103 -2217 -2836 2163 3431 -519 -1975
974 -1975 1710 3320 -971 -3815 557 4164 1443 -2942 -1075 3519 2019 -2880 -2526 406 -264 -4647
990 -4647 -4811 726 2320 -1348 -3376 324 3462 458 -3162 -471 2965 752 -1921 1067 5828
1005 5828 4824 -610 -916 2982 2850 -2013 -3456 43 1910 -1766 -3226 508 2829 -1316 -5190
1020 -5190 -2625 1374 -167 -3843 -2107 2209 1879 -1615 -1248 3129 3586 -1254 -2162 2017 4145 952
1036 952 -1926 811 3111 689 -2240 -318 3153 1202 -3443 -2399 1768 1418 -2828 -3765 -129 1493
$$ packed form
926G59n079J340N823J248m509j94N422J909l853j847L965J589n579m804K788L889
942B867k251m789R88M321p71m789P57L814K09m823p80N725K871l694k128L289
958H16L188k531l893L073L714l180m537J652N083k82n320o19M999J268l950j456
974a975L685J610m291k844M372L607k721m385J867M594j500m899L54K932o70m383
990d647j64N537J594l668k028L700L138l004l620K691L436k213k673K988M761
1005E828j004n434l06L898j32m863j443L499J867l676j460L734K321m145l874
1020e190K565L999j541l676J736M316l30l494L67M377M57m840r08M179K128l193
1036I52k878K737K300k422k929J922L471j951m645J044M167l50m246r37L636J622
$$ plain form
1052 1493 -1583 -2399 1381 3006 -146 -3076 -495 3284 763 -2677 -779 2928 2858 -447 -630 2739
1068 2739 2206 -2897 -3429 268 1834 -1079 -3204 289 2617 383 -2282 -736 2065 -137 -3350
1083 -3350 -1116 3253 3091 -513 -1018 2369 2682 -1268 -2430 324 1799 -1136 -3068 12 2868 -213
1099 -213 -3565 -1958 1499 691 -2301 -1428 2145 2290 -979 -1029 2316 3132 -797 -2266 990 3191 772
1116 772 -1699 114 2037 -141 -3533 -1810 1275 640 -2911 -2138 1844 1965 -1585 -2303 653 1977
1132 1977 -456 -2082 1265 3666 704 -1551 149 2705 1049 -2661 -1778 1422 966 -1605 -1304 2101
1148 2101 1861 -1887 -2837 385 1944 -724 -2342 197 3098 894 -1494 -231 2139 261 -2745
1163 -2745 -1653 1602 1871 -984 -1331 1148 2056 -1322 -2394 352 1636 -579 -2089 525 2822 1081
$$ packed form
1052A493l076q16L780J625l152k930K581L779k521l440J898L707p0l305j83L369
1068B739n33n103n32L697J566k913k125L493K328k234k665J546K801k202l213
1083c350K234M369j62l604n05L387L13l950j162K754J475k935j932L080K856l081
1099b13l352J607L457q08k992Q73L573J45l269n0L345Q16l929j469L256K201k419
1116G72k471J813J923k178l392J723L085o35l551P73L982J21l550p18K956J324
1132A977k433j626L347K401k962k255J700K556j656l710Q83L200m56k571L01L405
1148B101k40l748r50L222J559k668j618K539K901k204k388J263K370j878l006
1163b745J092L255K69k855l47K479R08l378j072K746J284k215j510K614K297j741
$$ plain form
1179 1081 -1877 -1058 1475 762 -2057 -1667 1461 1885 -1377 -1596 1127 1625 -1218 -2676 -165 1981
1195 1981 -21 -1689 279 2670 840 -2119 -1077 1373 946 -2072 -1236 1450 2011 -573 -1709 703
1211 703 1633 -1043 -2050 120 2633 890 -1449 140 2649 819 -2041 -1711 973 755 -1636 -1784
1227 -1784 1389 1630 -1376 -2239 -224 1194 -1238 -2626 99 2455 1722 -577 512 2990 1585 -1222
1243 -1222 -974 1678 1597 -849 -1215 1613 1506 -1570 -3137 -1476 51 -1857 -3312 -1178 1522 -66
1259 -66 -1683 -661 1677 1231 -1060 -258 2366 2736 668 128 2350 2800 -389 -1368 -84 1061 -567
1276 -567 -2779 -1449 861 -707 -2538 -2056 114 -20 -2100 -1500 1396 2186 370 -404 1612 2598 173
1293 173 -1413 416 1860 513 -1066 -61 1815 454 -2133 -2124 124 -72 -1748 -1637 753 2126
$$ packed form
1179A081k958Q19K533p13k819L90L128M24l262k19K723M98k843j458K511K146
1195A981k002j668J968K391j830k959J042K450m27l018Q36K686N61k584j136K412
1211G03R30k676j007K170K513j743k339J589K509j830k860L30K684k18k391j48
1227a784L173K41l006q63K015J418k432j388K725K356p33k299J089K478j405k807
1243a222K48K652q1k446l66K828j07l076j567J661J527j908j455K134K700j588
1259f6j617J022K338m46k291Q02K624L70k068n40K222M50l189r79J284J145j628
1276e67k212J330K310j568j831M82K170j34k080O00K896P90j816p74K016R86k425
1293A73j586J829J444j347j579J005J876j361k587RK248j96j676J11K390J373
$$ plain form
1309 2126 95 -626 693 1917 157 -1449 319 2170 1078 -604 -511 1509 721 -1802 -2152 -282
1325 -282 -36 -1701 -1985 212 1555 -419 -1642 170 1255 81 -958 502 2643 1826 -62 243
1341 243 2058 1054 -1344 -1610 454 810 -978 -1763 17 716 -968 -2683 -1063 736 -451 -1650
1357 -1650 -35 2010 1621 -333 -23 1584 1099 -832 -762 1225 1806 -305 -1146 259 1307 -760 -2137
1374 -2137 -997 415 -361 -1766 -301 1540 802 -976 -897 824 1124 -720 -699 954 1822 581 -391
1391 -391 716 1749 -348 -1594 -510 950 187 -1309 -666 900 223 -1466 -1518 211 566 -1260 -1471
1408 -1471 906 1727 174 -786 343 1438 247 -1003 207 1568 1349 -242 -181 1847 1239 -1027
1424 -1027 -1454 -161 379 -903 -1565 187 877 -496 -1565 -536 342 -377 -1804 -764 1060 612 -277
$$ packed form
1309B126k031p21J319J224j760j606J768J851j092j682R3K020p88k523l50J870
1325b82K46j665k84K197J343j974j223J812J085j174j039J460K141q17j888L05
1341B43J815j004k398k66K064L56j788p85J780O99j684j715J620J799j187j199
1357a650J615K045l89j954L10J607m85j931P0J987N81k111q41J405J048k067j377
1374b137J140J412p76j405J465J841p38j778P9J721L00j844K1J653Q68j241r72
1391c91J107J033k097j246J084J460p63j496O43J566o77j689n2J729L55j826k11
1408a471K377Q21j553r60J129J095j191j250J210J361k19j591O1K028o08k266
1424a027m27J293N40j282o62J752O90j373j069J029Q78p19j427J040J824m48q89
$$ plain form
1441 -277 43 1367 1459 -391 -863 906 1529 -25 -832 515 1329 122 -1123 -392 389 -31 -1257 -952
1459 -952 868 655 -976 -1217 207 551 -788 -1176 235 1153 154 -587 466 1301 -70 -1697 -792
1476 -792 509 -55 -828 -372 893 1025 -532 -443 693 562 -669 -902 443 1800 625 86 703 1225
1494 1225 29 -1438 -882 172 -370 -1480 -906 375 493 -734 -926 239 331 -615 -1031 388 1320
1511 1320 725 -367 594 1728 918 -609 -46 990 793 -775 -653 513 522 -880 -1440 -61 521 -722
1529 -722 -1192 -257 681 -44 -1159 -480 789 66 -913 228 1310 1310 -17 -159 933 589 -696 -1107
1547 -1107 -78 643 182 -478 504 1206 140 -991 -1157 415 -223 -1129 -538 1024 842 -110 -323 505
1565 505 709 -814 -1322 -38 704 -97 -457 421 1354 336 -535 -138 613 243 -863 -645 778 831 -281
$$ packed form
1441b77L20J324R2j850m72J769O23j554q07J347Q14j207j245P31P81m20j226L05
1459i52J820k13j631k41J424L44j339l88J411R18r99p41J053Q35j371j627R05
1476g92J301n64p73M56J265J32j557Q9J136j31j231k33J345J357j175n39O17N22
1494A225j196j467N56J054n42j110N74J281J18j227j92J165R2r46m16J419R32
1511A320n95j092R61J134q10j527N63J036j97j568J22J166Rj402n60J379N82j243
1529g22m70R35R38p25j115O79J269p23r79J141J082%j327j42J092l44j285m11
1547a107J029P21m61o60R82P02j066j131j66J572o38r06N91J562j82r52k13Q28
1565E05K04j523n08J284P42q01l60Q78R33j018q71L97P51l70j106K18J423N3j112
$$ plain form
1584 -281 -380 401 591 -548 -837 14 662 -150 -923 37 841 227 -631 4 671 736 129 -65 1171 767
1604 767 -386 -738 37 383 -323 -938 22 712 -172 -1047 -554 219 -293 -1239 -511 857 724 20 -32 647
1624 647 698 -131 -572 116 745 -96 -663 309 1083 605 -618 -514 127 -451 -1222 -618 109 575 -157 -140
1644 -140 818 890 -400 -936 8 609 -101 -432 -186 1001 330 -683 -331 241 -343 -1020 -965 252 533
1663 533 -410 -411 499 912 116 -401 277 1134 403 -410 59 718 524 -236 -261 394 189 -795 -1120 -287 -103
1684 -103 -871 -1428 -176 200 -252 -622 250 1134 626 -181 309 780 401 -170 -77 1036 1198 293 181 764
1704 764 502 -462 -1221 -782 -255 -1026 -1361 -96 436 201 -327 -304 440 78 -641 -555 532 574 44 143 704
1725 704 949 266 -334 36 185 -466 -1104 -528 155 129 -216 -176 617 118 -421 -635 137 114 -379 -415 409
$$ packed form
1584b81r9P81J90j139k89Q51O48q12p73R60Q04o14q58O35O67O5o07j94J236m04
1604G67j153l52P75L46p06o15R60O90q84q75M93P73n12r46P28J368j33p04n2O79
1624F47N1q29m41O88O29q41n67R72P74m78j223J04O41n78p71O04P27M66p32J7
1644a40R58P2j290n36R44O01p10l31K46J187o71j013L52N72n84o77N5J217K81
1663E33r43jR10M13p96n17O78Q57p31q13M69O59j94p60k5O55k05r84l25Q33J84
1684a03p68n57J252L76m52l70Q72Q84n08q07M90M71l79n71R3J113J62r05j12N83
1704G64k62r64p59M39N27p71l35J265N32k35n28K3P44l62p19Q6J087M2n30R9N61
1725G04K45o83o00L70J49o51o38N76O83k6l45M0P93m99n39k14P72k3m93l6Q24
$$ plain form
1746 409 981 383 -93 445 479 196 -474 -347 204 -146 -665 -645 224 212 -362 -132 289 552 4 -483 200
1767 200 139 35 -414 135 849 601 136 800 658 147 -456 -544 -6 -272 -287 -401 390 560 -197 -461 -448
1788 -448 121 -461 -782 -376 500 197 100 354 1008 995 -121 -303 153 94 -318 -421 174 388 77 -348 -82
1809 -82 244 -25 -602 -406 -71 -110 -618 -315 204 478 -66 38 655 798 16 -189 284 419 -326 -590 -44
1830 -44 154 32 -398 -215 252 -27 -425 -575 10 30 -344 -163 458 778 285 148 370 533 18 -384 -421
1851 -421 394 193 -473 -184 304 160 -411 -565 -54 -411 -614 -611 174 614 -108 -187 25 543 261 -348 -191
1872 -191 479 391 -248 55 720 181 -149 -370 51 -26 -278 -574 -74 0 -261 -696 -227 192 -141 -298 -20
1893 -20 605 237 13 96 459 213 -334 -191 472 233 -18 -193 145 432 -165 -376 -269 284 179 -484 -31
$$ packed form
1746D09N72n98m76N38L4k83o70J27N51l50n19K0Q69j2n74K30M21K63n48m87O83
1767B00o1j04m49N49P14k48m65O64j42n11o03q8N38k66j5j14P91J70p57k64J3
1788d48N69n82l21M06Q76l03r7K54O54j3j116j82M56n9m12j03N95K14l11m25K66
1809h2L26k69n77J96L35l9n08L03N19K74n44J04O17J43p82k05M73J35p45k64N46
1830d4J98j22m30J83M67k79l98j50N85K0l74J81O21L20m93j37K22J63n15m02l7
1851d21Q15k01o66K89M88j44n71j54N11l57k03LP85M40p22p9K12N18k82o09J57
1872a91O70q8o39L03O65n39l30k21M21p7k52k96N00P4k61m35M69M19l33j57K78
1893b0O25l68k24Q3L63k46n47J43O63k39k51j75L38K87n97k11J07N53j05o63M53
$$ plain form
1914 -31 319 -8 -543 -132 120 333 -107 -151 98 317 206 -292 28 392 223 -395 -147 9 -33 -419 -412 145
1936 145 53 -188 -138 134 184 -186 -227 350 548 74 -54 35 75 112 -155 -13 215 -5 -352 -118 115 -89
1958 -89 -256 -152 170 50 -195 -165 237 398 -82 -102 121 332 172 -192 -88 240 222 -179 -61 274 185 -103
1980 -103 -165 197 200 -152 -55 -61 216 -169 -211 127 108 -39 -299 -55 186 103 -30 -120 107 80 113 -239 300 266
2004 266 -148 55 185 170 16 46 -183 237 -111 -184 -241 67 79 -150 -103 22 222 -100 -269 -121 69 161
2026 161 -46 -29 4 82 -150 -7 448 222 -231 60 284 -5 -240 -362 -217 265 -410 -378 23 339 -10
2047 -10 -334 126 272 124 -54 -296 39 215 -155 20 548 340 185 -120 175 25 -355 -332 4 217 -309
2068 -309 -215 -270 284 -35 -225 -177 156 115 -29 -259 438 502 301 74 426 251 -65 -19 -131 166 -293 -107
$$ packed form
1914c1L50l27n35M11K52K13m40m4K49K19j11m98L20L64j69o18K48J56m2l86PN57
1936A45r2k41N0K72N0l70m1N77J98m74j28Q9M0L7k67J42K28k20l47K34K33k04
1958h9j67J04L22j20k45L0M02J61m80k0K23K11j60l64J04L28j8m01J18L35q9k88
1980a03o2L62Ll52R7oK77l85m2L38j9j47k60K44K41q3j33r0K27k7L3l52N39l4
2004B66m14K03J30j5j54L0k29M20l48p3n7L08J2k29M7J25K00l22j69J48J90R2
2026A61k07J7L3P8k32J43M55k26m53K91K24k89k35j22J45M82o75L2M01L16l49
2047a0l24M60J46j48j78k42L35J76l70J75N28k08j55l05K95j50l80K3L36K13n26
2068c09R4n5N54l19j90M8L33m1j44k30O97O4k01k27L52j75l16M6j12K97m59J86
$$ plain form
2090 -107 -57 72 115 -65 -329 -34 38 -282 -324 -41 14 180 40 87 78 93 144 -78 -7 -50 -167 -16 122 -45
2114 -45 -187 -168 114 -28 5 -174 -70 -3 -218 -568 -32 506 43 -87 324 250 286 -17 -278 116 214 -131
2136 -131 -50 170 -4 -457 -83 -123 152 -150 -364 -224 237 -11 -67 167 418 318 -105 111 74 85 -221 -102
2158 -102 50 25 5 -78 -94 -14 -148 -63 -149 -324 -94 -185 -411 75 293 -89 47 164 177 -68 -224 168 98
2181 98 232 -6 -143 210 190 25 -277 -27 -95 -242 -258 -180 -64 -92 -89 173 349 -88 38 103 -57 -315 8
2204 8 28 245 7 201 382 173 66 -274 -221 -431 -288 -384 -53 -140 469 145 296 37 -82 -207 -524 -216
2226 -216 80 -85 12 250 135 334 -20 217 60 363 -168 -317 -144 -140 -339 -109 95 308 88 -252 125
2247 125 -240 35 -92 4 190 470 190 280 463 115 79 -69 -203 21 -31 -434 -166 125 -43 -44 43 261
$$ packed form
2090a07N0J29M3j80k64K95P2l20m2K83N5J66j40M7rJ5N1k22P1m3j17J51J38j67
2114d5j42J9K82j42L3j79J04O7k15l50N36N38m63j30M11p4L6l03k61L94R8l45
2136a31Q1K20j74m53L74m0K75l02k14J40M61k48n6K34K51j00m23K16l7J1l06J19
2158a02J52k5k0q3j6Q0j34Q5q6j75K30r1k26M86K18l82J36J17J3k45j56L92p0
2181I8J34k38j37L53k0j65l02K50o8j47j6P8J16k8LK62J76m37J26O5j60k58L23
2204HK0K17k38J94J81k09j07l40N3k10J43r6L31q7O09l24J51k59j19j25l17L08
2226b16K96j65R7K38j15J99l54K37j57L03n31j49J73Mj99K30K04K13k20l40L77
2247A25l65K75j27R6J86K80k80R0J83l48l6j48j34K24n2m03K68K91j68jQ7K18
$$ plain form
2269 261 128 -162 28 105 143 -384 -125 155 150 271 420 141 -9 121 133 -175 -260 -156 -91 199 279 196 -353
2292 -353 -95 -170 -328 -225 -328 -133 80 -166 60 126 22 104 354 -7 -165 -13 -38 -16 -55 168 173 2 66
2315 66 -126 -134 -13 -289 -162 -71 -150 104 361 156 -195 194 -183 137 -43 -252 -111 103 -199 -121 -213 139
2337 139 113 -80 -91 -98 -130 -336 -143 -49 -44 144 166 173 314 -6 198 21 218 4 -262 -86 -26 211 -3 198
2361 198 136 -63 -88 -164 78 -57 -125 -96 139 80 172 107 -182 -3 67 -138 76 -50 -39 79 28 96 119 -59
2385 -59 -30 56 196 -253 -189 0 -43 5 158 200 133 49 -233 -197 -273 -255 -157 222 99 -26 63 165 116 99 -63
2410 -63 60 37 -468 -161 134 -123 -182 87 -142 126 -71 -64 -175 -390 -71 148 -198 18 131 146 282 40
2432 40 -11 -256 25 -322 -2 118 -131 -16 338 -6 -151 -42 -69 -183 -428 -33 -228 -97 27 -133 57
$$ packed form
2269B61j33k90J90P7L8n27K59K80nJ21J49k79j50J30J2l08q5J04O5K90Q0q3n49
2292c53K58p5j58J03j03J95K13k46K26O6j04Q2K50l61j58J52k5K2l9K23Nj71O4
2315F6j92qJ21k76J27R1p9K54K57k05l51L89l77L20j80k09J41K14l02P8r2L52
2337A39k6j93j1pl2k06J93R4NJ88K2PJ41l20K04j77J97k14k66J76O0K37k14K01
2361A98o2j99k5p6K42j35o8K9K35n9R2o5k89J79P0k05K14j26J1J18n1O8K3j78
2385e9K9Q6J40m49O4J89m3M8J53M2o7q4k82L6p6J8R8L79j23j25Q9J02m9j7j62
2410f3J23k3n05L07K95k57n9K69k29K68j97Pj11k15L19K19l46K16J13J5J36k42
2432D0n1k45K81l47L20J20k49J15L54l44j45J09k7j14k45L95j95J31J24j60J90
$$ plain form
2453 57 150 116 -249 -207 -155 -22 -143 43 -5 196 122 144 -122 237 19 -75 -50 129 -75 -193 -104 8 212 23
2477 23 97 89 157 -119 -130 36 13 -65 136 95 135 67 262 -33 -46 -197 -285 31 80 196 -150 -148 -102 84 62 -51
2503 -51 -79 -58 112 -171 27 91 41 299 186 28 137 51 -123 -159 78 -198 -200 -60 49 62 84 -108 5 89
2527 89 -185 141 -291 -121 -61 227 5 91 -36 107 93 71 -13 -37 -147 16 202 -154 -23 -18 -144 -96 -25 -103
2551 -103 -262 -67 141 122 127 -134 315 -13 142 16 155 212 213 -100 62 -139 391 -195 40 -20 72 121 -475
2574 -475 -69 129 -175 6 -110 11 2 -67 117 -83 227 118 36 187 -108 -51 105 -128 -31 153 -189 129
2596 129 -312 -217 -99 43 38 209 176 -57 222 -58 78 -42 180 167 14 228 120 154 427 -107 123 -2
2618 -2 -156 -57 -376 -1 124 57 -73 141 96 68 -116 33 -70 -159 -183 -6 83 118 184 437 -15 339 12 -53
$$ packed form
2453E7R3l4l65M2N2J33j21J86m8K01p4K2k66L59k18r4K5J79k04j18Q9J12K04j89
2477B3P4qO8k76j1J66k3p8K01m1M0o8J95k95j3j51q8L16M9J16l46KM6J86k2j13
2503e1k8K1J70k83J98O4n0K58j13j58J09q6j74l6K37k76kJ40J09J3K2j92J13Q4
2527H9k74L26m32J70O0K88k22Q6j27J43j4k2q4k4j10J63J86l56J31Nj26M8P1p8
2551a03j59J95K08j9Nk61M49l28J55j26J39N7Jl13J62k01N30n86K35o0R2M9n96
2574d75M06J98l04J81j16J21ro9J84k00L10j09q2J51k95N7J56k33R7J84l42L18
2596A29m41R5J18J42nJ71l3k33K79k80J36j20K22j3j53K14j08L4K73n34K30j25
2618bj54R9l19L75J25o7j30K14m5k8j84J49j03q9k4J77Q9L5O6K53m52L54l27o5
$$ plain form
2642 -53 -128 -214 113 -242 112 129 -113 -35 157 -36 -29 -131 -153 -130 -114 -104 -15 122 88 318 149 12 -111 -70 -180
2667 -180 -134 -78 -49 -7 -151 -71 -21 248 82 -135 31 -212 -127 -178 -177 -1 56 406 267 253 259 190 -94 -243 -287
2692 -287 -15 -236 -83 143 -73 83 -79 142 -465 -111 -147 -115 -130 64 -151 -36 57 96 237 325 -87 -176
2714 -176 -197 47 -228 -139 14 -63 59 158 40 87 -232 -168 83 -283 10 -2 -199 27 176 39 -81 54
2736 54 46 -84 122 -161 -120 -206 -2 -34 -14 78 69 -111 172 -20 110 89 186 117 55 30 -113 61 0 92 -229 -56
2762 -56 -137 -150 -163 -15 169 22 115 305 245 5 101 163 -133 -104 -298 94 -292 11 69 269 7 32 -130 13
2786 13 -46 -145 -111 74 140 -312 173 268 40 -113 -107 147 -267 -221 -77 64 -141 -254 200 37 53 89 -158 -21
2810 -21 -34 22 45 -52 -47 -125 27 119 86 101 -7 -110 -311 52 -269 19 -42 84 2 137 -121 -54 -90 -3 92 -47
$$ packed form
2642e3p5q6L27l55L54J7k42P8J92j93Pj02k2K3J6J0Q9J37l4K30j69j37j23M1j10
2667a80M6N6K9M2j44Q0N0K69j66k17J66k43Q5n1JJ76N7L50j39j4Oo9k84j49m4
2692b87K72k21J53K26k16J56j62K21o07L54l6L2j5J94k15J15R3L9J41Q8m12q9
2714a76k1K44k75Q9J53p7J22R9j18M7l19O4K51l66K93j2j97K26J49j37j20J35
2736E4qj30K06k83M1q6K04l2K0R2rj80K83j92J30k1R7o9o2k5j43J74o1R2l21J73
2762e6q1j3j3J48J84j47R3J90o0k40R6O2k96K9j94L92l86L03N8K00k62K5j62J43
2786A3n9r9L4J85O6m52M85R5k28j53OK54m14M6J44J41k05j13M54j63J6L6k47J37
2810b1j3N6K3r7Np8J52R2l3J5j08j03k01L63l21K88o1J26q2J35k58O7l6Q7R5j39
$$ plain form
2836 -47 -248 -89 -125 23 155 -76 -8 -24 157 5 -259 -89 -81 -8 124 -126 266 -62 180 54 80 247 -92
2859 -92 -22 126 -130 93 -179 -112 142 242 67 -222 89 178 -24 -385 -92 26 -64 96 100 -267 -38 108
2881 108 -1 -52 7 107 -57 202 131 -28 -111 -9 146 149 364 -148 -62 69 292 -36 -114 5 24 -38 -171
2904 -171 -114 -140 -95 -333 -49 -32 -24 48 57 -211 -185 85 64 -178 6 -8 63 -102 -111 203 -91 -14 92 43 146 -109
2930 -109 -66 -73 -5 176 183 1 125 53 35 34 164 -32 -68 101 100 -275 -49 110 -135 -114 -58 77 1 125 -100
2955 -100 -64 113 -225 -49 -86 -88 -87 116 125 146 -356 -62 242 32 107 51 56 156 -107 -266 -97 -147 114 15 18 -91
2981 -91 102 -25 -80 -88 -94 32 -33 -119 10 245 18 -83 38 -140 -29 1 117 -42 -160 -122 -91 -28 -67 126
3005 126 35 -191 219 -52 -77 -267 -156 137 -147 31 154 77 258 14 -111 -72 -35 -12 -100 191 -197 -13
$$ packed form
2836d7k01J59l6J48J32k31O8j6J81j52k64J70QP3J32k50L92l28K42j26K6J67l39
2859i2P0J48k56K23k72O7K54J00j75k89L11Q9k02l61K93J18r0J60Ml67K29J46
2881A08j09n1N9J00j64K59p1j59q3J02J55LK15n12Q6J31K23l28p8J19J9o2j33
2904a71N7k6M5k38K84J7QP2Rk68K6K70k1k42J84j4P1j65rL14k94P7J06m9J03k55
2930a09M3pO8J81Pj82J24p2j8jJ30j96l6J69jl75K26J59k45K1N6J35p6J24k25
2955a00L6J77l38J76l7kJK03RK1n02K94L04k10P5n6NJ00k63j59J69n0K61r9Lj09
2981i1J93j27n5qoJ26o5q6J29K35k27j01J21j78J11L0J16j59j18L8L1O3l9J93
3005A26r1k26M10k71k5j90J11K93k84J78J23p7J81k44j25L9L7K3q8K91l88J84
$$ plain form
3027 -13 -42 79 148 105 156 -116 -195 91 25 -1 -28 127 85 30 -44 2 -125 -99 -83 101 73 -124 -6 102 74 90
3053 90 -20 -300 -39 -191 -48 106 -57 84 21 20 247 25 -129 182 53 84 -91 -69 -48 -194 -36 34 76
3076 76 91 24 104 186 -95 151 -101 -40 -48 161 -74 136 5 284 -95 -29 -32 -143 158 58 111 -325 206 79
3100 79 194 -216 -66 82 -88 -113 190 138 83 144 243 -47 -8 -279 -7 -170 0 -84 53 28 115 120 -211 39
3124 39 -9 -202 -54 -54 -268 97 119 60 -16 35 29 167 -177 -43 -125 75 -120 -175 -113 165 -331 -53 -103 -243 -125
3149 -125 -207 -149 -102 33 -155 285 76 23 178 -103 -121 73 287 199 213 -75 132 146 -129 -106 217 49 -108
3172 -108 47 -207 115 -166 -166 54 211 0 -197 243 -194 60 126 59 20 -62 -26 3 218 314 -37 -83 -89 13
3196 13 100 -122 -16 -229 68 52 -5 -35 173 23 78 -54 135 -78 -10 -118 -190 -292 -72 -24 -168 67 -37
$$ packed form
3027a3k9J21O9m3N1k72p9K86o6k6k7J55m2n5p4M6j27K6J6J84k8j97J18J08k8J6
3053I0j10k80K61j52J43J54j63J41o3jK27k22j54L11j29L1j75K2K1j46J58P0M2
3076G6J5o7Q0Q2k81K46k52O1qK09k35K10j31K79l79O6lj11L01j00N3m36N31j27
3100G9J15m10J50J48j70k5L03n2n5O1R9k90L9k71K72j63J70q4J37k5Q7Nl31K50
3124C9m8j93J48%k14L65K2n9p6N1oJ38l44J34q2K00j95n5O2K78m96K78n0j40J18
3149a25q2N8M7J35j88M40k09n3J55k81j8J94K14q8J4k88K07J4k75K3L23j68j57
3172a08J55k54L22k81%K20J57k11j97M40m37K54O6o7l9q2L6K9K15R6l51m6oJ02
3196A3Q7k22J06k13K97j6n7l0K08j50N5j32J89k13O8j08p2j02K20M8j44K35j04
$$ plain form
3219 -37 -260 31 -64 20 97 36 214 32 -196 -3 -72 -268 65 86 -133 -74 -183 10 -127 90 297 95 -148
3242 -148 -240 188 -95 63 -269 -87 169 136 105 -17 89 145 -247 -161 132 -288 -49 -186 138 -65 44 -107
3264 -107 126 145 -212 -120 -249 -15 -11 27 -137 -398 277 -237 5 131 -64 -44 -260 170 -19 -12 8 445 -39
3287 -39 138 40 78 -251 -43 -26 174 -81 -75 -198 -95 224 262 -201 118 -148 238 173 -21 -239 -26 -66 -58 282
3311 282 -69 106 103 -84 107 -12 -248 -43 206 46 -50 -38 -101 -69 72 -313 29 -126 5 31 89 162 -12
3334 -12 38 143 129 47 -76 57 166 -126 111 -28 -124 -48 -24 33 145 74 2 -61 106 155 -122 8 66 -221
3358 -221 -199 172 -76 -174 115 185 0 73 67 -162 -2 -74 -55 63 11 -106 24 151 80 19 69 43 137 -111 -87
3383 -87 -205 -12 89 -79 53 -147 -163 179 233 81 127 44 201 87 86 -4 -165 5 264 235 42 253 171
$$ packed form
3219c7k23K91r5Q4P7o1J78j82k28J93o9j96L33K1k19N9j09J93j37K17K07k02k43
3242a48r2M28k83J58l32J82K56l3l1j22J06N6l92Q6K93m20K39j37L24k03J09j51
3264a07K33J9l57R2j29K34ML8j64k61O75n14K42J26j95K0k16M30j89PK0M37m84
3287c9J77r8L8l29K08J7K00k55Oj23J03L19L8m63L19k66L86o5j94k18K13m0QL40
3311B82l51J75lj87J91j19k36K05K49j60r6J2o3L2J41l85L42j55J31K6N8P3j74
3334a2N0J05j4q2j23J33J09k92K37j39r6P6K4N7J12p1p2o3J67M9k77J30N8k87
3358b21K2L71k48r8K89P0j85P3ok29J60p2J9J18n2j17J30J27p1o1N0k6R4k48K4
3383h7j18J93J01j68J32k00j6L42N4j52M6q3J57j14jr0j61J70K59k9j93K11q2
$$ plain form
3406 171 85 -4 -53 226 -102 -131 145 24 1 -39 -96 183 24 241 -55 -173 7 44 21 86 -62 -336 92
3429 92 -167 -351 164 -175 -6 -54 -193 -271 -141 -109 69 -71 17 111 229 -274 -15 38 -138 -52 -147 -65 -24 -284
3453 -284 -326 136 -46 -93 166 62 -47 92 -143 143 -60 74 -5 95 31 14 -16 -139 204 -221 -49 -102
3475 -102 36 90 107 32 -161 232 -188 70 -176 -42 -61 -32 -98 -203 64 -76 -56 -129 -133 194 14 -2 -80 222
3499 222 9 -130 180 -4 17 8 -68 -168 -9 -60 -111 24 -104 -83 -47 11 24 -41 120 -136 -37 -41 50 -143 205
3524 205 83 169 -28 -208 -201 -51 114 165 230 -255 56 -25 -4 119 148 240 108 -153 94 32 6 -106 110 -178
3548 -178 84 123 -197 -82 134 59 -107 -35 143 -72 -160 36 120 -12 -4 142 -107 -93 274 -18 -228 122 -46
3571 -46 -11 238 -271 -110 106 -69 -279 188 82 182 -96 70 -56 38 -167 88 -29 143 -116 -219 10
$$ packed form
3406A71q6q9m9K79l28k9K76j21k3m0n7K79j59K17k96j18J80L7k3O5j48k74M28
3429I2k59j84N15l39J69m8j39p8J30L2J78j40Q8R4J18n03K59N3j76Q6r5Q2M1k60
3453b84m2M62j82m7K59j04j09J39k35K86k03J34p9J00o4j7l0j23L43m25J72n3
3475a02J38N4J7p5j93L93m20K58k46J34j9K9o6j05K67j40K0p3mL27j80j6p8L02
3499B22k13j39L10j84K1rp6j00J59n1n1J35j28K1L6N8J3o5J61k56R9mR1j93L48
3524B05j22Q6j97j80PJ50J65N1O5m85L11q1K1J23K9R2j32k61K47o2k6j12K16k88
3548a78K62L9l20J15K16p5j66P2J78k15q8J96Q4j32QJ46k49J4L67k92k10L50j68
3571d6L5K49n09J61K16j75k10M67j06J00k78J66j26R4k05K55j17J72k59j03K29
$$ plain form
3592 10 128 157 -25 155 63 -108 -62 -100 229 -125 179 87 74 -142 262 -58 16 64 -122 144 -27 117 74
3615 74 -180 -290 233 -104 -35 -309 72 -9 67 -95 -249 -32 -70 -95 -42 -192 -356 -32 93 -76 10 -210 128
3638 128 161 111 -5 -57 -48 62 -39 -136 -55 21 -128 110 -47 -15 -7 -98 -212 287 -74 -78 164 110 115 210 48 77
3664 77 92 59 -114 202 235 -171 10 -154 -120 275 20 -185 -117 153 186 -237 -224 -263 43 -52 -234 -82 147
3687 147 -18 47 13 -213 -114 136 -7 58 -20 181 -22 28 -54 -91 -45 26 343 -2 -68 -120 162 -166 -26 149
3711 149 -47 -9 234 0 -75 -186 -46 -66 -117 -46 -42 -13 -34 -36 -127 -196 312 112 16 22 -108 72 -20 71 61 23 -145
3738 -145 91 -11 133 -113 -270 2 -101 72 45 -161 20 -188 -260 -176 -115 218 28 -21 -136 -99 59 41
3760 41 215 -78 114 116 81 118 -16 -18 -76 47 -247 324 -309 92 89 50 144 -79 67 -11 196 -147 -226 -171 -48
$$ packed form
3592A0J18K9j82J80r2j71M6l8L29l54L04r2j3k16M04l20P4M8j86K66j71J44m3
3615G4k54j10N23l37O9k74L81q1P6j62j54K17l8k5N3j50j64L24J25j69Q6k20L38
3638A28L3n0j16n2RJ10j01r7Q1P6j49K38j57L2Qr1j14M99l61mK42n4NR5j62K9
3664G7J5l3j73L16L3m06J81j64L4L95k55k05O8K70L3m23J3l9L06r5j82J52K29
3687A47j65O5l4k26R9K50j43O5p8K01k03N0q2l7M6P1L17l45o6n2K82l28J40J75
3711A49j96L8K43k34p5j11J40k0n1P1MK9k1kr1o9N08k00r6Oj30J80r2R1j0l8j68
3738a45K36j02J44k46j57K72j03J73k7k06J81k08p2Q4O1L33j90m9j15L7J58j8
3760D1J74k93J92Kl5L7j34kn8J23k94N71o33M01ll9R4k23J46p8K07l43p9N5J23
$$ plain form
3785 -48 242 174 -33 -161 -77 196 -144 86 70 -29 -332 -19 162 -289 48 -259 -27 -47 35 -3 104 -12 -15
3808 -15 -84 80 235 -152 159 26 175 263 61 -110 -152 -185 -113 109 45 8 -224 -20 -91 23 -196 -120 124
3831 124 -198 87 -63 -160 48 33 25 174 42 60 273 13 155 -43 61 -143 -31 64 193 34 40 271 130
3854 130 137 166 -81 5 -160 232 -103 -49 -61 35 -90 -65 5 -3 -11 -139 -146 -155 278 -28 94 -267 96 -119 153 313
3880 313 134 -180 145 -26 -25 182 -189 61 -29 -78 -98 -242 -240 -53 -196 131 -71 163 34 37 -103 -207 -121
3903 -121 -61 -84 111 96 -31 -100 67 448 161 -92 162 54 -249 -33 32 -52 99 -20 -154 -187 -17 -119
3925 -119 180 15 159 2 -75 -87 123 71 -14 244 169 -156 68 -45 -150 210 -190 -4 -158 17 -227 61
3947 61 -91 51 38 224 -43 63 -51 198 239 62 -88 99 4 41 97 123 153 -238 273 -36 136 -103 26
$$ packed form
3785d8K90o8k07j28Q4K73l40K30j6r9l03L13J81m51L37l07K32k0Q2l8J07j16l
3808a5o9J64J55l87L11j33J49Q8k02j71m2l3P2K22o4l7k32K04p1J14k19P6K44
3831A24l22K85j50r7K08j5qJ49j32J8K13k60J42j98J04k04J12R5J29j59OK31j41
3854A30PK9k47Q6j65L92l35N4j2R6j25K5P0qqj28prM33l06J22l61L63k15K72J60
3880C13j79l14L25j71JK07l71K50r0m9k0j44KJ87j43L27k02K34j29Lj40j04Q6
3903a21O0k3J95j5j27o9J67L81k87k53K54j08l03K16O5q4J51j19j34l3J70j02
3925a19K99j65J44j57p7j2K10n2q5K58p5l25K24j13j05L60m00J86j54J75k44K88
3947F1j52J42j3J86k67J06j14K49M1j77j50J87r5L7N6K6L0l91N11l09J72k39J29
$$ plain form
3970 26 -198 93 54 -13 20 54 -66 -147 -224 -204 128 -157 107 -115 -18 -127 -226 -201 61 181 -2 104 -309 12
3994 12 339 15 94 -180 229 95 -33 165 0 40 -66 -175 -145 -85 -76 -4 -190 97 -34 -25 -6 -148 -209 151
4018 151 -40 -228 7 74 3 -231 41 -146 -95 147 -43 -235 -170 41 -90 -72 138 -61 -39 -120 -32 81 -98
4041 -98 -125 -5 54 -4 -28 -69 -316 -130 203 14 -173 80 121 -4 -89 78 104 162 220 -63 37 73 126 -87
4065 -87 47 71 -68 63 -211 150 -137 3 -175 -14 136 17 123 -76 -46 117 -138 -130 -106 150 221 -83
4087 -83 -76 -46 156 -45 -79 -91 36 54 87 -69 85 122 50 -109 -166 202 -138 -19 193 79 144 -22 -104 184
4111 184 -56 41 52 77 -185 -132 327 42 -171 -159 -95 -93 -142 -142 -86 118 37 -161 158 141 127 -196 -97 132 184 -6
4137 -6 -50 0 -172 -141 -39 122 -188 -174 42 20 -1 45 -87 -53 56 183 119 -75 1 -113 -9 -205 -238 178
$$ packed form
3970B6k24K91l9o7L3L4j20q1p7K0L32k85K64k22R7j09r9K5K62J20j83J06m13L21
3994A2L27l24P9k74M09j34j28J98j65M0j06j09L0O0RP2j86K87j31RJ9j42o1L60
4018A51j91j88K35O7p1k34K72j87N1K42j90j92O5K11j31J8K10j99K2q1Q8J13j79
4041i8k7J20N9n8k4m1k47J86L33j89j87K53M1j25q5J67K6N8N8k83J00L6N3k13
4065h7J34K4j39J31k74L61k87J40j78J61J50j19J06j99L0J63k55QK4K56P1l04
4087h3PL0K02k01l4j2J27J8L3j56J54L7p2j59n7L68l40J19K12j14O5j66q2K88
4111A84k40R7J1K5k62N3M59k85k13J2O4Km9%N6K04q1j98L19j7j4l23R9K29N2j90
4137fm4N0j72L1J02J61l10J4K16k2k1M6j32L4J09J27o4j94P6j14J04j96l3M16
$$ plain form
4161 178 -83 106 -39 -101 -61 -67 73 -47 -261 80 109 206 -17 107 -34 -131 52 140 -399 -3 -116 114 225
4184 225 -240 54 -87 79 -70 -34 266 -189 146 30 -33 -25 -114 263 -220 -109 156 -217 291 123 208 50
4206 50 9 -69 -226 4 -103 -11 -140 -144 -52 127 -12 -69 -136 70 64 -278 61 -117 -83 103 2 -67 -63 -141 -3
4231 -3 -151 -135 -129 180 -112 -55 187 -6 -246 227 23 -154 167 -80 -44 -37 94 -148 9 164 -216 -139 48
4254 48 -183 -282 68 187 122 -171 5 -7 93 -196 -50 77 -33 140 -14 18 99 -25 -39 28 -27 -80 -38 44
4278 44 -124 107 -224 -64 180 86 193 -101 157 82 56 98 -53 -115 -106 -129 39 48 45 215 -56 68 -31 -79 -286
4303 -286 -61 -180 89 -16 -77 -202 -34 -32 -338 46 0 173 -90 -103 106 -11 -22 5 58 79 -285 91 72
4326 72 -134 -247 71 -84 -36 -27 36 -44 -41 -69 9 -164 65 -290 -282 -84 -288 -14 -135 -15 -175 -39 226 233 52
$$ packed form
4161A78k61J89j45o2M0oJ40j20k14L41K9R7k23J24j41r7J83Q8n39L96j13K30J11
4184B25m65K94j41J66j49L6L00m55L35j16o3Qq9L77m83J11K65l73N08j68Q5j58
4206E0m1p8j57K30j07R2j29mR2J79j39n7o7K06ol42L39j78L4J86j01o9Mp8J38
4231cj48J6OL09k92N7K42j93k40M73k04j77L21k47L6PJ31k42J57J55l80P7J87
4254D8k31r9L50J19o5k93J76j2J00k89J46J27j10J73j54L2Q1j24j4O7n5n3M2Q2
4278D4j68K31l31J60K44r4J07k94K58p5k6M2j51o2Rk3J68RlJ70k71J24r9m8k07
4303b86K25j19K69j05o1j25J68Kl06L84m6J73k63j3K09j17j1K7N3K1l64L76j9
4326G2k06j13L18j55M8RO3q0Lk8P8j73K29l55QJ98k04K74j21J20j60J36K65Pj81
$$ plain form
4351 52 -26 -132 -229 42 20 53 136 34 -10 67 44 -35 -119 -187 -54 -41 -13 166 137 18 13 158 78 -82 334 -308
4377 -308 47 119 -246 3 105 45 -54 42 -127 -171 35 -28 -180 124 -44 -18 55 -239 -16 7 20 157 22
4400 22 34 107 -197 232 126 176 83 226 -33 95 86 -26 130 52 18 -129 31 -46 33 -111 290 28 -61 -81
4424 -81 56 -221 78 240 -37 138 40 -69 94 118 117 34 -15 145 293 31 18 -63 -73 -109 -62 9 -50 154 60
4449 60 115 97 28 108 -74 -259 -29 -13 -113 49 87 -83 139 36 -15 87 9 24 200 -132 136 -93 -7 6
4473 6 21 106 -223 145 -108 148 -34 44 10 377 19 312 -190 -58 44 -179 -7 -36 -58 54 7 40 26 214
4497 214 -183 48 91 -75 18 301 -12 -59 -94 121 -8 44 -47 -101 148 -44 12 -143 282 -99 38 212 81
4520 81 -185 37 -28 267 70 -336 -98 -23 161 -83 -201 -147 -14 58 279 -116 8 -56 233 37 52 195
$$ packed form
4351E2p8j06r7K71k2L3Q3j02m4P7k3p9q4o8J33J3K8J79k9j19nJ45q0j60M16o42
4377c08L55P2l65K49J02o0r9R6j69m4K06o3j52L04j68K6P3k94K23K3J3J37j35
4400B2J2P3l04M29j06N0r3J43k59J28rj12J56p8l4j47J60p7P9j44M01k62q9k0
4424h1J37k77K99J62k77J75r8j09J63K4jq3m9J60J48k62j3q1j0l6M7P1n9K04r4
4449F0N5j8o9Q0j82j85K30J6j00J62L8j70K22j03n1J02p8J5J76l32K68k29Q6J3
4473FJ5Q5l29L68k53K56j82P8l4L67l58K93n02J32J02k23J72k9k2J12m7L3j4J88
4497B14l97K31M3j66R3K83l13m7l5K15j29N2r1n4K49j92N6j55M25l81J37J74j31
4520H1k66K22o5K95j97m06K38P5J84k44j18N4J33P2K21l95J24o4K89j96J5J43
$$ plain form
4542 195 -112 113 116 -167 -88 -35 -83 -148 -6 139 17 159 106 118 -133 27 -246 196 189 186 8 -60 -25 -151 -139
4567 -139 184 250 40 170 0 44 207 89 53 -214 -178 -273 -181 -80 129 11 2 -60 -73 61 -124 79 64 -72
4591 -72 -6 131 -51 30 104 23 133 -352 226 -158 38 29 8 124 -93 98 -130 27 262 119 180 25 284
4614 284 16 -111 -216 -180 162 97 356 -98 -18 109 -70 -105 66 -72 41 -46 53 34 140 31 -187 56
4636 56 185 -199 157 137 194 104 12 -59 47 132 74 -93 38 -6 100 -107 17 132 48 7 90 -29 -33 -38 -52 88
4662 88 -81 -24 -106 5 -102 109 -244 6 71 33 -26 -241 -115 -33 -112 108 -63 -57 201 -38 122 149 19 -106
4686 -106 145 148 -123 -26 66 -94 93 298 118 209 99 -62 -94 133 -35 5 79 81 -14 -52 5 -170 -188 84 -136
4711 -136 64 -233 116 275 156 130 99 -101 174 -42 16 -204 -222 209 -169 -244 106 -47 -91 165 -61 175
$$ packed form
4542A95l07K25Lk83P9N3m8o5J42J45j22J42n3J2k51J60k73M42plj78o8L5j26J2
4567a39L23O6k10J30j70M4J63j18l6k67L6r5R2J01K09j18ro2j3J34j85K03j5j36
4591g2O6J37j82Q1P4q1J10m85N78l84J96rk1J16k17J91k28J57K35j43O1j55K59
4614B84k68j27j05L6L42o5K59m54Q0J27j79l5J71j38J13q7R9j9J06j09k18K43
4636E6J29l84L56k0N7r0r2p1J06Q5n8j67J31m4J06k07J24J15q4m1Q3j19mnj4J40
4662H8j69N7q2J11j07K11l53K50O5l8n9k15J26Q2p9K20j71OK58k39J60K7j30j25
4686a06K51Lk71R7R2j60J87K05j80R1j10j61l2K27j68M0P4Kr5l8N7j75j8K72k20
4711a36K00k97L49J59j19k6l1k00K75k16N8k20j8M31l78p5L50j53m4K56k26K36
$$ plain form
4733 175 -174 21 -243 -141 144 109 -143 28 -63 87 10 -270 109 -9 0 68 60 43 -42 84 -212 -54 34 -74
4757 -74 -50 -80 47 171 8 39 17 -153 4 -52 -295 118 -10 -174 -13 108 96 149 31 154 172 -3 -109
4780 -109 -93 50 176 112 -8 179 2 43 -144 132 -119 117 -149 75 -5 108 54 39 265 -42 32 -161
4802 -161 66 -71 -251 155 -175 126 -136 -84 149 151 9 -20 -64 -192 -3 81 19 -1 -66 -193 143 -61 147
4825 147 -6 173 58 -94 110 -17 96 77 195 -235 -95 -1 -52 -74 16 172 62 3 103 -75 -83 87 -43
4848 -43 103 111 24 95 -20 132 39 30 -53 -107 23 -32 -109 9 245 52 -154 -179 -172 -27 122 -36 99 -22 119
4873 119 118 69 138 -7 -178 66 33 -24 -65 86 70 -75 -199 59 146 47 281 7 54 38 -33 109 -57 -196
4897 -196 -9 48 -134 -229 37 174 -134 -185 83 71 30 -78 -206 -131 108 -2 241 116 -46 118 166 -133
$$ packed form
4733A75l49J95k64J02K85l5k52J71r1J50p7k80L79j18RO8qj7q5J26k96J58Q8j08
4757g4K4l0J27J24j63L1k2j70J57n6k43M13j28j64J61J21j2N3j18J23J8j75j06
4780a09J6J43J26o4j20J87j77M1j87K76k51K36k66K24q0J13n4j5K26l07P4j93
4802a61K27j37j80M06l30L01k62N2K33Kj42k9m4j28J89Q4o2k0o5j27L36k04K08
4825A47j53J79j15j52K04j27J13j9J18m30J40R4n1k2R0J56j10n9J00j78qJ70j30
4848d3J46Qq7P1j15J52r3rq3n4J30n5p7J18K36j93k06k5PJ45J49j58J35j21J41
4873A19jm9O9j45j71K44l3n7m1J51j6j45j24K58Q7r9K34k74M7j6p1J42j66j39
4897a96J87N7j82r5K66J37l08n1K68j2m1j08j28P5K39j10K43j25j62J64M8k99
$$ plain form
4919 -133 111 34 59 -49 6 -165 276 247 -179 37 254 147 161 112 -187 -64 -22 -29 -13 -57 -81 -102 56 -103
4943 -103 -45 185 92 -46 -161 -113 36 169 -41 -108 -131 -177 -89 86 202 43 9 -43 97 282 55 -97 49
4966 49 5 -100 -200 -164 110 -176 42 136 -75 -80 86 -117 -195 100 -20 -205 196 116 111 208 -32 33 141 24
4990 24 66 188 89 -202 -2 -121 -64 14 -176 59 -136 -20 -49 305 -259 -41 233 17 180 -71 -254 0
5012 0 -117 -80 136 -84 4 173 -22 96 -276 58 171 39 -181 45 82 314 222 -24 52 17 -125 64 24
5035 24 -11 120 11 -23 -185 -20 8 -90 47 151 198 55 -16 5 140 -74 -82 91 -185 114 88 -174 -6 -9
5059 -9 190 -381 146 -133 -44 23 -10 -112 -90 211 -260 -127 -58 -158 -137 -172 74 1 -23 -1 -118 -10 -51 -102 -105
5084 -105 46 43 1 43 -62 70 -83 135 256 -128 231 44 -188 -53 -39 265 -73 48 118 197 8 -101
$$ packed form
4919a33K44p7K5j08N5j71M41k9m26K16K17j07J4m9k99J23M2pJ6m4k4k1J58j59
4943a03N8K30r3j38j15M8J49J33k10o7k3m6Q8J75J16j59l4n2J40J85k27j52J46
4966D9m4j05j00L6K74k86K18R4k11nJ66k03p8K95j20j85M01q0nR7k40O5J08j17
4990B4M2J22r9k91K00j19N7P8j90K35j95J16k9L54n64K18K74k16J63k51j83K54
5012@j17L7K16k20Q8J69j95J18l72L34J13j32k20K26L7K32r2k46P6l5j42J89m0
5035B4l5J31j09l4j62J65K8r8J37J04M7j43p1K1J35k14qJ73k76K99k6k62J68l
5059iJ99n71N27k79Q9O7l3j02K2L01m71J33O9j00K1l5K46p3k4K2j17J08m1n1l
5084a05J51lm2M2j05J32j53K18J21l84L59j87k32J35J4L04l38J21P0P9j89j09
$$ plain form
5106 -101 66 -2 141 98 211 -84 155 -81 -239 -45 -163 79 -219 40 43 35 -37 -247 44 279 159 -150
5128 -150 87 -240 -120 -93 16 -64 -107 37 -62 -90 13 62 -117 -66 -6 -41 -67 -345 16 114 97 -4 -34 20 200
5153 200 -99 -10 15 -19 138 75 117 -46 52 -118 -19 72 99 -209 -34 -135 -20 -64 37 288 -108 -81 63 212
5177 212 272 -65 116 -37 52 -56 -307 -210 23 167 134 127 160 51 72 -4 -56 234 379 -24 22 89 36 45 -142
5202 -142 196 193 -44 -270 -68 -209 43 150 180 130 17 119 70 -62 -71 35 239 6 25 6 17 -155 -102 -7
5226 -7 11 25 213 -98 -45 137 -125 195 220 227 -136 90 249 -106 79 31 93 -118 -37 233 198 -82 87 8
5250 8 -70 -155 -7 -47 28 193 -20 -6 -52 24 41 -49 -250 46 -105 -214 -67 -67 49 80 -126 -117 -59 -257 -79 -69
5276 -69 107 -325 90 -170 23 85 -189 122 -155 -69 102 -110 10 -73 147 163 9 -12 193 112 240 26
$$ packed form
5106a01J67o8J43m3J13k95K39k36j58J94j18K42k98K59Lqp2k10K91K35j20l09
5128a50K37l27J20K7J09q0m3J44r9k8J03M9j79N1O0l5k6k78L61R8j7j01l0N4J80
5153B00k99Q9K5l4J57o3M2j63R8j70R9R1K7l08J75j01J15m4J01K51l96K7J44J49
5177B12O0l37J81j53Q9j08k51R7K33J44l3pL3j09K1p6n2K90J45m03M6O7n3Rj87
5202a42L38lk37k26K02j41K52J07L0n0j13J02m9j32rJ06K04k33J9j9J1j72N3R5
5226gJ8J4J88l11N3J82k62L20K5Pl63K26J59l55J85m8O2k11Q1K70l5k80J69p9
5250Hp8q5J48m0P5J65k13J4m6P6J7r0k01K96j51j09J47%J16L1k06RN8j98J78J0
5276f9J76m32M15k60J93O2k74L11k77Q6J71k12J20q3K20J6j54k1K05q1J28k14
$$ plain form
5298 26 14 -115 24 -134 -312 98 -111 274 154 -53 26 -264 119 -72 89 144 67 -131 -197 6 -32 -68 -183
5321 -183 -262 148 181 70 77 -179 -151 60 -20 -82 -38 31 -217 -11 -84 83 -94 44 53 -65 -6 276 -107 123
5345 123 170 56 85 -196 29 -108 173 -163 -67 -84 -50 -114 -13 36 -97 1 -33 -201 160 19 52 68 -111 30
5369 30 -114 109 188 -97 -35 100 -132 30 80 -221 -206 -24 -183 99 53 -226 27 -108 -109 -202 12 198 96
5392 96 224 5 41 -13 -267 17 -100 -57 -23 -13 19 86 -8 -111 15 -18 179 48 -187 -16 -149 114 21 40
5416 40 144 36 -179 -113 -22 52 112 40 -163 -117 -182 72 -90 201 81 98 99 -112 -75 -104 105 -36 -24 -98 -165
5441 -165 224 -107 60 -25 -38 235 80 -89 -98 184 50 -90 8 67 -297 78 -310 89 190 -243 3 -42
5463 -42 -214 29 -14 -9 261 75 28 -75 47 138 -43 -49 -270 -137 -59 85 -30 -9 -29 -53 151 -74 52 26
$$ packed form
5298B6j2j29J39j58j78M10k09L85j20k07P9k90L83j91J61N5p7j98o6K03l8l6j15
5321a83p9M10L3j11Pk56K8K11q0o2M4O9k48K06p3J67j77J38Rj18N9K82l83K30
5345A23M7j14K9k81K25j37K81l36R6j7L4o4J01M9j33R8l4j68L61j41L3J6j79J41
5369C0j44K23P9k85O2J35k32J62N0l01J5J82j59K82m6k79K53j35jr3K14J86j02
5392I6J28k19L6n4k54K84j17M3L4J0L2O7r4j03J26l3J97j31k35J71j33K63r3J9
5416D0J04j08k15O6R1P4O0p2k03M6o5K54j62K91j20J7Jk11L7k9K09j41J2p4o7
5441a65L89l31J67q5j3K73j55j69rK82j34j40R8N9l64L75l88L99J01m33K46m5
5463d2j72K43m3NK70j86m7j03J22R1j81ok21J33P8J44j15K1k0k4K04k25J26k6
$$ plain form
5487 26 -60 108 -93 -247 63 -46 388 -33 38 -135 94 248 -179 176 -4 23 -88 5 -83 108 -41 -164
5509 -164 7 -44 -141 70 93 -176 118 4 8 54 27 104 -59 -16 217 15 158 69 -64 -189 -56 -39 -36 -163
5533 -163 -54 240 125 -149 59 -58 20 2 -97 7 173 213 -53 190 21 -191 55 40 -266 -51 56 -101
5555 -101 -287 18 99 -61 0 -128 -43 -68 60 22 276 180 57 40 195 -22 -9 -9 -129 138 99 -113 -75 30
5579 30 -93 -117 109 36 -67 123 200 9 41 95 -1 26 79 121 8 64 -189 -30 183 -86 83 3 62 207
5603 207 -85 68 126 -277 298 -23 69 141 29 225 -6 121 -116 1 -174 -11 -25 -234 -17 -46 39 -112
5625 -112 -93 -77 195 -44 -46 70 103 -51 10 -92 -10 77 61 -190 150 -176 -98 167 147 -51 37 17 -189 -300
5649 -300 33 -96 193 -15 -34 98 114 158 6 -138 155 -129 -183 -139 -152 136 165 332 75 -113 -238 -64
$$ packed form
5487B6q6J68k01j54L10j09M34m21P1j73K29J54m27L55j80K7j11R3q8J91j49j23
5509a64J71n1r7K11K3k69K94j14MM6k7P7j63M3K33k02J43q9j33j25J33J7Lj27
5533a63J09K94j15k74K08j17P8j8r9J04J66M0k66K43j69k12K46j5l06K15J07j57
5555a01j86L05Q1j60O1j28Q5k5J28l8K54r6j23j7J55k17J3%j20K67l9k12L8J05
5579C0j23k4K26p3j03J90P7j91L2N4r6K7N3M2j13N6k53J59K13k69J69q0N9J45
5603B07k92J53N8m03N75l21R2P2j12J96k31J27k37J17j75J63j4k09K17k9Q5j51
5625a12J9J6K72k39kJ16L3j54O1j02Q2Q7j6k51L40l26P8K65k0j98Q8k0k06j11
5649c00L33j29K89k08j9J32J6M4j52j44K93k84n4M4j3K88K9J67k57j88j25J74
$$ plain form
5671 -64 34 104 28 -10 -221 72 65 123 20 -133 161 -5 208 65 48 44 -17 -9 112 -5 -111 128 68 149 -56
5696 -56 196 -26 28 65 70 57 -82 -117 77 54 26 -177 87 67 -49 9 -284 94 -159 242 155 -17 21 50 68
5721 68 132 3 -214 23 108 53 10 102 -7 26 -166 -150 -155 63 -217 -35 77 154 403 112 36 -68 84 -200
5745 -200 71 -142 168 -68 -181 86 183 201 17 -126 -119 -17 -52 -111 -15 -92 141 181 -88 91 -68 12 -205
5768 -205 -19 159 -98 111 -2 -161 -100 -188 30 94 56 105 72 -201 -4 85 -230 74 -41 -40 72 -13 27 -19
5792 -19 -43 -249 -106 17 -156 143 31 64 -260 48 -48 97 156 -24 -13 -11 -22 82 -136 122 105 47 -142 -132
5816 -132 -114 155 -60 -170 -10 51 -58 -119 -126 -136 57 -18 53 197 -112 -94 -42 41 52 -232 278 32 -38 -188
5840 -188 -233 267 7 146 15 -36 -214 -151 196 -119 302 -198 30 84 110 -36 -47 -168 12 28 100 184 73
$$ packed form
5671f4R8P0p6l8k11K93pN8j03j53K94j66K13j43j7mo1QJ21j17j06K39o0Q1k05
5696e6K52k22N4L7Nj3j39l5J94k3k8k03K64k0j16N8k93L78k53M01q7j72L8K9J8
5721F8O4j29k17K37Q5n5m3R2j09L3j92J6nK18k80J82J12P7K49k91p6j04J52k84
5745b00K71k13L10k36j13K67R7J8j84j43PJ02l5n9R6p7K33M0k69J79j59Q0k17
5768b05J86J78k57K09j13j59O1q8K18O4l8M9l3k73J97Q9l15L04j15JJ12q5M0m6
5792a9k4k06J43J23j73K99j12L3l24L08r6J45N9j80J1Kj1J04k18K58j7n8j89J0
5816a32J8K69k15j10J60O1j09o1pj0J93p5P1J44l09J8N2Q3J1k84N10k46p0j50
5840a88m5N00k60J39j31n1j78O3L47l15M21n00K28N4K6j46j1j21J80J6P2Q4j11
$$ plain form
5863 73 85 199 126 -216 62 -62 235 -92 -70 -213 102 26 -53 -36 34 53 60 31 18 -102 8 177 -131 -90 36
5888 36 -72 15 -40 -60 221 122 -52 -58 31 -127 -128 -141 -86 61 63 32 90 -40 207 46 179 8 3 -60 -48 15 66
5915 66 -18 35 91 -8 -25 -170 3 116 82 -7 -110 -17 116 220 -71 -16 -169 -89 126 -162 104 247 186 -72
5939 -72 -22 -49 125 -248 -137 36 126 -34 181 -8 -39 -66 -29 -69 -9 -151 87 26 56 -173 -205 -105 225 27
5963 27 -146 -80 14 11 -64 -38 -51 14 231 -68 -51 -203 62 70 32 -55 -60 -79 27 160 53 -129 -195 189 294 -9
5989 -9 201 -109 7 -10 163 18 -220 -152 2 194 3 159 -102 -103 25 -28 -351 47 -64 -45 34 -248 -260
6012 -260 -80 109 24 100 10 125 -122 1 -203 39 -210 -11 129 77 58 49 3 -348 -105 40 -60 -163 51
6035 51 100 -78 21 19 -14 24 31 -59 -170 -217 94 -40 57 123 -35 -28 181 -165 -186 53 143 -7 66 -140 -56 46
$$ packed form
5863G3J2J14p3l42K78j24K97l27K2j43L15p6p9J7P0J9Pk9j3j20J10J69l08M1J26
5888C6j08Q7n5k0K81r9j74oQ9j58jj3N5J47Kl1N8j30K47j61J33j71no3J2O3N1
5915F6q4N3N6r9j7j45J73J13l4q9j03R3J33J04k91N5j53Q0K15k88K66J43o1k58
5939g2N0k7J74l73J11J73R0j60K15j89l1k7L7m0O0j42K38o1L0k29l2J00L30j98
5963B7j73O6R4lp5K6j3O5K17k99J7j52K65Ql8q7nj9J06J33j07j82o6L84J05l03
5989iK10l10J16j7J73j45k38O8J54J92j91J56k61jJ28n3l23L98j11J9P9k82j2
6012b60J80J89q5P6r0J15k47J23k04K42k49J99J40n2j9rm6l51K43J45j00j03K14
6035E1M9j78R9kl3L8Pr0j11m7L11j34R7O6j58PK09l46k1K39R0j50P3k06Q4J02
$$ plain form
6061 46 -195 293 239 94 67 -94 59 125 -221 -184 -8 181 -147 105 -63 -40 -31 -87 116 -147 32 50 41 51
6085 51 303 175 18 140 42 -248 -28 38 -89 -24 -37 160 -132 49 -145 -220 76 -86 130 -154 261 -52
6107 -52 21 -113 -66 152 -6 -7 126 42 -79 143 -46 -249 -220 127 3 71 110 68 170 -1 -75 -13 -106 -14 173
6132 173 59 -76 35 38 52 104 -19 -80 111 4 71 290 150 -191 -110 -92 3 311 -134 200 333 -328 -37
6155 -37 61 -77 -60 -129 124 36 28 220 -117 87 -93 -81 -63 -116 -97 99 95 -105 106 -39 97 -65 -47 -122 171
6180 171 28 91 -9 86 70 -139 86 -57 215 195 -38 0 -98 -106 81 -6 0 272 90 -122 -40 -76 -80 -260 281
6205 281 23 144 -92 -130 79 63 21 -23 41 22 147 -13 167 -125 -37 36 210 -202 -17 88 -196 81 -59
6228 -59 114 -153 36 66 -124 -94 3 113 5 165 47 286 -166 163 43 180 117 18 317 -66 230 272
$$ packed form
6061D6k41M88n4j45k7j61J53O6l46L7J76J89l28K52j68K3Rn6K03k63J79J8rJ0
6085E1K52j28j57J22r8k90K20O6j27O5j3J97k92J81j94p5K96j62K16k84M15l13
6107e2P3j34M7K18j58jJ33q4j21K22j89k03K9L47j24O8L9m2J02j71p4O2r3R2J87
6132A73j14j35J11LJ4N2j23o1J91j07O7K19j40l41Q1J8R5L08m45L34J33o61K91
6155c7R8j38J7o9K53q8qJ92l37K04j80J2J8n3J9J96mk00K11j45J36j62J8p5K93
6180A71j43O3j00R5j6k09K25j43K72k0k33L8r8qJ87q7OK72j82k12Q2l6mj80N41
6205B81k58J21k36l8K09j6m2m4O4j9J25j60J80k92Q8P3J74m12J85J05k84K77j40
6228e9J73k67J89L0j90L0R7J10j08J60j18K39m52L29j20J37o3r9K99l83K96M2
$$ plain form
6250 272 -158 131 -319 149 -281 -139 -312 -71 -70 99 13 147 184 12 -68 -111 78 54 -162 105 301 212 -145
6273 -145 -60 -118 -132 -317 28 -76 -256 -111 -10 -31 -69 -148 274 129 247 231 80 -14 -102 171 52 -72 -113
6296 -113 -64 -309 -40 -128 -191 -28 118 77 153 -71 -49 66 -34 -169 175 102 178 -83 8 237 70 105 165 -111
6320 -111 15 3 115 -17 217 -235 95 -47 3 106 -117 83 105 -63 218 -47 -120 78 -46 205 4
6341 4 -97 36 59 163 -36 -173 -7 -1 39 139 78 -39 148 -104 -166 -270 -158 -69 -169 123 155 -9 141
6364 141 166 -13 -110 102 6 -170 240 -10 101 -145 -138 -124 -126 -94 67 64 72 -40 -45 98 26 -93 -29 -140 -67 -19
6390 -19 -102 355 123 -113 -97 38 171 32 -104 -112 -83 -243 -69 92 68 -121 304 -287 115 -160 -65 -86 -420
6413 -420 10 -35 -162 33 222 -146 36 -42 200 77 64 -201 -19 -243 -17 196 239 89 -4 -351 8 -35
$$ packed form
6250B72m30K89m50M68m30J42j73K41JJ69q6J34L7j72q0m3J89k4k16K67J96q9l57
6273a45Q5n8j4j85L45j04j80J45J01k1l8p9M22j45J18j6j51r4q8K73j19j24m1
6296a13M9k45K69q8o3J63J46m1P6k24K2J15j00j35L44p3P6k61R1K29j67L5O0k76
6320a11J26j2J12j32K34m52L30j42N0J03k23K00K2j68K81k65p3J98j24K51k01
6341Dj01J33K3J04j99j37J66OM0J00o1j17J87k52o2j04J12Q9j00K92L2j64J50
6364A41K5j79r7K12r6j76M10k50J11k46PJ4kL2J61lQj12nJ43p2j19O4j11P3M8
6390a9q3M57k32k36J6J35J33j39j36qK9j60J74J61k4j89M25n91M02k75R5k1l34
6413d20M30m5j27J95J89l68J82p8K42j23j3k65J82k24K26K13M3j50r3l47L59m3
$$ plain form
6435 -35 -192 -75 85 -6 -40 188 -208 -51 -158 111 -160 -64 -23 121 -55 -12 -173 74 188 145 20 -143
6457 -143 -108 -301 41 -66 332 152 -157 -79 154 -77 -3 -82 22 119 -2 184 -101 186 7 -23 -46 -25 77
6480 77 -45 121 86 23 311 -190 135 -115 86 -70 121 -58 -3 85 132 71 82 -157 90 -41 -35 111 110 185
6504 185 -92 167 -142 -60 -81 -143 263 -27 -20 25 -53 168 -73 -36 -14 173 -17 -297 -20 -38 66 -90 -44 -68
6528 -68 -176 2 201 75 -122 -205 241 232 226 -4 7 -250 27 -114 -161 -127 27 -3 -86 -57 -110 229 60 52 19
6553 19 -76 206 -143 -193 9 143 140 18 21 -152 15 -194 -1 -102 -17 68 16 27 197 -64 -99 27 -10 261
6577 261 -122 269 134 54 99 -174 -86 -170 -141 -6 -120 65 24 -50 -156 37 -132 -145 65 -61 83 -3 -184
6600 -184 -42 129 62 84 -95 -12 249 -65 -33 125 62 -9 -125 41 63 181 -20 150 150 -148 223 -112 -228
$$ packed form
6435c5j57J17J60r1l4K28l96J57j07K69k71R6M1J44j76M3j61K47J14m3j25j63
6457a43L5j93L42j07L98j80l09P8K33k31P4p9J04R7j21J86k85K87j79l0k3K1J02
6480G7j22J66l5o3K88n01L25k50K01j56J91j79N5Q8M7o1J1k39K47j31OJ46jP5
6504A85k77K59l09Q2k1o2M06k90PM5p8K21k41L7K2J87j90k80K77j8J04j56M6k4
6528f8j08J78J99j26j97q3M46rok30J1k57K77j41m7L4J54l0q3K9n3L39j69ql3
6553A9r5K82l49n0K02J34lj22Lj73J67k09J93j01Q5Q5n2J1J70k61l5J26l7K71
6577B61l83L91j35q0M5k73Q8q4K9J35j14J85m1p4j06J93j69j3K10j26J44q6j81
6600a84J42J71o7K2j79Q3K61l14L2J58o3p1j16J66K2J18k01J70%k98L71l35j16
$$ plain form
6623 -228 44 133 -31 88 -28 76 127 -82 356 -105 265 -185 82 0 -75 22 -246 -25 124 -158 17 -125
6645 -125 55 -95 -172 -116 -35 -15 19 84 130 -124 32 15 167 69 -115 -106 -52 32 25 -30 -252 176 61 -35 143 154
6671 154 -33 -12 25 69 88 -46 108 25 125 -97 -75 151 142 -134 -46 120 -117 49 7 57 -116 129 -46 157
6695 157 -48 2 -153 34 -206 204 229 -58 7 -134 20 -262 -222 132 -57 -209 -5 -92 -1 70 77 -4 -50 10
6719 10 134 -39 -101 -297 73 -85 151 90 -234 -99 -23 267 220 -128 50 -195 86 9 -123 -150 88 -114
6741 -114 18 166 41 -383 0 84 -80 164 -79 104 -62 -67 -66 29 -97 38 124 33 -242 -74 109 22 182
6764 182 -175 105 142 -250 -9 -108 0 179 -83 10 -11 -171 160 -197 -18 129 181 -41 91 77 166 217 -112
6787 -112 146 -170 -76 -165 -51 45 -1 -121 60 176 149 146 338 39 -8 -19 -233 19 -72 -20 101 61 -170 -451
$$ packed form
6623b28K72Q9j64J19j16J04N1k09M38m61L70m50K67q2p5R7k68K21J49k82J75j42
6645a25J80j50p7N6Q1K0L4O5M6k54J56j7J52r8j84RN4Q4pn5k22M28j15r6J78J1
6671A54j87K1L7M4J9j34J54q3J00k22K2K26rk76Q8J66k37J66m2N0j73K45j75K03
6695A57k05N0j55J87k40M10K5k87O5j41J54k82M0L54j89j52K04q7R1P1Pq1m6O0
6719A0J24j73o2j96L70j58K36o1l24J35P6K90m7l48J78k45K81p7j32k7K38k02
6741a14J32J48j25m24L83Q4j64K44k43J83j66nJR5j26J35Q6r1k75J68J83q7J60
6764A82l57K80L7l92K41r9J08J79k62R3k1j60L31l57J79J47N2k22J32j4Q9N1l29
6787a12K58l16R4q9J14R6m6j20J81J16k7lJ92k99m7j1k14K52r1N2J21m0k31k81
$$ plain form
6811 -451 97 25 297 -346 -22 -27 -148 99 -22 131 -255 203 -191 -416 -50 18 236 16 60 -25 -27 148 23
6834 23 106 101 -57 -115 -23 131 126 -57 -91 -5 234 -128 -55 214 -106 197 -19 -128 -154 17 -99 -24 85 184 -120
6859 -120 -50 213 -139 -185 8 11 -120 -219 104 -65 -192 85 -110 183 -129 151 -51 -53 76 -28 -115 -202 -296
6882 -296 92 -247 61 124 -331 1 -18 -16 -257 -161 -64 36 146 93 -20 49 -22 -196 28 -2 -66 -14 25 20 -87
6907 -87 111 5 -84 3 103 182 184 -235 -111 53 111 -75 73 120 99 -32 -39 233 70 13 -38 119 179 -23 -32
6932 -32 -117 -25 178 289 -109 3 82 12 21 36 -312 170 99 167 -74 -154 -57 -35 -290 -135 -59 253 -122 269 -30
6957 -30 -37 13 127 88 -203 -169 156 -8 85 -52 -157 -13 -24 124 -109 114 187 -35 28 161 129 90 -126 -43
6981 -43 368 76 3 0 -48 -30 12 -20 -189 92 189 121 -215 -384 -64 25 84 234 180 165 -189 -33 -17 -109 45
$$ packed form
6811d51N48p2K72o43L24nj21K47j21J53l86M58l94k25L66O8K18k20M4q5kJ75j25
6834B3Q3nj58n8R2J54nj83l4Q6K39l62P3K69l20L03k16j09k6J71j16P5J09R9l04
6859a20P0K63l52m6J93Lj31r9L23j69j27K77j95K93l12K80k02kJ29j04q7q7r4
6882b96L88l39L08O3m55L32j9Kk41R6R7J00J10n3j13O9p1j74K24l0o4N2L9nj07
6907h7J98j06q9Q7J00P9Km19J24J64N8j86J48M7k1j31pK72j63n7n1J57O0k02r
6932c2q5R2K03J11l98J12P9p0RJ5l48M82p1O8k41q0R7K2k55J55P6L12l75L91k99
6957c0pN0J14l9k91L4L25j64R3j37j05J44j1J48k33K23P3k22O3J33l2l9k16Q3
6981d3M11k92p3lm8J8M2l2j69K81R7o8l36j69L20Q9N9J50n4j5l54J56J6r2J54
$$ plain form
7006 45 -69 187 -137 235 -160 63 30 126 -61 71 223 61 47 -36 57 185 232 -159 113 -127 -220 -186 -443
7029 -443 -105 264 146 32 149 -32 -158 -264 -8 153 54 244 -57 -152 -83 4 81 -299 88 -70 8 -143
7051 -143 275 -64 42 99 -222 214 22 -116 -17 34 -92 -167 22 265 -73 241 84 59 -20 -86 34 -20 -153
7074 -153 27 46 -113 -214 -151 6 -84 30 27 85 -37 47 -162 -29 -50 105 -17 99 -244 -112 48 -84 41
7097 41 -62 -20 -65 53 -32 268 -287 -45 84 -98 -17 -12 -134 -25 -115 60 111 85 -93 39 13 -69 23 30 69
7122 69 69 -40 11 123 14 62 -44 -163 41 -115 44 77 134 -9 324 -53 122 -89 243 269 -95 -93 374
7145 374 11 46 -132 -239 145 -45 -5 -147 164 -245 46 118 92 191 113 -265 134 5 56 -79 -276 -25
7167 -25 86 -105 -234 17 -56 -95 21 -76 -55 236 88 -123 94 -263 -50 94 -31 35 25 -231 -18 -66 119
$$ packed form
7006D5j14K56l24L72l95K23l3R6j87J32J52j62j4q3R3J28M7l91K72k40r3L4k57
7029d43L38L69j18j14J17j81j26j06K56J61r9J90l01r5O9Q7P7l80L87j58P8j51
7051a43M18l39J06N7l21M36j92j38R9N1j26p5J89K43l38L14j57k5p9o6J20n4j33
7074a53J80J9j59j01O3J57r0J14lN8j22Q4k09J33k1J55j22J16l43J32J60j32J25
7097D1j03M2m5J18q5L00n55K42J29j82Q1Nj22J09r0J75N1k6j78J32k6q2R2PL9
7122F9%j09N1J12j09M8j06j19K04j56J59L3N7j43L33l77J75k11L32K6l64KM67
7145C74l63L5j78j07L84j90M0j42L11m09K91P2k6R9p8l78L99j29N1j35j97K51
7167b5J11j91j29K51p3l9J16r7K1K91j48k11K17l57K13J44j25O6j0k56K13m8J85
$$ plain form
7190 119 70 182 -132 51 -155 123 -84 60 -41 -6 286 -127 -104 -131 28 -111 -233 -26 140 10 -82 -159
7212 -159 -111 -81 135 54 -9 12 -89 -74 46 68 -202 24 -29 215 -110 -182 -15 142 6 -75 -31 44 287 70
7236 70 122 75 84 -46 67 -57 -228 221 19 45 -36 -111 109 214 66 -94 -169 -40 -55 -125 -23 81 -119 -159
7260 -159 111 13 -98 192 -52 115 -137 -112 289 -27 83 -156 17 -27 134 -51 -26 8 -30 98 -195 46
7282 46 77 161 98 -82 9 129 50 31 -40 -50 -118 -94 32 53 97 -165 -211 113 3 18 -106 197 -25 -122 37
7307 37 -96 221 -123 61 -273 -66 17 83 96 61 -306 -19 -162 64 -77 -42 -27 -168 68 147 32 -60 48
7330 48 43 101 60 -14 -30 -122 -96 179 170 211 8 177 -128 -87 -222 -60 -34 -113 -17 261 -55 176 232 78 4 170
7356 170 -30 -109 -55 3 -130 -195 295 -9 244 -99 68 -81 -152 -34 -11 120 134 1 -29 278 224 83 -204
$$ packed form
7190A19m9J12l14J83k06K78k07J44j01L5K92m13K3k7J59j39j22K07J66j30r2p7
7212a59M8L0K16q1o3K1j01J5J20K2k70K26n3K44l25p2J67J57j36q1M4P5K43k17
7236G0N2m7Rj30J13j24j71M49k02K6q1p5K20J05j48j60p5J29j5p0J02J04k00m0
7260a59K70r8j11K90k44J67k52K5M01l16J10k39J73m4J61j85K5L4l8J28k93K41
7282D6L1Q4o3j80R1J20p9j9p1j0o8K4J26K1M4k62m6L24j10J5j24L03k22r7J59
7307C7j33L17l44J84l34K07Q3O6J3l5l67K87j43K26j41L5J5j41K36P9j15r2J08
7330D8nN8m1p4j6r2K6K75rM1k03J69l05M1j35J62K6p9R6K78l16K31N6j54p4J66
7356A70k00p9N4N8j33o5M90l04K53l43J67j49p1J18K3J31J4j33l0L07n4j41k87
$$ plain form
7379 -204 106 143 -2 131 146 -324 256 437 -67 -8 -130 -4 -163 -68 -46 52 -66 -263 176 65 20 -87
7401 -87 -8 30 119 -10 332 -96 145 -130 -254 -39 -50 -51 -150 -89 -17 56 -221 -106 -199 -35 104 -94 -105 163
7425 163 -38 275 194 -54 -73 96 -52 -12 141 -131 99 -6 -71 86 -96 -2 -182 260 48 -80 132 -224
7447 -224 149 60 136 -101 -243 -186 -93 -122 -193 -115 34 88 -27 82 -22 223 -193 52 -139 94 -98 137 -116
7470 -116 61 -118 -99 49 141 156 10 -31 -247 -54 3 -244 -52 -70 199 134 -73 251 61 52 24 196 241 -291
7494 -291 -150 -83 151 165 -2 3 -51 -81 18 154 66 118 3 202 -50 -68 -145 82 85 118 -78 6 309 -34 -7
7519 -7 -175 94 -199 -259 -182 26 -143 -154 252 167 -110 -147 -131 112 -101 101 84 -2 -159 -16 110 33 15 187
7543 187 -26 -51 17 -224 54 45 3 29 -36 -82 -42 -80 -105 -145 54 311 -73 7 52 -1 108 223 112 84 41 -102
$$ packed form
7379b04L10L7j45J33J5m70N80J81n04N9j22J26j59R5K2R8j18j97M39j11m5j07
7401h7P9L8Q9j29L42m28K41k75j24K15j1jr9O1P2P3k77J15r3J64J39j98j1K68
7425A63k01L13q1k48j9J69j48M0J53k72K30j05o5J57j82R4j80M42k12j28K12l56
7447b24L73q9P6k37j42N7R3k9p1P8J49N4j15J09j04K45m16K45j91K33j92K35k53
7470a16J77j79J9J48R2J5j46m1k16J93N7k47J92j8K69o5k07L24j90rk8J72M5n32
7494b91J41O7K34J4j67Nn4l0R9J36q8N2j15J99k52j8p7K27LL3j96Q4L03l43K7
7519gj68K69k93o0P7K08j69j1M06q5k77l7J6K43k13K02j7q6j57J43J26p7j8J72
7543A87k13k5O8k41K78rm2K6o5m6M0l8k5m0J99K57l84Q0M5n3J09J15j11k8m3j43
$$ plain form
7569 -102 153 -83 137 51 149 -102 -6 -88 -35 -202 -97 -83 46 45 233 -32 -127 178 -74 37 188 -99 -230
7592 -230 -168 56 32 6 41 -187 -5 -8 81 -11 -128 178 104 -206 -43 139 289 -16 -118 16 175 160 -92
7615 -92 81 30 -159 15 6 -42 -96 -1 -14 -131 73 -109 100 13 -173 222 61 -33 -25 -119 -161 -111 18 -89 172
7640 172 205 229 67 27 -277 104 274 -13 4 -120 -49 -79 -80 82 56 -18 8 32 63 191 16 -84 57 71 -82
7665 -82 258 29 -24 -100 116 206 -28 -153 -4 24 -23 46 81 47 27 -160 101 -140 -223 134 -46 -27 -83 60
7689 60 70 -7 72 -48 -131 39 -47 41 -84 -130 -116 48 103 156 -105 111 204 -125 -32 47 54 90 114 66 -233 88
7715 88 -30 217 169 -27 42 -104 -61 160 -294 73 24 15 -162 172 21 89 -125 -167 -109 -184 -80 -202 58 -138
7739 -138 178 -164 57 10 -288 161 -95 49 245 -10 -165 107 -27 -39 76 -45 199 178 -35 -63 -92 -254
$$ packed form
7569a02K55k36K20q6R8k51R6q2N3j67J05J4J29jJ88k65r5L05k52J11J51k87j31
7592b30O2K24k4k6L5k28J82lQ9r2j17L06p4l10J63J82J50l05j02J34J59j5k52
7615i2J73n1j89J74rm8n4R5j3j17K04j82K09q7j86L95j61r4Qr4m2N0J29j07K61
7640A72L3K4j62m0l04L81J70k87J7j24P1l0jJ62k6p4K6K4L1J28j75j00J41J4j53
7665h2L40k29n3p6K16R0k34j25J49K8m7O9L5l4k0j87K61k41q3L57j80J9n6J43
7689F0J0p7P9j20q3J70q6Q8j25m6J4J64N5N3k61K16R3l29R3P9PL6K4m8k99L21
7715H8j18K47m8j96O9j46M3K21m54L67m9rj77L34j51O8k14m2N8p5J04j22K60j96
7739a38L16l42K21m7k98M49k56J44J96k55j55K72j34j2J15j21K44k1k13k8k9j62
$$ plain form
7761 -254 86 -44 -61 4 -16 92 -101 -292 -43 63 -110 -322 48 -62 54 -26 -78 -58 105 -136 36 17
7783 17 -69 238 -61 80 211 -40 -121 38 6 162 -40 -62 4 150 -95 89 -67 -94 20 7 60 -110 1
7806 1 -118 264 -156 -191 -58 160 -11 -82 -125 131 -15 181 229 370 -30 -58 32 109 272 52 267 1 244
7829 244 220 -234 51 -149 -183 -139 -106 -28 43 -162 -26 -166 -157 44 0 14 166 -149 202 80 -203 138 103 -115
7853 -115 -157 41 128 58 108 -91 90 86 -64 92 315 162 -2 -88 -121 291 86 -129 41 -15 -257 -44 134
7876 134 -91 -80 82 127 68 -16 30 28 -67 129 -174 29 -32 -146 76 -117 -99 106 85 -143 184 -3 -89 -108
7900 -108 84 130 -56 -97 -204 93 50 158 2 18 -108 103 -20 274 -137 18 -70 164 82 -212 200 12
7922 12 -70 -24 -207 -43 -83 39 12 -114 47 18 32 71 -64 47 26 -33 -45 -64 -7 -7 -143 -156 -14 26 -162 -9
$$ packed form
7761b54L40j30j7O5k0J08j93j91K49J06j73k12L70j10J16q0n2K0J63k41J72j9
7783A7q6L07k99J41J31k51q1J59l2J56k02k2O6J46k45J84j56k7J14j3N3j70J11
7806Aj19L82m20l5J33K18j71p1m3K56j46J96M8J41m00k8R0P7J63k20K15k66K43
7829B44k4m54K85k00l4M4L3P8P1k05J36j40RK01m4J4J52l15L51j22k83L41l5k18
7853a15m2J98Q7p0N0j99J81mj50J56K23j53j64q6l3M12k05k15J70n6k42K13J78
7876A34k25J1J62M5n9q4M6kr5J96l03K03o1j14K22j93J8K05k1k28L27j87q6j9
7900a08J92M6j86m1j07K97m3J08j56J6j26K11j23K94m11J55q8K34q2k94M12j88
7922A2q2M6j83J64m0J22k7j26J61k9J4L9j35J11k1n9j2j9N7%j36j3J42M0j88J53
$$ plain form
7948 -9 -55 -24 109 -212 19 112 -59 65 35 138 -323 88 32 -49 99 69 -78 -170 -28 133 -6 -98 -53 236
7972 236 120 19 276 82 -287 -76 -93 36 -201 12 -62 -64 56 97 76 -96 184 53 30 -184 130 -11
7994 -11 -177 268 271 -15 172 8 -45 232 118 -214 -91 72 47 10 125 54 -32 -13 103 -3 -111 108 -115
8017 -115 125 79 -64 274 79 10 -243 -36 -129 -32 126 -5 -96 -118 -224 296 -24 -140 -62 43 -98 -217
8039 -217 213 47 170 23 100 -254 -100 -123 -180 -106 44 99 -45 168 -80 68 225 -61 -68 -175 -34 -139
8061 -139 151 34 -56 55 -112 189 -68 66 47 -72 29 -103 175 -26 -184 -72 64 66 75 -119 316 -193
8083 -193 66 2 53 -61 134 16 -23 129 -53 73 44 -222 -10 126 101 127 28 9 -41 -117 -147 27 66 -73
8107 -73 5 94 38 -53 -37 -138 -36 -64 58 93 -123 157 -104 -128 47 140 73 -33 -110 -44 -34 92 -5 -22 -153
$$ packed form
7948im6L1J33l21K31R3j71J24l0J03m61M11n6q1J48l0j47r2J42J61j39r2M5K89
7972B36j16j01K57j94l69K11j7J29k37K13p4kJ20M1k1j72K80j31k3k14L14j41
7994a1j66M45Lk86J87j64n3K77j14l32J23J63k5l7J15p1q6J9J16j06j08K19k23
8017a15K40m6j43L38j95o9k53K07r3R7J58j31r1k2j06N20l20j16P8J05j41j19
8039b17M30j66J23j47P7l54J54k3n7P4J50N5j44K13k48J48J57k86pj07J41j05
8061a39K90j17r0J11j67L01k57J34j9j19J01j32K78k01j58J12J36KRj94M35n09
8083a93K59o4N1j14J95j18l9J52j82J26k9k66K12J36k5K6r9j9n0p6l0J74L9j39
8107g3P8Q9n6r1J6j01J02k8J22L5k16K80k61k4J75R3o7j06p7O6J0J26r7j7j31
$$ plain form
8132 -153 144 -168 65 93 4 11 -230 -2 -35 -113 -222 165 -70 26 -14 141 97 13 -23 -30 -59 -83 -67 -1 0 -38 131
8159 131 38 271 3 -166 24 90 80 34 -194 178 147 -32 -64 58 49 77 -38 22 -161 145 -50 52 -101
8182 -101 -114 -87 -170 -25 192 -309 136 282 127
$$ packed form
8132a53K97l12K33K8q9Pk41K28l3p8j09L87k35R6m0J55m4q4l6pk9k4J6O6Jl8J69
8159A31r3K33k68j69J90O6j0m6k28L72l1j79l2J22rK8j15O0j83L06j95J02j53
8182a01j3K7q3J45K17n01M45J46j55
8191A27
$$ Imaginary data points
##PAGE= N=2
##DATA TABLE= (X++(I..I)), XYDATA
$$ plain form
0 0 0 0 0 0 0 0 0 0 0 0 0 0 0 0 0 0 0 0 0 -8 8 -8 8 -8 8 -16 16 -16 19 -24 24 -31 32 -39 41 -48 55 -61 68 -76
40 -76 84 -93 102 -115 125 -139 155 -170 187 -205 226 -250 275 -305 336 -372 414 -461 515 -582 660
61 660 -755 879 -1041 1261 -1589 2115 -3119 5688 -26562 -32905 59506 95429 49042 -4970
75 -4970 24822 72031 51959 -7895 -12023 25978 37564 15569 27094 60872 36512 -43598 -73604
88 -73604 -28988 2984 -33047 -70944 -45124 -1054 -2030 -13388 10196 34713 4447 -41911 -23536
101 -23536 35698 41518 -7761 -30209 3001 28064 10500 1472 26569 31204 -8648 -35202 -2552
114 -2552 35762 10606 -37905 -30097 16588 33024 15247 15476 34553 17889 -28512 -37537 -2471
127 -2471 10706 -27163 -54377 -20180 22368 16727 -7203 -5265 3264 -21081 -48188 -24361 22064
$$ packed form
0@%%%%%%%%%%%%%%%%%%%qJ6j6J6j6J6k4L2l2L5m3M8n5O3p1Q0q9J03j16J29j44
40g6J60j77J95k17K40k64K94l25L57l92M31m76N25n80O41p08P86q75R76j097J242
61F60j415J634j920K302k850L704n234Q807l2250o343R2411L5923m6387n4012
75d970K9792M7209k0072n9854m128L8001J1586k1995J1525L3778k4360q0110l0006
88g3604M4616L1972l6031l7897K5820M4070r76j1358K3584K4517l0266m6358J8375
101b3536N9234N820m9279k2448L3210K5063j7564r028K5097M635l9852k6554L2650
114b552L8314k5156m8511P808M6685J6436j7777K29J9077j6664m6401r025L5066
127b471J3177l7869k7214L4197M2548n641k3930J938Q529k4345k7107K3827M6425
$$ plain form
140 22064 25101 -4364 -3033 39029 58606 28588 2179 7771 7825 -16802 -24834 8726 34667
153 34667 8705 -26451 -15839 13433 7417 -26856 -34482 -12541 -9034 -23950 -13047 20986 25900
166 25900 -10106 -27689 2704 28128 10674 -12944 -2403 17746 7643 -10475 3775 25658
178 25658 9598 -22463 -16615 20660 29681 -1195 -16280 1123 8581 -11039 -19382 3759 17630
191 17630 -6416 -25055 -3163 23045 8636 -25151 -25471 -1060 944 -13874 -5057 21392 22038
204 22038 -5590 -12139 14631 25561 -821 -20793 -3138 20346 12244 -4292 5907 18425
216 18425 -1590 -29291 -22326 5552 5663 -19725 -20206 8419 20395 1613 -10595 4727 12647
229 12647 -8233 -18687 6414 30210 17366 -7261 -1014 19674 10211 -17223 -20179 -1125 335
$$ packed form
140B2064L037k9465J331M2062J9577l0018k6409N592N4k4627q032L3560K5941
153C4667k5962l5156J0612K9272o016l4273p626K1941L507j4916J0903L4033M914
166B5900l6006j7583L0393K5424j7454k3618J0541K0149j0103j8118J4250K1883
178B5658j6060l2061N848L7275R021l0876j5085J7403P458j9620q343K3141J3871
191A7630k4046j8639K1892K6208j4409l3787l20K4411K004j4818Q817K6449O46
204B2038k7628o549K6770J0930k6382j9972J7655K3484q102j6536J0199J2518
216A8425k0015k7701O965K7878J11k5388m81K8625J1976j8782j2208J5322P920
229A2647k0880j0454K5101K3796j2844k4627O247K0688r463k7434k956J9054J460
$$ plain form
242 335 -19044 -17620 10566 18490 -6275 -21817 -3689 13878 412 -15153 111 21067 13393
255 13393 -4437 2892 23259 14570 -13554 -16020 7054 12429 -8725 -18333 -229 8710 -10256
268 -10256 -22253 -4821 11947 -14 -16809 -2890 20478 13251 -9542 -7917 12012 12246 -7760
281 -7760 -8210 14921 20426 -1665 -14073 715 10371 -9252 -26293 -10889 9783 3329 -10795
294 -10795 -646 20324 13242 -10761 -11696 7248 8967 -8968 -11310 11567 21928 3552 -9639
307 -9639 2812 11658 -5729 -23444 -11652 7748 2129 -11599 -3343 16331 12943 -8861 -11427
320 -11427 7513 11308 -5437 -10815 6530 17092 1158 -10842 1066 11666 -1879 -17799
332 -17799 -8374 10758 6313 -11085 -8902 7379 7260 -9619 -10642 7639 13529 -2537 -7916 8246
$$ packed form
242C35j9379J424K8186P924k4765j5542J8128J7567j3466j5565J5264K0956p674
255A3393j7830P329K0367q689k8124k466K3074N375k1154r608J8104Q939j8966
268a0256j1997J7432J6768j1961j6795J3919K3368p227k2793J625J9929K34k0006
281g760m50K3131N505k2091j2408J4788R656j9623j7041J5404K0672o454j4124
294a0795J0149K0970p082k4003r35J8944J719j7935k342K2877J0361j8376j3191
307i639J2451Q846j7387j7715J1792J9400n619j3728Q256J9674l388k1804k566
320a1427J8940L795j6745n378J7345J0562j5934j2000J1908J0600j3545j5920
332a7799R425J9132m445j7398K183J6281j19j6879j023J8281N890j6066n379J6162
$$ plain form
346 8246 18281 2430 -14297 -5826 7450 -184 -11850 -3618 12464 7882 -10550 -8959 7676
359 7676 7488 -10669 -15782 1475 12593 1773 -5051 7398 14288 -292 -14421 -5003 10029
372 10029 1851 -13814 -8911 8751 9581 -4818 -7408 5611 6873 -7769 -9131 8769 18278 4000
386 4000 -8764 2117 13931 3942 -10533 -6232 5536 554 -12882 -7488 8125 4285 -15844
399 -15844 -20261 -3043 6311 -4594 -9515 5443 15730 6682 -1928 8840 19301 5867 -10891
412 -10891 -3386 14535 13920 -2415 -5014 6483 4174 -12969 -16514 -3892 -993 -15938 -21997 -3656
426 -3656 11839 3574 -8697 -2554 9914 5344 -5330 2313 16425 12008 -3840 -3008 13574 15833
440 15833 -2243 -12066 -2065 4699 -4657 -12169 -1986 5784 -6675 -17913 -6800 10067 6834
$$ packed form
346H246J0035j5851j6727Q471J3276p634j1666Q232J6082m582j8432J591J6635
359G676j88j8157n113J7257J1118j0820o824J2449O890j4580j4129R418J5032
372A0029q178j5665M903J7662Q30j4399k590J3019J262j4642j362J7900R509j4278
386D000j2764J0881J1814r989j4475M301J1768m982j3436N394J5613l840k0129
399a5844m417J7218R354j0905m921J4958J0287r048q610J0768J0461j3434j6758
412a0891P505J7921o15j6335k599J1497k309j7143l545J2622K899j4945o059J8341
426c656J5495q265j2271O143J2468m570j0674P643J4112m417j5848Q32J6582K259
440A5833j8076r823J0001O764r356p512J0183P770j2459j1238J1113J6867l233
$$ plain form
453 6834 -7709 -5733 9933 12113 -6 -2361 7457 7159 -7905 -11682 4952 14774 1811 -11087
467 -11087 -4921 6098 -115 -12650 -8547 2213 -521 -9636 -2463 15547 16930 -404 -7503 4373
481 4373 10537 802 -6887 1479 8621 -266 -7865 1029 10773 778 -16707 -15079 597 2529 -7956
496 -7956 -8289 3117 6314 -4037 -5144 8495 13449 -115 -8995 1967 15018 9296 -3760 -1338
510 -1338 6897 1700 -8467 -5036 7334 4147 -11414 -12956 1736 7379 -4190 -12602 -3411 4958
524 4958 -969 -5248 5048 13624 4360 -8734 -2887 11067 8565 -4759 -5942 5246 7910 -1808
538 -1808 -3613 5664 5537 -8520 -14768 -2641 7714 -547 -10717 -4702 5480 2537 -5674 -2552
552 -2552 6751 2884 -8240 -4499 10200 13026 159 -6267 2927 8765 483 -4908 2201 7412
$$ packed form
453F834j4543J976J5666K180j2119k355R818k98j5064l777J6634R822j2963j2898
467a1087O166J1019o213j2535M103J0760k734r115P173J8010J383j7334p099J1876
481D373O164r735p689Q366P142q887p599Q894R744r995j7485J628J5676J932j0485
496g956l33J1406L197j0351j107J3639M954j3564q880J0962J3051n722j3056K422
510a338Q235n197j0167L431J2370l187j5561j542J4692N643j1569q412R191Q369
524D958n927m279J0296Q576r264j3094N847J3954k502j3324j183J1188K664r718
538a808j805R277j27j4057o248J2127J0355q261j0170O015J0182k943q211L122
552b552R303l867j1124L741J4699K826j2867o426R194N838q282n391P109N211
$$ plain form
566 7412 -1044 -9034 -1349 8666 2092 -11384 -11006 724 3290 -5276 -5587 4145 4919 -4824 -7192
581 -7192 3873 9375 -1056 -9096 -96 10604 7453 -928 1231 7940 2901 -7398 -4605 5642
595 5642 4751 -6777 -9506 2202 8271 -531 -7021 -1284 3348 -2962 -8590 -486 8483 2490 -7275
610 -7275 -3521 8012 7655 -3401 -5378 2514 3681 -4364 -6112 3166 6729 -3584 -9300 -149 8774
625 8774 3410 -5295 -2109 6416 3369 -4657 -1721 6753 5418 -5243 -4982 6625 9681 -1451 -7756
640 -7756 -1528 2806 -3989 -9881 -2880 4720 -1128 -8164 -2169 8389 5543 -5712 -6150 3204 5065
655 5065 -1823 -2095 6405 9945 690 -3453 4546 8909 109 -9024 -5036 3670 549 -6415 -3352
670 -3352 4470 2193 -6479 -6165 3143 3776 -5691 -7983 647 6562 966 -3434 2932 8135 1962 -4745
$$ packed form
566G412q456p990P685J0015o574j3476L78J1730K566q566l11R732P74r743k368
581g192J1065N502j0431q040R000J0700l151q381K159O709n039j0299K793J0247
595E642q91j1528k729J1708O069q802o490N737M632o310n628Q104Q969n993r765
610g275L754J1533l57j1056j977P892J167q045j748R278L563j0313n716R151Q923
625H774n364q705L186Q525l047q026K936Q474j335j0661K61J1607L056j1132o305
640g756O228M334o795n892P001P600n848p036N995J0558k846j1255m38R354J861
655E065o888k72Q500L540r255m143P999M363q800r133L988Q706l121o964L063
670c352P822k277q672L14R308O33r467k292Q630N915n596m400O366N203o173o707
$$ plain form
686 -4745 -317 7140 2737 -6705 -4400 5241 5009 -2793 -4256 3105 4673 -3536 -6411 1124 4731
701 4731 -2277 -7682 -1222 6598 2588 -4164 -809 5645 3078 -4653 -3827 3964 3607 -4329 -5036 3318
717 3318 7479 -145 -4707 962 4755 -1207 -6974 -2561 4166 741 -5894 -2390 6060 4555 -3502
732 -3502 -4561 2592 3505 -3910 -5183 2268 6173 182 -3627 2517 8045 1928 -5323 -2111 3799
747 3799 1121 -6075 -3939 3981 3403 -3952 -4253 2852 4326 -3604 -7111 -104 4013 -1402 -5395 719
763 719 7216 3075 -3729 -51 5750 2949 -4757 -3882 3439 3624 -3071 -3857 3459 5313 -1180 -5398
779 -5398 346 4063 -1584 -6395 -1525 4687 2103 -3855 -829 6007 4127 -3278 -3442 2823 3210 -3857
795 -3857 -5194 1666 4198 -1650 -5031 -74 4642 -407 -6392 -2777 3112 1448 -4271 -2054 5584
$$ packed form
686d745M428P457m403r442K305R641k32p802j463P361J568q209k875P535L607
701D731p008n405O460P820m010o752L355O454k567p731Q26P791l57p936p07Q354
717C318M161p624m562N669L793n962n767M413O727l425o635L504Q450j505q057
732c502j059P153R13p415j273P451L905n991l809O144N528o117p251L212N910
747C799k678p196K136P920n78p355l01P105J474p930l507P007M117n415l993O114
763G19O497m141o804L678N801k801p706Q75P321J85o695p86P316J854o493m218
779e398N744L717n647m811M870O212k584n958L026O836j880p405j64O265L87p067
795c857j337O860K532n848l381M957M716n049n985L615N889j664n719K217P638
$$ plain form
810 5584 5545 -1227 -1087 5373 6011 -681 -3860 1246 5044 -11 -3927 170 4238 18 -5657 -3445
826 -3445 2129 -699 -7332 -6678 305 1929 -3089 -3587 2758 4943 -323 -3088 2140 6219 1597 -3180
842 -3180 1150 6949 5033 -1003 3 4863 2549 -4169 -4404 1073 1589 -4831 -6415 -40 3523 -1388
858 -1388 -5263 -1122 2925 -1118 -5090 -1042 4612 2135 -2870 -1089 4991 5120 -1734 -3176 1845
873 1845 2933 -2045 -3837 1075 4412 -799 -4373 106 4844 1851 -3386 -1550 3828 2814 -2349
888 -2349 -1086 3934 3706 -2200 -3241 2313 3967 -2392 -5852 -2162 1195 -2763 -6289 -2613 1895
903 1895 -463 -4642 -1553 4403 3705 -2161 -1688 4266 5844 1678 769 5515 7142 1764 -1284 2269
919 2269 4385 -114 -6046 -3954 857 -982 -5385 -4208 -30 -1035 -5937 -6345 -51 1294 -3264
$$ packed form
810E584l9o772J40O460O38o692l179N106L798n055l916M097M068m220n675K212
826c445N574k828o633O54O983J624n018m98O345K185n266k765N228M079m622m777
842c180M330N799j916o036J006M860k314o718k35N477N16o420j584O375L563m911
858a388l875M141M047m043l972M048N654k477n005J781O080J29o854j442N021
873A845J088m978j792M912L337n211l574M479M738k993n237J836N378j014n163
888b349J263N020k28n906j041N554J654o359l460L690L357l958l526L676M508
903A895k358m179L089N956o98n866M73N954J578m166r09M746J627n378l048L553
919B269K116m499n932K092M811j839m403J177M178j005m902m08O294J345m558
$$ plain form
934 -3264 -3953 1805 5997 3070 294 3171 6051 2676 -1296 584 4988 3349 -2387 -1608 3146 3406
950 3406 -1990 -3889 -696 811 -3505 -5214 -377 2278 -1020 -4508 -932 3641 1746 -2641 -1606
965 -1606 2589 1740 -2719 -2092 2666 2606 -2368 -3475 1633 4058 98 -3194 143 3114 188 -2574
981 -2574 -376 3900 2141 -2074 -113 4734 4102 -1425 -3283 367 1181 -3093 -4188 -198 2095 -1465
997 -1465 -4275 -782 2572 -909 -5015 -3175 1254 1220 -2023 -375 4585 4169 -123 -684 3249 4100
1013 4100 -676 -3050 1006 3988 1072 -1578 440 2998 260 -4547 -2449 1422 115 -4030 -3906
1028 -3906 834 2003 -1933 -2569 921 2100 -986 -2789 1065 4009 763 -2529 -106 3586 2304
1043 2304 -1595 -566 2968 2302 -1355 -1405 1995 2187 -2453 -4207 -298 2278 -480 -2771 -494 2317
$$ packed form
934c264o89N758M192k927k776K877K880l375l972J880M404j639n736P79M754K60
950C406n396j899L193J507m316j709M837K655l298l488L576M573j895m387J035
965a606M195q49m459O27M758o0m974j107N108K425l960l292L337K971k926k762
981b574K198M276j759m215J961M847o32n527j858L650Q14m274j095L990K293l560
997a465k810L493L354l481m106J840M429l4l243J648M960m16m292n61L933Q51
1013D100m776k374M056K982k916k650K018K558k738m807K098L871j307m145J24
1028c906M740J169l936o36L490J179l086j803L854K944l246l292K423L692j282
1043B304l899J029L534o66l657n0L400J92m640j754L909K576k758k291K277K811
$$ plain form
1059 2317 15 -2958 -1209 1669 443 -2821 -1772 3378 3716 19 -1264 1678 2284 -833 -2930
1074 -2930 446 2582 -913 -2915 -155 3220 999 -3189 -2273 1270 202 -2646 -1741 2359 2880 -860
1090 -860 -1371 2325 3242 -361 -2720 -78 2636 381 -2106 -202 2519 174 -3314 -2243 1015 1061
1106 1061 -2971 -2620 972 2191 -823 -2290 1102 2472 -635 -2004 991 3872 1837 -1557 -477
1121 -477 2495 924 -2156 -1829 1138 1159 -1974 -1971 1516 1939 -1667 -3312 -524 1947 -616 -2258 541
1138 541 2833 1582 -1088 -377 2947 1248 -2562 -1707 1568 2053 -577 -1556 1088 1776 -1232 -2861
1154 -2861 5 1720 -503 -2813 54 2952 1370 -1728 -1284 1456 885 -2067 -1740 1925 2319 -756
1170 -756 -1704 1170 2350 -926 -2844 -497 1707 83 -1881 -252 2822 1165 -2039 -1365 1494 1392
$$ packed form
1059B317k302k973J749K878j226l264J049N150L38l697j283K942O06l117k097
1074b930L376K136l495k002K760L375k221m188R16L543j068k848R05M100N21l740
1090h60n11L696R17l603k359K642K714k255k487J904K721k345l488J071L258M6
1106A061m032L51L592J219l014j467L392J370l107j369K995K881k035l394J080
1121d77K972j571l080L27K967K1l133LL487M23l606j645K788K471k563j642K799
1138E41K292j251k670P11L324j699l810Q55L275M85k630r79K644O88l008j629
1154b861K866J715k223k310K867K898j582l098M44K740n71k952L27L665L94l075
1170g56r48K874J180l276j918K347K204j624j964J629L074j657l204O74K859j02
$$ plain form
1186 1392 -1395 -1660 1478 2339 -491 -1525 138 1504 -861 -2974 -510 2206 761 -1782 -719
1201 -719 2181 913 -1872 -1978 865 1145 -1149 -1703 1438 2521 -495 -2321 -214 1492 -378 -2221
1217 -2221 -165 2523 1236 -955 -125 2304 1691 -1621 -1771 1193 1689 -936 -1264 747 1863 -669
1233 -669 -3072 -1117 748 -997 -2969 -840 2021 1125 -1077 -174 2110 1838 -691 -945 1981 2957
1249 2957 602 -250 1523 2653 -194 -2401 -1125 874 -983 -2911 -1797 701 104 -2635 -2331 324
1265 324 251 -1680 -1371 1301 2601 823 -404 1931 3105 934 -867 413 2329 762 -1377 -390
1281 -390 1214 342 -2203 -2572 -154 24 -2223 -2166 507 1798 -56 -1516 526 2146 393 -1319
1297 -1319 46 2379 1804 -531 214 1918 934 -1695 -1985 4 233 -1547 -2112 183 1775 -202
$$ packed form
1186A392k787k65L138Q61k830j034J663J366k365k113K464K716j445k543J063
1201g19K900j268k785j06K843K80k294n54L141J083l016j826K107J706j870j843
1217b221K056K688j287k191Q30K429o13l312j50K964M96k625l28K011J116k532
1233f69k403J955J865j745j972K129K861q96k202R03K284k72k529k54K926R76
1249B957k355q52J773J130k847k207J276J999j857j928J114K498n97k739L04K655
1265C24p3j931L09K672J300j778j227K335J174k171j801J280J916j567k139R87
1281c90J604q72k545l69K418J78k247N7K673J291j854j460K042J620j753j712
1297a319J365K333n75k335P45J704r84k629k90J989K29j780n65K295J592j977
$$ plain form
1313 -202 -1575 -193 1747 319 -1374 254 2279 1649 -143 51 1787 1382 -1150 -1726 -107 493
1329 493 -1393 -2103 53 1121 -823 -2210 -710 1011 105 -1595 -502 2182 1968 41 195 1810
1345 1810 1720 -386 -1148 999 1947 129 -1527 -113 1139 -733 -2450 -1317 116 -457 -1965 -968
1361 -968 1444 1251 -868 -875 739 1250 -294 -988 1263 2038 356 -786 644 1663 53 -1886 -1120
1378 -1120 450 196 -1401 -954 817 576 -1338 -1403 77 826 -830 -1367 352 1924 914 -488 637
1395 637 1789 345 -1153 -346 1503 654 -652 -451 877 736 -863 -1692 -500 118 -880 -1450 38
1412 38 1300 -20 -1600 -662 956 231 -975 -479 1302 1623 -223 249 1628 1674 -300 -1362 224
1429 224 1182 -91 -1281 -4 1112 63 -1443 -1055 219 -490 -1791 -1218 797 797 -780 -807 763
$$ packed form
1313b02j373J382J940j428j693J628K025o30j792J94J736m05k532n76J619O00
1329D93j886p10K156J068j944j387J500J721r06j700J093K684k14j927J54J615
1345A810r0k106p62K147R48j818j656J414J252j872j717J133J433n73j508R97
1361i68K412j93k119pJ614N11j544o94K251P75j682j142J430J019j610j939P66
1378a120J570k54j597M47J771k41j914o5J480P49j656n37J719J572j010j402J125
1395F37J152j444j498Q07J849q49j306K01J328j41j599q29J192O18r98n70J488
1412C8J262j320j580R38J618p25j206M96J781L21j846M72J379M6j974j062J586
1429B24R58j273j190J277J116j049j506L88J274p09j301N73K015%j577k7J570
$$ plain form
1446 763 953 -561 -743 672 1443 208 -488 547 1497 557 -1222 -716 905 323 -1049 -723 812
1463 812 895 -833 -1137 286 646 -737 -1225 234 1215 604 -659 154 773 -340 -1468 -1156 241 707
1481 707 -576 -452 815 876 -802 -1017 -194 447 -574 -699 750 1975 1034 19 566 1588 763 -1046
1499 -1046 -632 397 531 -762 -727 877 637 -768 -1701 -711 -88 -805 -1543 -480 917 348 -588 158
1517 158 1480 785 -294 -27 1257 1102 -6 -125 493 834 -447 -925 157 584 -333 -1239 -331 806
1535 806 -32 -1418 -1240 -15 82 -986 -297 1265 1252 -2 -652 499 531 -488 -1410 39 1004 376
1553 376 -23 385 1153 360 -650 -1107 283 -29 -830 -691 861 1214 -101 -335 171 635 -431 -1190
1571 -1190 -501 728 234 -727 169 1015 656 -463 -389 719 456 -839 -570 729 740 -201 -762 174 800
$$ packed form
1446G63J90j514j82J415P71j235o96J035R50r40j779N06J621n82j372L26J535
1463H12Q3j728l04J423L60j383m88J459R81o11j263Q13O19j113j128L12J397M66
1481G07j283J24J267O1j678k15Q23O41j021j25J449J225r41j015N47J022q25j809
1499a046M14J029J34j293L5J604k40j405r33R90O23p17p38J063J397n69r36P46
1517A58J322o95j079K67J284j55j108j19O18L41j281m78J082M27r17r06R08J137
1535H06q38j386J78J225R7j068O89J562j3j254o50J151L2j019r22J449R65o28
1553C76l99M08P68p93j010m57J390l12q01J39J552L53j315k34N06M64j066p59
1571a190O89J229m94r61Q96Q46l59j119P4J108k63j295K69J299J1r41n61R36O26
$$ plain form
1590 800 -194 -1021 -280 703 0 -1169 -619 664 110 -819 -739 759 860 -192 -144 755 585 -158 -218 196
1610 196 958 89 -509 212 834 247 -1050 -941 313 -348 -1134 -997 294 574 -118 -571 401 655 -103
1629 -103 -716 41 697 371 -156 285 1210 605 -473 -563 281 47 -992 -819 292 575 58 -545 329
1648 329 555 -288 -864 -155 720 164 -26 220 1102 642 -675 -460 234 -67 -964 -1110 179 123 -238 -570
1668 -570 222 737 -14 -592 -34 782 605 -428 136 998 952 139 6 641 485 -270 -635 47 5 -911
1688 -911 -1455 -688 -131 -428 -921 -488 761 206 -483 -312 400 281 -535 -326 957 1288 526 356 982
1707 982 1142 103 -593 -281 33 -131 -820 -141 549 400 -562 -549 264 -246 -704 -1010 -237 426 76 -148
1727 -148 830 1140 -7 -69 -218 140 -181 -491 -354 136 414 -338 -262 698 48 -318 -717 -289 347 -281
$$ packed form
1590H00r94q27P41R83p03j169N50J283n54r29Q0J498J01j052M8Q99j70p43o0M14
1610A96P62q69n98P21O22n87j297J09J254o61p86J37J291K80o92m53R72K54p58
1629a03o13P57O56l26n27M41R25o05j078r0Q44k34j039J73J111K83n17o03Q74
1648C29K26q43n76P09Q75n56j90K46Q82m60j317K15O94l01q97j46J289n6l61l32
1668e70P92N15p51n78N58Q16j77j033N64Q62m6q13j33O35j56p55l65O82m2r16
1688i11n44P67N57k97m93M33J249n55o89J71P12j19q16K09J283L31p62j70O26
1707I82J60j039o96L12L14j64o89O79O90j49r62J3Q13n10m58l06P73O63l50k24
1727a48R78L10j147o2j49L58l21l10J37M90K78p52P6R60o50l66l99M28O36o28
$$ plain form
1747 -281 -718 220 493 280 113 388 767 304 -160 -256 68 56 -757 -522 146 58 -386 -461 72 445 -119
1768 -119 -751 -648 -168 -96 -583 20 1043 807 103 286 765 552 -324 -390 -61 433 -123 -337 532 562 -5
1789 -5 -487 -500 -123 -559 -998 -742 -47 285 -261 -168 1069 496 -84 -65 239 221 -42 -334 291 474 171 -107
1811 -107 64 364 -72 -746 -636 -42 -110 -732 -426 149 273 -225 -191 373 911 53 -473 261 360 -77 -118
1832 -118 -92 229 491 -363 0 283 352 -513 -612 -137 113 -191 -542 199 602 249 -125 203 420 289 -237
1853 -237 -93 485 290 -334 35 402 530 -356 -338 -58 -202 -661 -731 -158 130 -46 -529 -49 341 59 -141
1874 -141 -28 425 278 -61 -143 434 620 -80 -334 220 541 46 -351 -194 60 -97 -788 -358 151 -49
1894 -49 -423 -366 107 313 -153 -277 92 231 159 -177 93 339 76 -310 115 683 191 -381 -260 279 -57
$$ packed form
1747b81m37R38K73k13j67K75L79m63m64r6L24j2q13K35O68q8m44p5N33L73n64
1768a19o32J03M80P2m87O03J023k36p04J83M79k13q76o6L29M94n56k14Q69L0n67
1789em82j3L77m36m39K56O95L32n46R3J237n73n80J9L04j8k63k92O25J83l03k78
1811a07J71L00m36o74J10N94o8o22L06N75J24m98L4N64N38q58n26P34R9m37m1
1832a18K6L21K62q54L63K83O9q65r9M75K50l04l51P41M03l53l74L28K17j31n26
1853b37J44N78j95o24L69L67J28q86J8K80j44m59p0N73K88j76m83M80L90k82k00
1874a41J13M53j47l39q2N77J86p00k54N54L21m95l97J57K54j57o91M30N09k00
1894d9l74N7M73K06m66j24L69J39p2l36K70K46k63l86M25N68m92n72J21N39l36
$$ plain form
1915 -57 -569 -450 47 267 -284 -475 451 431 -3 -149 135 425 84 -224 82 591 -153 -235 -24 56 144 -385
1937 -385 -83 121 21 -62 -194 42 318 -56 -345 46 551 278 -189 -76 528 -33 -245 -248 96 245 -66
1958 -66 -200 -26 48 -180 -288 127 14 -97 -310 -66 335 -31 -119 -59 356 142 -216 -313 68 -14 -265 -138
1980 -138 289 397 -5 -235 39 9 6 -165 278 158 215 -168 7 99 280 -424 -220 334 333 -368 -147 137
2002 137 174 -196 -201 -4 429 65 -192 -82 303 237 -351 -68 179 114 -153 -247 -154 415 -352 -267 -140 138 -225
2025 -225 -171 -53 182 -73 -346 55 372 77 -264 -240 192 192 39 126 512 246 -390 -321 -124 132 -221 -228 -158
2048 -158 185 -64 -181 51 -151 82 -351 -390 174 477 -95 -51 402 58 42 -203 168 182 9 -416 92
2069 92 312 122 -251 -298 97 -344 -376 -396 -91 9 -146 22 217 345 -50 -106 63 427 -12 9 31 347
$$ packed form
1915e7n12J19M97K20n51j91R26k0m34j46K84K90l41l08L06N09p44q2K11Q0Q8n29
1937c85L02K04j00q3j32K36K76l74k89L91N05k73m67J13O04n61k12lL44J49l11
1958f6j34J74P4k28j08M15j13j11k13K44M01l66q8O0M15k14l58r7L81q2k51J27
1980a38M27J08m02k30K74l0lj71M43j20N7l83J75R2J81p04K04N54jp01K21K84
2002A37L7l70nJ97M33l64k57J10L85o6n88K83K47o5k67r4R3N69p67Q5J27K78l63
2025b25N4J18K35k55k73M01L17k95l41K4M32%j53Q7L86k66o36O9J97K56l53pP0
2048a58L43k49j17K32k02K33m33l9N64L03n72M4M53l44j6k45L71J4j73m25N08
2069I2K20j90l73m7L95m41l2k0L05J00j55J68J95J28l95n6J69L64m39K1K2L16
$$ plain form
2091 347 161 -99 -295 351 -27 -325 -145 13 -113 -185 -252 -174 165 106 30 168 288 263 -133 3 152 79
2113 79 -143 179 322 105 -25 -39 -169 6 -231 -660 38 19 -205 -379 -63 141 162 -29 26 111 194 -140
2135 -140 -77 188 -62 257 75 294 250 -75 -210 -180 -21 -127 -365 -296 60 -102 -230 103 393 175 177 -104
2157 -104 -101 146 -87 77 67 244 272 134 175 185 114 -220 -69 -180 -174 -40 -296 200 -147 -63 51 186 118 -108
2181 -108 -127 54 175 3 287 197 266 381 134 153 57 -74 -320 -548 -113 111 -12 -202 161 66 -159 -247
2203 -247 -54 49 -41 -376 27 144 20 198 346 98 299 -57 -198 -33 -287 -296 -345 46 23 -178 62 -20
2225 -20 136 -255 -375 -134 14 130 -173 69 342 362 284 -234 196 256 -321 -450 -144 -21 -49 -234 -229 143
2247 143 -95 -88 -100 25 -174 -348 -183 95 30 7 220 133 272 108 178 26 -40 -105 -296 -74 323 122 -39
$$ packed form
2091C47j86k60j96O46l78k98J80J58j26p2o7P8L39n9p6J38J20k5l96J36J49p3
2113G9k22L22J43k17j30j4j30J75k37m29O98j9k24j74L16K04K1j91N5Q5Q3l34
2135a40O3K65k50L19j82K19m4l25j35L0J59j06k38O9L56j62j28L33K90k18Kk81
2157a04LK47k33J64j0J77K8j38M1J0p1l34J51j11OJ34k56M96l47Q4J14J35o8k26
2181a08j9J81J21j72K84r0O9J15k47J9r6j31k46k28M35K24j23j90L63r5k25q8
2203b47J93J03r0l35M03J17j24J78J48k48K01l56j41J65k54rm9L91k3k01K40q2
2225b0J56l91j20K41J48J16l03K42K73K0p8n18M30O0n77j29L06J23k8j85NL72
2247A43k38Pj2J25j99j74J65K78o5k3K13q7J39j64P0j52o6o5j91K22L97k01j61
$$ plain form
2270 -39 46 188 -198 -364 -266 -13 -106 -303 -385 152 387 124 151 136 81 116 -348 -182 111 147 -64 222 351
2293 351 41 -204 -108 69 -69 -411 -360 -262 6 87 -280 239 327 -19 95 189 124 63 -269 -22 100 50 57 154
2317 154 -87 184 -27 -466 -90 -162 -181 201 -82 -171 345 138 43 359 -137 -90 -82 130 151 -91 -35 264 50
2340 50 22 -86 34 -237 -125 -297 -31 -205 -88 -174 -117 88 -75 -41 109 24 36 -296 -133 146 125 -43 -158
2363 -158 36 -128 207 -87 -99 -216 -199 -103 79 105 58 33 -110 20 -168 -140 -141 -294 47 143 -156 79 215
2386 215 2 25 -153 -29 42 -163 -109 -19 112 312 -101 150 187 -226 -59 -206 118 -52 -300 159 36 -57
2408 -57 102 107 -81 0 -238 -193 -216 -178 52 141 118 409 297 42 9 -59 20 -102 -63 -127 -195 3 -166 125 169
2433 169 -62 15 136 192 -46 -143 -71 157 160 64 123 183 164 120 -80 -195 -79 -111 -174 -67 -298 120 -209 112
$$ packed form
2270c9Q5J42l86j66R8K53r3j97q2N37K35k63K7j5n5L5m64J66K93L6k11K86J29
2293C51l10k45R6J77j38l42N1R8K68Q1l67N19Q8l46J14R4o5o1l32K47J22n0PR7
2317A54k41K71k11m39L76p2j9L82k83q9N16k07r5L16m96M7QK12K1k42N6K99k14
2340E0k8j08J20k71J12j72K66j74J17q6N7K05j63L4J50q5J2l32J63K79k1j68j15
2363a58J94j64L35k94j2j17J7R6J82K6m7k5j43J30j88K8jj53L41R6k99K35J36
2386B15k13K3j78J24P1k05N4R0J31K00m13K51L7m13J67j47L24j70k48M59j23r3
2408e7J59Nj88Q1k38M5k3L8K30Q9k3K91j12k55l3o8P9j22L9o4o8J98j69K91M4
2433A69k31P7J21N6k38r7P2K28Lr6N9O0j9m4k00j15J16l2o3J07k31M18l29L21
$$ plain form
2457 112 20 1 -157 -185 1 -85 2 80 258 49 -15 -27 -3 9 -311 -225 160 -229 84 77 127 64 61 2 143 99
2483 99 -119 -408 -241 19 -24 -20 146 22 215 163 -189 130 -100 -240 27 159 -63 -48 -87 -7 29 -82 -33
2506 -33 -76 -346 -167 66 -12 170 14 68 -12 107 157 -84 -108 82 -138 1 150 56 265 -48 91 63 -196
2529 -196 -24 -12 -330 -241 27 5 -260 17 205 51 -248 194 66 43 -70 -94 106 -48 128 144 -131 43
2551 43 -72 32 -112 -45 -49 -118 157 45 -25 -154 -126 -7 -231 -45 20 15 127 -30 67 -33 317 18 -288 -46
2575 -46 7 -171 -208 24 270 89 -116 -8 139 64 -229 -92 -5 23 262 -33 231 162 -46 66 156 9 -127
2598 -127 -114 -19 67 -123 -19 111 -21 95 -16 -64 -111 -141 -378 6 91 128 -13 99 200 179 -47 138 -10
2621 -10 -8 -112 -106 -124 85 -80 34 86 305 167 -52 -135 -138 31 -47 171 -52 195 201 -3 501 219 172 -215 -103
$$ packed form
2457A12r2j9j58k8J86q6Q7P8J78k09o4j2K4J2l20Q6L85l89L13pN0o3ln9J41m4
2483I9k18k89J67K60m3MJ66j24J93n2l52L19k30j40K67J32k22J5l9Q0L6j11M9
2506c3m3k70J79K33p8J82j56N4q0J19N0k41k4J90k20J39J49r4K09l13J39k8k59
2529a96J72J2l18Q9K68k2k65K77J88j54k99M42j28k3j13k4K00j54J76J6k75J74
2551D3j15J04j44O7mo9K75j12p0j29K8J19k24J86O5nJ12j57R7j00L50k99l06K42
2575d6N3j78l7K32K46j81k05J08J47p5k93J37Q7K8K39k95K64o9k08J12R0j47j36
2598a27J3R5Q6j90J04J30j32J16j11m8m7l0k37L84Q5L7j41J12J01k1k26J85j48
2621a0Kj04Oj8K09j65J14N2K19j38k19q3lJ69p8K18k23K47Ok04N04k82m7l87J12
$$ plain form
2646 -103 -230 -259 -250 217 -30 -38 -16 -60 2 -192 53 -50 47 -193 -11 -420 302 347 195 49 57 274 229 38
2670 38 -48 -3 -299 29 42 283 199 254 102 -20 100 -145 -259 -97 -190 48 260 325 168 240 58 80 -126
2693 -126 -90 -130 86 52 28 93 211 272 -15 -129 -125 -79 -201 -215 -186 -133 69 136 97 39 69 138 -220 -37 -75 234
2719 234 164 -109 79 220 107 276 -17 -100 -50 -316 -148 -158 33 38 249 63 105 237 11 -83 92 -42 -70
2742 -70 -151 6 157 -17 6 4 -11 93 -128 -60 -113 -70 4 -57 -15 -22 -301 14 252 68 -96 74 -214 -5 64
2767 64 -113 107 -243 -264 92 126 145 -128 155 189 54 51 24 131 -61 74 -133 202 -40 -155 -115 157 81
2790 81 -8 -85 -118 34 11 139 140 108 178 98 155 -49 -66 -62 -159 256 -108 212 34 218 -260 178 21 -152 37
2815 37 108 412 36 -109 323 99 19 122 -152 -108 236 -16 -72 132 -250 89 24 112 37 -238 -127 -20 85
$$ packed form
2646a03j27k9RM67k47qK2m4O2j94K45j03R7k40J82m09P22M5j52j46QK17m5j91
2670C8q6M5k96L28J3K41q4N5j52j22J20k45j14J62r3K38K12O5j57P2j82K2k06
2693a26L6m0K16l4k4O5J18O1k87j14MM6j22j4K9N3K02O7l9n8L0O9l58J83l8L09
2719B34p0k73J88J41j13J69k93q3N0k66J68j0J91NK11j86M2J32k26r4J75j34k8
2742g0q1J57J51j74K3kj5J04k21O8n3M3P4o1M2pk79L15K38j84j64J70k88K09O9
2767F4j77K20l50k1L56L4J9k73K83L4j35lk7J07j92J35k07L35k42j15M0K72p6
2790H1q9p7l3J52k3J28Jl2P0q0N7k04j7Mr7M15l64L20j78J84m78M38j57j73J89
2815C7P1L04l76j45M32k24q0J03k74M4L44k52n6K04l82L39o5Q8p5k75J11J07J05
$$ plain form
2838 85 -109 86 -174 15 160 268 150 67 9 24 -232 207 -90 -203 -116 83 143 -68 63 113 -268 -33
2860 -33 9 -34 -8 131 -104 -74 154 -35 96 67 1 -122 -32 -63 28 95 31 -73 -187 -178 89 196 198 -65 31 58
2886 58 -148 -196 -68 -14 77 23 -11 -34 103 -103 14 115 -11 30 -81 20 -238 -79 -49 91 -116 -153 -128 -132
2910 -132 -85 -124 11 -196 75 30 333 -130 -188 43 -19 -51 219 259 -53 66 -69 20 -157 104 -38 -62 8
2933 8 -136 -66 -109 51 47 -36 51 39 83 -90 203 -103 27 8 -45 91 201 214 -63 165 59 36 -62 -47 -288
2958 -288 14 70 -249 51 113 91 -10 -47 84 -47 -43 57 110 -33 1 139 17 272 132 -61 -156 144 -9
2981 -9 49 -82 -32 -79 90 106 -134 -13 -190 -63 -71 100 191 63 16 19 147 -76 61 100 -158 -17 -118 63
3005 63 78 134 102 -34 71 -154 -112 -118 -203 71 -193 310 -126 -100 -68 135 -11 -76 29 1 -101 -110 33 20 -155
$$ packed form
2838H5j94J95k60J89J45J08j18q3n8J5k56M39k97j13Q7J99O0k11J31N0l81K35
2860c3M2m3K6J39k35L0K28j89J31k9o6j23R0l1R1O7o4j04j14RK67J07Kk63R6K7
2886E8k06m8J28N4R1n4l4k3J37k06J17J01j26M1j11J01k58J59L0J40k07l7K5m
2910a32M7l9J35k07K71m5L03m63n8K31o2l2K70M0l12J19j35Q9j77K61j42k4P0
2933Hj44P0m3J60mq3Q7j2M4j73K93l06J30j9n3J36J10J3k77K28j06k3r8J5k41
2958b88L02N6l19L00O2k2j01l7J31j31MJ00N3j43L4J38j22K55j40j93r5L00j53
2981iN8j31N0m7J69J6k40J21j77J27qJ71R1j28m7LJ28k23J37L9k58J41j01J81
3005F3J5N6l2j36J05k25M2oq5K74k64N03m36K6L2K03j46o5J05k8j02rJ43j3j75
$$ plain form
3030 -155 119 72 -128 35 45 -164 -306 -184 -38 309 -178 -29 174 -51 -42 -109 174 -112 -32 290 -129 110
3052 110 118 -150 81 132 -97 -191 -181 -262 -110 -39 -140 214 -28 -111 -44 -9 24 67 -95 29 -215 -25 99 -103
3076 -103 -56 -11 219 37 176 139 31 -285 -13 12 -109 165 -136 -71 221 -51 32 -117 122 -120 15 -46
3098 -46 93 -319 105 151 292 157 -129 -199 -259 187 35 -53 -243 -61 -188 -171 -158 -241 -2 19 -27 -59 -31 22
3122 22 107 -175 5 107 60 141 -10 29 44 -6 -239 -100 48 59 11 -250 -94 -124 152 -61 -60 -13 79 129 -50
3147 -50 154 45 25 147 -222 -114 219 140 -7 -293 -87 -1 -161 155 259 106 -30 21 -105 -119 143 -39
3169 -39 167 64 -253 -114 -118 -4 -48 -62 17 180 96 -168 -63 15 173 -23 -127 11 -95 -235 178 39 -136
3192 -136 -94 -154 54 199 28 -20 169 26 -9 51 42 41 130 26 -9 131 -177 -31 -101 -198 0 20 -56 47 -118
$$ packed form
3030a55K74m7k00J63J0k09j42J22J46L47m87J49K03k25Ro7K83k86Q0L22m19K39
3052A10Qk68K31N1k29r4J0q1J52P1j01L54k42q3O7L5L3M3j62J24k44J90J24k02
3076a03M7M5K30j82J39l7j08l16K72K5j21K74l01O5K92k72Q3j49K39k42J35o1
3098d6J39m12M24M6J41j35k86p0o0M46j52q8j90J82j27J7J3q3K39K1m6l2K8N3
3122B2Q5k82J80J02m7Q1j51L9J5n0k33J39J48J1m8k61J56l0K76k13JM7R2N0j79
3147e0K04j09k0J22l69J08L33p9j47k86K06Q6j60L16J04j53j36N1j26j4K62j82
3169c9K06j03l17J39mJ14m4j4P9J63q4k64J05P8J58j96j04J38j06j40M13j39j75
3192a36M2o0K08J45j71m8J89j43l5O0rjQ9j04l5J40l08J46p0r7J98K0p6J03j65
$$ plain form
3217 -118 -109 -161 -163 -39 95 -140 102 -220 22 -39 -87 12 116 109 91 41 121 83 -68 -113 -15 4 99 68 59 -275 -326
3244 -326 94 -28 -259 114 -152 215 -6 142 -8 -47 -33 -189 -113 -67 40 -156 85 -135 -47 -127 247 -39
3266 -39 162 202 15 -41 -89 -95 -72 103 24 -91 -78 -165 -90 -107 -117 394 148 87 -148 43 7 341 103 -135 -154
3291 -154 41 57 -120 101 12 47 -77 -48 248 28 -205 -36 43 -166 21 12 -13 -7 -116 -265 -187 -128 -46 -71 -17
3316 -17 -44 -50 -3 -175 56 -2 -147 20 -182 -154 279 108 95 43 77 49 45 5 299 78 173 21 42 160 10
3341 10 90 49 108 -55 -324 -51 153 34 105 21 56 60 -25 -143 -62 36 40 -176 -226 -34 -123 42 -131 211 53
$$ packed form
3217a18Rn2kJ24J34k35K42l22K42o1m8R9J04pj8n0Q0l8j51m5R8J9R5l1rl34n1
3244c26M20j22k31L73k66L67k21J48j50l9J4j56P6M6J07j96K41k20Q8q0L74k86
3266c9K01M0j87n6m8oK3J75p9j15J3q7P5j7j0N11k46o1k35J91l6L34k38k38j9
3291a54J95J6j77K21q9L5j24K9K96k20k33J69P9k09J87rk5Oj09j49P8N9Q2k5N4
3316a7k7oM7j72K31n8j45J67k02K8M33j71j3n2L4k8mm0K94k21R5j52K1J18j50
3341A0Q0m1N9j63k69K73K04j19P1q4L5Mq5j18Q1R8Mk16n0J92q9J65j73L42j58
$$ [...]
8191@
##END NTUPLES=NMR FID
##END=
