##TITLE=1H_Pr 4ex
 CDCl3
 8 sc, 
 11.03.2022
##JCAMPDX= 6.0         $$ Bruker NMR JCAMP-DX V2.0
##DATA TYPE= NMR FID
##DATA CLASS= NTUPLES
##ORIGIN= UXNMR, Bruker Analytische Messtechnik GmbH
##OWNER= root
$$ XWIN-NMR		Version 3.5
$$ Fri Mar 11 11:40:24 2022 Russian Standard Time (UT+4h)  she@DPX200
##.OBSERVE FREQUENCY= 200.131346
##.OBSERVE NUCLEUS= ^1H
##.DELAY= (6, 6)
##.ACQUISITION MODE= SIMULTANEOUS
##.ACQUISITION SCHEME= undefined
##.AVERAGES= 8
##.DIGITISER RES= 18
##SPECTROMETER/DATA SYSTEM= spect
##.PULSE SEQUENCE= zg30
##.SOLVENT NAME= CDCl3
##.SHIFT REFERENCE= (INTERNAL, CDCl3, 0, 15.7039)
##AUDIT TRAIL= $$ (NUMBER, WHEN, WHO, WHERE, WHAT)
$$ ##TITLE= Audit trail, XWIN-NMR		Version 3.5
$$ ##JCAMPDX= 5.01
$$ ##ORIGIN= Bruker BioSpin GmbH
$$ ##OWNER= she
$$ F:/spectra/data/she/nmr/H-F/1/audita.txt
$$ ##AUDIT TRAIL=  $$ (NUMBER, WHEN, WHO, WHERE, WHAT)
(   1,<2022-03-11 11:39:17.42 +0400>,<she>,<DPX200>,
      <created by zg, POWCHK disabled, PULCHK disabled
       configuration hash MD5:
       00 E9 B6 7A A2 85 ED C7 34 08 36 98 17 FE 4E 26
       data hash MD5: 16K
       CE 33 16 45 64 CB 3C 73 C8 C1 EE 9D E2 AA 32 BA>)
$$ ##END=
$$ 
$$ hash MD5
$$ CC CF D0 D4 89 BB 15 D6 2D 0F 40 75 CD 29 23 FF
##$RELAX= 
##$RELAX= 
##$RELAX= 
##$RELAX= 
##$RELAX= 
##$RELAX= 
$$ Bruker specific parameters
$$ --------------------------
##$DU= <F:/spectra>
##$EXPNO= 1
##$NAME= <H-F>
##$PROCNO= 1
##$TYPE= <nmr>
##$USER= <she>
##$AMP= (0..31)
100 100 100 100 100 100 100 100 100 100 100 100 100 100 100 100 100 100 
100 100 100 100 100 100 100 100 100 100 100 100 100 100 
##$AQSEQ= 0
##$AQ_mod= 1
##$AUNM= <au_zg>
##$AUTOPOS= <>
##$BF1= 200.13
##$BF2= 200.13
##$BF3= 200.13
##$BF4= 200.13
##$BF5= 200.13
##$BF6= 200.13
##$BF7= 200.13
##$BF8= 200.13
##$BYTORDA= 1
##$CFDGTYP= 0
##$CFRGTYP= 5
##$CHEMSTR= <none>
##$CNST= (0..31)
1 1 145 1 1 1 1 1 1 1 1 1 1 1 1 1 1 1 1 1 1 1 1 1 1 1 1 1 1 1 1 1 
##$CPDPRG= <>
##$CPDPRG1= <>
##$CPDPRG2= <>
##$CPDPRG3= <>
##$CPDPRG4= <mlev>
##$CPDPRG5= <mlev>
##$CPDPRG6= <mlev>
##$CPDPRG7= <mlev>
##$CPDPRG8= <mlev>
##$CPDPRGB= <>
##$CPDPRGT= <>
##$D= (0..31)
0 1.2 0 0 0 0 0 0 0 0.06 0 0.03 0 0 0 0 0.0002 0 0 0 0 0 0 0 0 0 0 0 0 
0 0 0 
##$DATE= 1646984356
##$DBL= (0..7)
120 120 120 120 120 120 120 120 
##$DBP= (0..7)
150 150 150 150 150 150 150 150 
##$DBP07= 0
##$DBPNAM0= <>
##$DBPNAM1= <>
##$DBPNAM2= <>
##$DBPNAM3= <>
##$DBPNAM4= <>
##$DBPNAM5= <>
##$DBPNAM6= <>
##$DBPNAM7= <>
##$DBPOAL= (0..7)
0.5 0.5 0.5 0.5 0.5 0.5 0.5 0.5 
##$DBPOFFS= (0..7)
0 0 0 0 0 0 0 0 
##$DE= 6
##$DECBNUC= <off>
##$DECIM= 32
##$DECNUC= <off>
##$DECSTAT= 4
##$DIGMOD= 1
##$DIGTYP= 9
##$DL= (0..7)
0 120 120 120 120 120 120 120 
##$DP= (0..7)
150 150 150 150 150 150 150 150 
##$DP07= 0
##$DPNAME0= <>
##$DPNAME1= <>
##$DPNAME2= <>
##$DPNAME3= <>
##$DPNAME4= <>
##$DPNAME5= <>
##$DPNAME6= <>
##$DPNAME7= <>
##$DPOAL= (0..7)
0.5 0.5 0.5 0.5 0.5 0.5 0.5 0.5 
##$DPOFFS= (0..7)
0 0 0 0 0 0 0 0 
##$DQDMODE= 0
##$DR= 18
##$DS= 0
##$DSLIST= <SSSSSSSSSSSSSSS>
$$ [...]
##$SUBNAM2= <"">
##$SUBNAM3= <"">
##$SUBNAM4= <"">
##$SUBNAM5= <"">
##$SUBNAM6= <"">
##$SUBNAM7= <"">
##$SUBNAM8= <"">
##$SUBNAM9= <"">
##$SW= 18.0517287032376
##$SWIBOX= (0..15)
0 0 2 0 0 0 0 0 0 0 0 0 0 0 0 0 
##$SW_h= 3612.71676300578
##$TD= 16384
##$TD0= 1
##$TE= 0
##$TE2= 300
##$TE3= 300
##$TEG= 300
##$TL= (0..7)
0 120 120 120 120 120 120 120 
##$TP= (0..7)
150 150 150 150 150 150 150 150 
##$TP07= 0
##$TPNAME0= <>
##$TPNAME1= <>
##$TPNAME2= <>
##$TPNAME3= <>
##$TPNAME4= <>
##$TPNAME5= <>
##$TPNAME6= <>
##$TPNAME7= <>
##$TPOAL= (0..7)
0.5 0.5 0.5 0.5 0.5 0.5 0.5 0.5 
##$TPOFFS= (0..7)
0 0 0 0 0 0 0 0 
##$TUNHIN= 0
##$TUNHOUT= 0
##$TUNXOUT= 0
##$USERA1= <user>
##$USERA2= <user>
##$USERA3= <user>
##$USERA4= <user>
##$USERA5= <user>
##$V9= 5
##$VALIST= <valist>
##$VCLIST= <CCCCCCCCCCCCCCC>
##$VD= 0
##$VDLIST= <DDDDDDDDDDDDDDD>
##$VPLIST= <PPPPPPPPPPPPPPP>
##$VTLIST= <TTTTTTTTTTTTTTT>
##$WBST= 1024
##$WBSW= 4
##$XGAIN= (0..3)
0 0 0 0 
##$XL= 0
##$YL= 0
##$YMAX_a= 52062
##$YMIN_a= -68218
##$ZGOPTNS= <>
##$ZL1= 120
##$ZL2= 120
##$ZL3= 120
##$ZL4= 120
##$ABSF1= 10
##$ABSF2= 0
##$ABSG= 5
##$ABSL= 3
##$ALPHA= 0
##$AQORDER= 0
##$ASSFAC= 0
##$ASSFACI= 0
##$ASSFACX= 0
##$ASSWID= 0
##$AUNMP= <proc_1d>
##$AZFE= 0.1
##$AZFW= 0.1
##$BCFW= 1
##$BC_mod= 2
##$BYTORDP= 1
##$COROFFS= 0
##$CY= 11.3945322036743
##$DATMOD= 1
##$DC= 2
##$DFILT= <>
##$DTYPP= 0
##$F1P= 2.36226072786647
##$F2P= -0.459571619588291
##$FCOR= 0.5
##$FTSIZE= 0
##$FT_mod= 4
##$GAMMA= 1
##$GB= 0.15
##$INTBC= 1
##$INTSCL= 1
##$ISEN= 128
##$LB= 0.24
##$LEV0= 0
##$LPBIN= 0
##$MAXI= 10000
##$MC2= 0
##$MEAN= 0
##$ME_mod= 0
##$MI= 1.114404
##$NCOEF= 0
##$NC_proc= 0
##$NLEV= 6
##$NOISF1= 3.799351
##$NOISF2= 2.8
##$NSP= 1
##$NTH_PI= 0
##$NZP= 0
##$OFFSET= 15.70392
##$PC= 1
##$PHC0= -16587.08
##$PHC1= 13.20078
##$PH_mod= 1
##$PKNL= yes
##$PPARMOD= 0
##$PSCAL= 0
##$PSIGN= 0
##$REVERSE= no
##$SF= 200.130013532006
##$SI= 16384
##$SIGF1= 3
##$SIGF2= 2
##$SINO= 400
##$SIOLD= 16384
##$SREGLST= <1H.CDCl3>
##$SSB= 0
##$STSI= 0
##$STSR= 0
##$SW_p= 3612.71676300578
##$SYMM= 0
##$S_DEV= 0
##$TDeff= 0
##$TDoff= 0
##$TI= <>
##$TILT= no
##$TM1= 0
##$TM2= 0
##$TOPLEV= 0
##$USERP1= <user>
##$USERP2= <user>
##$USERP3= <user>
##$USERP4= <user>
##$USERP5= <user>
##$WDW= 1
##$XDIM= 8192
##$YMAX_p= 0
##$YMIN_p= 0
$$ End of Bruker specific parameters
$$ ---------------------------------
##NTUPLES= NMR FID
##VAR_NAME=  TIME,          FID/REAL,        FID/IMAG
##SYMBOL=    X,             R,               I
##VAR_TYPE=  INDEPENDENT,   DEPENDENT,       DEPENDENT
##VAR_FORM=  AFFN,          ASDF,            ASDF
##VAR_DIM=   8192,          8192,            8192
##UNITS=     SECONDS,       ARBITRARY UNITS, ARBITRARY UNITS
##FACTOR=    0.0002768,     1,               1
##FIRST=     0,             0,               0
##LAST=      2.2672688,     0,               0
##MIN=       0,             -68218,          0
##MAX=       2.2672688,     52062,           0
$$ Real data points
##PAGE= N=1
##DATA TABLE= (X++(R..R)), XYDATA
$$ plain form
0 0 0 0 0 0 0 0 0 0 0 0 0 0 0 0 0 0 -8 8 -8 8 -8 9 -16 16 -16 24 -24 32 -32 40 -44 49 -57 65 -73 81 -93 104
38 104 -115 129 -143 159 -176 197 -217 239 -266 291 -323 355 -391 432 -474 522 -576 641 -710 791
58 791 -885 995 -1129 1291 -1497 1764 -2127 2657 -3502 5055 -8907 41748 30085 -36358 16226
73 16226 52062 27489 -12944 164 9102 -3511 -13903 -7623 -15932 -18161 -7639 -7657 -31692 -34091
87 -34091 -5610 6813 -16827 -22479 231 10541 -685 2130 17979 21237 14181 16159 14340
100 14340 7259 15974 29525 15179 -9877 -8468 10141 8080 -8517 -12381 -11159 -16824 -17281 -12903
114 -12903 -13971 -17721 -14065 -9584 -12688 -9048 6486 9805 56 5626 22444 17790 798 10105
128 10105 31551 19414 -6276 186 16777 5644 -10297 -967 7082 -11718 -24657 -8389 2836
$$ packed form
0@%%%%%%%%%%%%%%%%qJ6j6J6j6J7k5L2l2M0m8N6o4P2q4R3j06J22j38J54j74J97
38A04k19K44k72L02l35L73m14M56n05N57o14O78p46Q23r06R96j098J217j351J501
58G91j676J880k124K420k788L261l891M784o159Q557j3962N0655j1663o6443N2584
73A6226L5836k4573m0433J3108Q938j2613j0392O280q309k229J0522j8k4035k399
87c4091K8481J2423k3640n652K2710J0310j1226K815J5849L258p056J978j819
100A4340p081Q715J3551j4346k5056J409J8609k061j6597l864J222n665m57M378
114a2903j068l750L656M481l104L640J5534L319r749N570J6818m654j6992R307
128A0105K1446j2137k5690O462J6591j1133j5941R330Q049j8800j2939J6268J1225
$$ plain form
141 2836 -9752 -19529 -12998 -7558 -8763 -4535 1364 -2103 -2647 6692 8909 2874 6962 18399 14506
156 14506 436 3588 16523 10898 -2445 1215 8410 -110 -9833 -5654 -1216 -7516 -10104 -6779
170 -6779 -11094 -15138 -7721 730 -2803 -8432 -3058 3975 3498 5329 10600 8801 4269 7507 12562
185 12562 7691 2286 6886 7921 -2854 -6040 2118 1785 -9369 -10181 -319 -3514 -15583 -11365 1835
200 1835 34 -10147 -8679 1416 4130 727 2060 5464 5964 6525 6468 4180 4818 9260 8468 -646
216 -646 -4600 3771 6499 -3018 -8627 -3594 -1668 -7348 -9107 -4604 -4461 -7564 -5526 -3032 -3831 -1779
232 -1779 3640 4959 1556 2035 8068 9278 6108 5487 6681 5466 3224 2691 2005 -731 -1703 -758 -4672
249 -4672 -8519 -5693 -2729 -6108 -10129 -6138 -1797 -5537 -6674 795 4909 1317 -1076 3364 8118
$$ packed form
141B836j2588r777O531N440j205M228N899l467n44R339K217o035M088J1437l893
156A4506j4070L152J2935n625j3343L660P195q520r723M179M438o300k588L325
170f779m315m044P417Q451l533n629N374P033m77J831N271j799m532L238N055
185A2562m871n405M600J035j0775l186Q158l33j1154q12R862l195j2069M218J3200
200A835j801j0181J468J0095K714l403J333L404N00N61n7k288O38M442p92r114
216f46l954Q371K728r517n609N033J926n680j759M503J43l103K038K494p99K052
232a779N419J319l403M79O033J210l170o21J194j215k242n33o86k736r72R45l914
249d672l847K826K964l379m021L991M341l740j137P469M114l592k393M440M754
$$ plain form
264 8118 7703 6730 5814 4086 4890 7683 5859 667 -1345 1133 1107 -3644 -6156 -4544 -4946 -6508 -6379
281 -6379 -6571 -8032 -7134 -2110 -195 -4038 -3045 3155 5258 3114 4007 8238 8842 5232 4977 7391 7465
298 7465 5444 2590 -327 -911 -51 -274 -4236 -8573 -7766 -4727 -5522 -7800 -7874 -5819 -4451 -3115 -447
315 -447 -597 -1520 2196 7157 7104 3949 4014 7294 9111 7741 5610 2848 1835 3157 3333 163 -3840
332 -3840 -5177 -4303 -4261 -6188 -6970 -7207 -6957 -6339 -5083 -3897 -3022 -1455 749 1441 2303 5223 6808 5356
350 5356 4847 7072 8929 6609 3407 3017 3488 3442 1563 -2664 -5219 -4366 -2353 -3298 -7125 -9516 -7211
367 -7211 -4160 -3250 -4471 -5006 -2834 -245 2504 3421 2179 2593 5583 7178 6223 4768 4655 5261 4454
384 4454 3499 2625 640 -1164 -1440 -1829 -2917 -4701 -6091 -6287 -5390 -4152 -4331 -5060 -4204 -2291 -214
$$ packed form
264H118m15r73r16j728Q04K793j824n192k012K478k6m751k512J612m02j562J29
281f379j92j461Q98N024J915l843R93O200K103k144Q93M231O04l610k55K414P4
298G465k021k854k917n84Q60k23l962m337Q07L039p95k278p4K055J368J336K668
315d47j50r23L716M961n3l155O5L280J817j370k131k762j013J322J76l170m003
332c840j337Q74M2j927p82k37K50O18J256J186Q75J567K204O92Q62K920J585j452
350E356n09K225J857k320l202l90M71m6j879m227k555Q53K013r45l827k391K305
367g211L051R10j221n35K172K589K749R17j242M14K990J595r55j455j13O06q07
384D454r55q74j985j804k76l89j088j784j390j96Q97J238j79p29Q56J913K077
$$ plain form
401 -214 927 897 1861 3562 3650 4218 5877 6278 4396 2697 3649 4785 3374 497 -1690 -1588 -422 -1510
419 -1510 -4496 -6276 -5386 -2743 -2408 -4823 -6100 -3652 187 1355 -1130 -1311 1685 4125 4254 3343
435 3343 2942 3829 4326 4288 3228 2058 1700 1282 470 -952 -2318 -2346 -1992 -3254 -4523 -4091 -2708 -2651 -3520
454 -3520 -2719 -1084 -522 127 888 1122 1500 3019 4341 3903 1504 1408 4483 5017 932 -2179 32 2749
472 2749 65 -4132 -3895 -1211 -1207 -3581 -4780 -3185 -1547 -1147 -1327 -1979 -864 1769 2760 1361 189
489 189 2634 5214 3458 446 1552 4696 3669 -912 -2364 924 2063 -1584 -4211 -3534 -1087 -1135
505 -1135 -3582 -4417 -2917 -1146 -227 -1030 -1830 -668 2271 3931 1652 47 3179 5709 3951 674
521 674 1298 3602 2540 -578 -463 732 -704 -3163 -2921 -1270 -2789 -5047 -3351 -1042 -2520 -4123
$$ packed form
401b14J141l0R64J701Q8N68J659M01j882j699R52J136j411k877k187J02J166j088
419a510k986j780Q90K643L35k415j277K448L839J168k485j81K996K440J29r11
435C343m01Q87M97l8j060j170l58m18q12j422j366k8L54j262j269M32J383N7q69
454c520Q01J635N62O49P61K34L78J519J322m38k399r6L075N34m085l111K211K717
472B749k684m197K37K684Mk374j199J595J638M00j80o52J115K633R91j399j172
489A89K445K580j756l012J106L144j027m581j452L288J139l647k627O77K447m8
505a135k447q35J500J771R19q03q00J162K939J660k279j605L132K530j758l277
521F74O24K304j062l118J15J195j436k459K42J651j519k258J696K309j478j603
$$ plain form
537 -4123 -1553 1522 450 -1434 943 3891 3931 2303 2043 3371 4428 3926 2798 841 -299 1877
553 1877 3238 -576 -5108 -4134 397 -118 -5593 -7117 -3361 -350 -1757 -4325 -3331 -34 1465 1066
569 1066 357 1552 3537 3987 3778 3136 2859 4099 4387 1916 51 1357 2314 -321 -3996 -3412 -414
586 -414 -1530 -5272 -6134 -2940 -1602 -3609 -4220 -1661 -684 -1183 58 2769 2553 861 2203 5319 5013
603 5013 3019 2553 3550 3653 2504 1632 639 -1314 -1460 -346 -1427 -4075 -5101 -3224 -2179 -3609 -4189
620 -4189 -2743 -2375 -2150 -862 675 886 414 1299 3541 4054 3512 2939 3411 3925 3650 2417 1532 829
638 829 610 161 -837 -1908 -3015 -2799 -2704 -3521 -4113 -3188 -2232 -2434 -3127 -1909 885 1053 -795 -367 3211
657 3211 5144 2837 671 2634 4982 4335 1990 218 723 1898 1552 -633 -2887 -2714 -963 -1482
$$ packed form
537d123K570L075j072j884K377K948M0j628k60J328J057n02j128j957j140K176
553A877J361l814m532R74M531n15n475j524L756L011j407k568R94L297J499l99
569A066p09J195J985M50k09o42k77J240K88k471j865J306R57k635l675N84K998
586d14j116l742q62L194J338k007o11K559R77m99J241K711k16j692J342L116l06
603E013j994m66R97J03j149q72r93j953j46J114j081k648j026J877J045j430n80
620d189J446L68K25J288J537K11m72Q85K242N13n42n73M72N14k75j233q85p03
638H29k19m49r98j071j107K16R5q17n92R25R56k02o93J218K794J68j848M28L578
657C211J933k307k166J963K348o47k345j772N05J175l46k185k254J73J751n19
$$ plain form
673 -1482 -3370 -4110 -2953 -1720 -2067 -2539 -1714 -803 -172 592 1069 1346 1938 2386 2839 2399 2242 3038 2709
692 2709 1452 936 1087 1060 -335 -1072 -1569 -1608 -1658 -1884 -2548 -2568 -2183 -1770 -1377 -1365 -1047 -526 307 1059 1257
713 1257 1226 1190 1980 2678 2427 1335 1296 1783 1582 585 -161 -414 -476 -880 -1027 -1532 -2191 -1988 -1674 -1285 -1239
734 -1239 -1323 -1036 -111 359 281 169 541 1760 1830 1625 1176 1308 1946 1710 497 411 367 -119 -633 -850 -810
755 -810 -1295 -1821 -1592 -1351 -1144 -1184 -1306 -982 -103 304 352 266 906 1446 1547 1443 1438 1231 1121 1100 1049 719 37
778 37 -581 -363 -567 -1054 -1418 -1638 -1634 -1575 -1114 -854 -1279 -1316 -376 474 873 492 422 1261 1889 2257 1867 949
800 949 915 1477 1855 1132 -376 -924 -51 -358 -853 -1699 -2273 -2132 -1326 -971 -1800 -2329 -1558 -73 274 -26
820 -26 242 782 1657 1630 1667 2072 1896 1908 1482 1615 1486 1099 101 -606 -892 -362 -498 -2102 -2523 -2252 -1555
$$ packed form
673a482j888p40J157J233l47m72Q25R11O31P64M77K77N92M48M53m40j57P96l29
692B709j257n16J51k7j395p37m97l9n0k26o64k0L85M13L93J2L18N21Q33P52J98
713A257l1l6P90O98k51j092l9M87k01r97p46k53o2m04j47n05o59K03L14L89M6
734a239q4K87R25M70p8j12L72J219P0k05m49J32O38k36j213q6m4m86n14k17M0
755h10m85n26K29K41K07m0j22L24Q79M07M8q6O40N40J01j04nk07j10k1n1l30o82
778C7o18K18k04m87l64k20MN9M61K60m25l7R40Q50L99l81p0Q39O28L68l90r18
800I49l4N62L78p23j508n48Q73l07m95q46n74J41Q06L55q29n29P71J485L47l00
820b6K68N40Q75k7L7M05j76J2m26J33j29l87r98p07k86N30j36j604m21K71O97
$$ plain form
841 -1555 -1569 -2027 -2127 -1876 -828 451 497 -134 111 1265 2564 2591 1824 1359 1882 2568 2746 1419 216
860 216 -39 465 717 -494 -1856 -2276 -1740 -1421 -1668 -2691 -2718 -2049 -952 -689 -1113 -1057 223 836 1135
879 1135 1551 2023 2063 1899 2368 2724 2176 1838 1201 566 491 473 439 -864 -2176 -2207 -1161 -1245 -2558 -3004 -2657
900 -2657 -1484 -765 -862 -1596 -1380 208 2032 1862 388 731 2229 3262 2574 1460 1026 1530 2069 1569
918 1569 -21 -769 -313 -55 -1159 -2262 -2036 -1381 -1944 -2212 -1973 -1576 -1388 -1229 -667 -136 148 1099 1455
937 1455 824 843 2342 2790 1844 763 1510 2105 1471 662 228 -429 -489 -224 -412 -1607 -2853 -1780 -567
956 -567 -1203 -2320 -2099 -709 -126 -332 -527 177 581 1235 1358 1191 1463 1722 1756 1271 1087 1320 852 346
976 346 40 -256 -386 -490 -990 -1742 -1622 -736 -534 -2026 -2132 -394 266 -641 -1168 153 1193 450 33
$$ packed form
841a555j4m58j00K51J048J279M6o31K45J154J299K7p67m65N23O86J78j327j203
860B16k55N04K52j211j362m20N36L19k47j023k7O69J097K63m24N6J280O13K99
879A135M16M72M0j64M69L56n48l38o37o35p5j8l4j303j312l1J046q4j313m46L47
900b657J173P19r7p34K16J588J824j70j474L43J498J033o88j114m34N04N39n00
918A569j590p48M56K58j104j103K26O55n63k68K39L97J88J59N62N31K84R51L56
937A455o31J9J499M48r46j081P47N95o34q09m34o57o0K65j88j195j246J073J213
956e67o36j117K21J390N83k06j95P04M04O54J23j67K72K59L4m85j84K33m68n06
976C46l06k96j30j04n00p52J20Q86K02j492j06J738O60r07n27J321J040p43m17
$$ plain form
995 33 1420 1645 711 823 1455 1065 343 734 1084 -239 -1020 28 444 -1113 -2043 -411 276 -1291 -1741
1014 -1741 -641 86 -614 -632 80 621 211 457 1067 604 274 987 1445 816 185 431 807 76 -383 -413
1034 -413 -561 -612 -315 -836 -1111 -849 -510 -424 -451 -402 -211 -30 659 770 162 -185 775 2008 849 -352
1054 -352 599 1222 396 -495 64 243 -748 -1013 -251 -305 -1591 -1125 -313 -637 -1198 -435 427 -454 -814 619
1074 619 1747 216 -83 1178 1797 920 372 896 1010 29 113 584 15 -976 -1150 -446 -725 -1158 -1096 -1248
1094 -1248 -1455 -952 123 -339 -1178 -524 941 1138 538 625 540 1199 1959 1619 783 249 992 1524 456
1113 456 -419 -274 -312 -810 -919 -985 -1316 -2158 -1478 -352 -998 -1463 -744 -114 -277 -326 797 1121 280 711
1133 711 1814 1882 1317 1444 1341 845 522 1291 1025 -817 -1425 -146 45 -1152 -2179 -1785 -1153 -1218 -1088
$$ packed form
995C3J387K25r34J12O32l90p22L91L50j323p81J048M16j557r30J632O87j567m50
1014a741J100P27p00j8P12N41m10K46O10m63l30P13M58o29o31K46L76p31m59l0
1034d13j48n1K97n21k75K62L39Q6k7M9J91J81O89J11o08l47R60J233j159j201
1054c52R51O23q26q91N59J79r91k65P62n4j286M66Q12l24n61P63Q62q81l60J433
1074F19J128j531k99J261O19q77n48N24J14r81Q4M71n69r91j74P04k79m33O2j52
1094a248k07N03J075m62q39O54J465J97o00Q7q5O59P60l40q36n34P43N32j068
1113D56q75J45l8m98j09o6l31q42O80J126o46m65P19O30j63m9J123L24q41M31
1133G11J103O8n65J27j03m96l23P69k66j842o08J279J91j197j027L94O32o5J30
$$ plain form
1152 -1088 -1312 -1903 -1418 282 804 -161 -479 855 1950 1433 1174 1262 1174 1411 1835 1489 445 -54 456
1171 456 349 -632 -875 -701 -1147 -1817 -1517 -928 -1361 -1880 -1292 -827 -874 -433 58 134 -317 767 1730 1578
1191 1578 684 1117 1745 1732 1547 1031 456 176 563 862 -178 -1559 -1099 -414 -809 -1435 -1799 -1206 -1319
1210 -1319 -910 -134 -758 -1093 -49 903 883 117 534 1526 1382 1145 1452 1403 812 624 812 546 -250 -346
1230 -346 -156 -772 -1208 -710 -452 -1283 -1853 -1085 -474 -775 -913 -297 -214 42 652 831 374 235 1335 1683
1250 1683 773 407 869 1041 733 421 359 -185 -668 -159 87 -945 -1198 -831 -631 -1107 -908 -417 -242 -735
1270 -735 64 456 234 78 374 940 659 516 995 1016 337 469 600 404 -253 -137 16 -157 -551 -311
1290 -311 -412 -723 -611 -350 -451 -574 -245 273 69 -248 373 579 224 214 753 693 357 260 532 399 -12
$$ packed form
1152a088k24n91M85J700N22r65l18J334J095n17k59Q8q8K37M24l46j044m99N10
1171D56j07r81k43J74m46o70L00N89m33n19N88M65m7M41M91P6m51J084R63j52
1191A578q94M33O28j3j85n16n75k80L87K99j040j381M60O85l95o26l64N93j13
1210a319M09P76o24l35J044R52k0p66M17R92j44k37L07m9n91j88J88k66p96r6
1230c46J90o16m36M98K58q31n70P68O11l01j38O16Q3K56O10J79m57j39J100L48
1250A683r10l66M62J72l08l12o2n44m83N09K46j032k53L67K00m76J99M91J75m93
1270g35P99L92k22j56K96N66k81j43M79K1o79J32J31j96o57J16J53j73l94K40
1290c11j01l11J12K61j01j23L29N18k04l17O21K06l55j0N39o0l36r7K72j33m11
$$ plain form
1311 -12 121 6 -202 -545 -259 -94 -713 -794 -420 -79 -553 -392 -103 36 118 185 470 423 442 759 834 386
1333 386 345 596 516 3 -345 -35 -119 -206 -394 -586 -905 -799 -346 -380 -776 -631 -270 -65 30 -1 134 207 608
1356 608 1071 789 362 285 871 897 257 64 247 102 -319 -469 -520 -769 -1072 -711 -903 -685 -751 -436 -690
1377 -690 -589 -285 97 259 146 398 932 1290 967 527 527 932 1292 1051 431 -148 118 184 111 -776 -1120
1398 -1120 -905 -745 -570 -1141 -1333 -1250 -531 -78 -329 -780 -30 385 758 698 829 802 962 1155 1398 981 657
1419 657 591 589 297 65 -141 -175 -690 -933 -777 -615 -947 -1388 -1365 -915 -674 -558 -511 -548 39 531 840 691
1441 691 414 598 1312 1578 1057 590 482 970 959 291 -194 -323 -280 -195 -490 -1182 -1076 -1083 -838 -784 -948 -996
1463 -996 -729 -299 -57 22 127 487 628 688 1112 1014 941 840 953 1033 611 536 338 -27 -167 -258 -308 -520 -1112
$$ packed form
1311a2J33j15k08l43K86J65o19q1L74L41m74J61K89J39Q2O7K85m7J9L17P5m48
1333C86m1K51q0n13l48L10q4q7j88j92l19J06M53l4l96J45L61K05R5l1J35P3M01
1356F08M63k82m27p7N86K6o40j93J83j45m21j50n1k49l03L61j92K18o6L15k54
1377f90J01L04L82J62j13K52N34L58l23m40%M05L60k41o20n79K66O6p3q87l44
1398a120K15J60J75n71j92Q3P19M53k51m51P50M15L73o0J31k7J60J93K43m17l24
1419F57o6kk92k32k06l4n15k43J56J62l32m41K3M50K41J16M7l7N87M92L09j49
1441F91k77J84P14K66n21m67j08M88j1o68m85j29M3Q5k95o92J06pK45N4j64m8
1463i96K67M30K42P9J05L60J41O0M24r8p3j01J13Q0m22p5j98l65j40r1n0k12n92
$$ plain form
1486 -1112 -1114 -874 -557 -951 -1059 -922 -328 -98 -30 70 163 350 772 1108 896 415 664 1162 1199 492 90
1507 90 323 258 28 54 -231 -600 -461 -672 -591 -937 -887 -649 -526 -474 -454 -319 43 111 87 328 622 588 576 776
1531 776 931 717 389 426 344 173 -25 -79 -186 -442 -626 -483 -281 -644 -754 -580 -231 -318 -548 -298 135
1552 135 95 302 324 480 416 238 693 637 307 61 308 437 80 -330 -207 -34 -344 -589 -139 -180 -582 -346
1574 -346 -141 -40 -450 -314 240 186 57 349 308 506 207 563 389 201 -36 290 236 -22 -450 -231 -207
1595 -207 -281 -292 -477 -509 -333 -349 -132 -211 -77 -108 252 530 159 334 334 377 423 515 312 495 -5 172 210 184
1619 184 -198 -479 -501 -372 -404 -352 -763 -701 -556 -365 -94 -181 -124 -91 420 688 388 153 523 792 850 665 400
1642 400 211 283 412 176 -292 -345 -215 -303 -348 -682 -854 -715 -512 -313 -529 -453 -511 6 89 258 417 499 736
$$ packed form
1486a112kK40L17l94j08J37N94K30O8J00R3J87M22L36k12m81K49M98L7p07m02
1507I0K33o5k30K6k85l69J39k11Q1l46N0K38J23N2K0J35L62O8k4K41K94l4j2K00
1531G76J55k14l28L7q2j71j98n4j07k56j84J43K02l63j10J74L49q7k30K50M33
1552A35m0K07K2J56o4j78M55n6l30k46K47J29l57m10J23J73l10k45M50m1m02K36
1574c46K05J01m10J36N54n4j29K92m1J98k99L56j74j88k37L26n4k58m28K19K4
1595b07p4j1j85l2J76j6K17p9J34l1L60K78l71J75%M3M6R2k03J83n00J77L8k6
1619A84l82k81k2J29l2N2m11O2J45J91K71q7N7L3N11K68l00k35L70K69N8j85k65
1642D00j89P2J29k36m68n3J30q8m5l34j72J39K03J99k16P6n8N17Q3J69J59Q2K37
$$ plain form
1665 736 754 605 855 862 594 477 557 584 291 -118 -170 -455 -539 -239 -588 -956 -986 -499 -480 -631 -807 -670 -229
1688 -229 -16 379 87 149 362 1080 1026 553 476 764 1049 724 397 175 -66 12 116 -244 -545 -892 -529
1709 -529 -631 -818 -854 -770 -559 -497 -383 -192 -24 -61 71 364 585 886 831 839 694 903 1129 808 321 210
1731 210 100 158 -67 -415 -692 -625 -478 -541 -974 -1125 -907 -642 -395 -583 -559 -265 168 451 600 333 429 738
1753 738 820 726 611 666 566 518 243 72 14 -94 -234 -250 -447 -602 -776 -733 -811 -718 -545 -433 -268 -404 -68
1776 -68 92 197 231 352 497 501 486 629 513 513 594 644 402 200 41 13 -177 -321 -382 -660 -574 -316 -384 -585
1800 -585 -558 -401 -158 -144 -94 2 115 381 337 609 531 390 568 713 359 131 27 2 206 -295 -94 -188 -285
1823 -285 -170 -300 -262 -415 -362 -249 -194 -181 -347 78 38 -12 168 158 298 314 146 328 165 187 223 119 235
$$ packed form
1665G36J8j49K50Pk68j17Q0K7k93m09n2k85q4L00l49l68l0M87J9j51j76J37M41
1688b29K13L95k92O2K13P18n4m73p7K88K85l25l27k22k41P8J04l60l01l47L63
1709e29j02j87l6Q4K11O2J14J91J68l7J32K93K21L01n5Qj45K09K26l21m87j11
1731B10j10N8k25l48k77O7J47o3m33j51K18K65K47j88K4K94M33K83J49k67R6L09
1753G38Q2r4j15N5j00m8k75j71n8j08j40j6j97j55j74M3p8R3J73J12J65j36L36
1776f8J60J05L4J21J45Mj5J43j16%Q1N0k42k02j59k8j90j44o1k78Q6K58o8k01
1800e85K7J57K43J4N0R6J13K66m4K72p8j41J78J45l54k28j04k5K04n01K01r4r7
1823b85J15j30L8j53N3J13N5J3j66M25m0n0J80j0J40J6j68J82j63K2L6j04J16
$$ plain form
1846 235 99 65 10 -128 -68 -78 -157 -38 -98 -146 -124 -50 -17 -39 10 50 173 154 174 80 128 193 180 171 -17 54 106 166
1874 166 -117 -419 -242 -75 -26 -177 -208 -59 -195 62 120 -140 -37 154 259 248 210 78 237 383 345 133
1896 133 23 -87 9 92 -105 -318 -386 -364 -329 -277 -371 -418 -263 -124 -177 -13 -23 286 25 -6 439 438 573 190
1920 190 341 506 411 230 84 -72 -77 101 -17 -452 -387 -535 -227 -418 -478 -602 -517 -123 -39 -181 -200 -149 223
1943 223 424 557 391 286 437 762 682 210 309 528 303 213 -129 -8 -337 -643 -219 -396 -500 -785 -568
1964 -568 -434 -330 -444 -269 -400 -71 167 443 494 335 124 548 889 621 533 416 419 324 297 233 -129 -566
1986 -566 -239 -129 -207 -535 -858 -653 -424 -427 -567 -661 -404 -297 22 -15 144 127 382 580 581 533 465 674 465
2009 465 462 306 507 116 38 -80 -143 -163 -426 -485 -477 -528 -504 -649 -538 -453 -452 -47 -6 -173 -10 332 424 452 326
$$ packed form
1846B35j36l4n5j38O0j0p9J19o0m8K2P4L3k2M9M0J23j9K0r4M8O5j3rj88P1N2O0
1874A66k83l02J77J67M9j51l1J49j36K57N8k60J03J91J05j1l8j32J59J46l8k12
1896A33j10j10R6Q3j97k13o8K2L5N2r4m7J55J39n3J64j0L09k61l1M45jJ35l83
1920A90J51J65r5j81j46j56nJ78j18m35O5j48L08j91o0j24Q5L94Q4j42j9N1L72
1943B23K01J33j66j05J51L25q0m72R9K19k25r0l42J21l29l06M24j77j04k85K17
1964e68J34J04j14J75j31L29K38K76N1j59k11M24L41k68q8j17Lr5k7o4l62m37
1986e66L27J10p8l28l23K05K29lj40r4K57J07L19l7J59j7K55J98Jm8o8K09k09
2009D65lj56K01l91p8j18o3k0k63n9Qn1K4j45J11Q5JM05M1j67J63L42R2K8j26
$$ plain form
2034 326 344 585 558 646 352 371 249 295 220 -31 -197 -423 -306 -356 -332 -407 -539 -395 -280 -194 -452 -328 -199
2057 -199 13 68 232 272 203 252 414 600 388 325 343 282 207 186 129 -175 -144 -518 -148 -14 -430 -299 -340 -361
2081 -361 -303 -229 -172 -165 -128 -54 182 120 131 139 194 109 205 381 222 162 169 89 86 -69 15 34 -134 -30 -153 -168 -207 -200 -237
2110 -237 -251 -178 14 -177 -176 67 58 -8 59 131 391 129 244 211 219 52 37 174 -70 -21 -130 159 -76 -231 80
2135 80 -164 -297 -98 -5 117 2 -16 285 95 -127 55 23 -70 -105 -109 52 -119 -130 136 -44 -173 -77 50
2158 50 24 24 -191 74 -222 -15 -38 206 148 239 234 85 142 324 368 -55 44 232 133 139 43 -65 -261 -190 42 25
2184 25 -437 -381 -41 52 -72 -224 -116 -118 -14 -58 187 287 -43 274 409 230 193 259 318 50 184 147 6
2207 6 -226 -123 -109 -190 -473 -210 -432 -390 -184 -215 -285 -350 -201 54 143 -92 140 208 179 316 437 393 201 192 590
$$ packed form
2034C26J8K41k7Q8k94J9j22M6p5k51j66k26J17n0K4p5j32J44J15Q6k58J24J29
2057a99K12N5J64M0o9M9J62J86k12o3J8o1p5k1n7l04L1l74L70J34m16J31m1k1
2081c61N8P4N7PL7P4K36o2J1QN5q5R6J76j59o0Pq0lj55Q4J9j68J04j23j5l9Pl7
2110b37j4P3J92j91JK43ro6O7P2K60k62J15l3Qj67j5J37k44M9j09K89k35j55L11
2135H0k44j33J99R3J22j15j8L01j90k22J82l2r3l5mJ61j71j1K66j80j29R6J27
2158E0k6%k15K65k96K07k3K44n8R1nj49N7J82M4m23R9J88r9Or6j08j96P1K32j7
2184B5m62N6L40R3j24j52J08kJ04m4K45J00l30L17J35j79l7O6N9k68J34l7j41
2207Fk32J03J4q1k83K63k22M2K06l1p0o5J49K55Q9k35K32O8k9J37J21m4j92rL98
$$ plain form
2232 590 281 16 25 -37 70 0 -221 -377 -471 -262 -190 -544 -541 -470 -232 -110 -193 -32 -113 -82 181 378 303 394 361
2257 361 500 394 331 243 405 186 -161 177 87 -138 -358 -206 -357 -363 -445 -388 -506 -457 -405 -170 -281 -209 -136 212
2281 212 330 188 367 392 298 444 385 345 108 355 539 230 84 41 -11 -74 -260 -152 -331 -473 -387 -317 -409
2304 -409 -489 -368 -247 -200 -194 214 -55 8 84 439 418 307 376 453 501 385 298 167 -90 -40 58 -35 -148 -206 -193
2329 -193 -446 -185 -191 -419 -497 -247 -87 -74 3 -185 28 91 9 235 335 165 102 386 254 180 163 333 171
2352 171 -10 -69 -59 97 -152 -172 -124 -131 -218 -100 -256 -267 -219 38 -18 -154 146 346 111 33 256 165 247 -6
2376 -6 235 157 -44 -18 222 55 40 106 64 -47 -124 -83 -155 -107 -191 95 -94 45 -196 -107 -106 4 -25 95 -22
2401 -22 169 151 103 31 148 11 115 -121 60 156 -121 -19 26 -46 -38 -113 -14 -36 -115 63 -14 -261 34 33 70 59
$$ packed form
2232E90l09k65Ro2J07p0k21j56r4K09P2l54LP1K38J22q3J61q1L1K63J97p5R1l3
2257C61J39j06o3q8J62k19l47L38r0k25k20J52j51oq2N7j18M9N2K35j11P2P3L48
2281B12J18j42J79K5r4J46n9m0k37K47J84l09j46m3n2o3j86J08j79j42Q6P0r2
2304d09q0J21J21M7OM08k69O3P6L55k1j11O9P7M8j16q7j31k57N0R8r3j13n8J3
2329a93k53K61ok28p8K50J60J3P7j88K13O3q2K26J00j70o3K84j32p4j7J70j62
2352A71j81n9J0J56k49k0M8pq7J18j56j1M8K57n6j36L00K00k35p8K23r1Q2k53
2376fK41p8k01K6K40j67j5O6m2j11p7M1p2M8q4K86j89J39k41Q9JJ10k9J20j17
2401b2J91j8m8p2J17j37J04k36J81R6k77J02M5p2Qp5R9k2p9J78p7k47K95jL7j1
$$ plain form
2427 59 12 -44 -46 -63 62 46 91 -250 -138 196 66 1 -28 3 -123 73 -13 -97 -38 151 267 224 -139 212 121
2452 121 -34 104 143 -51 43 -182 -127 -132 -13 -81 -192 7 -278 -82 1 -89 -81 -182 182 -1 -31 31 16 253
2476 253 219 137 83 74 228 332 191 118 0 193 124 12 -181 -83 -253 -194 -275 -312 -271 -386 -167 -132 -242 -194 -197
2501 -197 138 34 32 295 141 90 176 185 331 347 296 202 57 259 144 30 -141 -167 -122 -75 -238 -279 -378 -157 -288
2526 -288 -300 -216 -297 -88 61 -5 -24 12 167 387 307 361 239 234 241 155 209 94 170 28 -57 26 -186 -229 -132 -301
2552 -301 -169 -284 -293 -389 -247 -64 31 -54 -24 4 125 156 210 261 367 427 509 374 295 137 89 40 61 197 -133
2577 -133 -131 -202 -87 -164 -322 -285 -343 -266 -284 -412 -198 86 -118 111 124 19 114 150 245 396 202 248 297 267 261 95
2603 95 61 120 74 20 37 -55 -122 -150 -260 -232 -125 -352 -277 -202 -14 -54 36 2 -40 120 67 171 28 118 48 171
$$ packed form
2427E9m7n6kj7J25j6M5l41J12L34j30o5k9L1j26J96q6q4N9J89J16m3l63L51r1
2452A21j55J38L9j94R4k25N5nJ19o8j11J99k85J96Q3r0Qj01L64j83l0O2j5K37
2476B53l4q2n4rJ54J04j41p3j18J93o9j12j93R8j70N9q1l7M1j15K19L5j10M8l
2501a97L35j04kK63j54n1Q6RJ46J6n1r4j45K02j15j14j71k6M5M7j63m1r9K21j31
2526b88j2Q4q1K09J49o6j9L6J55K20q0N4j22nPq6N4j15P6j42q5Q3k12m3R7j69
2552c01J32j15rr6J42J83R5q5L0K8J21L1N4N1J06O0Q2j35p9j58m8m9K1J36l30
2577a33Kp1J15p7j58L7n8P7j8j28K14K84k04K29J3j05R5L6R5J51j94M6M9l0oj66
2603I5l4N9m6n4J7r2o7k8j10K8J07k27P5P5J88m0R0l4m2J60n3J04j43R0p0J23
$$ plain form
2629 171 220 287 144 -15 100 10 -65 -100 -109 37 -93 -97 -158 -99 -133 -93 -188 -91 -124 -106 122 92 105 82 26 -18 188
2656 188 9 -9 131 43 114 99 -77 33 147 30 -28 -62 -58 93 65 -14 47 -96 -122 -34 -39 -125 -72 -81 138 -13
2682 -13 -103 -189 112 10 136 121 68 -48 41 175 14 -115 34 -15 100 -55 -31 48 -18 0 4 76 193 126 -99
2707 -99 -53 -110 98 -99 -239 -85 -139 -134 -29 -145 -96 -244 -117 110 50 -36 171 -63 -56 -101 60 228 -140 61
2731 61 129 133 -27 10 92 18 -218 -130 -91 -76 -257 -174 -61 -144 -72 -83 1 -117 -225 21 20 -53 -33 83 77 12 -75 436
2759 436 271 186 102 127 -39 185 70 -25 -100 -207 -112 -123 -82 -285 -365 -37 -153 -231 -31 -258 2 165 81 -71
2783 -71 -3 70 336 146 275 268 202 200 412 6 149 76 202 40 -28 -220 -218 -127 -311 -199 -168 -288 -243 -185 -92 -76
2809 -76 -87 114 -106 -8 32 230 217 9 318 306 211 207 176 -69 220 123 87 -157 -228 -35 -130 63 -211 -213 -152 -267
$$ packed form
2629A71M9O7j43j59J15r0p5l5rJ46j30mo1N9l4M0r5R7l3J8K28l0J3k3n6m4K06
2656A88j79j8J40q8P1j5j76J10J14j17n8l4MJ51k8p9O1j43k6Q8nq6N3rK19j51
2682a3r0q6L01j02J26j5n3j16Q9J34j61j29J49m9J15j55K4P9o6J8MP2J17o7k25
2707i9M6n7K08j97j40J54n4NJ05j16M9j48J27K27o0q6K07k34Pm5J61J68l68K01
2731F1O8Mj60L7Q2p4k36Q8L9J5j81Q3J13q3P2j1Q4j18j08K46jp3K0J16oo5q7N11
2759D36j65q5q4K5j66K24j15r5p5j07R5j1M1k03q0L28j16p8K00k27K60J63q4j52
2783g1O8P3K66j90J29po6kK12m06J43p3J26j62o8j92KR1j84J12L1j20M5N8R3J6
2809g6j1K01k20R8M0J98j3k08L09j2r5ml1k45K89r7l6k44p1J93r5J93k74kO1j15
$$ plain form
2835 -267 -336 -257 -106 -102 -185 -113 53 107 181 173 117 -5 294 197 346 154 208 140 111 126 67 -131 -112 42 -181 -280
2861 -280 -121 -92 -73 -240 -143 -246 -256 -176 -14 102 83 53 55 212 215 79 521 188 140 134 56 256 15 47 114 -5
2887 -5 -90 -37 -181 -50 -201 -249 80 -118 -187 -69 -181 58 -72 103 -53 124 151 -44 48 66 18 222 118
2910 118 179 71 -39 -42 68 -23 41 38 7 -34 -126 -109 -29 -311 -132 31 46 -167 -188 -38 -107 -86 67 142 80 -12
2936 -12 90 146 21 -113 42 12 20 -16 126 121 -23 -41 -31 24 74 -169 6 -8 -51 132 -317 -19 -24 -89 29 -52
2962 -52 -165 -16 143 1 -3 12 84 -70 127 -2 -54 150 -32 7 -17 1 61 27 -2 190 131 13 18 -75 -25 -36
2988 -36 6 -133 -103 -117 5 11 -83 41 80 -87 -119 -126 -155 -57 42 195 243 97 171 68 75 184 149 4 137 171 208
3015 208 46 35 -55 71 12 -198 -267 -190 -9 -43 -20 -180 -247 -105 -91 -60 58 44 93 16 171 130 95 225 184
$$ packed form
2835b67o9P9J51Mq3P2J66N4P4qn6j22K99r7J49j92N4o8k9J5n9j98J9J54k23r9
2861b80J59K9J9j67R7j03j0Q0J62J16j9l0KJ57Lj36M42l33m8op8K00k41L2O7j19
2887eq5N3j44J31j51m8L29j98o9J18j12K39j30J75j56J77K7j95R2J8m8K04j04
2910A18O1j08j10lJ10r1O4ll1m1r2J7Q0k82J79J63J5k13k1J50o9K1J53P5o2r2
2936a2J02N6j25j34J55l0Ql6J42nj44j8J0N5N0k43J75j4m3J83m49K98no5J18q1
2962e2j13J49J59j42mJ5P2j54J97j29n2K04j82L9k4J8O0l4k9J92n9j18Nr3N0j1
2988c6M2j39L0j4J22Or4J24L9j67l2pk9R8R9J53M8j46P4j03PJ09l5j45J33L4L7
3015B08j62j1r0J26n9k10o9P7J81l4K3j60o7J42J4L1J18j4M9p7J55m1l5J30m1
$$ plain form
3040 184 7 180 190 175 170 -47 29 -95 -13 -30 -225 -227 -149 -214 -258 -304 -212 -198 -80 -152 -154 -20 36 72 42 101 189 103
3068 103 338 447 146 237 154 173 70 227 149 -82 -136 -102 40 -203 -134 -259 -142 -148 -164 -198 -59 -136 -67 203
3092 203 90 32 161 360 212 254 167 196 127 226 171 140 50 150 11 201 -116 -101 -188 -196 -181 -145 -181 -98 -250 -188
3118 -188 10 -57 4 155 106 151 279 99 164 140 236 130 197 20 91 -13 195 -109 -38 43 -27 9 -149 -260
3142 -260 -315 -275 -251 -53 -99 -120 -161 -47 40 -30 -48 150 176 133 215 251 195 217 152 -59 225 114 141 41 -26 13
3168 13 -90 -170 -126 -84 -4 52 -88 -120 -140 73 -109 -139 54 140 52 -37 54 120 -146 -33 45 160 -71 168 60
3193 60 98 -66 -29 110 92 3 -30 -47 -173 -4 -237 -52 -200 -85 -22 -57 -57 -23 53 -16 271 29 15 -1 168
3218 168 -122 -85 -126 215 35 -52 17 86 15 -79 54 -53 8 -115 20 -116 106 -21 97 26 -138 -9 -39
$$ packed form
3040A84j77J73J0j5nk17P6j24Q2j7j95kP8o5m4m6R2J4J18p2kJ34N6L6l0N9Q8q6
3068A03K35J09l01R1q3J9j03J57p8k31n4L4J42k43O9j25J17oj6l4J39p7O9K70
3092B03j13n8J29J99j48M2q7K9o9R9n5l1r0J00j39J90l17J5q7qJ5L6l6Q3j52O2
3118a88J98o7O1J51m9M5J28j80O5k4R6j06O7j77P1j04K08l04P1Q1p0L6j58j11
3142b60n5M0K4J98m6k1m1J14Q7p0j8J98K6m3Q2L6n6K2o5k11K84j11K7j00o7L9
3168A3j03q0M4M2Q0N6j40l2k0K13j82l0J93Q6q8q9R1O6k66J13P8J15k31K39j08
3193F0L8j64L7J39j8q9l3j7j26J69k33J85j48J15O3l5%L4P6o9K87k42j4j6J69
3218A68k90L7m1L41j80q7O9O9p1r4J33j07O1j23J35j36K22j27J18p1j64J29l0
$$ plain form
3241 -39 83 111 19 105 -43 -123 46 161 -91 -6 61 73 55 110 -29 112 6 -27 157 39 -32 -54 3 -57 28
3266 28 122 -101 93 -37 155 -86 -110 198 21 64 -53 5 11 -2 -212 -45 38 6 89 -13 40 6 153 44
3290 44 -45 -30 249 -52 -152 83 186 -77 -27 -64 -95 -269 -249 127 -107 -212 -188 -68 -264 -44 -195 64 -10
3313 -10 -40 30 88 -25 184 136 179 94 121 314 180 63 -77 7 62 -28 4 -173 -141 121 -154 -60 -208 -207 -117 -89
3339 -89 -19 -20 -45 -38 134 10 95 47 52 184 176 102 195 61 134 62 58 -41 -51 -49 -119 -151 -138 -58 -182 -224 -106 -16 -61 -138
3369 -138 -119 -14 -19 -109 115 151 -17 101 175 113 61 104 185 176 198 207 1 69 20 63 17 -214 -167 -114 -144 -293 -157
3396 -157 -85 -94 -62 -256 39 2 144 136 179 213 237 229 83 138 189 133 103 288 174 -213 -17 20 -114 -76 -186 -64
3422 -64 -199 -158 -293 -138 -254 -224 -105 -10 -77 -33 35 -106 126 225 3 47 101 -39 0 97 211 16 170 109
$$ packed form
3241c9J22K8r2Q6j48q0J69J15k52Q5O7J2j8N5j39J41j06l3J84j18p1k2N7o0Q5
3266B8R4k23J94j30J92k41k4L08j77M3j17N8Oj3k10J67Q3l2Q3j02N3l4J47j09
3290D4q9J5K79l01j00K35J03k63N0l7l1j74K0L76k34j05K4J20j96K20j51K59p4
3313a0l0P0N8j13K09m8M3q5K7J93j34j17j40Q4N5r0L2j77L2K62k75R4j48JR0K8
3339h9P0jk5PJ72j24Q5m8NJ32qp4R3j34P3p2mr9j0Kp0l2J3Q0j24m2J18R0m5p7
3369a38J9J05nr0K24L6j68J18P4o2n2M3Q1rK2Rk06O8m9M3m6k31M7N3l0j49J36
3396a57P2rL2j94K95l7J42qM3L4K4qj46N5N1n6l0J85j14l87J96L7j34L8j10J22
3422f4j35M1j35J55j16L0J19R5o7M4O8j41K32R9k22M4N4j40L9R7J14j95J54o1
$$ plain form
3446 109 -18 35 40 160 -98 -21 -88 -119 90 -233 -74 -83 -115 -1 60 30 49 24 97 178 211 -14 126 123 237 125
3472 125 -76 274 48 214 -70 -58 -8 -185 -39 -127 -65 -39 -142 -47 -54 -199 119 25 30 -173 40 -15 -4 -86 81
3497 81 -50 22 55 44 58 -4 -22 61 -7 -58 41 13 88 -101 -34 106 -22 -92 42 -73 56 -33 -19 126 -60 -35
3523 -35 72 -46 18 -57 -83 -27 -27 146 57 65 -10 -28 95 78 -149 -33 65 100 8 -2 28 125 131 64 55 -14 48 -31 46
3552 46 81 81 -79 -119 -106 -127 -138 -7 -70 21 -57 107 56 6 1 42 133 72 102 96 -44 69 37 65 24 80 -9 19 13 -43
3582 -43 18 -23 40 -21 -44 -71 -235 -128 -127 43 -32 127 -40 87 39 193 104 160 73 65 110 -86 139 128 -9 124
3608 124 -92 -99 -53 -100 -83 -55 -81 -11 -107 -173 -63 -41 -237 -52 -3 -18 -34 130 72 159 142 166 86 221 209 175 146
3635 146 -11 122 53 91 154 -82 103 -147 -44 -254 -152 -42 -120 -40 7 -139 -75 200 20 22 -6 111 162 127
$$ packed form
3446A09j27N3NJ20k58P7o7l1K09l23J59rl2J14O1l0J9k5P3Q1L3k25J40lJ14j12
3472A25k01L50k26J66k84J2N0j77J46q8O2K6j03R5pj45L18r4Nk03K13n5J1q2J67
3497H1j31P2L3j1J4o2j8Q3o8n1R9k8P5j89O7J40j28p0J34j15J29q9J4J45j86K5
3523c5J07j18O4p5k6N6%J73q9Qp5j8J23j7k27J16R8L5r2j0L0R7Oo7ro9O2p9P7
3552D6L5%j60m0J3k1j1J31o3R1p8J64n1n0nM1R1o1L0oj40J13l2K8m1N6q9K8on6
3582d3O1m1O3o1k3k7j64J07JJ70p5J59j67J27m8J54q9N6q7qM5j96K25j1j37J33
3608A24k16pM6m7J7K8k6P0r6o6J10K2j96J85M9j5j6J64n8Q7j7K4q0J35j2l4k9
3635A46j57J33o9L8O3k36J85k50J03k10J02J10p8Q0M7j46O4K75j80Kk8J17N1l5
$$ plain form
3659 127 -19 229 71 140 65 -29 -27 56 66 -33 109 70 -28 -94 -90 -210 -144 -117 21 -53 -199 -66 -91 1 59 -86
3685 -86 73 54 66 140 103 122 119 0 90 221 39 -29 82 8 -248 -147 -79 -126 15 -90 4 1 -232 -21 40 -103
3711 -103 20 -213 -146 47 19 9 95 -13 112 209 122 53 9 -22 168 -87 -61 -14 72 99 -126 41 -125 -88 -267
3736 -267 -52 -114 -21 -103 -43 71 -45 -86 111 137 3 66 2 59 -144 117 37 -186 -87 33 -85 -35 -36 -12 9
3761 9 -130 -63 28 71 -119 -24 -148 55 -95 -8 -206 121 10 69 75 -64 -34 12 -190 14 31 -85 42 132 79
3786 79 -155 35 91 -77 -91 116 95 10 -169 -75 100 -19 210 -71 65 39 97 -76 -24 -158 44 116 -43
3809 -43 74 4 32 -58 19 20 69 26 -18 -52 -13 -86 59 135 -4 30 83 5 125 -183 67 -67 -112 -13 -28 15 57
3836 57 33 -38 9 52 23 15 -60 151 63 43 67 195 -87 28 45 90 160 -44 -18 55 182 5 -12 40 -14 -67 -21
$$ packed form
3659A27j46K48j58O9p5r4KQ3J0r9J42l9r8o6Mj20O6K7J38p4j46J33k5R2N8j45
3685h6J59j9J2P4l7J9lj19R0J31j82o8J11p4k56J01O8m7J41j05R4lk33K11O1j43
3711a03J23k33O7J93k8j0Q6j08J25R7q7o9m4l1J90k55K6M7Q6K7k25J67j66L7j79
3736b67K15o2R3q2O0J14j16m1J97K6j34O3o4N7k03K61q0k23R9J20j18N0jK4K1
3761Ij39O7R1M3j90R5j24K03j50Q7j98L27j11N9Oj39L0M6k02K04J7j16J27R0n3
3786G9k34J90N6j68j4K07k1q5j79R4J75j19K29k81J36k6N8j73N2j34K02P2j59
3809d3J17p0K8r0P7JM9m3m4l4L9p3J45P6j39L4N3p8J20l08K50j34m5R9j5M3M2
3836E7k4p1M7M3k9qp5K11q8k0K4J28k82J15J7M5P0k04K6P3J27j77j7N2n4n3M6
$$ plain form
3863 -21 -72 -133 -141 -54 4 24 -200 -68 -74 -18 -6 160 -97 64 130 87 213 70 48 197 98 44 -50 -39 -9 -6 23 69
3891 69 -97 -173 -42 -118 -70 -3 71 -27 -40 -238 35 -61 166 141 -6 230 -50 -31 48 -16 47 235 139 142 168 -52
3917 -52 88 -19 -84 -57 -141 -39 -47 -49 -89 -147 -41 -123 -89 -11 -191 -211 102 -130 60 -34 146 90 10 114 331 165
3943 165 256 167 107 89 123 -55 -16 26 96 4 -56 -66 -93 25 -123 11 -37 -95 -212 74 32 133 -165 -25 55
3968 55 146 -117 152 41 29 146 289 -69 -87 -39 -49 35 24 -71 -18 -34 -235 -113 -157 -80 -38 68 -7 47 -37 58
3994 58 43 -35 -70 -58 141 255 -63 -97 134 80 -34 -106 -5 15 -127 115 -102 -161 133 19 -103 -50 -88 -24
4018 -24 -76 -103 4 143 -84 77 57 127 -16 -42 64 2 72 4 107 267 -30 285 9 82 125 -3 -72 102
4042 102 128 -70 -50 -7 230 -80 -158 -147 -8 56 -41 -98 49 -14 25 -37 -76 -129 52 22 -37 25 54 105 -6 -189
$$ packed form
3863b1n1o1qQ7N8K0k24J32oN6J2J66k57J61O6m3J26j43k2J49r9n4r4J1L0LK9M6
3891F9j66p6J31p6M8O7P4r8j3j98K73r6K27k5j47K36k80J9P9o4O3J88r6LK6k20
3917e2J40j07o5K7q4J02qkm0n8J06q2L4P8j80k0L13k32J90r4J80n6q0J04K17j66
3943A65R1q9o0j8L4j78L9M2P0r2o0j0k7J18j48J34m8n8j17K86m2J01k98J40Q0
3968E5R1k63K69j11j2J17J43l58j8M8j0Q4j1r5N3j6k01J22m4P7M2J06p5N4q4R5
3994E8j5p8l5J2J99J14l18l4K31n4j14p2J01K0j42K42k17n9K94j14j22N3l8O4
4018b4n2k7J07J39k27J61k0P0j43k6J06o2P0o8J03J60k97L15k76P3M3j28o9J74
4042A02K6j98K0M3K37l10p8J1J39O4r7n7J47o3L9o2l9n3J81l0n9O2K9N1j11j83
$$ plain form
4068 -189 89 257 19 54 59 108 49 -72 152 83 -38 -90 -12 27 -84 28 -23 -68 -106 -13 -119 175 114 -8 147
4093 147 171 -63 109 149 -29 -5 30 -46 30 128 136 -15 -51 104 97 -37 18 -21 -82 -98 -74 27 60 1 -98 -18 -57
4120 -57 2 15 102 30 -118 23 97 -20 20 26 35 -6 137 144 68 47 126 82 155 6 76 89 -134 -89 23 95 -78 70
4148 70 -4 -32 25 -50 106 36 -26 -139 141 -35 43 91 1 6 2 111 -34 141 -16 92 12 -29 -99 37 50 72
4174 72 -107 9 -78 -130 124 -210 -97 -19 -247 20 -77 35 105 -78 -26 79 178 39 85 14 -74 122 -81 244
4198 244 19 -76 -4 -101 -99 67 -10 -163 47 -142 -104 -146 -91 -48 -99 -108 -52 198 61 3 56 -6 120 124 111 -76 103
4225 103 -12 79 -3 163 116 39 -89 81 34 -126 -88 -68 -104 18 -84 -36 -108 -3 -8 -54 119 -21 -198 -67
4249 -67 105 -6 97 43 55 77 16 259 52 -108 -51 8 54 21 32 89 79 -49 -41 -33 -45 -81 105 84 22 -151 16
$$ packed form
4068a89K78J68k38L5NM9n9j21K24o9j21n2P8L9j11J12n1m5l8R3j06K94o1j22J55
4093A47K4k34J72M0j78K4L5p6P6R8Qj51l6J55pj34N5l9o1j6K4J01L3n9r9Q0l9
4120e7N9J3Q7p2j48J41P4j17M0ORm1J43Pp6k1P9m4P3j49P0J3k23M5J12P2j73J48
4148G0p4k8N7p5J56p0o2j13K80j76P8M8r0NmJ09j45J75j57J08q0m1p0J36J3K2
4174G2j79J16q7n2K54l34J13P8k28K67r7J12P0j83N2J05R9j39M6p1q8J96k03L25
4198B44k25r5P2r7KJ66p7j53K10j89L8m2N5M3n1rN6K50j37n8N3o2J26Mj3j87J79
4225A03j15R1q2J66m7p7j28J70m7j60L8K0l6J22j02M8p2J05nm6J73j40j77J31
4249f7J72j11J03n4J2K2o1K43k07j60N7N9M6l3J1N7j0j28QQj2l6J86k1o2j73J67
$$ plain form
4276 16 -7 123 -148 80 137 59 32 95 4 7 148 -46 34 -97 -147 -66 -215 -117 -62 82 22 -139 -78 110 14 -10
4302 -10 -77 50 -48 16 -15 -121 -23 49 -43 109 88 145 116 22 -82 55 75 189 -68 -151 -111 -67 -8 52 -87 -117
4328 -117 -98 28 -79 34 53 -53 -124 -192 19 73 21 208 67 -55 39 -22 111 -186 -110 -90 -5 -28 -38 -44 7
4353 7 -45 -12 102 50 -94 18 -8 -35 -182 111 92 -198 -16 -156 -135 51 15 -20 -109 -161 35 -1 55 68 42 -64
4379 -64 -55 76 -43 -125 -14 86 71 45 56 20 177 6 -84 107 -20 50 -95 -24 -32 13 120 19 -29 -161 205
4404 205 -157 -80 58 10 40 -2 48 -26 51 90 2 76 110 3 -9 -134 41 -56 33 -77 -38 -125 -118 -96 -38 -88 72
4431 72 -62 100 4 -39 -86 105 69 110 229 21 -107 -44 -82 -23 139 -8 28 124 109 -11 84 4 29 -9 -80 -14
4457 -14 41 -112 -19 -203 8 -5 -60 112 -46 -7 105 -38 251 65 133 133 -28 76 -26 49 99 75 146 176 -5
$$ packed form
4276A6k3J30k71K28N7p8k7O3r1LJ41j94Q0j31n0Q1j49R8N5J44o0j61O1J88r6k4
4302a0o7J27r8O4l1j06R8P2r2J52k1N7k9r4j04J37K0J14k57q3M0M4N9O0j39l0
4328a17J9J26j07J13J9j06p1o8K11N4n2J87j41j22R4o1J33k97P6K0Q5k3j0oN1
4353Gn2L3J14n2j44J12k6k7j47K93j9k90J82j40K1J86l6l5q9n2J96l6N6J3k6j06
4379f4RJ31j19q2J11J00j5k6J1l6J57j71r0J91j27P0j45P1qM5J07j01m8j32L66
4404B05l62P7J38m8L0m2N0p4P7L9q8P4L4j07j2j25J75r7Q9j10L9q7PK2N8n0J60
4431G2j34J62r6m3m7J91l6M1J19k08j28O3l8N9J62j47L6R6j5j20R5q0K5l8p1O6
4457a4N5j53R3j84K11j3n5J72j58L9J12j43K89j86O8%j61J04j02P5N0k4P1L0j81
$$ plain form
4482 -5 -43 -102 -130 12 161 53 -22 27 -54 64 18 -46 62 -8 -1 -194 55 -64 123 49 51 109 -43 22 52 -43 -56
4509 -56 -45 33 -64 129 -168 -128 -117 1 -122 -78 77 -87 65 54 -96 184 76 -29 107 88 39 -139 -75 100
4533 100 25 95 -171 22 -25 127 -98 -147 -40 7 26 -161 -57 213 -116 -23 27 -83 27 -54 128 -166 25
4556 25 -95 -36 -54 0 14 24 78 75 139 34 29 91 181 82 -74 -15 158 72 54 -4 -180 -13 59 -1 41 15 0 -132
4584 -132 65 49 -97 -60 23 -1 -30 82 -3 -118 -20 -70 -112 103 7 87 -71 -114 -65 -29 17 8 -16 -89 115 36 -29
4611 -29 -163 -75 -55 0 -155 -103 14 -299 -58 -44 -53 -85 -135 7 28 41 -101 -1 7 43 -17 83 79 54 2 62 24
4638 24 0 135 81 -65 -10 23 -101 -84 -140 -72 49 -57 45 105 19 -53 -110 85 124 -94 167 -26 83 146 50
4663 50 -6 -82 -29 -135 161 78 119 -97 90 0 -116 -89 -43 31 58 3 -12 -170 17 84 54 37 5 -133 -23 32
$$ packed form
4482el8n9k8J42J49j08p5M9q1J18m6o4J08p0Pj93K49j19J87p4KN8j52O5L0r5j3
4509e6J1P8r7J93k97M0J1J18j23M4J55j64J52j1j50K80j08j05J36j9m9j78O4J75
4533A00p5P0k66J93m7J52k25m9J07M7J9j87J04K70l29R3N0j10J10q1J82k94J91
4556B5j20N9j8N4J4J0N4lO4j05nO2R0r9j56N9J73q6j8n8j76J67P2o0M2k6j5j32
4584a32J97j6j46L7Q3k4k9J12q5j15R8n0m2K15r6Q0j58m3M9L6M6rk4p3K04p9o5
4611b9j34Q8K0N5j55N2J17l13K41J4rl2n0J42K1J3j42J00QL6o0J00mk5n2O0l8
4638B4k4J35n4j46N5L3j24J7n6O8J21j06J02O0q6p2n7J95L9k18K61j93J09O3r6
4663E0n6p6N3j06K96q3M1k16J87r0j16K7M6P4K7n5j5j58J87O7l0j7l2j38J10N5
$$ plain form
4689 32 25 78 -135 -77 80 -53 -8 -205 74 69 18 -121 -86 14 17 -150 -21 42 -60 -19 -95 -76 -26 -64 -134 -16
4715 -16 -39 -13 3 102 -11 39 81 -56 63 76 -70 -9 73 46 44 137 22 -137 -133 -181 -174 -125 -149 -34 -61 -48 -9 -17 -152
4744 -152 16 2 -93 128 -12 111 48 -34 82 98 -23 -51 67 -39 84 48 84 -31 -16 23 51 -142 -25 76
4768 76 55 106 -176 -156 -26 -97 -180 128 -71 -51 -36 172 -48 -112 17 97 -12 88 149 -6 61 24 -104 57
4792 57 15 43 -207 -34 -91 -62 -105 -91 -150 -21 -47 -60 -37 -37 43 78 13 -75 -25 41 56 -13 36 195 39 180 140 159
4820 159 54 131 -70 -2 -36 205 -24 23 -34 74 118 3 36 -148 47 49 118 11 -94 16 -29 -133 -55 -48 -45
4845 -45 -11 -37 -44 80 121 49 29 -44 101 25 -12 27 25 -7 -92 -235 -95 -73 -278 -158 -88 -67 -91 51 -61 -46 147
4872 147 40 76 25 59 81 7 -76 65 -47 77 -20 -18 27 20 22 89 6 0 -129 35 -9 -92 -45 -72 24 -35 -66 15 -71
$$ packed form
4689C2pN3k13N8J57j33M5j97K79nn1j39L5J00Lj67J29O3j02M1p6J9N0l8p0J18
4715a6k3K6J6R9j13N0M2j37J19J3j46O1Q2k7kR3j15j59Mm8PM9k4J15k7J3L9qj35
4744a52J68j4r5K21j40J23o3q2J16J6j21k8J18j06J23l6L6j15J5L9K8j93J17J01
4768G6k1N1k82K0J30p1q3L08j99K0J5K08k20o4J29Q0j09J00O1j55O7l7j28J61
4792E7m2K8k50J73n7K9m3J4n9J29k6j3K3%Q0L5o5q8N0O6J5o9M9J59j56J41m0J9
4820A59j05P7k01O8l4K41k29M7n7J08M4j15L3j84J95KO9j07j05J10m5j04P8PL
4845d5L4k6pJ24M1p2k0p3J45p6l7L9kl2q5j43J40K2k05J20P0K1k4J42j12J5J93
4872A47j07L6n1L4K2p4q3J41j12J24r7KM5pKO7q3oj29J64m4q3M7k7R6n9l1Q1q6
$$ plain form
4901 -71 47 88 -124 115 1 -3 -32 -55 126 -32 24 73 221 -21 -72 41 -34 59 42 96 -17 68 43 -86 21
4926 21 12 6 21 11 -38 -60 -196 -37 -46 63 56 -46 -45 36 26 -8 133 -63 -16 -77 56 -68 14 107 47 95 -63 36
4954 36 -202 -124 6 -107 82 34 -74 -247 13 -206 117 75 -38 -6 104 66 17 61 92 44 63 79 -21 120
4978 120 -17 10 -88 -51 15 114 15 -49 -94 71 24 4 55 39 18 -6 125 132 154 -8 -38 66 -51 -26 142 27
5004 27 174 30 -59 46 161 -65 88 -45 100 10 14 63 -81 -66 -45 1 14 -111 -151 22 100 104 39 65 88 -36
5030 -36 11 -3 27 97 140 13 -76 -58 9 111 38 156 103 6 -194 63 54 -54 49 -29 -86 -236 -82 44 -58
5055 -58 -34 -21 37 5 -56 -20 -95 -98 -66 -35 39 146 -43 -32 59 -9 31 187 -30 5 -6 -113 13 -91 -80 -172 70
5082 70 -93 -91 47 -30 45 50 70 31 145 75 -25 -48 -69 -44 53 14 110 63 15 209 72 -91 -101 -16 -36 92 -4
$$ packed form
4901g1J18M1k12K39j14mk9k3J81j58N6M9J48k42n1J13p5R3j7N4j13Q5k5j29J07
4926B1roJ5j0m9k2j36J59rJ09pj02JQ1j0l4J41j96M7o1J33j24Q2R3o0M8j58R9
4954C6k38P8J30j13J89m8j08j73K60k19L23m2j13L2J10l8m9M4L1m8J9J6j00J41
4978A20j37K7r8L7O6R9r9o4m5J65m7k0N1j6k1k4J31PK2j62l0J04j17K5J68j15
5004B7J47j44q9J05J15k26J53j33J45r0MM9j44J5K1M6J3j25m0J73P8Mo5K6K3j24
5030c6M7j4L0P0M3j27q9J8O7J02p3J18n3r7k00K57rj08J03p8n7j50J54J26j02
5055e8K4J3N8l2o1L6p5lL2L1P4J07j89J1R1o8M0J56k17L5j1j07J26j04J1r2K42
5082G0j63KJ38p7P5NK0l9J14p0j00k3k1K5R7l9R6m7m8J94j37j63j0Q5k0J28r6
$$ plain form
5109 -4 129 -108 -37 35 -15 143 -181 39 -28 -41 -57 -219 124 -71 5 63 260 6 129 -121 -114 2 2 27 171
5134 171 0 -84 -86 -13 6 -31 -133 76 -22 -14 -70 -145 -44 -1 -19 116 -132 -8 -30 110 21 14 21 -70 -64 -31 47 -108
5162 -108 10 11 7 106 -106 56 135 27 87 -140 -114 -25 -14 -37 -130 -145 47 -84 69 73 -124 -52 -53 -230 10 -69
5188 -69 39 -122 68 -39 -75 33 6 -50 22 76 24 36 -25 -68 113 2 -119 162 -110 -50 -41 69 -43 -72 -79
5213 -79 176 90 -104 88 34 65 22 -73 -16 25 -157 40 42 -98 22 43 7 85 -29 27 -8 -60 -6 106 30 -23
5239 -23 -91 94 -66 -130 55 -52 -136 48 -100 89 37 -37 193 164 72 35 -2 -44 -37 -34 13 45 120 -125 -44 46 -61
5266 -61 6 -94 117 40 -49 14 -61 40 -25 -1 137 86 -8 235 11 20 117 95 -17 92 53 82 -23 -50 44 -142
5292 -142 -72 -28 84 13 83 -118 75 -69 -18 94 155 -108 55 -250 -33 57 139 11 -10 25 80 -83 -13 85
$$ packed form
5109dJ33k37P1P2n0J58l24K20o7j3j6j62L43j95P6N8J97k54J23k50PJ16%K5J44
5134A71j71q4kP3J9l7j02K09r8Qn6p5J01M3j8J35k48J24k2J40q9pPr1OL3P8j55
5162a08J18JmR9k12J62P9j08O0k27K6Q9J1k3r3j5J92j31J53Mj97P2jj77K40p9
5188f9J08j61J90j07l6J08k7n6P2N4n2J2o1m3J81j11j21K81k72O0RJ10j12k9p
5213g9K55q6j94J92n4L1m3r5N7M1j82J97Kj40J20K1l6P8j14N6l5n2N4J12p6n3
5239b3o8J85j60o4J85j07q4J84j48J89n2p4K30k9r2l7l7m2PLM7L2P5k45Q1R0j07
5266f1O7j00K11p7q9O3p5J01o5K4J38n1r4K43k24RR7k2j12J09l9K9j05k7R4j86
5292a42P0M4J12p1P0k01J93j44N1J12O1k63J63l05K17R0Q2j28k1L5N5j63P0R8
$$ plain form
5316 85 21 49 -107 78 75 -67 -103 72 -98 -150 159 -10 145 151 -291 -82 -140 -109 38 78 -133 24 -83 25
5340 25 235 -47 -78 36 50 117 -17 121 157 -116 112 29 28 48 -55 -63 2 32 79 47 60 -88 50 -10 -46 17
5366 17 -114 -11 28 82 -26 21 23 53 -31 122 2 128 -13 -47 -112 81 90 149 52 51 87 -32 -174 -4 -79 37
5392 37 -70 -153 42 45 -93 -148 -23 -114 8 -26 -14 121 21 -98 98 62 102 4 9 -185 26 -118 19 120
5416 120 120 145 88 64 -48 49 -59 -73 -15 43 42 -219 -162 58 -5 20 -59 138 87 -112 137 95 148 -167 138 18
5442 18 -22 143 -71 -83 -258 150 -86 -144 37 9 92 49 138 85 271 49 30 -17 21 112 -115 36 3 2 98 -1
5468 -1 -66 12 81 -18 116 121 54 162 13 57 64 -57 153 75 -19 116 -33 106 111 21 -72 -27 -142 -24 -29 -85 24
5495 24 -21 34 140 54 115 -64 131 112 170 96 46 70 -21 111 134 41 9 -143 -84 -72 -60 -68 -22 -106 -185 -78 -55 -57
$$ packed form
5316H5o4K8j56J85lj42l6J75j70n2L09j69J55Om42K09n8L1J47M0k11J57j07J08
5340B5K10k82l1J14J4O7j34J38L6k73K28q3jK0j03qO5L0M7l2J3j48J38o0l6O3
5366A7j31J03L9N4j08M7KL0q4J53j20J26j41l4o5J93RN9r7jL6j19j42J70p5J16
5392C7j07q3J95Lj38n5J25r1J22l4J2J35j00j19J96l6M0r8Nj94K11j44J37J01
5416A20%K5n7k4j12R7j08j4N8N8jk61N7K20o3K5p9J97n1j99K49m2N3l15L05j20
5442A8m0J65k14j2j75M08k36n8J81k8Q3m3Q9n3J86k22j9m7L8R1k27J51l3jR6r9
5468ao5P8O9r9J34No7J08j49M4Pj21K10p8r4J35j49J39Nr0r3M5j15J18nn6J09
5495B4m5N5J06q6O1j79J95j9N8p4n0K4r1J32K3r3l2j52N9J2J2qM6q4p9J07K3k
$$ plain form
5523 -57 16 124 28 43 -27 103 -55 -55 -8 1 76 117 28 255 28 5 52 37 -81 -47 134 -47 41 -108 154 -212
5549 -212 -176 9 -9 22 -87 -1 53 -39 15 46 -104 -128 -61 20 -58 -145 -8 -221 146 -8 122 157 18 -82 104
5574 104 55 -129 -136 62 -36 120 -76 -60 -43 34 -5 -2 -18 -1 45 17 -210 -14 -17 45 175 79 223 -43 -73 54
5600 54 -72 -78 84 -77 168 -4 -7 65 134 44 -61 1 -174 -65 -26 91 -115 -15 62 -45 111 120 24 53 -43
5625 -43 55 125 28 75 98 22 -1 29 6 14 55 -185 53 29 -60 20 -48 -70 2 -99 8 -123 -32 31 -55 -27 53 -29
5653 -29 -15 -93 -79 -90 29 86 71 -42 -137 -49 42 39 -21 -42 -107 -38 52 -53 -69 1 -45 277 86 -169 -46 -20 175
5680 175 -22 -190 -51 -123 127 139 45 -73 -84 72 24 35 -32 -102 -66 46 -13 32 -172 -55 -112 -23 -27 23 -82
5705 -82 -88 28 68 -191 -25 180 -62 -50 -52 78 62 50 34 -23 138 -25 75 3 66 -57 20 -37 -69 55 74 -164
$$ packed form
5523e7P3J08r6J5p0J30j58%M7RP5M1q9K27k27k3M7j5j18L4J81j81Q8j49K62l66
5549b12L6J85j8L1j09Q6N4r2N4L1j50k4O7Q1p8q7J37k13L67j54J30L5j39j00J86
5574A04m9j84pJ98r8J56j96J6J7P7l9Lj6J7M6k8k27J96lO2J30r6J44k66l0J27
5600E4j26oJ62j61K45j72lP2O9r0j05O2j75J09L9J17k06J00P7j07J56Rr6K9r6
5625d3R8P0r7M7K3p6k3L0k3QM1k40K38k4q9Q0o8k2P2j01J07j31R1O3q6K8Q0q2
5653b9J4p8J4j1J19N7j5j13r5Q8R1lo0k1o5O9R0j05j6P0m6L22j91k55J23K6J95
5680A75j97j68J39p2K50J2r4j18j1J56m8J1o7p0L6J12n9M5k04J17n7Q9mN0j05
5705h2oJ16M0k59J66K05k42J2kJ30j6j2j6n7J61j63J00p2O3j23P7n7l2J24J9k38
$$ plain form
5731 -164 31 -137 2 -3 -148 -64 21 -61 -123 -51 -58 54 -5 -118 -225 -183 -12 200 24 165 30 138 77 184
5755 184 54 11 -117 32 -4 -116 -34 -91 -188 -40 -97 73 13 101 -173 130 -9 3 18 -33 6 98 -37 -33 103
5780 103 2 21 -140 76 -74 24 -4 70 82 -127 -7 -25 -52 27 101 194 3 -153 47 311 57 34 171 29
5804 29 -34 -21 6 -152 -116 -7 -31 82 38 -31 -84 8 184 175 -5 143 -102 40 110 11 -71 26 -76 44 61 90
5830 90 -86 -52 59 35 -21 -73 -173 -11 54 79 194 -98 3 -74 3 -200 206 -120 -26 -80 101 35 76 277
5854 277 -55 21 10 12 -25 4 -62 1 -85 -102 -171 49 -105 17 -48 -67 -76 -14 -40 -86 -67 -46 -31 40 -11 30 15 102 28
5883 28 87 1 -60 105 4 -41 -22 -6 -36 -54 15 -64 -69 37 42 -109 -117 82 105 -151 -152 4 -67 10 -43 71 -137 52
5911 52 16 98 -182 -4 -51 20 -82 -52 -7 -28 -136 -91 111 38 -112 -4 43 -58 -49 41 -25 -16 27 -56 -16 56 20
$$ packed form
5731a64J95j68J39nj45Q4Q5q2o2P2pJ12n9j13j07M2J71K12j76J41j35J08o1J07
5755A84j30m3j28J49l6j12Q2n7r7J48n7J70o0Q8k74L03j39J2J5n1L9R2j35MJ36
5780A03j01J9j61K16j50R8k8P4J2k09J20j8k7P9P4R3j91j56K00K64k54k3J37j42
5804B9o3J3K7j58L6J09k4J13m4o9n3R2J76rj80J48k45J42P0r9q2R7j02J20J7K9
5830I0j76L4J11k4n6n2j00J62O5K5J15k92J01p7P7k03M06l26R4n4J81o6M1K01
5854B77l32P6j1Kl7K9o6O3q6j7o9K20j54J22o5j9rO2k6m6J9K1J5P1n1M1j5Q7p4
5883B8N9q6o1J65j01m5J9J6l0j8O9p9nJ06Nj51qJ99K3k56jJ56p1P7n3J14k08J89
5911E2l6Q2k80J78m7P1j02L0M5k1j08M5K02p3j50J08M7j01RR0o6RM3q3M0P2l6
$$ plain form
5938 20 -67 -101 -39 -56 36 107 9 -33 4 34 -120 -81 54 -6 -172 9 -9 -62 -82 16 32 -57 -117 84 -6 -108 46
5965 46 115 51 91 -80 159 59 57 154 56 -17 -18 120 -86 175 0 -142 -72 -34 83 -53 183 10 52 -6 90
5990 90 -29 72 172 -83 94 71 56 -69 33 -160 -12 -106 138 35 196 166 23 31 99 -4 1 -3 93 -16
6014 -16 157 -59 -8 -132 40 -103 -30 78 -103 99 -230 -35 55 -59 -25 -72 -8 71 -66 55 -108 31 114
6037 114 -129 -102 -84 63 -15 -92 29 74 -103 -147 -5 -87 121 100 -22 -63 -66 -50 -100 -8 -62 -51 39 -68 154 -68
6063 -68 -31 -63 20 192 61 76 121 15 -42 -22 6 -109 -149 10 8 -47 145 86 1 13 -132 29 -14 -14 -99 -128 -88
6090 -88 69 -68 -37 -36 -21 59 -87 150 113 24 -16 78 115 97 -66 -8 38 -41 -113 -114 38 133 50 -149 108 61 1
6117 1 36 -46 45 -32 9 77 -20 -32 -27 -19 22 23 -34 154 -159 -7 11 8 40 -16 -63 -13 -55 189 101 150 83 -50 -113 -34
$$ packed form
5938B0q7l4O2j7R2P1r8m2L7L0j54L9J35o0j66J81j8n3k0R8J6q9o0K01r0j02J54
5965D6O9o4M0j71K39j00kR7r8p3jJ38k06K61j75j42P0L8J17j36K36j73M2n8R6
5990I0j19J01J00k55J77k3j5j25J02j93J48r4K44j03J61l0j43QO8j03NmR6j09
6014a6J73k16N1j24J72j43P3J08j81K02l29J95R0j14L4m7O4P9j37J21j63J39Q3
6037A14k43K7J8J47p8p7J21M5j77m4J42q2K08k1j22m1lJ6n0R2n4J1R0j07K22k22
6063f8L7l2Q3J72j31J5M5j06n7K0K8j15m0J59kn5J92n9q5J2j45J61m3%q5k9M0
6090h8J57j37L1JJ5Q0j46K37l7q9m0R4L7j8j63N8M6p9p2jJ52R5q3j99K57m7o0
6117AL5q2R1p7M1O8r7j2NQM1Jn7J88l13J52J8lL2n6m7N0m2K44q8M9o7j33o3P9
$$ plain form
6147 -34 19 -62 71 -130 6 42 27 20 54 40 -170 66 16 9 -21 -153 -75 116 -22 -68 78 -3 -28 93 -173 257
6173 257 153 -86 -75 -12 -109 -9 -45 -189 114 0 -52 29 -105 -15 8 -79 -14 42 118 32 80 -32 -98 126 -24
6198 -24 -106 -175 58 87 -50 57 -61 -85 13 -164 -42 -6 142 -68 -60 -86 91 32 7 69 47 -30 -29 189 114 41
6224 41 23 -101 63 65 -158 102 58 93 -65 22 50 28 74 -51 -6 36 -208 -79 -68 -105 -121 71 -64 -42 -73 -13
6250 -13 19 -55 -167 -120 -61 46 -19 -92 236 44 -52 13 3 84 -169 56 123 55 46 56 9 -68 -16 -154 157 -124
6276 -124 16 -4 26 -68 -93 71 49 -65 176 171 44 -52 75 -36 40 -6 71 -17 36 50 20 28 -48 112 67 -124
6302 -124 81 -184 -50 -78 -13 105 -131 87 -127 156 125 -121 -70 97 187 142 33 134 95 201 -5 133
6324 133 59 54 -5 56 74 -121 -6 -68 -6 48 -225 -69 -23 38 112 -91 -34 -26 34 88 -10 -45 -94 63 -25 43 73 -30
$$ packed form
6147c4N3q1J33k01J36L6j5pL4j4k10K36n0pl0j32P8J91j38m6J46q1k5J21k66M30
6173B57j04k39J1O3r7J00l6j44L03j14n2Q1j34R0K3q7O5N6P6q6M8j12o6K24j50
6198b4q2o9K33K9j37J07j18k4R8j77J22L6J48k10Qk6J77n9k5O2k2p7JK18p5p3
6224D1j8j24J64Kk23K60m4L5j58Q7K8k2M6j25M5M2k44J29J1l7j6J92j35K2l1O0
6250a3L2p4j12M7N9J07o5p3L28j92r6O5j0Q1k53K25O7o8rJ0m7p7N2j38L11k81
6276a24J40k0L0r4k5J64k2j14K41nj27r6J27j11P6m6P7q8N3J4l0Qp6J60m5j91
6302a24K05k65J34k8O5J18k36K18k14K83l1k46N1J67R0m5j09J01l9J06k06J38
6324A33p4nn9O1J8j95J15o2O2N4k73J56M6O1P4k03N7QO0N4r8l5m9J57q8O8L0j03
$$ plain form
6352 -30 31 -19 58 -155 -83 -39 -10 -112 -69 -17 -25 -20 -94 45 95 72 -43 9 24 -100 70 -98 37 125 -55 13 148
6379 148 -45 -128 -225 -99 71 -26 85 93 222 -39 -3 -14 -54 -50 -145 -6 67 -23 -52 -3 -17 65 -39 27 24 -133 -31
6406 -31 -48 -110 51 35 -132 26 84 -69 36 -83 -156 17 -23 -107 -12 -112 33 -62 -83 29 3 105 -98 2
6430 2 -108 -26 -18 -4 3 -10 -95 137 52 -123 84 108 80 87 144 -40 41 -152 -140 169 -27 -27 99 -48 -58 -53 -105 -14
6458 -14 -42 -87 89 90 41 118 65 -26 -156 92 8 146 -55 122 -97 -48 68 -17 -59 18 40 -21 -71 77 105 -29
6484 -29 72 -112 43 97 -115 -107 -171 -125 101 -91 -17 -14 -51 -43 -33 90 38 166 -13 -39 35 -39 81 180 -24 -22 -73
6511 -73 -140 -88 0 100 -21 53 25 -111 -89 42 53 24 -99 -125 13 -35 -28 -75 -14 -5 16 72 52 -16 -28 -295 65
6538 65 64 14 38 5 45 60 100 -5 8 4 24 18 -113 -134 -155 -48 -89 -128 211 87 12 112 26 35 52 55 85 -80 -30
$$ packed form
6352c0O1n0P7k13P2M4K9j02M3N2qNp4J39N0k3j15N2J5j24J70j68J35Q8j80O8J35
6379A48j93q3r7J26J70r7J11QJ29k61L6j1m0Mr5J39P3r0k9M9j4Q2j04O6lj57J02
6406c1j7o2J61j6j67J58N8j53J05j19p3J73m0q4R5j00J45r5k1J12k6J02k03J00
6430Bj10Q2QJ4Pj3q5K32q5j75K07K4k8PN7j84Q1j93J2L09j96%J26j47j0Nn2R1
6458a4k8m5J76Jm9P7n3r1j30K48q4J38k01J77k19M9J16q5m2P7K2o1n0J48K8j34
6484b9J01j84J55N4k12Qo4M6K26j92P4Ll7QJ0J23n2J28j79k6P4p4J20R9k04Kn1
6511g3o7N2Q8J00j21P4k8j36K2J31J1k9j23k6J38m8Pm7O1RK1N6k0o8j2k67L60
6538F5jn0K4l3M0J5M0j05J3mK0oj31k1k1J07m1l9L39j24p5J00q6RJ7LL0j65N0
$$ plain form
6567 -30 69 113 56 -115 -25 37 197 -103 37 17 196 35 -9 26 -9 -61 -125 0 3 -134 83 -179 -101 -90 -83 -15
6593 -15 -42 152 145 94 -24 76 33 119 -74 33 39 16 -25 21 9 -57 -26 -84 -19 -48 -116 40 -2 96 -122 104 70
6620 70 57 -19 13 83 -55 -21 65 -13 155 -26 47 56 -88 41 -75 -64 107 -11 25 -30 -21 31 96 69 51 -36 -13
6647 -13 30 -108 66 -29 -24 158 -102 13 49 -106 -147 46 -23 61 94 -42 -82 -70 -31 1 35 -25 165 -104 33
6672 33 -98 -71 -5 -30 33 67 -20 44 69 17 -49 -16 50 -20 -82 -98 83 -149 -40 -25 -138 111 93 3 52 27 31 -42
6700 -42 -26 -94 -106 3 154 53 132 78 86 -97 28 -24 -143 75 -36 -39 -11 -117 292 109 -5 -2 70 254 79
6725 79 110 18 189 48 55 34 -146 -1 -21 -67 178 -30 127 8 -18 -23 -12 76 62 64 168 -46 -105 73 -33 -83
6751 -83 -35 -88 100 -173 -32 75 -89 70 -27 -28 24 142 77 -18 89 18 129 122 -96 35 -39 75 109 -27 -40
$$ packed form
6567c0R9M4n7j71R0O2J60l00J40k0J79j61m4L5l5n2o4J25Lj37K17k62P8J1PO8
6593a5k7J94pn1j18J00m3Q6j93J07Ok3m1M6j2o6L1n8O5k9o8J56m2R8k18K26l4
6620G0j3p6L2P0j38L4Q6p8J68j81P3Rj44J29j16J1J71j18L6n5RN2O5k7j8q7K3
6647a3M3j38J74r5NJ82k60J15L6j55m1J93o9Q4L3j36m0J2L9L2L4o0J90k69J37
6672C3j31K7O6k5O3L4q7O4K5n2o6L3O6p0o2j6J81k32J09J5j13K49j8r0M9k5Mp3
6700d2J6o8j2J09J51j01P9n4Qj83J25n2j19K18j11lK8j06M09j83j14LP2J84j75
6725G9L1r2J71j41Pk1j80J45k0m6K45k08J57j19k6nJ1Q8j4KJ04k14n9J78j06n0
6751h3M8n3J88k73J41J07j64J59r7jN2J18o5r5J07p1J11pk18J31p4J14L4j36j3
$$ plain form
6776 -40 -50 -18 40 139 26 -38 34 -103 -82 13 -49 14 -101 -74 187 -13 -113 -117 -51 7 25 -84 -98 -47 -76 107 -83
6803 -83 154 -29 -34 52 34 -22 53 -65 -8 101 -46 -15 50 -55 -41 -17 -57 32 -37 -131 71 116 90 3 -61 -84 -141
6830 -141 -108 -144 35 -64 80 183 59 -118 115 -131 25 -22 28 -92 103 -43 -4 63 -150 135 -44 -197
6852 -197 -29 49 93 -31 -5 29 150 26 69 -28 43 149 -166 -122 -1 75 -37 31 76 117 -67 -11 94 78 -187
6877 -187 -17 135 -67 32 211 86 -141 -67 68 31 -79 16 -65 119 -10 31 -99 -13 91 -86 -108 -44 10
6900 10 -19 -87 -54 -124 -94 61 -78 36 76 85 124 132 -28 13 -11 -23 -155 -20 -48 8 206 140 -12 -58 -56 -3 -22 -46
6928 -46 99 -148 -190 122 102 -188 125 86 0 -11 -162 -8 145 -113 66 -25 7 64 52 300 58 18 70 178
6952 178 -11 -26 -125 137 -9 154 17 -124 3 -186 -174 97 21 61 -40 -72 -10 -74 60 46 -66 41 172
$$ packed form
6776d0j0L2N8R9j13o4P2j37K1R5o2O3j15K7K61k00j00mO6N8J8j09j4N1k9J83j90
6803h3K37j83nQ6j8n6P5j18N7J09j47L1O5j05J4K4m0Q9o9r4K02M5k6q7o4k3n7
6830a41L3l6J79r9J44J03j24j77K33k46J56m7N0j20J95j46L9O7k13K85j79j53
6852a97J68P8M4j24K6L4J21j24M3r7P1J06l15M4J21P6j12O8M5M1j84N6J05j6k65
6877a87J70J52k02R9J79j25k27P4J35l7j10R5q1J84j29M1j30Q6J04j77k2O4N4
6900A0k9o8L3p0L0J55j39J14M0RL9Qj60M1k4j2j32J35k8N6J98o6j52m6KN3j9k4
6928d6J45k47m2L12k0k90L13l9q6j1j51J54J53k58J79r1L2N7j2K48k42m0N2J08
6952A78j89j5r9K62j46J63j37j41J27j89J2K71p6M0j01l2O2o4J34j4j12J07J31
$$ plain form
6975 172 60 15 -37 -114 29 126 -66 1 39 70 82 108 -73 11 -71 -123 -25 -160 -82 28 56 22 173 -45 -55 14
7001 14 144 -200 143 69 142 109 9 94 -11 22 66 -105 -93 62 35 -131 -168 75 67 -101 21 128 -40 139
7025 139 -162 -27 -31 51 -52 -210 21 98 -119 25 -20 40 -59 -46 -141 7 157 -161 -98 -24 33 53 31 -36 97
7050 97 -156 -104 -61 -49 -54 -11 -133 -51 -55 -123 -106 -58 59 108 0 13 -89 -65 70 -64 -9 -74 -72 106 -76 139 107
7077 107 120 -15 47 -22 12 48 43 -32 35 71 -125 75 35 79 -246 -39 -203 -60 70 75 10 -62 -24 -38 11 -74 18
7104 18 -98 79 -13 -28 156 71 10 122 -11 -86 52 129 59 156 -36 -65 44 -94 -38 70 121 141 41 -178
7128 -178 -93 84 113 0 -37 39 10 -34 14 -29 45 -137 97 -20 59 13 -143 98 47 31 -20 -27 -181 -111 90 -158
7154 -158 86 33 13 43 9 82 41 155 101 -17 109 99 96 -65 23 -53 -62 -137 123 -98 42 38 -17 -43 22 54 -2
$$ packed form
6975A72j12m5n2p7J43R7j92O7L8L1J2K6j81Q4q2n2R8j35P8J10K8l4J51k18j0O9
7001A4J30l44L43p4P3l3j00Q5j05L3M4j71J2J55k7j66l7K43qj68J22J07j68J79
7025A39l01J35mQ2j03j58K31P7k17J44m5O0r9J3r5J48J50l18O3P4N7K0k2o7J33
7050I7k53N2M3J2nM3j22Q2mo8J7M8J17M9j08J3j02K4J35j34N5o5KJ78j82K15l2
7077A07J3j35O2o9L4L6np5O7L6j96K00m0M4l25K07j64J43J30No5p2L8j4M9q5R2
7104A8j16J77r2j5J84q5o1J12j33p5J38P7p0R7j92k9J09j38N6J08N1K0j00k19
7128a78Q5J77K9j13l7P6k9m4M8m3P4j82K34j17P9m6j56K41n1j6n1pj54P0K01k48
7154a58K44n3k0L0l4P3m1J14n4j18J26j0lj61Q8p6rp5K60k21J40mn5k6O5L2n6
$$ plain form
7181 -2 -143 -72 67 -144 -91 -87 54 -34 117 -90 -109 -71 -24 -99 66 -31 1 95 45 165 46 147 38 38 -134 -221
7207 -221 -94 51 -115 -2 -22 -50 -9 -214 -11 -64 -5 -49 83 -19 -21 -68 150 42 175 -178 -67 -34 67
7230 67 73 19 66 -104 130 48 -98 -162 56 -28 24 19 -117 -9 -60 149 92 -6 46 41 -53 27 -33 -156 122 -25 70
7257 70 46 -21 65 46 -16 26 91 -24 91 -29 130 -95 -41 -32 -60 88 148 -131 50 -24 -50 69 -107 31 146
7282 146 23 -29 -95 -95 -28 3 -52 -12 -130 -146 -81 -125 15 -16 11 -74 99 66 49 -80 -29 -4 -43 34 74 -12 18 53
7310 53 15 56 -94 -103 53 62 71 -50 18 60 14 -98 -7 -38 -124 -55 -43 36 49 63 67 -146 -39 67 74 -6 70 181 -84
7339 -84 -84 -113 98 96 54 28 64 5 87 114 21 -46 -29 20 -102 -65 72 -64 6 -41 -188 -3 -88 30 -128 15 96
7366 96 -16 -18 -94 55 -150 -45 -115 117 67 273 38 33 -87 70 -112 -44 30 -112 105 138 170 33 -9 -123
$$ packed form
7181bj41P1J39k11N3MJ41q8J51k07j9L8M7p5J65r7L2R4n0J20j19J01j09%j72q7
7207b21J27J45j66J13k0k8M1k05K03n3N9m4J32j02km7K18j08J33l53J11L3J01
7230F7On4M7j70K34q2j46o4K18q4N2nj36J08n1K09n7r8N2nr4Q0o0j23K78j47R5
7257G0k4o7Q6j9o2M2O5j15J15j20J59k25N4Rk8J48O0k79J81p4k6J19j76J38J15
7282A46j23n2o6%O7L1n5M0j18j6O5m4J40l1K7q5J73l3j7j29N1K5l9P7M0q6L0L5
7310E3l8M1j50rJ56RRj21O8M2m6j12R1l1q6O9J2P9J3J4Mk13J07J06Pq0P6J11k65
7339h4%k9K11km2k6L6n9Q2K7r3o7J7M9j22L7J37j36P0m7j47J85q5J18j58J43Q1
7366I6j12kp6J49k05J05p0K32n0K06k35nj20J57j82O8P4j42K17L3L2j37m2j14
$$ plain form
7390 -123 -1 -80 -83 61 4 -77 -153 -80 70 -63 -10 -31 -153 68 153 -74 29 -58 3 63 -148 -139 -37 -27 -65 23
7416 23 -8 18 122 -35 -45 -113 -113 -61 -85 18 43 -139 -27 -57 -149 -108 143 65 70 -14 25 22 37 -42 31 -151 139 -4
7444 -4 -81 60 78 -103 42 -38 59 57 67 -33 -85 -45 -13 148 -57 -91 164 84 38 15 -28 -32 -8 43 44 30 1 115
7472 115 -16 78 90 75 -119 -19 -18 27 -41 -13 49 -49 -41 100 61 -151 -40 -51 -94 87 43 19 141 10 -16 80
7498 80 -130 116 149 68 -29 41 -5 132 -76 248 -8 -16 25 -49 -71 -156 143 -7 29 28 -9 -56 19 77 -120 -40 53
7525 53 -148 -129 -93 82 6 44 -67 89 -142 -38 -46 -4 -149 -42 40 -25 115 143 99 17 -73 74 -50 -81 -61
7550 -61 202 -208 26 -18 115 87 -165 -61 -82 -78 -136 26 -95 3 -54 -38 15 -10 198 -8 157 60 5 -30 -45
7575 -45 2 -136 -54 115 98 30 23 -41 -49 217 68 137 41 -71 -90 -47 128 156 -142 69 -141 -13 -160 -200 -35
$$ packed form
7390a23J22p9lJ44n7q1p6P3J50j33N3k1j22K21Q5k27J03q7O1O0k11RJ02J0l8Q8
7416B3l1K6J04j57j0o8%N2k4J03K5j82J12l0r2M1K51p8Nq4L9lJ5p9P3j82K90j43
7444dp7J41J8j81J45q0R7kJ0j00n2M0L2J61k05l4K55q0m6k3m3mK4N1Jj4k9J14
7472A15j31R4J2j5j94J00JM5o8K8O2r8QJ41l9k12J11j1m3J81m4k4J22j31k6R6
7498H0k10K46L3q1r7P0m6J37k08L24k56qM1p4k2q5K99j50L6jl7m7P5N8j97Q0R3
7525E3k01J9L6J75p6L8j11J56k31J04qM2j45J07Q2o5J40K8m4q2r0J47j24l1K0
7550f1K63m10K34m4J33k8k52J04k1Mn8J62j21R8n7J6N3k5K08k06J65r7n5l5j5
7575d5M7j38Q2J69j7o8po4qK66j49O9r6j12j9M3J75K8k98K11k10J28j47m0J65
$$ plain form
7600 -35 61 -31 32 115 6 -71 -140 -28 33 -13 -70 8 12 -5 43 -101 12 -7 20 -22 5 -81 -37 -40 -137 77 117 -47
7628 -47 -16 48 11 44 -72 89 59 98 -56 -88 -61 122 -142 40 -79 159 -28 -58 35 -81 47 120 76 47 60
7653 60 -98 10 -118 43 36 -233 -25 12 -19 60 9 -31 -50 43 26 -10 22 -92 65 101 141 42 -31 137 -73 70
7679 70 12 -42 40 -57 42 -122 -91 -60 -37 56 -55 -81 83 -23 74 -61 -69 118 69 33 -203 24 -51 -39 -21 -88 4
7706 4 73 50 11 132 131 93 -55 128 -146 -128 -12 8 68 -10 -104 106 -2 90 6 126 121 -124 -173 -89 -130 -22 -20
7733 -20 -90 28 162 -1 -14 55 -32 81 -21 -36 -71 126 23 14 63 -25 -191 -31 -88 24 74 -61 144 -105
7757 -105 -35 -144 24 -9 -32 69 -53 21 -1 67 -97 15 85 -46 -37 -66 98 117 -165 -69 8 -4 -67 16 -23 -106
7783 -106 63 -112 2 109 1 0 -34 82 -28 -81 -87 24 57 13 5 95 35 18 -63 -59 -19 -44 -81 -96 -29 -40 -23 -64
$$ packed form
7600c5R6r2O3Q3j09p7o9J12O1m6n7P8Mj7M8j44J13j9K7m2K7q6M4lr7K14M0j64
7628d7L1O4l7L3j16J61l0L9j54l2K7J83k64J82j19K38j87l0R3j16J28P3m4k9J3
7653F0j58J08j28J61pk69K08L7l1P9n1m0j9R3j7l6L2j14J57L6M0r9p3J68k10J43
7679G0n8n4Q2r7R9j64L1L1K3R3j11k6J64j06R7j35qJ87m9l6k36K27p5J2J8o7R2
7706DO9k3l9J21jl8j48J83k74J8J16K0O0p8r4K10j08R2q4J20nk45m9Q4m1J08K
7733b0p0J18J34j63j3O9q7J13j02j5l5J97j03rM9q8j66J60n7J12N0j35K05k49
7757a05P0j09J68l3k3J01j22P4k2O8j64J12P0j31Rk9J64J9k82R6P7j2o3Q3l9q3
7783a06J69j75J14J07j08jl4J16j10n3oJ11L3m4qR0o0j7q1MM0k5l7j5O7j1J7m1
$$ plain form
7811 -64 2 -14 -27 -54 -70 77 -10 -7 -143 -78 5 -10 7 30 -96 -88 -142 89 66 -17 67 21 -78 88 -135 -31 55 83
7839 83 17 -138 46 -30 115 -45 -22 -55 -36 17 -31 51 -53 -67 104 124 -41 191 -6 148 33 -22 -156 63
7863 63 92 32 -10 -73 83 16 66 -139 15 -107 -58 46 151 136 -49 -21 42 35 -43 41 -33 -112 21 13 -34 -134 -69
7890 -69 -18 -49 132 -4 -26 -17 -31 4 62 -206 -4 83 146 -41 0 46 -102 80 12 39 -45 -10 106 -49 295 56
7916 56 2 46 11 30 93 6 -151 -5 85 63 -101 11 12 114 -89 129 209 75 -36 -35 -38 -48 72 17 93 28 66
7943 66 18 -65 -18 -20 28 -122 5 -31 251 154 63 15 -71 -4 75 74 -18 -14 58 94 126 -107 56 9 29 -60 14 -84 5
7972 5 72 117 77 -63 43 276 114 -17 87 -31 77 -28 56 44 10 -15 6 -52 -35 -259 23 33 56 85 53
7997 53 -13 8 -81 -26 126 -16 -79 -89 73 -2 -12 109 150 26 -4 19 232 65 -144 -78 13 -7 -20 -14 158 -131
$$ packed form
7811f4O6j6j3k7j6J47q7Lj36O5Q3j5J7K3j26Qn4K31k3q3Q4m6r9J66k23J04Q6K8
7839H3o6j55J84p6J45j60K3l3J9N3m8Q2j04j4J71K0j65K32j97J54j15n5j34K19
7863F3K9o0m2o3J56o7N0k05J54j22M9J04J05j5j85K8O3pp8Q4p4p9J33qm7j00O5
7890f9N1l1J81j36k2Rj4L5N8k68K02Q7O3j87M1M6j48J82o8K7q4L5J16j55L44k39
7916E6n4M4l5J9O3q7j57J46R0k2j64J12JJ02k03K18Q0j34j11Jlj0J20n5P6o5L8
7943F6m8q3M7kM8j50J27l6K82r7r1m8q6O7P9jr2MP2L6L2k33J63m7K0q9P4r8Q9
7972EO7M5m0j40J06K33j62j31J04j18J08j05Q4j2l4k5K1n8J7k24K82J0K3K9l2
7997E3o6K1q9N5J52j42o3j0J62p5j0J21M1j24l0K3K13j67k09O6R1k0j3OJ72k89
$$ plain form
8023 -131 -133 96 -9 98 -17 174 8 29 -63 38 54 30 54 182 60 70 -81 131 156 -26 2 43 -35 102
8047 102 91 27 79 100 40 -27 -21 21 11 0 90 -41 29 -14 -1 82 29 44 -101 -189 36 74 28 -93 -126 25 -26 -49
8075 -49 -71 32 -29 -12 -13 -32 -55 123 -102 33 123 -30 3 46 17 68 81 -2 -103 -16 80 55 -20 -2 60 149 -3
8102 -3 -38 10 -65 255 -11 98 58 -7 -8 39 59 -4 -69 -27 -23 3 61 117 22 50 -22 153 64 -10 145 137 121 -154 86
8131 86 103 -21 2 17 -2 53 -88 25 38 -6 94 -131 227 -76 57 122 -46 150 56 -90 -7 87 -36 -49
8155 -49 -21 94 -2 -94 -45 -19 78 -172 -135 6 -63 50 13 139 -42 -37 -13 -75 -45 115 -75 -123 72 -102 105
8180 105 -41 -164 2 55 -27 -105 -22 -47 95 -122 73
$$ packed form
8023a31kK29j05J07j15J91j66K1r2J01J6k4K4J28j22J0j51K12K5j82K8M1p8J37
8047A02j1o4N2K1o0o7OM2j0j1R0j31P0m3J3Q3n3J5j45q8K25L8m6j21l3J51n1k3
8075d9k2J03o1J7jj9k3J78k25J35R0j53L3M3k9N1J3q3j01Q7R6k5p5J8O2Q9j52
8102cl5M8p5L20k66J09m0o5jM7K0o3o5M2MK6N8N6r5K8p2J75q9p4J55qj6k75K40
8131H6J7j24K3J5j9N5j41J13J3m4J00k25L58l03J33O5j68J96r4j46Q3R4j23j3
8155d9K8J15r6r2M9K6R7k50L7J41o9J13l7J26j81NK4o2L0J60j90m8J95j74K07
8180A05j46j23J66N3q2p8Q3k5J42k17J95
8191G3
$$ Imaginary data points
##PAGE= N=2
##DATA TABLE= (X++(I..I)), XYDATA
$$ plain form
0 0 0 0 0 0 0 0 0 0 0 0 0 0 0 0 0 0 0 0 0 0 0 -1 8 -8 8 -8 8 -8 9 -14 16 -16 17 -22 24 -25 30 -33 38 -41 46 -50 56
43 56 -62 69 -75 83 -92 102 -111 122 -134 149 -164 181 -202 225 -250 281 -320 363 -418 493 -590
64 -590 730 -939 1293 -2008 3990 -20030 -68218 -3107 49045 20142 -16152 7318 33275 23806
78 23806 14521 23888 21787 14795 18717 14259 -9437 -15584 5871 8853 -22692 -35408 -14204 -6869
92 -6869 -23595 -25676 -10035 -6815 -15227 -11714 -3986 -2773 8002 22746 13765 -2998 7839 31960
106 31960 30550 11462 7796 13097 8765 4472 5381 610 -8019 -9511 -8437 -13683 -15631 -6922 -7257
121 -7257 -19733 -17559 -2657 -4939 -18656 -8094 14537 7137 -13602 -1017 23449 17456 2262
134 2262 12676 24105 8588 -3146 12592 21902 3576 -10741 -4948 -33 -6165 -9174 -7313
$$ packed form
0@%%%%%%%%%%%%%%%%%%%%%jRj6J6j6J6j6J7k3L0l2L3l9M6m9N5o3P1p9Q7r6J06
43E6j18J31j44J58j75J94k13K33k56K83l13L45l83M27m75N31o01O83p81R11j083
64e90J320j669K232l301N998k4020m8188O5111N2152k8903l6294K3470K5957r469
78B3806r285R367k101o992L922m458k3696o147K1455K982l1545j2716K1204P335
92f869j6726k081J5641L220q412L513P728J213J0775J4744q981j6763J0837K4121
106C1960j410j9088l666N301m332m293R09m771q629j492J074n246j948Q709l35
121g257j2476K174J4902k282j3717J0562K2631p400k0739J2585K4466n993j5194
134B262J0414J1429j5517j1734J5738R310j8326j4317N793M915o132l009J861
$$ plain form
147 -7313 -12640 -16607 -9691 -6987 -12950 -9784 1034 -223 -9981 -3425 13314 11479 674 6710
161 6710 17658 11875 2780 8348 14205 6549 655 2513 -1072 -6656 -2523 1695 -5776 -14199 -10488
176 -10488 -3783 -6118 -7897 -4264 -4808 -8167 -3399 3671 1920 -1298 5090 10063 3642 2244 12360
191 12360 13809 2996 1516 10315 7280 -5642 -3765 7023 1654 -12044 -11699 -2261 -1901 -8823
205 -8823 -9300 -5350 -4713 -4845 -3343 -2736 -24 5089 6101 725 423 10631 14478 5240 124 6376
221 6376 9003 2095 -1476 1872 882 -5074 -5459 -3809 -6200 -6617 -3703 -4198 -8201 -7915 -1680 244
237 244 -2939 -2260 1474 2897 2917 4463 6618 5901 6213 7772 5618 2530 4601 6723 1617 -3788 -1868
254 -1868 457 -4714 -8534 -3997 -2144 -8110 -11309 -6572 -1794 -2736 -4561 -3057 -1576 1434 5644
$$ packed form
147g313n327l967O916K704n963L166J0818j257r758O556J6739j835j0805O036
161F710J0948n783r095N568N857p656n894J858l585n584M133M218p471q423L711
176a0488O705k335j779L633n44l359M768P070j751l218O388M973o421j398J0116
191A2360J449j0813j480Q799l035j2922J877J0788n369j3698L45R438L60o922
205h823m77L950O37j32J502O07K712N113J012n376l02J0208L847r238n116O252
221F376K627o908l571L348r90n956l85J650k391m17K914m95m003K86O235J924
237B44l183O79L734J423K0J546K155p17L12J559k154l088K071K122n106n405J920
254a868K325n171l820M537J853n966l199M737M778r42j825J504J481L010M210
$$ plain form
269 5644 5754 3204 4070 8312 10025 5979 3932 6274 5925 2524 908 -634 -3060 -4291 -2206 -3113
285 -3113 -8628 -9838 -4778 -3959 -7524 -6978 -2502 -1405 -3725 -2038 3071 5009 4261 3868 4559 6612
301 6612 8810 9105 6069 2534 3698 6172 3461 -1139 -2677 -2256 -3024 -5047 -5774 -7176 -9282 -7069
317 -7069 -3465 -4784 -7670 -6204 -1210 2104 1245 1032 2172 4320 7496 9298 7133 4926 5382 7234
333 7234 6781 3555 1622 553 -799 -2017 -3382 -4471 -5842 -6578 -6294 -6794 -7250 -5203 -4039 -4892 -4451
350 -4451 -852 2200 1544 575 3230 6375 7390 6883 4775 4373 6493 7914 5847 1266 -1089 515
366 515 1508 -794 -4475 -6661 -5917 -4576 -4725 -5798 -7437 -6826 -3445 -1548 -2094 -2377 -236 2402 3502
383 3502 4073 5116 5127 5292 6372 6381 5327 3726 2183 1903 1710 701 -1249 -3703 -4521 -3948 -3848 -4704
$$ packed form
269E644J10k550Q66M242J713m046k047K342l49l401j616j542k426j231K085r07
285c113n515j210N060Q19l565N46M476J097k320J687N109J938p48l93O91K053
301F612K198K95l036l535J164K474k711m600j538M21p68k023p27j402k106K213
317g069L604j319k886J466M994L314q59k13J140K148L176J802k165k207M56J852
333G234m53l226j933j069j352j218j365j089j371p36K84n00m56K047J164q53M41
350d451L599L052o56r69K655L145J015n07k108m02K120J421k067m581k355J604
366E15R93k302l681k186P44J341j49j073j639O11L381J897n46k83K141K638J100
383C502N71J043J1J65J080Rj054j601j543k80j93j009j950k454q18N73J00q56
$$ plain form
401 -4704 -5926 -5588 -4301 -4141 -3425 -1392 -394 -808 -499 2221 5078 4632 3170 3314 4902 6281 5362
418 5362 2297 1159 2248 3310 1436 -2345 -4257 -2567 -931 -2297 -5966 -6787 -3742 -2058 -2838 -3917
434 -3917 -3095 -978 562 1411 1661 1924 2954 4120 3927 3736 3343 3328 3926 2453 718 520 847 -356
452 -356 -2334 -2882 -2360 -2795 -3775 -3383 -3501 -3309 -2150 -846 -1001 -2218 -922 2907 3814 983 -357 3174
470 3174 6373 3879 -15 1343 4132 3264 32 -1642 -440 290 -1007 -2620 -3869 -3243 -1789 -1857
486 -1857 -3690 -3965 -1822 881 -222 -2349 -52 3686 3466 51 300 4623 5775 2204 6 1617
502 1617 3762 2468 -658 -1957 -873 -365 -1220 -3190 -4315 -3581 -1435 -1200 -3388 -4490 -955 1933
518 1933 297 -1988 -31 3721 3486 1215 2225 4417 3635 1754 1979 3254 1932 -840 -220 1164
$$ packed form
401d704j222L38J287J60P16K033R98m14L09K720K857m46j462J44J588J379r19
418E362l065j138J089J062j874l781j912J690J636j366l669q21L045J684p80j079
434c917Q22K117J540Q49K50K63J030J166j93j91l93j5N98j473j735j98L27j203
452c56j978n48N22m35r80L92j18J92J159J304j55j217J296L829R07k831j340L531
470C174L199k494l894J358K789q68l232j674J202P30j297j613j249O26J454o8
486a857j833k75K143K703j103k127K297L738k20l415K49M323J152l571k198J611
502A617K145j294l126j299J084N08q55j970j125P34K146K35k188j102L535K888
518A933j636k285J957L752k35k271J010K192p82j881K25J275j322k772O20J384
$$ plain form
534 1164 -1508 -3976 -2455 -884 -2921 -5488 -3857 -781 -1824 -3507 -2699 -356 1352 1451 857 891 1925
551 1925 4784 5832 2851 194 2295 6493 5144 -1374 -2532 1176 2566 -972 -4801 -4342 -1888
566 -1888 -1841 -3946 -4704 -3850 -2006 -1610 -1940 -1588 -433 1417 2633 1566 1385 3838 5542 3963 1363
583 1363 2626 5416 4089 -73 -959 1499 1877 -1967 -4116 -2521 -2257 -4176 -4270 -2860 -3305 -5082 -3636
600 -3636 -187 -323 -2181 -976 1617 2875 2715 2771 3098 2936 3743 5127 4029 1543 1038 2333 2269 -279
618 -279 -2066 -1418 -1779 -3168 -3408 -3063 -3738 -4536 -3930 -1941 -1587 -2149 -1955 -576 1230 1959 1770 1851 2793
637 2793 3629 4040 3596 3015 2707 2646 2631 1141 -32 -232 -238 -1824 -3207 -3029 -1877 -2527 -4867 -4701 -1491
656 -1491 -326 -2650 -4073 -947 2421 1719 34 364 2394 4334 4095 2627 1395 2410 4026 3349
$$ packed form
534A164k672k468J521J571k037k567J631L076j043j683Q08K343J708R9n94L4J034
551A925K859J048k981k657K101M198j349o518j158L708J390l538l829M59K454
566a888M7k105p58Q54J844L96l30L52J155J850J216j067j81K453J704j579k600
583A363J263K790j327m162q86K458L78l844k149J595K64j919r4J410m45j777J446
600c636L449j36j858J205K593J258j60N6L27j62Q07J384j098k486n05J295o4k548
618b79j787O48l61j389k40L45o75p98O06J989L54n62J94J379J806P29j89Q1R42
637B793Q36M11m44n81l08o1j5j490j173k00oj586j383J78J152o50k340J66L210
656a491J165k324j423L126L368p02j685L30K030J940k39j468j232J015J616o77
$$ plain form
672 3349 480 -514 109 721 -901 -2626 -2402 -2104 -2313 -2739 -2814 -2731 -2486 -1828 -1264 -1118 -590 880 1263
691 1263 699 1482 2316 2857 2340 1885 2371 2477 2013 1534 511 -15 -254 -408 -1062 -1782 -2270 -2163 -2140 -2019
711 -2019 -1829 -2142 -1845 -1099 -171 152 -407 93 1576 1895 1402 1466 1859 2201 2021 1560 1227 599 386 525
731 525 -95 -777 -1507 -1444 -1025 -1438 -1938 -2032 -1685 -830 -508 -837 -741 29 775 1123 623 996 1738 1610 1402
752 1402 1303 1350 1021 579 322 317 -13 -630 -1135 -1387 -1082 -1268 -1686 -1613 -1316 -933 -562 -680 -250 27 331 908
774 908 1181 1381 1262 1231 1761 1860 1206 828 600 410 170 -101 -222 -1299 -1731 -1281 -960 -1250 -1922 -1939 -1214
795 -1214 -333 -210 -478 -576 51 1336 1858 1223 969 1204 2349 2598 1581 869 499 551 1025 530 -805
814 -805 -1821 -1449 -585 -1219 -2368 -2294 -1784 -1453 -1247 -1269 -730 -283 35 439 874 1640 1828 1539 1563 1935 2376
$$ packed form
672C349k869r94O23O12j622j725K24K98k09m26p5Q3K45O58N64J46N28J470L83
691A263n64P83Q34N41n17m55M86J06m64m79j023n26k39j54o54p20m88J07K3J21
711b019J90l13K97P46R28L23n59N00J483L19m93O4L93L42j80m61l33o28k13J39
731E25o20o82p30O3M19m13n00r4L47Q55L22l29R6P70P46L48n00L73P42j28k08
752A402r9M7l29m42k57nl30o17n05k52L05j86m18P3K97L83L71j18M30K77L04N77
774I08K73K00j19l1N30R9o54l78k28j90k40k71j21j077m32M50L21k90o72j7P25
795a214Q81J23k68r8O27J285N22o35k54K35J145K49j017p12l70N2M74m95j335
814h05j016L72Q64o34j149P4N10L31K06k2N39M47L18M04M35P66J88k89K4L72M41
$$ plain form
835 2376 2292 1197 359 804 1191 412 -707 -1510 -1623 -1302 -1281 -1786 -2995 -2899 -1626 -874 -1055 -1701 -1424 -161
855 -161 1064 1554 981 764 1692 2823 2966 2261 1295 1497 2072 1693 978 -284 -868 -539 -617 -980 -2202
874 -2202 -2836 -2013 -1838 -2172 -1882 -1615 -1513 -1114 -577 629 919 631 1066 1659 2034 2695 2519 2073 1279 1511
894 1511 2612 1711 82 -827 -456 -92 -468 -1655 -2670 -2801 -1923 -824 -1931 -3208 -2619 -548 305
911 305 -281 -795 -70 1185 2184 2059 1126 1295 2402 2915 2017 1133 1089 1496 784 -312 -319 -465 -1179 -1480
931 -1480 -1574 -1820 -2234 -1920 -1485 -2129 -2087 -463 127 -553 -870 422 1856 1498 1055 1284 1638 1986 2120 1894
951 1894 985 218 922 1406 284 -1386 -1312 -420 -505 -1741 -2028 -1776 -1483 -1063 -1180 -1194 -1111 -448 6 28 409
972 409 1044 1188 1077 1286 1551 1497 1445 1218 497 533 936 788 -754 -1331 -37 179 -1362 -2152 -1246 -326
$$ packed form
835B376q4j095q38M45L87p79j119q03j13L21K1n05j209R6J273P52j81o46K77J263
855a61J225M90n73k17R28J131J43p05r66K02N75l79p15j262n84L29p8l63j222
874b202o34Q23J75l34K90K67J02L99N37J206K90k88M35N93L75O61j76m46p94K32
894A511J101r01j629r09L71L64l76j187j015j31Q78J099j107j277N89K071Q53
911C05n86n14P25J255R99j25r33J69J107N13q98q84m4M07p12j096pj46p14l01
931a480r4k46m14L14M35o44M2J624N90o80l17J292J434l58m43K29L54L48J34k26
951A894r09p67P04M84j122j670P4Q92q5j236k87K52K93M20j17j4Q3O63M54K2L81
972D09O35J44j11K09K65n4n2k27p21L6M03j48j542n77J294K16j541p90R06R20
$$ plain form
992 -326 -1473 -1930 -543 -54 -552 -438 356 809 162 723 1700 900 301 1465 1815 294 -401 938 1335
1011 1335 -268 -1297 -156 273 -945 -1412 -783 -667 -1064 -989 -561 -449 -994 -89 606 87 -176 403 1132
1030 1132 938 431 723 838 783 684 291 -210 -48 109 -64 -546 -886 -548 -903 -333 -553 -1179 -1216 -169
1050 -169 629 -214 -863 364 1483 785 19 841 1239 648 233 1138 1195 -392 -262 528 -106 -974 -698
1069 -698 -98 -992 -1809 -605 72 -1184 -1754 -133 629 19 -359 591 1086 347 746 1519 1294 315 740
1088 740 1476 979 146 108 296 -536 -372 79 -997 -1809 -1531 -396 -621 -1482 -1616 -1070 -339 231 197 -379
1108 -379 -145 1075 1925 1067 416 1277 1694 1287 1062 1202 510 -81 35 690 -419 -1320 -997 -734 -1470
1127 -1470 -1890 -1155 -897 -1709 -1621 -164 -153 -666 -340 528 721 752 1631 1847 510 523 2087 2316 1000 162
$$ packed form
992c26j147m57J387M89m98J14P94M53o47N61R77q00n99J164L50j521o95J339L97
1011A335j603j029J141M29j218m67O29J16l97P5M28J12n45R05O95n19k63N79P29
1030A132j94n07K92J15n5r9l93n01J62J57j73m82l40L38l55N70k20o26l7J047
1050a69P98q43o49J227J119o98p66Q22L98n91m15R05N7j587J30P90o34q68K76
1069f98O00q94q17J204O77j256n70J621P62o10l78R50M95p39L99P73k25r79M25
1088G40P36m97q33l8J88q32J64M51j076q12K78J135k25q61j34N46P31N70l4n76
1108c79K34J220Q50q58o51Q61M17m07k25J40o92n91J16O55j109r01L23K63p36
1127a470m20P35K58q12Q8J457J1n13L26Q68J93L1Q79K16j337J3J564K29j316q38
$$ plain form
1147 162 590 1044 315 -274 -794 -1567 -1315 -348 -589 -2071 -2551 -1197 -320 -921 -1181 -849 -321 273 790
1166 790 978 583 632 1530 1940 1392 1126 1523 1271 633 751 929 85 -826 -640 -395 -1082 -1480 -1243 -1540
1186 -1540 -2004 -1411 -517 -928 -1721 -811 239 460 202 729 688 948 1691 2054 1398 255 975 2103 1309
1205 1309 148 -4 161 -196 -457 -515 -985 -1822 -1344 -442 -1007 -1863 -1414 -407 -572 -526 -58 308 212 583
1225 583 1152 1283 964 887 1556 1089 802 1047 1018 326 -230 129 258 -593 -1339 -714 -938 -1078 -984 -890 -1038
1246 -1038 -1301 -407 205 -408 -546 290 879 795 747 892 846 828 1122 1418 481 229 427 522 -95 -592 -308
1267 -308 -414 -948 -713 -580 -939 -1196 -772 -155 -436 -736 -127 135 -110 105 653 636 402 713 964 525
1287 525 146 626 435 -84 -79 8 -130 -594 -593 -326 -669 -870 -583 -61 -647 -559 -7 207 -131 -178 550 451 185
$$ packed form
1147A62M28M54p29n89n20p73K52R67k41j482m80J354Q77o01k60L32N28N94N17
1166G90J88l95M9Q98M10n48k66L97k52o38J18J78q44r11J86K45o87l98K37k97
1186a540m64N93Q94m11p93R10J050K21k58N27m1K60P43L63o56j143P20J128p94
1205A309j161j52J65l57k61n8m70q37M78R02n65q56M49J007j65M6M68L66r6L71
1225E83N69J31l19p7O69m67k87K45k9o92n56L59J29q51p46O25k24j40R4R4j48
1246a038k63Q94O12o13j38Q36N89q4m8J45m6j8K94K96r37k52J98R5o17m97K84
1267c08j06n34K35J33l59k57M24O17k81l00O09K62k45K15N48j7k34L11K51m39
1287E25l79M80j91n19NQ7j38m64JK67l43k01K87N22n86Q8N52K14l38m7P28r9k66
$$ plain form
1310 185 500 802 348 313 449 550 15 -366 81 -58 -447 -551 -297 -472 -606 -748 -212 -285 -413 54 148
1331 148 -131 -70 331 671 259 218 755 708 605 520 453 189 346 220 140 -657 -728 -230 -308 -802 -1014 -820 -698
1354 -698 -439 -195 -152 -593 -297 598 601 315 392 704 1075 800 804 858 651 433 472 339 198 -224 -410 -450 -784
1377 -784 -693 -637 -893 -1160 -932 -728 -294 -389 -527 -64 297 692 617 478 623 943 1403 1334 666 330 716 837
1399 837 774 121 -622 -491 -219 -316 -922 -1485 -1189 -667 -738 -1096 -1015 -840 -413 -134 190 115 216 637 949 1005
1421 1005 977 1221 1055 895 524 819 782 284 -169 -222 -116 -301 -861 -1037 -1122 -1144 -796 -827 -1076 -1202 -926 22
1443 22 147 -223 -379 318 1047 1169 793 768 993 1088 1304 927 359 170 293 235 226 -521 -750 -978 -522 -857
1465 -857 -1146 -1124 -923 -926 -829 -520 -481 -427 -135 280 578 701 760 736 812 995 792 901 811 326 362 461 449 -110
$$ packed form
1310A85L15L02m54l5J36J01n35l81M47j39l89j04K54j75j34j42N36p3j28M67R4
1331A48k79O1M01L40m12m1N37m7j03q5o7k64J57j26q0p97p1M98p8m94k12J94J22
1354f98K59K44M3m41K96Q95Lk86P7L12L71k75MN4k07k18L9j33j41m22j86m0l34
1377g84R1N6k56k67K28K04M34r5j38M63L61L95p5j39J45L20M60o9o68l36L86J21
1399H37o3o53p43J31K72r7o06n63K96N22p1l58Q1J75M27K79L24p5J01M21L12N6
1421A005k8K44j66j60l71K95l7m98m53n3J06j85n60j76q5k2L48l1k49j26K76R48
1443B2J25l70j56O97P29J22l76k5K25R5K16l77n68j89J23n8rp47k29k28M56l35
1465h57k89K2K01lR7L09L9N4K92M15K98J23N9k4P6J83k03J09r0m85L6R9j2n59
$$ plain form
1489 -110 -550 -596 -342 -607 -982 -928 -1067 -915 -700 -366 -759 -713 -374 343 404 36 211 696 1201 887 817 595
1511 595 798 675 665 500 173 -256 -122 3 -279 -751 -722 -443 -758 -908 -769 -410 -441 -430 -81 -25 181 259
1533 259 99 566 533 570 723 439 575 323 533 454 63 -194 -111 -112 -232 -586 -560 -423 -431 -771 -355 -163 -342
1556 -342 -81 -45 124 -40 -53 541 695 242 123 522 636 300 146 397 178 71 -251 113 -238 -648 -564
1577 -564 -241 -187 -690 -525 -201 -262 -181 15 230 -43 176 479 423 268 160 449 558 240 129 70 2 -101
1599 -101 -82 -297 -479 -481 -464 -269 -263 -364 -391 -259 -153 -101 -49 295 210 190 344 485 575 611 266 115 384 328 165
1624 165 8 -90 -167 -292 -272 -401 -791 -678 -429 -406 -584 -941 -394 158 142 75 65 155 605 730 747 587 318
1647 318 542 1000 538 289 193 191 290 -217 -381 -541 -653 -658 -548 -766 -759 -761 -499 -462 -301 -175 21 46 273 425
$$ packed form
1489a10m40m6K54k65l75N4j39J52K15L34l93M6L39P17O1l68J75M85N05l14p0k22
1511E95K03j23j0j65l27m29J34J25k82m72K9K79l15j50J39L59l1J1L49N6K06P8
1533B59j60M67l3L7J53k84J36k52K10p9l91k57Q3jj20l54K6J37ql40M16J92j79
1556c42K61L6J69j64j3N94J54m53j19L99J14l36j54K51k19j07l22L64l51m10Q4
1577e64L23N4n03J65L24o1Q1J96K15k73K19L03n6j55j08K89J09l18j11n9o8j03
1599a01J9k15j82kJ7J95Oj01k7J32J06N2N2L44q5k0J54J41R0L6l45j51K69n6j63
1624A65j57r8p7j25K0j29l90J13K49K3j78l57N47N52j6o7j0R0M50J25J7j60k69
1647C18K24M58m62k49r6kR9n07j64j60j12nJ10k18PkK62L7J61J26J96K5K27J52
$$ plain form
1671 425 590 789 829 565 717 815 899 594 186 219 354 250 -256 -762 -738 -517 -534 -646 -1075 -1225 -659 -309
1693 -309 -160 -649 -426 82 290 404 371 527 758 850 979 778 693 646 642 551 203 -131 -282 -76 -430 -612
1715 -612 -784 -762 -744 -840 -810 -782 -777 -485 -365 -336 17 250 318 394 491 760 962 885 636 503 722 668 567 77
1739 77 -120 -142 -254 -147 -783 -725 -746 -613 -623 -650 -828 -682 -541 -178 -138 -224 22 528 537 707 653 603 682 680 732
1764 732 763 432 335 289 102 -106 -197 -396 -564 -705 -554 -679 -773 -617 -886 -520 -209 -264 -192 -107 155 307 463
1787 463 362 376 512 699 649 525 512 205 247 192 114 -157 -195 -268 -426 -320 -572 -522 -550 -613 -512 -280 -163 -254
1811 -254 -185 197 -53 171 288 489 353 241 420 387 181 266 219 72 -80 45 -58 -215 -328 -378 -109 -344
1833 -344 -274 -330 -121 -24 -92 -153 -72 28 89 143 365 245 229 215 275 371 315 58 96 76 -18 -175 -126 -124 -207 -100 -209
$$ packed form
1671D25J65J99M0k64J52R8Q4l05m08L3J35j04n06n06K4K21j7j12m29j50N66L50
1693c09J49m89K23N08K08J14l3J56K31R2J29k01q5m7mr1l48l34j51K06l54j82
1715f12j72K2J8r6L0K8NK92J20K9L53K33O8P6R7K69K02p7k49j33K19n4j01m90
1739G7j97k2j12J07o36N8k1J33j0k7j78J46J41L63M0q6K46N06RJ70n4n0P9kN2
1764G32L1l31r7m6j87k08r1j99j68j41J51j25r4J56k69L66L11n5P2Q5K62J52J56
1787D63j01J4J36J87n0j24j3l07M2n5p8k71l8p3j58J06k52N0k8o3J01K32J17r1
1811b54O9L82k50K24J17K01j36j12J79l3k06Q5m7j47j52J25j03j57j13n0K69k35
1833c44P0n6K09R7o8o1Q1J00O1N4K22j20j6j4O0R6n6k57L8k0r4j57M9Kq3J07j09
$$ plain form
1860 -209 -127 -131 -2 -84 -48 15 89 136 186 166 24 394 275 -10 -14 128 64 119 40 -16 -232 -71 -213 -160 -354 -324
1886 -324 -269 -24 -56 -433 -197 163 345 364 119 88 393 350 406 375 63 108 219 148 216 -69 -253 -129 -120 -298
1910 -298 -318 -395 -414 -539 -190 -3 -70 -290 -232 -36 114 346 216 171 258 506 611 686 429 168 269 450 365
1933 365 -76 -306 -121 24 -246 -569 -736 -671 -420 -400 -318 -478 -357 -185 72 63 -15 273 375 564 371 483
1955 483 545 549 487 406 514 260 41 -83 -5 -227 -447 -434 -686 -546 -585 -607 -560 -573 -719 -457 -45 -17 -83 54
1979 54 262 508 618 645 335 502 693 628 565 349 26 203 339 22 -322 -706 -193 -426 -419 -675 -555 -791
2001 -791 -441 -268 -414 -225 -130 26 194 289 394 507 498 609 410 632 663 201 227 273 263 64 -145 -113 -311
2024 -311 -218 -231 -454 -578 -683 -645 -299 -350 -717 -271 -202 189 309 105 141 393 456 583 448 287 422 482 426
$$ packed form
1860b09Q2mJ29q2L6O3P4M7N0k0j42L70j19k85mJ42o4N5p9n6k16J61j42N3j94L0
1886c24N5K45l2l77K36L60J82J9k45l1L05m3N6l1l12M5J11p1O8k85j84J24Rj78
1910b98k0p7j9j25L49J87o7k20N8J96J50K32j30m5Q7K48J05P5k57k61J01J81q5
1933C65m41k30J85J45k70l23j67O5K51K0Q2j60J21J72K57rp8K88J02J89j93J12
1955D83O2Mo2q1J08k54k19j24P8k22k20J3k52J40l9k2M7j3j46K62M12K8o6J37
1979E4K08K46J10K7l10J67J91o5o3k16l23J77J36l17l44l84N13k33Pk56J20k36
2001g91L50J73j46J89R5J56J68R5J05J13rJ11j99K22L1m62K6M6j0j99k09L2j98
2024c11R3j3k23j24j05L8L46n1l67M46O9L91J20k04L6K52O3J27j35j61J35O0n6
$$ plain form
2047 426 350 169 39 -6 -220 -353 -423 -460 -327 -364 -548 -482 -409 -346 -198 -154 5 -118 -16 70 333 232 342
2070 342 481 430 256 307 459 423 91 66 182 -8 -160 -331 -3 -383 -340 -192 -288 -343 -212 -174 -73 -232 -178
2093 -178 -50 -128 -56 271 247 190 272 333 364 247 210 238 78 116 129 81 -44 -112 -103 -6 -206 -332 -52 -202 -219 -170
2119 -170 -192 -97 25 46 7 -85 -20 231 222 -70 -29 3 -39 -125 76 138 8 142 29 32 -216 -233 158 -33 -125 -130
2145 -130 78 -34 52 115 39 54 -33 125 147 -37 0 103 -120 -66 -126 28 -266 -241 -94 34 11 -16 -278 -62
2169 -62 -186 -31 176 -33 -1 226 203 163 82 194 240 200 351 112 -153 -195 -133 41 37 -416 -501 -44 -175 -250
2193 -250 -216 -347 -316 -72 36 -4 -102 141 238 236 204 256 389 229 280 430 354 167 20 112 42 -170 21 -308
2217 -308 -407 -442 -316 -287 -535 -417 -265 -183 -100 117 -236 -25 134 338 307 125 106 498 351 420 377 177 135
$$ packed form
2047D26p6j81j30m5k14j33p0l7J33l7j84O6P3O3J48M4J59j23J02Q6K63j01J10
2070C42J39n1j74N1J52l6l32k5J16j90j52j71L28l80M3J48r6n5J31L8J01j59N4
2093a78J28p8P2L27k4n7Q2O1L1j17l7K8j60L8J3m8j25o8RR7k00j26K80j50j7M9
2119a70k2R5J22K1l9r2O5K51rk92M1L2m2q6K01O2j30J34j13Lk48j7L91j91r2n
2145a30K08j12Q6O3p6J5q7J58K2j84L7J03k23N4o0J54k94K5J47J28k3k7k62K16
2169f2j24J55K07k09L2K27k3m0q1J12M6m0J51k39k65m2O2J74mm53q5M57j31p5
2193b50L4j31L1K44J08m0r8K43R7kl2N2J33j60N1J50p6j87j47R2p0k12J91l29
2217c08r9l5J26K9k48J18J52Q2Q3K17l53K11J59K04l1j82j9L92j47O9m3k00m2
$$ plain form
2240 135 246 397 130 -315 -41 -99 -263 -309 -465 -315 -583 -472 -310 -177 -430 -304 -79 68 57 119 301
2261 301 264 142 507 519 309 292 229 364 360 49 101 -7 -61 -40 -274 -397 -550 -392 -263 -356 -543 -222 -318 -228
2285 -228 -129 -32 -50 -65 155 343 407 188 347 317 538 438 411 297 154 226 279 -70 -322 -151 -302 -357 -319 -341
2309 -341 -231 -411 -248 -86 -167 -290 -30 -38 -17 185 285 282 228 243 374 385 382 137 198 231 245 99 -33 -165 -127
2334 -127 -183 -246 -414 -502 -249 -188 -268 -245 -146 -180 -212 54 12 15 137 183 364 291 331 280 234 182 301 252 133 -69
2360 -69 125 222 -352 -88 -47 -97 -203 -282 -180 -275 -329 13 -71 -352 -91 29 53 190 -2 132 370 -39 162
2383 162 172 133 145 155 5 175 73 34 113 -201 -49 -112 -263 -117 -169 -103 -259 -256 8 -53 154 124 -6 -118
2407 -118 -58 93 77 56 -61 48 -46 -22 165 269 181 -38 84 62 14 -68 -199 72 16 28 160 -118 -67 -110
$$ packed form
2240A35J11J51k67m45K74n8j64m6j56J50k68J11J62J33k53J26K25J47j1O2J82
2261C01l7j22L65J2k10j7o3J35ml11N2j08n4K1k34j23j53J58J29r3j87L21r6R0
2285b28R9R7j8j5K20J88O4k19J59l0K21j00k7j14j43P2N3l49k52J71j51n5L8k2
2309c41J10j80J63J62q1j23K60qK1K02J00ln4J5J31J1lk45O1L3J4j46j32j32L8
2334a27n6o3j68q8K53O1q0K3R9l4l2K66m2LJ22M6J81p3M0n1m6n2J19m9j19k02
2360f9J94R7n74K64M1n0j06p9J02r5n4L42q4k81K61J20K4J37j92J34K38m09K01
2383A62J0l9J2J0j50J70j02l9P9l14J52o3j51J46n2O6j56LK64o1K07l0j30j12
2407a18O0J51j6k1j17J09r4K4J87J04q8k19J22k2m8q2j31K71n6J2J32k78N1m3
$$ plain form
2431 -110 144 -135 -94 78 39 86 3 -232 -34 -164 -93 -6 -175 -210 -68 -6 16 -34 56 -32 -118 -105 159 105 -39
2456 -39 78 180 37 157 266 139 -11 116 122 -188 -24 -168 -244 -157 -263 -179 -237 -73 -107 -149 -149 -130 -207 58
2480 58 91 76 -20 55 382 334 108 278 292 177 318 188 81 -29 77 77 -34 -117 -224 -285 -266 -256 -290 -235 -108
2505 -108 -313 -120 -25 27 12 -38 150 173 223 252 193 292 260 272 320 120 -90 -68 5 -60 -167 -242 -300 -204 -313 -243
2531 -243 -204 -274 -254 -34 -30 -91 -96 23 155 155 242 346 190 238 166 317 103 39 172 242 -64 -38 80 -237 -104
2556 -104 -121 -309 -243 -253 -329 -432 -225 -203 -241 -367 -202 19 -100 213 53 303 188 352 377 241 247 130 294
2579 294 351 159 65 -15 161 -211 -46 -277 -323 -273 -205 -207 -285 -276 -128 -367 -114 -212 -110 33 113 226 136 137 336
2604 336 248 224 130 152 19 236 130 133 49 -42 -141 -265 0 -365 -103 -239 -242 -266 -101 -166 -124 -268 -19 107 117
$$ packed form
2431a10K54k79M1J72l9M7q3k35J98j30P1Q7j69l5J42O2K2n0R0q8q6J3K64n4j44
2456c9J17J02j43J20J09j27j50J27Ol10J64j44p6Q7j06Q4n8J64l4m2%J9p7K65
2480E8L3j5r6P5L27m8k26J70J4j15J41j30j07j10J06%j11q3j07o1J9J0l4N5J27
2505a08k05J93R5N2j5n0J88K3N0K9n9R9l2J2M8k00k10K2P3o5j07p5n8R6j09P0
2531b43L9p0K0K20Mo1nJ19J32%Q7J04j56M8p2J51k14o4J33P0l06K6J18l17J33
2556a04j7j88O6j0p6j03K07K2l8j26J65K21j19L13j60K50j15J64K5j36Oj17J64
2579B94N7j92r4q0J76l72J65k31m6N0O8kp8RJ48k39K53r8J02J43Q0J13r0JJ99
2604C36q8k4r4K2j33K17j06Lq4r1r9j24K65l65K62j36lk4J65o5M2j44K49J26J0
$$ plain form
2629 117 -204 193 60 214 196 381 213 245 154 217 80 237 110 60 77 -106 -80 -202 -60 -93 51 -86 -137
2652 -137 -55 -172 5 28 -86 -48 39 50 182 -9 -20 198 7 126 -18 78 72 101 107 52 -91 81 33 135 83
2677 83 7 -31 -83 -146 3 -104 75 -16 -139 95 -24 -74 57 -27 -3 -80 -10 -220 13 -72 28 182 -59 -26
2701 -26 72 123 74 159 -11 98 111 145 35 -117 3 44 -173 103 -17 -86 -225 -6 -38 63 -251 -4 -20 63
2725 63 -30 -170 26 -135 -18 75 71 -130 55 205 315 84 67 290 52 154 157 149 -28 -77 -93 -63 52 -154
2749 -154 -56 9 -197 -143 -70 45 -147 -135 107 -46 -149 100 75 248 123 236 86 286 166 321 313 148 25
2772 25 -22 -9 22 -88 -55 -107 -132 -163 -245 -351 -188 -47 -142 -112 -107 10 -95 -4 265 56 214 170 301 202 201 207 378
2799 378 336 219 109 86 -108 -184 -66 -236 -114 -166 -119 -299 -181 -282 -103 -287 -178 -96 15 -77 22 118 30
$$ packed form
2629A17l21L97j33J54j8J85j68L2r1O3j37J57j27n0J7j83K6j22J42l3J44j37n1
2652a37Q2j17J77K3j14L8Q7J1J32j91j1K18j91J19j44R6oK9On5j43J72m8J02n2
2677H3p6l8n2o3J49j07J79r1j23K34j19n0J31q4K4p7P0k10K33q5J00J54k41L3
2701b6R8N1m9Q5j70J09J3L4j10j52J20M1k17K76j20o9j39K19l2J01l14K47j6Q3
2725F3r3j40J96j61J17R3mk01J85J50J10k31j7K23k38J02Lqj77m9j6L0J15k06
2749a54R8O5k06N4P3J15j92J2K42j53j03K49k5J73j25J13j50K00j20J55qj65j23
2772B5m7J3L1j10L3n2k5l1q2j06J63J41r5L0NJ17j05R1K69k09J58m4J31r9jOJ71
2799C78m2j17j10k3j94p6J18j70J22n2M7j80J18j01J79j84J09Q2J11r2R9R6q8
$$ plain form
2822 30 245 127 319 358 232 31 281 162 -90 15 46 95 -53 -217 -58 -86 -75 -131 -339 -372 -294 -281 -41
2845 -41 -69 -135 -96 176 198 16 267 128 210 303 154 271 329 126 115 137 -6 150 -60 -174 -4 -53 -106 -217
2869 -217 -180 -17 -290 -182 -111 -225 -68 -8 -127 -16 26 126 183 159 370 213 128 69 144 198 119 37 26 -67 95
2894 95 -59 -32 -68 -295 -107 -377 -45 -19 49 -81 -78 -19 -72 -212 21 88 126 43 162 203 237 -26 205 183 88
2919 88 88 -31 34 -161 49 155 -95 -66 -78 233 -73 -170 -92 -94 56 149 36 -1 -58 -29 21 47 2 -29 68 36 -79
2946 -79 -192 -94 218 16 -58 80 71 1 119 -30 -66 129 -21 -13 -104 -148 -206 6 -142 -29 -45 -39 42 176 13
2971 13 -188 -69 -111 22 -46 -111 -10 36 205 5 -22 -122 84 66 -30 90 204 123 61 -32 129 17 79 -108
2995 -108 73 -180 -121 -6 90 -100 -139 44 -7 -216 -178 -50 -31 -205 -40 25 172 127 134 2 87 151 143 93 94 138
$$ packed form
2822C0K15j18J92L9j26k01K50j19k52J05L1M9j48j64J59k8J1n6k08l3P8J3K40
2845d1k8o6L9K72K2j82K51j39Q2R3j49J17N8k03j1K2j43J56k10j14J70m9n3j11
2869b17L7J63k73J08P1j14J57O0j19J11M2J00N7k4K11j57q5n9P5N4p9q2j1r3J62
2894I5j54K7l6k27J88k70L32K6O8j30LN9n3j40K33O7L8q3J19M1L4k63K31k2r5
2919H8%j19O5j95K10J06k50K9j2L11l06r7P8kJ50R3j13l7n7K9N0K6m5l1R7l2j15
2946g9j13R8L12k02p4J38rp0J18j49l6J95j50Qr1m4n8K12j48J13j6OQ1J34j63
2971A3k01J19m2J33o8o5J01M6J69k00k7j00K06j8r6J20J14q1o2r3J61j12O2j87
2995a08J81k53N9J15R6j90l9J83n1k09L8J28J9j74J65O5J47m5Pj32Q5O4qn0JM4
$$ plain form
3021 138 -39 146 149 122 -29 -253 51 -77 -192 -441 -244 -251 -183 -126 -121 -88 -16 -63 88 -78 -49 155 44 160
3045 160 113 189 316 81 96 57 169 214 109 40 -197 40 -65 -126 4 -254 -197 -142 -133 -179 -174 -179 -9 29 -44 115
3071 115 122 108 161 121 139 146 183 158 210 87 -28 94 44 69 -21 30 -193 -334 -250 -232 -174 -194 -72 -193 -98 -285 -130
3098 -130 -146 -76 -91 199 -95 -17 131 237 262 -73 201 64 71 27 231 26 -105 -128 -12 -140 -271 -96 -120
3121 -120 -152 -198 -198 -183 -83 -162 2 -134 47 -99 119 147 113 130 310 30 178 100 -23 83 133 78 -95 126
3145 126 -187 -81 -42 -176 -100 -240 -150 -181 -200 -28 -10 -80 71 99 54 12 -35 142 21 311 202 151 48 149
3169 149 69 -113 -8 -74 43 -182 27 69 -84 -129 -82 -95 -202 -116 -84 73 -135 -162 9 -59 67 180 -21
3192 -21 -33 90 135 85 -20 123 47 32 -163 -92 -68 -142 -53 -104 -119 -45 -2 -67 -234 -132 -18 18 16 -49 156 -42
$$ packed form
3021A38j77J85Lk7j51k24L04j28j15k49J97pO8N7NL3P2m7J51j66K9K04j11J16
3045A60m7P6J27k35J5l9J12M5j05o9k37K37j05o1J30k58N7N5Rm6NnJ70L8p3J59
3071A15Pj4N3m0J8PL7k5N2j23j15J22n0K5r0N1k23j41Q4J8N8k0J22j21R5j87J55
3098a30j6P0j5K90k94P8J48J06K5l35K74j37Pm4K04k05j31k3J16j28j31J75k4
3121a20l2m6%J5J00p9J64j36J81j46K18K8l4J7J80k80J48p8j23J06N0n5j73K21
3145A26l13J06L9j34P6j40R0l1j9J72J8p0J51K8m5m2m7J77j21K90j09n1j03J01
3169A49q0j82J05o6J17k25K09M2j53m5M7j3j07Q6L2J57k08k7J71o8J26J13k01
3192b1j2J23M5n0j05J43p6j5j95P1K4p4Q9n1j5P4M3o5j67J02J14L6ko5K05j98
$$ plain form
3218 -42 -61 102 -230 54 40 100 27 12 -249 36 89 -170 -72 -46 33 35 49 -111 -71 -141 -11 8 114 -153 77
3243 77 20 -69 -152 49 -45 -256 -162 71 -91 -35 -46 -236 40 12 -113 -6 -25 6 -105 132 56 -96 146 -58
3267 -58 77 117 22 -112 44 81 8 46 -99 1 -131 -59 -115 -86 6 -30 -154 -28 -218 -164 -39 -173 -45 -131
3291 -131 60 72 -3 -30 165 82 204 123 73 -6 174 285 65 -118 25 65 -42 -196 -116 53 -53 -64 -214
3314 -214 -68 -17 -156 -35 -68 -54 -59 -8 169 2 122 100 33 202 172 28 162 111 65 59 71 35 50 -87 -210
3339 -210 -95 -153 -33 -201 -55 -235 -286 -83 -220 -115 -13 -63 50 -55 35 165 251 309 197 238 213 211 82
3362 82 290 -34 158 -6 -65 -72 -132 -202 -140 -233 -253 -214 -174 -159 -74 48 24 -145 -34 158 -28 35 67 168 179 85
3388 85 54 -79 55 104 128 213 -72 -34 -151 27 -149 51 -165 -90 -88 -229 -179 -111 -107 -163 -73 -13 27 81 43 195
$$ packed form
3218d2j9J63l32K84j4O0p3j5k61K85N3k59R8K6P9KJ4j60M0p0J30J9J06k67K30
3243G7n7q9q3K01r4k11R4K33j62N6j1j90K76k8j25J07j9L1j11K37p6j52K42k04
3267e8J35M0r5j34J56L7p3L8j45J00j32P2n6K9R2l6j24J26j90N4J25j34J28q6
3291a31J91J2p5k7J95q3J22q1n0p9J80J11k20j83J43M0j07j54Q0J69j06j1j50
3314b14J46N1j39J21l3J4nN1J77j67J20k2o7J69l0j44J34n1m6oJ2l6J5j37j23
3339b10J15n8J20j68J46j80n1K03j37J05J02n0J13j05R0J30Q6N8j12M1k5kj29
3362H2K08l24J92j64n9po0p0O2r3k0L9M0J5Q5J22k4j69J11J92j86O3L2J01J1r4
3388H5l1j33J34M9K4Q5k85L8j17J78j76K00k16P5Kj41N0O8Mn6R0O0M0N4l8J52
$$ plain form
3414 195 256 207 150 118 61 61 42 288 192 97 -33 -31 30 -13 -211 -48 -76 -309 -42 -16 -19 -138 -68 -93 65 -153 88
3441 88 138 -154 306 124 191 -32 64 160 110 90 143 121 70 62 -15 17 -118 -211 -15 48 -203 -118 -158 -53 -131 -17
3467 -17 -61 14 138 -145 -71 75 19 8 140 59 118 33 21 17 125 72 64 107 -100 56 -99 78 -46 -141 -61 99
3493 99 20 -152 -86 21 40 -135 -23 -54 7 6 66 39 -81 10 -81 3 15 54 173 -22 112 26 -48 192 -52 -29
3519 -29 48 -36 82 -43 -12 189 43 7 -123 -140 -183 -25 -167 39 87 -54 -154 49 72 -43 43 89 -15 -98
3543 -98 -68 88 119 10 26 92 -18 72 -39 42 132 53 -54 27 -167 -191 -8 -37 -51 -89 -60 -137 14 -235 -52
3568 -52 -41 -86 -3 5 -76 -31 80 118 78 95 217 -41 27 121 -26 113 37 -103 79 -206 -181 -27 -69 -145 -86 -211
3594 -211 17 -23 -22 -167 -113 38 -3 85 25 -67 103 5 120 201 245 252 175 115 1 5 74 157 -68 71 -91 -126 -104
$$ packed form
3414A95O1m9n7l2n7%j9K46r6r5j30KO1m3j98J63k8k33K67K6lj19P0k5J58k18K41
3441H8N0k92M60j82O7k23R6R6n0k0N3k2n1qp7L2j35r3J96O3k51Q5m0J05p8J14
3467a7m4P5J24k83P4J46n6j1J32q1N9q5j2mJ08n3qM3k07J56j55J77j24r5Q0J60
3493I9p9j72O6J07J9j75J12l1O1jO0k7j20R1r1Q4J2L9J19j95J34q6p4K40k44K3
3519b9P7q4J18j25L1K01j46l6j30j7m3J58j42K06M8j41j00K03K3j15Q6M6j04q3
3543i8L0J56L1j09J6O6j10R0j11Q1R0p9j07Q1j94k4J83k9j4l8K9p7J51k49J83
3568e2J1m5Q3Qq1M5J11L8m0J7J22k58O8R4j47J39p6j40J82k85K5J54m2p6N9j25
3594b11K28m0Jj45N4J51m1Q8o0r2J70r8J15Q1M4Pp7o0j14MO9Q3k25J39j62l5K2
$$ plain form
3621 -104 -86 -67 -117 -62 -69 -30 -122 -83 3 -219 136 107 25 -52 14 116 90 161 183 171 179 141 162 -75 54 16 -45 -60
3649 -60 -77 -5 -255 -260 -93 -161 -49 -146 -29 -115 -100 -89 12 226 -11 254 0 145 237 69 245 211 123 123 96
3674 96 -59 4 -116 -160 62 -76 -83 -63 -140 -44 -227 -148 -6 -16 -25 -213 84 60 32 69 26 153 50 177 140 18
3700 18 267 32 51 -61 -125 79 40 21 60 -175 -143 -353 -87 -128 -221 -116 -102 -30 -65 -193 -55 -99 97 95 70
3725 70 123 182 3 96 135 57 80 -113 210 17 -196 -99 -133 -104 -30 -58 -189 -34 -52 -177 -164 -25 -1 -65 -94 -55
3751 -55 141 82 -9 28 120 -63 66 -8 -8 186 -26 50 37 58 107 24 35 33 27 -147 -126 36 88 -53 36 -53 25 16
3779 16 35 53 16 22 110 -67 50 -34 -127 87 48 54 -106 73 139 -78 -152 59 89 17 -42 40 -35 -110 -3 109 30
3806 30 -6 -93 13 -111 -84 -125 -28 14 31 90 60 -114 11 -50 48 -100 69 -51 -42 14 -43 141 131 -32 -74 4
$$ packed form
3621a04J8J9n0N5pL9r2L9Q6k22L55k9q2p7O6J02k6P1K2j2Ql8K1k37J29l8o1j5
3649f0j7P2k50nJ67o8J12r7J17q6J5J1J01K14k37K65k54J45R2j68J76l4q8%k7
3674I6j55O3j20m4K22j38pK0p7R6j83P9J42j0rj88K97k4k8L7m3J27j03J27l7j22
3700A8K49k35J9j12o4K04l9j9L9k35L2k10K66m1r3J05J4P2l5j28J38m4J96kk5
3725G0N3N9j79R3L9p8K3j93L23j93k13R7l4K9P4k8j31J55j8j25J3J39K4o4k9L9
3751e5J96n9r1L7R2j83J29p4%J94k12P6j3K1M9q3J1koj74K1J62N2j41Q9q9P8r
3779A6J9J8l7OQ8j77J17q4r3K14l9Oj60J79O6k17p4K11L0p2n9Q2p5p5J07J12p9
3806C0l6q7J06j24K7m1R7M2J7N9l0j74J25o1R8j48J69j20RN6n7J84j0j63m2P8
$$ plain form
3832 4 189 42 162 132 -44 -45 -207 -12 59 9 -180 64 16 -102 -1 -35 -48 -131 75 -71 41 162 -34 -110
3856 -110 -77 -73 28 17 55 46 152 20 184 33 -51 -66 -65 -56 -8 47 -141 -61 -55 178 -295 -173 -124 -218 -170 -79 -45 -152
3884 -152 -89 252 -141 108 169 139 88 176 164 247 61 35 76 4 165 -1 -120 -260 -239 -115 13 93 -61 -31
3908 -31 -151 -166 21 158 56 150 103 -8 123 192 93 204 127 63 128 96 -116 31 -79 -48 -44 -86 -208 -103 -129
3933 -129 -131 -123 -128 -54 -196 -63 -177 -74 167 53 139 45 32 34 125 71 328 189 177 9 -6 -13 215 -22 -28 -53 -94
3960 -94 84 -76 -30 -26 -122 -88 3 108 -4 -153 -56 107 -87 15 36 38 123 155 271 -70 88 95 -17 -6 -9 132
3986 132 136 -172 72 -97 -57 -145 -32 -30 -66 -271 -262 93 -82 9 45 7 -54 95 52 19 36 184 -43 55 75 125
4012 125 141 153 22 48 -164 7 -107 -75 -43 -58 -218 1 90 -29 -181 -177 -81 -89 74 47 -136 -17 134 169 16
$$ packed form
3832DJ85j47J20l0j76jj62J95P1n0j89K44m8j18J01l4j3q3K06j46J12J21j96p6
3856a10L3MJ01j1L8rJ06j32J64j51q4j5JRM8N5j88Q0OK33m73J22M9r4M8R1L4j07
3884a52O3L41l93K49O1l0n1Q8j2Q3j86k6M1p2J61j66j19j40K1J24J28Q0j54L0
3908c1j20j5J87J37j02R4m7j11J31O9r9J11p7o4O5l2k12J47j10L1Mm2j22J05k6
3933a29kQnP4j42J33j14J03K41j14Q6r4j3KR1n4K57j39j2j68j5pK28k37ok5m1
3960i4J78j60M6Mr6L4R1J05j12j49R7J63j94J02K1KQ5L2J16l41J58Pj12J1lJ41
3986A32Ml08K44j69M0q8J13Kl6k05RL55j75R1L6l8o1J49m3l3J7J48k27R8K0N0
4012A25J6J2j31K6k12J71j14L2L2j5j60K19Q9j19j52MR6qJ63k7j83J19J51L5j53
$$ plain form
4037 16 113 49 -108 -29 13 -17 72 -111 -162 -55 62 -39 166 -28 78 -11 134 -104 10 63 -46 -26 -90 29
4061 29 -83 26 30 -122 100 -103 19 73 46 -23 9 20 -51 36 -2 -15 -16 -37 16 98 27 -10 38 -86 83 98 -167
4088 -167 60 -141 122 -40 174 37 -100 -216 -57 -109 35 -137 66 -57 51 -46 10 26 11 37 -18 11 13
4111 13 53 120 31 17 21 98 61 -54 -113 22 122 -143 -157 -21 -108 25 47 -60 58 -4 -41 54 -15 85 61 64 121
4138 121 63 37 -37 170 -111 199 66 22 -13 9 -29 80 -25 -43 -178 18 -6 -102 -57 10 -157 -90 -18 -95 94
4163 94 2 240 52 48 133 -81 140 178 35 -135 200 -147 28 96 16 -9 -60 134 -218 2 -195 34 7 -195
4187 -195 105 8 -43 -103 -75 -68 135 198 187 110 32 92 -57 13 45 62 112 137 106 -58 62 -29 -58 -105 -51 -140 -309
4214 -309 -36 186 -62 -19 -128 -155 -71 101 -118 219 -12 239 115 -73 59 172 25 -67 -19 258 90 -130
$$ packed form
4037A6R7o4j57P9M2l0Q9j83n1J07J17j01K05j94J06q9J45k38J14N3j09K0o4J19
4061B9j12J09Mj52K22k03J22N4k7o9L2J1p1Q7l8j3jk1N3Q2p1l7M8j24J69J5k65
4088a67K27k01K63j62K14j37j37j16J59n2J44j72K03j23J08r7N6J6j5K6n5K9K
4111A3M0O7q9j4MP7l7j15n9J35J00k65j4J36q7J33K2j07J18o2l7R5o9J00k4LN7
4138A21n8k6p4K07k81L10j33m4l5K2l8J09j05j8j35J96k4r6M5O7j67O7P2p7J89
4163I4r2K38j88mQ5k14K21L8j43j70L35l47J75O8q0k5n1J94l52K20j97K29k7k02
4187a95L00r7n1o0K8PK03O3j1p7p8O0j49P0L2J7N0K5l1j64J20r1k9m7N4q9j69
4214c09K73K22k48M3j09k7Q4J72k19L37k31K51j24j88J32J13j47r2M8K77j68k20
$$ plain form
4236 -130 155 28 -131 37 -14 -145 -36 101 106 86 -144 -81 -28 141 -155 77 -123 -84 99 23 69 76 113 -3
4260 -3 157 247 144 68 48 8 33 49 5 -42 -11 0 -34 33 122 67 52 -154 -134 -30 12 -123 -84 -4 138 50 226
4287 226 70 133 -51 74 -46 -199 33 21 -133 35 42 55 39 58 -60 -62 -8 -58 -137 -19 -46 -61 -217 -59 11
4312 11 -2 -104 -62 -165 123 105 135 -48 101 -86 -171 133 -17 106 -31 -106 44 67 15 35 -39 -1 109 4
4336 4 -83 -92 -9 -108 -174 -33 18 21 101 103 -19 -35 -19 -44 172 -150 128 -80 3 102 75 147 18 84 41 -68 114 103
4364 103 -12 14 -38 95 -58 60 -15 -46 -71 -8 22 -66 61 -15 -44 -86 160 125 21 72 -23 115 121 -47 96
4389 96 -26 -160 28 144 -67 92 116 61 122 18 -147 36 14 -73 -52 -38 -107 -55 113 26 -105 -9 -24 40 194
4414 194 -30 134 173 74 90 -125 -18 30 103 78 -111 -43 34 4 -8 -220 -42 -152 -48 -55 28 -25 -114 -33 79
$$ packed form
4236a30K85j27j59J68n1j31J09J37Nk0k30O3N3J69k96K32k00L9J83p6M6PL7j16
4260cJ60R0j03p6k0m0K5J6m4m7L1J1l4O7Q9n5j5k06K0J04M2j35L9Q0J42q8J76
4287B26j56O3j84J25j20j53K32j2j54J68PJ3j6J9j18kN4n0p9J18k7j5j56J58P0
4312A1j3j02M2j03K88j8L0j83J49j87q5L04j50J23j37p5J50K3n2K0p4L8J10j05
4336Dq7rQ3r9o6J41N1LQ0Kj22j6J6k5K16l22K78k08Q3R9k7P2j29O6m3j09J82j1
4364A03j15K6n2J33j53J18p5l1k5O3L0q8J27p6k9m2K46l5j04N1r5J38Oj68J43
4389I6j22j34J88J16k11J59K4n5O1j04j65J83k2q7K1J4o9N2J68q7j31R6j5O4J54
4414A94k24J64L9r9J6k15J07M8P3k5j89O8P7l0j2k12J78j10J04pQ3n3q9Q1J12
$$ [...]
8191d5
##END NTUPLES=NMR FID
##END=
