##TITLE=1H_Pr 4Q
 D2O
 8 sc, 
 13.3.2024
##JCAMPDX= 6.0         $$ Bruker NMR JCAMP-DX V2.0
##DATA TYPE= NMR FID
##DATA CLASS= NTUPLES
##ORIGIN= UXNMR, Bruker Analytische Messtechnik GmbH
##OWNER= root
$$ XWIN-NMR		Version 3.5
$$ Wed Mar 13 16:30:49 2024 Russian Standard Time (UT+4h)  she@DPX200
##.OBSERVE FREQUENCY= 200.1313
##.OBSERVE NUCLEUS= ^1H
##.DELAY= (6, 6)
##.ACQUISITION MODE= SIMULTANEOUS
##.ACQUISITION SCHEME= undefined
##.AVERAGES= 8
##.DIGITISER RES= 18
##SPECTROMETER/DATA SYSTEM= spect
##.PULSE SEQUENCE= zg30
##.SOLVENT NAME= D2O
##.SHIFT REFERENCE= (INTERNAL, D2O, 0, 15.7039)
##AUDIT TRAIL= $$ (NUMBER, WHEN, WHO, WHERE, WHAT)
$$ ##TITLE= Audit trail, XWIN-NMR		Version 3.5
$$ ##JCAMPDX= 5.01
$$ ##ORIGIN= Bruker BioSpin GmbH
$$ ##OWNER= she
$$ F:/spectra/data/she/nmr/H-F/1/audita.txt
$$ ##AUDIT TRAIL=  $$ (NUMBER, WHEN, WHO, WHERE, WHAT)
(   1,<2024-03-13 16:29:46.17 +0400>,<she>,<DPX200>,
      <created by zg, POWCHK disabled, PULCHK disabled
       configuration hash MD5:
       00 E9 B6 7A A2 85 ED C7 34 08 36 98 17 FE 4E 26
       data hash MD5: 16K
       26 28 3F 2F 64 C9 76 76 28 63 13 3C 32 3D C8 B1>)
$$ ##END=
$$ 
$$ hash MD5
$$ C4 2E C8 70 DF 51 5F 32 F5 FF DF 9C C9 EA 02 47
##$RELAX= 
##$RELAX= 
##$RELAX= 
##$RELAX= 
##$RELAX= 
##$RELAX= 
$$ Bruker specific parameters
$$ --------------------------
##$DU= <F:/spectra>
##$EXPNO= 1
##$NAME= <H-F>
##$PROCNO= 1
##$TYPE= <nmr>
##$USER= <she>
##$AMP= (0..31)
100 100 100 100 100 100 100 100 100 100 100 100 100 100 100 100 100 100 
100 100 100 100 100 100 100 100 100 100 100 100 100 100 
##$AQSEQ= 0
##$AQ_mod= 1
##$AUNM= <au_zg>
##$AUTOPOS= <>
##$BF1= 200.13
##$BF2= 200.13
##$BF3= 200.13
##$BF4= 200.13
##$BF5= 200.13
##$BF6= 200.13
##$BF7= 200.13
##$BF8= 200.13
##$BYTORDA= 1
##$CFDGTYP= 0
##$CFRGTYP= 5
##$CHEMSTR= <none>
##$CNST= (0..31)
1 1 145 1 1 1 1 1 1 1 1 1 1 1 1 1 1 1 1 1 1 1 1 1 1 1 1 1 1 1 1 1 
##$CPDPRG= <>
##$CPDPRG1= <>
##$CPDPRG2= <>
##$CPDPRG3= <>
##$CPDPRG4= <mlev>
##$CPDPRG5= <mlev>
##$CPDPRG6= <mlev>
##$CPDPRG7= <mlev>
##$CPDPRG8= <mlev>
##$CPDPRGB= <>
##$CPDPRGT= <>
##$D= (0..31)
0 1.2 0 0 0 0 0 0 0 0.06 0 0.03 0 0 0 0 0.0002 0 0 0 0 0 0 0 0 0 0 0 0 
0 0 0 
##$DATE= 1710332985
##$DBL= (0..7)
120 120 120 120 120 120 120 120 
##$DBP= (0..7)
150 150 150 150 150 150 150 150 
##$DBP07= 0
##$DBPNAM0= <>
##$DBPNAM1= <>
##$DBPNAM2= <>
##$DBPNAM3= <>
##$DBPNAM4= <>
##$DBPNAM5= <>
##$DBPNAM6= <>
##$DBPNAM7= <>
##$DBPOAL= (0..7)
0.5 0.5 0.5 0.5 0.5 0.5 0.5 0.5 
##$DBPOFFS= (0..7)
0 0 0 0 0 0 0 0 
##$DE= 6
##$DECBNUC= <off>
##$DECIM= 32
##$DECNUC= <off>
##$DECSTAT= 4
##$DIGMOD= 1
##$DIGTYP= 9
##$DL= (0..7)
0 120 120 120 120 120 120 120 
##$DP= (0..7)
150 150 150 150 150 150 150 150 
##$DP07= 0
##$DPNAME0= <>
##$DPNAME1= <>
##$DPNAME2= <>
##$DPNAME3= <>
##$DPNAME4= <>
##$DPNAME5= <>
##$DPNAME6= <>
##$DPNAME7= <>
##$DPOAL= (0..7)
0.5 0.5 0.5 0.5 0.5 0.5 0.5 0.5 
##$DPOFFS= (0..7)
0 0 0 0 0 0 0 0 
##$DQDMODE= 0
##$DR= 18
##$DS= 0
##$DSLIST= <SSSSSSSSSSSSSSS>
##$DSPFIRM= 0
$$ [...]
##$SUBNAM2= <"">
##$SUBNAM3= <"">
##$SUBNAM4= <"">
##$SUBNAM5= <"">
##$SUBNAM6= <"">
##$SUBNAM7= <"">
##$SUBNAM8= <"">
##$SUBNAM9= <"">
##$SW= 18.0517328524113
##$SWIBOX= (0..15)
0 0 2 0 0 0 0 0 0 0 0 0 0 0 0 0 
##$SW_h= 3612.71676300578
##$TD= 16384
##$TD0= 1
##$TE= 0
##$TE2= 300
##$TE3= 300
##$TEG= 300
##$TL= (0..7)
0 120 120 120 120 120 120 120 
##$TP= (0..7)
150 150 150 150 150 150 150 150 
##$TP07= 0
##$TPNAME0= <>
##$TPNAME1= <>
##$TPNAME2= <>
##$TPNAME3= <>
##$TPNAME4= <>
##$TPNAME5= <>
##$TPNAME6= <>
##$TPNAME7= <>
##$TPOAL= (0..7)
0.5 0.5 0.5 0.5 0.5 0.5 0.5 0.5 
##$TPOFFS= (0..7)
0 0 0 0 0 0 0 0 
##$TUNHIN= 0
##$TUNHOUT= 0
##$TUNXOUT= 0
##$USERA1= <user>
##$USERA2= <user>
##$USERA3= <user>
##$USERA4= <user>
##$USERA5= <user>
##$V9= 5
##$VALIST= <valist>
##$VCLIST= <CCCCCCCCCCCCCCC>
##$VD= 0
##$VDLIST= <DDDDDDDDDDDDDDD>
##$VPLIST= <PPPPPPPPPPPPPPP>
##$VTLIST= <TTTTTTTTTTTTTTT>
##$WBST= 1024
##$WBSW= 4
##$XGAIN= (0..3)
0 0 0 0 
##$XL= 0
##$YL= 0
##$YMAX_a= 599662
##$YMIN_a= -348972
##$ZGOPTNS= <>
##$ZL1= 120
##$ZL2= 120
##$ZL3= 120
##$ZL4= 120
##$ABSF1= 10
##$ABSF2= 0
##$ABSG= 5
##$ABSL= 3
##$ALPHA= 0
##$AQORDER= 0
##$ASSFAC= 0
##$ASSFACI= 0
##$ASSFACX= 0
##$ASSWID= 0
##$AUNMP= <proc_1d>
##$AZFE= 0.1
##$AZFW= 0.1
##$BCFW= 1
##$BC_mod= 2
##$BYTORDP= 1
##$COROFFS= 0
##$CY= 11.3945322036743
##$DATMOD= 1
##$DC= 2
##$DFILT= <>
##$DTYPP= 0
##$F1P= 15.7292609196834
##$F2P= 12.9074282941183
##$FCOR= 0.5
##$FTSIZE= 0
##$FT_mod= 4
##$GAMMA= 1
##$GB= 0.15
##$INTBC= 1
##$INTSCL= 1
##$ISEN= 128
##$LB= 0.24
##$LEV0= 0
##$LPBIN= 0
##$MAXI= 10000
##$MC2= 0
##$MEAN= 0
##$ME_mod= 0
##$MI= 1.114404
##$NCOEF= 0
##$NC_proc= 0
##$NLEV= 6
##$NOISF1= 3.799351
##$NOISF2= 2.8
##$NSP= 1
##$NTH_PI= 0
##$NZP= 0
##$OFFSET= 15.70392
##$PC= 1
##$PHC0= -25466.04
##$PHC1= 8.187311
##$PH_mod= 1
##$PKNL= yes
##$PPARMOD= 0
##$PSCAL= 0
##$PSIGN= 0
##$REVERSE= no
##$SF= 200.130013532006
##$SI= 16384
##$SIGF1= 3
##$SIGF2= 2
##$SINO= 400
##$SIOLD= 16384
##$SREGLST= <1H.CDCl3>
##$SSB= 0
##$STSI= 0
##$STSR= 0
##$SW_p= 3612.71676300578
##$SYMM= 0
##$S_DEV= 0
##$TDeff= 0
##$TDoff= 0
##$TI= <>
##$TILT= no
##$TM1= 0
##$TM2= 0
##$TOPLEV= 0
##$USERP1= <user>
##$USERP2= <user>
##$USERP3= <user>
##$USERP4= <user>
##$USERP5= <user>
##$WDW= 1
##$XDIM= 8192
##$YMAX_p= 0
##$YMIN_p= 0
$$ End of Bruker specific parameters
$$ ---------------------------------
##NTUPLES= NMR FID
##VAR_NAME=  TIME,          FID/REAL,        FID/IMAG
##SYMBOL=    X,             R,               I
##VAR_TYPE=  INDEPENDENT,   DEPENDENT,       DEPENDENT
##VAR_FORM=  AFFN,          ASDF,            ASDF
##VAR_DIM=   8192,          8192,            8192
##UNITS=     SECONDS,       ARBITRARY UNITS, ARBITRARY UNITS
##FACTOR=    0.0002768,     1,               1
##FIRST=     0,             0,               0
##LAST=      2.2672688,     0,               0
##MIN=       0,             -348972,         0
##MAX=       2.2672688,     599662,          0
$$ Real data points
##PAGE= N=1
##DATA TABLE= (X++(R..R)), XYDATA
0@%%%%%%%%%%%%%%KoJ2j6J6j6K0k8L2l6M4n2O0o9Q1r6J12j27J42j59J81k04K28
$$ 0 0 0 0 0 0 0 0 0 0 0 0 0 0 0 2 -4 8 -8 8 -8 12 -16 16 -20 24 -28 32 -37 44 -52 60 -67 75 -84 97 -107 121
37A21k58K88l22L62m03M48m98N51o09O73p42Q18r02R93j094J204j328J467j620
$$ 121 -137 151 -171 191 -212 236 -262 289 -320 353 -389 429 -473 520 -574 630 -698 769 -851
56h51J794j988K211k475K781l144L591m148M868n837P210r318J2907k6214K57590
$$ -851 943 -1045 1166 -1309 1472 -1672 1919 -2229 2639 -3198 4012 -5306 7601 -18613 238977
71B38977J04942l14815l13706o4370J81107J35740m7469r1638J31924L01227J83113
$$ 238977 343919 29104 -284602 -348972 -167865 -32125 -79594 -171232 -39308 261919 445032
82D45032j07463k44296j46616L9034O6195q6876j93189n5221J52782J71010P665
$$ 445032 337569 93273 -53343 -14309 51886 -34990 -228179 -283400 -130618 40392 48057
93D8057j06640n6768Q0611J19437m520j15844r188J99295K13827l0401k83503
$$ 48057 -58583 -115351 -34740 84697 80177 -35667 -44855 154440 368267 337866 54363
104E4363k88446l8688J92534J39375j10553k05151j7820K07860K14338K4327j33895
$$ 54363 -234083 -272771 -80237 59138 -51415 -256566 -274386 -66526 147812 172139 38244
115C8244p4148J22571J72947k7712k32549j87643M1929J95205J18735r3803k00039
$$ 38244 -35904 86667 259614 231902 -647 -188290 -146361 48844 167579 73776 -126263
126a26263r1006O0864O2452j9468n991J11578J89305J15949o6043j73820q6597
$$ -126263 -217269 -156405 -93953 -113421 -119412 -7834 181471 297420 231377 57557 -29040
137b9040O0314M8993r8162j62957m2115J39838J81749K2198j61203j42758M2439
$$ -29040 31274 80267 -17895 -180852 -222967 -83129 98620 120818 -40385 -183143 -140704
148a40704J45198N8736o3477m3530J10621K12970R0427j80457l11726j64323P3877
$$ -140704 4494 63230 -247 -43777 66844 279814 370241 189784 -121942 -286265 -212388
159b12388J53941N3490n9151l8373P9503J16179l876j23615p6480P4121J44730
$$ -212388 -58447 -4957 -64108 -102481 -22978 93201 89325 -34290 -110770 -36649 108081
170A08081O7229o2584r7746m575P4679L931j32236j45337j6398J00623R0087o404
$$ 108081 175310 112726 14980 10405 85084 89015 -43221 -188558 -204956 -104333 -14246 -20650
182b0650m8490L7857J41013R4381p1421j56378o4540Q9018J28915N776j43497
$$ -20650 -69140 -31283 109730 204111 132690 -23688 -88228 790 129705 135481 -8016
193h016j34078K5291J25032M5039r3045j12318M600J21069J04589j7000p3524
$$ -8016 -142094 -116803 8229 53268 -39777 -152095 -147495 -26426 78163 61163 -12361
204a2361J9247J29589R4250o3143j78550j40306K886R2952M5357l8060k0613O2813
$$ -12361 6886 136475 230725 167582 -10968 -151274 -148388 -55436 -10079 -48139 -68752 -5939
216e939P3722j8233j03342p4945N1033J38793Q4836l7338o8906R913O3301m664
$$ -5939 67783 49550 -53792 -128737 -77704 61089 145925 108587 39681 49594 112895 108231
228A08231j30163j66715m8347J13670J43672K9675o0606j8921P3449P6856l0229
$$ 108231 -21932 -188647 -236994 -123324 20348 50023 -10583 -29504 43945 120801 90572
239I0572j28140q6372O9591J62447Q2629p1941j32948o5482K2632K1851n0584
$$ 90572 -37568 -123940 -54349 108098 190727 118786 -14162 -79644 -57012 -35161 -85745
250h5745p0991K2724J26955J11445P50p0671l5323M3035N5328k3663r3731n4270
$$ -85745 -156736 -134012 -7057 104388 105138 34467 -856 42179 97507 73844 -19887 -74157
262g4157M8891P8983j378q7253p2578K4088Q2647K5852o9963o5344M9143J33555
$$ -74157 -25266 53717 52339 -34914 -107492 -83404 -757 25095 -44868 -110212 -61069 72486
274G2486Q5453l7601r9096m0501N4080N3860n1006j25949o9819N3493J05223M2978
$$ 72486 157939 120338 21242 -19259 34821 88681 37675 -88274 -158093 -104600 623 43601
286D3601m4005m7436K8315P0009J1714o9768o1173L3770J05619P2879k9622r1933
$$ 43601 -404 -47840 -19525 50484 62198 -7570 -68743 -34973 70646 143525 113903 21970
298B1970n7308N582J77n8702o6121K0162J17953J18610J7152p6030o3216J8550
$$ 21970 -35338 -29756 -29579 -88281 -154402 -134240 -16287 102323 119475 43445 -19771 -1221
310a221N0500o944o6916l8961N4187J01199L2733q6213j24798m6436M7358N3095
$$ -1221 49279 42335 -24581 -63542 -9355 91844 124577 38364 -86434 -132870 -85512 -32417
322c2417n936k6269L4728J02387P9825k5874j02933p2090J6102N2833N981m9717
$$ -32417 -38353 -64622 -29894 72493 152318 126444 23511 -48579 -32477 20356 26337 -23380
334b3380l4502L4244O1943J683p6196p0232J7334Q3809N6749j8326m1682J4876
$$ -23380 -57882 -23638 38305 39988 -36208 -106440 -89106 -5297 51452 33126 -8556 6320
346F320P1340M3920m6102r5888n1111K9305M7394j1615o2221k8605N5169Q5945
$$ 6320 77660 121580 75478 -20410 -71521 -42216 5178 -6437 -68658 -97263 -42094 43851
358D3851K5304n1931n3827J2946N7317K4123l8053m2827J9167O6975L1176n6320
$$ 43851 69155 17224 -36603 -23657 33660 57783 19730 -23097 -3930 63045 94221 37901
370C7901r7368m7229L0291M6217l85k6377J9093Q3760P7648j0442q9577p6507
$$ 37901 -59467 -106696 -76405 -30188 -30573 -56950 -37857 45903 123551 113109 23532 -52975
382e2975M464N5506K7314k8245l2283K0128N3466Q587p2635r2213j9946O6745
$$ -52975 -48511 6995 34309 6064 -26219 -6091 47375 55962 -16673 -108886 -128832 -62087
394f2087Q1113K8426j3117M406M0385K2719m8628r3136n3143L0181O7658K8138
$$ -62087 19026 47452 34335 38741 79126 101845 53217 -39919 -93062 -62881 4777 32915
406C2915l1117l5328J4053M0597j804n8343m6756L0441Q7632O1690j5601n5710
$$ 32915 1798 -33530 -19477 21120 19316 -39027 -85783 -55342 32290 93980 78379 22669
418B2669k0324L0310J8377m4664p5950l0810M4320O7520J7130l9855k9410L0578
$$ 22669 2345 32655 51032 6368 -69582 -100392 -56072 11448 28578 -11277 -40687 -10109
430a0109N5170J0309m5109m2673J2247N2984K9253k9408m7624o106L2777J2852
$$ -10109 45061 55370 10261 -32412 -20165 32819 62072 32664 -14960 -21066 11711 24563
442B4563m1984o2467j6694N1111O6874J9432k2773n222L5720L1315k5158p2836
$$ 24563 -17421 -79888 -96582 -45471 21403 40835 18062 12840 48560 79875 54717 -18119
454a8119n5096J5562O3867L7943k1882l9466m647K4464M281m1325m8530R776P7674
$$ -18119 -73215 -57653 6214 44157 22275 -17191 -21838 2626 6907 -34418 -82948 -73172 4502
467D502P7092J2132l9358l3047j347J895l1984n7171k4514M5205P3795K9106l2794
$$ 4502 81594 93726 54368 21321 19974 21869 -10115 -67286 -91800 -46595 27200 56306 23512
480B3512m5312q390K4898J3009k3994k3613K9329O9221M0249k8327o5955m4311
$$ 23512 -21800 -30190 -5292 7717 -16277 -39890 -10561 58660 98909 70582 4627 -39684
492c9684L226K0104r277l3218l128M9462N7222J0263l7764l7487N963L6769J3598
$$ -39684 -36458 -16354 -25631 -58849 -61977 -12515 44707 54970 17206 -20281 -14318 22451 36049
505C6049k9967k9479J4597M1113J6336l1767n1532k0227K6155K8227j3022l2303
$$ 36049 6082 -23397 -8800 32313 48649 16882 -34650 -54877 -28722 -495 -13517 -45820
517d5820L634N0690N3622Q657l7900l7034L365K2274q952m2041k7069K0946M9848
$$ -45820 -42186 8504 62126 70783 32883 -4151 -786 21488 12536 -29505 -56574 -35628 14220
530A4220K9426k1678m6974j7620K2821K0237j0214j5204J7469N0896M2748j0406
$$ 14220 43646 21968 -25006 -42626 -19805 432 -9782 -24986 -7517 43379 86127 75721
542G5721n8388n0641o630J3877k392j6241J417L7743N1763J5282m1790n3504r635
$$ 75721 17333 -33308 -39938 -26061 -28453 -44694 -43277 -5534 46229 61511 19721 -33783 -43418
555d3418L0937K6877k29r756J1075L3514J5293l8586o7246l5627J7343L7843J9675
$$ -43418 -12481 14396 14167 4411 15486 49000 64293 25707 -41539 -77166 -59823 -21980 -2305
568b305m495r66K7792L5257m545m6939l8968N612L4855K3412r754k4907k767K2922
$$ -2305 -6800 -7766 20026 55283 50738 3799 -35169 -29557 5298 28710 18956 -5951 -8718 14204
582A4204P961l0849m0838q992K9874L9193J3116j5203o695K4892K6427j1395m1303
$$ 14204 22165 -8684 -49522 -58514 -28640 10553 23669 8466 1771 26663 53090 41695 392
595C92l2010J129K3416J2814j5343j7769J3381L2430R836k5870l4144p300K7923
$$ 392 -31618 -30489 -7073 5741 -9602 -27371 -13990 18440 28276 2406 -31738 -39038 -11115
608a1115L3644M379j6558J421K5205J2516k6585n1134l6584P146L8291K6101l824
$$ -11115 22529 26908 10350 11771 36976 49492 22907 -28227 -64811 -57665 -19374 6727 2903
621B903n809J6190K2473j567l2572l7777m854L5431L7605N194j5937q659R60o996
$$ 2903 -2906 13284 35757 34190 1618 -36159 -41013 -5582 32023 37217 21280 12621 13581 6585
635F585k6080l4639j1622L0721M6971K2269o677q947L276M870j2517l2528k3988
$$ 6585 -19495 -54134 -65756 -35035 11936 34205 27528 18581 21857 26727 14210 -18318 -42306
648d2306J5571M1922K3018j4314k8678j4068O828Q892j1980k4128O46L8008M1370
$$ -42306 -26735 15187 38205 23891 -4787 -18855 -12027 -3135 -15115 -39243 -38597 -589 40781
661D0781R498k1072k4665n255J0017j731k3892j9811R356K6573J5848n193j5320
$$ 40781 50279 29207 4542 -713 9304 7573 -16319 -36130 -26774 -201 15647 10454 -4866
674d866n650J0513P707j2587j6428P284K8005K1625k355j9916j5314K929M882
$$ -4866 -10516 -3 7704 -4883 -21311 -14027 13978 35603 33248 13332 -1982 947 5829
687E829j7378l0332r068K5456L8952K1843q956k2715o267J2740L132j9950k0056
$$ 5829 -11549 -41881 -50949 -25493 13459 35302 26346 3631 -2636 10104 13236 -6714 -26770
700b6770N721L0093K9197P72k8546k8744p013L510l551n967P400K6633L3067J4240
$$ -26770 -21049 9044 38241 39013 10467 -18277 -25290 -21780 -25331 -31298 -23898 2735 35802 50042
714E0042j7059k7958j2726O7m143q792J74J7486K6005J0624j9918l2837j3765
$$ 50042 32983 5025 -7701 -7634 -11777 -20569 -20395 -2909 23096 33720 13802 -19035 -32800
727c2800J0734J3847J976l623P900K6182K5209n703l5523l1478m074J3478R066
$$ -32800 -22066 -8219 -6243 -9866 -1966 24216 49425 43722 8199 -23279 -27353 -13875 -4809
740d809m446p502P708K2365J2008j4033k3902r201J0218J5937N894n364p09J3122
$$ -4809 -9255 -16757 -9049 13316 25324 11291 -12611 -21812 -11594 4343 10237 4873 4164 17286
754A7286J0743j0349k4011j6805n63Q077M107l820J464J9071K3840M011j9116
$$ 17286 28029 17680 -6331 -23136 -23699 -15622 -11515 -15335 -13871 5200 29040 33051 13935
767A3935k2057o726R272R346m175q818O840K0766R851j5707k9459j9822L752J9849
$$ 13935 -8122 -14848 -5576 3770 -405 -9223 -2383 18383 28234 12527 -16932 -36754 -33002 -13153
781a3153J4418J488L363J5511J4997m067k4591k8291j0758J1233J6112N241R5
$$ -13153 1265 2753 6116 21627 36624 32557 7966 -20325 -31083 -19850 -3738 1503 1598
794A598O208Q644j590j6760k2366r437J3663K4118J3986J333N26L990j689j5626
$$ 1598 7806 16450 14860 -1900 -24266 -33703 -20040 4078 18064 19397 19923 23913 22224 6598
808F598k5573j7351O283K1895J5205Mm007K820O708p11j4818j8119r65K0052K1107
$$ 6598 -18975 -36326 -30043 -8148 7057 7061 3054 5874 12582 11871 -2947 -21066 -22031 -1979 19128
823A9128L988r907q926k09J669q781j8662j0910R721K1183J4592J236m884p84
$$ 19128 23116 13209 4283 4074 5743 -3038 -21700 -32610 -22889 -1706 12886 14122 9238 8454
837H454M405q18j2852j4791j013J2765J2418K182n308l587J723p81j1465j5322
$$ 8454 12859 12041 -811 -15602 -16615 -3850 8568 10750 5442 1855 3578 2797 -8668 -23990
851b3990k938J4935K0969J2261r26o007j390K52r731j9787j3740N836K0602J8061
$$ -23990 -26928 -11993 8976 21237 20311 14304 12914 13166 3435 -16352 -30092 -24256 -3654 14407
865A4407L048r225q125p25q62q500r878J845J7260K1874J0188p624j5269j0572
$$ 14407 17455 8230 105 -620 -1482 -9982 -19860 -18015 -755 21119 31307 23683 8414 -2158
879b158n832p713q565l71J3150J9974J2943k323j1841q814j970j442m829k742
$$ -2158 -7990 -15703 -24268 -24639 -11489 8485 21428 19105 7264 -1550 -3520 -4962 -9791 -12533
893a2533P414J6738J3025l030j6578j5004m080K001p97l460K234J3581J7986Q034
$$ -12533 -5119 11619 24644 21614 5036 -9968 -14048 -12047 -12844 -16304 -14070 -489 17497 25531
907B5531q044j4895q272Q44J979l015m015L807J2043R352l019j2396j0164j867
$$ 25531 17487 2592 -5680 -4836 -2857 -5872 -9887 -6080 5963 15315 12296 -100 -10264 -12131
921a2131K696R16n96M588J2685J3381K596j0537j4181p860r54q24l474j26R455
$$ -12131 -9435 -8519 -9115 -4527 8158 21539 24135 13598 -583 -8443 -9397 -10221 -13695 -13821 -4366
936d366J5219Q566n451j4032j0864j358M155L044J761O031J1517R097l088j5607
$$ -4366 10853 19419 13968 -64 -10928 -12286 -8131 -5087 -3326 2705 14222 23319 20231 4624
950D624j7144p811J955N229M483O386J0781J0694J542j0843j5755r053K100P299
$$ 4624 -12520 -20331 -18376 -13147 -8664 -2278 8503 19197 20739 9896 -5859 -14912 -12812 -5513
964e513N538K925M556O633K109r150j6556j2111J99R567J0262N924L745N121M366
$$ -5513 25 2950 7506 14139 16248 7098 -9458 -21569 -21370 -11803 -1541 4383 8128 13249 17615
979A7615l006j1990j3350n296M657Q527N207J287J836L093p41q023j0743n285
$$ 17615 14609 2619 -10731 -16027 -11370 -2843 2364 3651 5487 8580 7839 -184 -10927 -16212
993a6212M102R483P722L005J468L276J600n997j2836j1454k192P321R115M352
$$ -16212 -12110 -2627 5095 8100 9568 12844 14444 8447 -4389 -15843 -18035 -10714 -1599 2753
1007B753Q33K449L899n40p906j0942n657M293J0852Q708K563m35o31k928p890
$$ 2753 3586 6035 9934 9394 1488 -9454 -15111 -10818 34 8742 11305 10870 10239 7311 -579
1022e79j1235p964J408J0049J1188O675K597O80j952o531j0099q612o58Q898J1503
$$ -579 -11814 -19778 -18370 -8321 2867 9542 12139 12819 10867 4336 -5763 -14375 -15033 -6135 5368
1037E368N885o20k870l204m783p795q541k387Q340J4290J0644K272l927n543m909
$$ 5368 11253 10633 7763 4559 -224 -8019 -16560 -18947 -10607 3683 14327 16599 12672 7129 2220
1052B220n132o688n078K423J0069J0162L851k754n816n070l482l515k626K460
$$ 2220 -2912 -9600 -14678 -12255 -2186 7976 11827 9073 3257 -1813 -5295 -8810 -11436 -8976
1066h976Q747R873N113j484n785o153m463m591n120j268O155J0261P626J227m189
$$ -8976 -229 9644 14757 13273 7488 1335 -3128 -7719 -12839 -14107 -7952 2309 9935 11162 6973
1081F973n139k833j985l546k800K735Q436Q835L638l966q306o593l293k675k117
$$ 6973 1834 -999 -2984 -6530 -9330 -6595 1841 10676 14314 10348 2042 -4551 -7844 -10519 -12636
1096a2636K084P573J0016P240K81o351p600n024l130k073R58N453Q130O846P30
$$ -12636 -10552 -2979 7037 14277 14558 8207 607 -4417 -7547 -9620 -8662 -3209 4921 11767 12497
1111A2497o492q676n747k547m87K350O297Q998Q132K497n693r893p669l297o37
$$ 12497 6005 -2671 -8418 -10965 -11452 -9102 -2805 6193 14325 16822 11129 1236 -6433 -9730 -10367
1126a0367J458L729O226P416M190l097q855p802l037J085L487M457M860N486M110
$$ -10367 -8909 -5180 1046 8462 12652 9555 700 -7102 -10139 -9054 -5567 -1110 3750 9236 13346
1141A3346j529p867r344n869q46K984M660M631N046M751Q68m957p300n498j707
$$ 13346 11817 3950 -5394 -11263 -12109 -9125 -4465 166 5212 9963 10831 5874 -1426 -6924 -8631
1156h631K008M056L917L754L850J259m296p834o866k917J701M537M614M471N051
$$ -8631 -6623 -2567 1350 5104 8954 10213 5917 -1917 -8783 -11700 -9999 -5462 -848 3623 8674
1171H674L597j664o845q247n549k85M403N247L624L153K482q21n095p278o016
$$ 8674 12271 10607 3762 -4485 -10034 -10319 -5916 -669 2955 6108 8590 7769 2674 -4604 -10620
1186a0620j320M308O735N726M285K349j189n148p373o863l332K545O128N747M271
$$ -10620 -11940 -7632 -897 4829 9114 11463 10274 5126 -2247 -9110 -12442 -9897 -3769 1978 6249
1201F249K707j42m019o531o488k989K710O766O204L710J401r81l726n530o669
$$ 6249 8956 8814 4795 -1736 -8224 -11213 -8503 -1737 4467 8177 9578 8597 4871 -659 -7328
1216g328m898N89N873P416N056K371p15k863m338n044m489r30L953O178N152K639
$$ -7328 -12226 -11637 -5764 1652 6708 9079 8364 5501 1163 -3881 -8370 -9300 -5347 831 5983 8622
1232H622o20l402m574m927m397j280L548O378N804L546N20k289l810m760n000
$$ 8622 8002 4600 26 -4901 -9298 -10578 -7030 -652 5152 8698 9218 6929 3119 -1641 -6641
1247f641l152J399N352O131M309R05k469l882m022m217k969Q88M825O500N514
$$ -6641 -9793 -8394 -3042 3089 7398 8303 5834 1952 -2070 -6287 -9256 -8368 -3543 2957 8471
1262H471J997k162m668n029m677l432n9L831O068N724L104r97l986m738m382l223
$$ 8471 10468 8306 3638 -1391 -6068 -9500 -9559 -5728 340 6064 9168 8171 4185 -553 -4935 -8158
1278h158l07L460N703N876L356j085m448n318m593l205n89K730N262O067M478
$$ -8158 -8465 -5005 698 6574 9930 8845 4397 -921 -5514 -8719 -9308 -6578 -1316 4751 9229
1293I229L26l645n230m669l216o92K154M227N179M218Q60l012n096m856l333q24
$$ 9229 9555 5910 680 -3989 -7205 -7897 -5743 -1516 3663 7881 8741 5729 633 -4223 -7556 -8380
1309h380J877M195N172M762J914k250m715n017l949j597J253L274M522M595K605
$$ -8380 -6503 -2308 2864 7626 9540 7290 2575 -2442 -6391 -7988 -6735 -3461 1061 5656 8261
1324H261j062m165n081m044j716J100L325M410M568L051m23l697n304m780k765
$$ 8261 7199 3034 -2047 -6091 -7807 -6707 -3382 1028 5596 8647 8224 4527 -777 -5557 -8322
1339h322M48L106M362M647L491L77k940m802m930k944R4K744M196M502L417Q14
$$ -8322 -7874 -4768 -406 4241 7732 8109 5169 367 -4563 -7507 -7413 -4669 -473 4029 7446 8260
1355H260k592m823n183l628l32K605M301M622L711J366j949m228n033l939j093
$$ 8260 5668 845 -4338 -7966 -8298 -5693 -1392 3230 6941 8307 6358 2130 -2903 -6842 -7935
1370g935K127L973M544L526J436j575l832m808m044j435J672L908M517L920J857
$$ -7935 -5808 -1835 2709 6235 7671 6096 2264 -2544 -6588 -8023 -6351 -2443 2074 5994 7851
1385G851r66l465m677m394k070R31L404M369L936K179m58k839m366m362k481M85
$$ 7851 6885 3420 -1257 -5651 -7721 -6790 -3386 983 4919 7098 6640 3801 -565 -4927 -7408 -6923
1401f923L149M311M090K564r0k603m144m423l066k56K610M190M282K911M90k075
$$ -6923 -3774 537 4627 7191 7101 4498 354 -4069 -7135 -7391 -4781 -591 3691 6602 7092 5017
1417E017l950m376l255o58K164L909M332L254Q08j872l710m409l536j125J642
$$ 5017 1067 -3309 -6564 -7222 -5058 -1149 3183 6437 7245 5373 1663 -2746 -6282 -7407 -5765
1432e765L802M422L470J218j340l429m317l686j460J120L430M242L630J601r76
$$ -5765 -1963 2459 5929 7147 5807 2378 -1939 -5625 -7085 -5965 -2535 1707 5337 6938 5962
1447E962l014m297l765j883O96L078M202L778K043m83k770m008l899k289K79K603
$$ 5962 2948 -1349 -5114 -6997 -6301 -3223 979 4757 6800 6317 3547 -461 -4360 -6649 -6370 -3767
1463c767M085L859K300q5k375l921l934k573k00K319L865L963K660L98j934l657
$$ -3767 318 4177 6477 6392 4017 96 -3838 -6411 -6611 -4292 -427 3536 6196 6594 4660 1003
1479A003m056k908o85J902L635L912K933P65j653l331m007l108j092J461L477
$$ 1003 -3053 -5961 -6646 -4744 -1109 2803 5736 6501 4848 1517 -2490 -5598 -6690 -5229 -1752
1494a752M118L198J044j346l092l879l312j552J023L062M034L219J521q42k827
$$ -1752 2366 5564 6608 5262 2170 -1709 -5021 -6573 -5550 -2488 1546 4765 6286 5444 2617
1509B617l782l414j740O41K893L898L439J720n24k542l623l561k141J7K384L874
$$ 2617 -1165 -4579 -6319 -5678 -2785 1113 4552 6272 5748 3206 -417 -3978 -6119 -6102 -3718 156
1525A56L599K071j40k157l319l384k289l42J855L490L786K379K26k026l282l490
$$ 156 3755 5826 5686 3529 210 -3174 -5463 -5805 -3950 -460 3326 5705 5931 3905 623 -2867
1541b867k509p48J506L327L825K868P50j467l054l588k800j096J062L017L744
$$ -2867 -5376 -6124 -4618 -1291 2534 5402 6152 4685 1631 -1957 -4757 -5853 -4791 -1774 1970
1556A970L001R58j305l001l430k806j326P91K692L819L367J617r17k905l648l008
$$ 1970 4971 5929 4624 1623 -1807 -4613 -5939 -5148 -2456 1363 4730 6347 5430 2525 -1123 -4131
1572d131j501M08K192L495L423J871m48k546l501l071j669L23K176L294L332K137
$$ -4131 -5632 -5224 -3032 463 3886 5757 5309 2763 -738 -3809 -5478 -5155 -2979 315 3647 5784
1588E784j87k183l544l237j967j19J729K949L363K500N24j802l175l233k100l18
$$ 5784 5597 3414 -130 -3367 -5334 -5453 -3724 -775 2588 5088 5612 3810 635 -2598 -4698 -5016
1604e016J453K629L179K478Q09j376l028l549k446o04J251K506L117K790J361
$$ -5016 -3563 -934 2245 4723 5532 4156 1128 -2421 -4867 -5471 -4220 -1714 1403 4193 5554
1619E554p82k618l403k741j148P88K269K930K680J505k92k343l444k979j312O20
$$ 5554 4772 2154 -1249 -3990 -5138 -4350 -2081 849 3529 5034 4742 2399 -1045 -4024 -5336 -4716
1635d716K240L151K886J766N3k139l320l310j920K70J982K964K833J864K15j555
$$ -4716 -2476 675 3561 5327 5380 3241 -79 -3389 -5309 -5039 -3057 -93 2740 4604 4819 3264
1651C264l018l253j966J05J840K975K871J895M29j448k863l402k465m76J710K939
$$ 3264 246 -3007 -4973 -4868 -3028 -53 2818 4713 5142 3694 831 -2571 -5036 -5512 -3802 -863
1667h63K956K048O88r21k333l139k514q48J195K618K966K128O14q97k114l000
$$ -863 2093 4141 4829 3908 1575 -1564 -4078 -4926 -3731 -1113 1853 3981 4595 3698 1584 -1416
1683a416k616j161Q69K496L015K448J121m62j820k750k796j628K24K001K951K518
$$ -1416 -4032 -5193 -4324 -1828 1187 3635 4756 4294 2474 -276 -3072 -4700 -4476 -2475 476 2994
1699B994J231k92j605k384k663j811j29J811L013K881J606j08j460k505k808k060
$$ 2994 4225 3933 2328 -56 -2719 -4530 -4659 -2848 165 3046 4652 4544 3084 579 -2229 -4289
1715d289o29J298K752L012J985L07j229k320k634k110p13J068K596L033K157L87
$$ -4289 -4918 -3620 -868 2144 4129 4436 3207 887 -1747 -3857 -4570 -3502 -906 2127 4284 4671
1731D671j304k324k765k168r21O75K313L193K546Q78j022k253k515k127j006L23
$$ 4671 3367 1043 -1722 -3890 -4811 -4136 -1823 1370 3916 4794 3772 1519 -996 -3123 -4129 -3806
1747c806J912K861K438J055p56k156k653k077j029K40J592K876K740J431m40j876
$$ -3806 -1894 967 3405 4460 3704 1548 -1105 -3182 -4211 -3971 -2379 497 3237 4668 4228 2352
1763B352k607k279j262j03J147K326K680J692O1j559k491k345j277n4J017K114
$$ 2352 -255 -2534 -3796 -3899 -2752 -426 2254 3946 4007 2448 -43 -2388 -3665 -3719 -2702 -588
1779e88K652J942L83j232k450k692j789l39Q02J921K546K214Q91q28k241k586
$$ -588 2064 4006 4389 3157 707 -1985 -3774 -4113 -3311 -1390 1156 3370 4261 3433 1192 -1394
1795a394j866m96O74J671K487K128R78m96k147k864k218o92O67J797K371K250
$$ -1394 -3260 -3756 -3082 -1411 1076 3204 4182 3686 1539 -1325 -3543 -4235 -3568 -1771 600 2850
1811B850J317j24j701k766k469j057L81J582K349K090J262m3j516k600k394j235
$$ 2850 4167 4043 2342 -424 -2893 -3950 -3569 -1987 362 2452 3714 3671 2155 -445 -2839 -4074
1827d074L71J644K248K198J473J39j191k473k607j538n5J339K072K209J356L98
$$ -4074 -3703 -2059 189 2387 3860 3999 2808 335 -2272 -3810 -3865 -2526 -454 1755 3111 3509
1843C509p32k001k492j734k49J239K102K160J413M49p50j851k436j947o63P48
$$ 3509 2777 776 -1716 -3450 -3699 -2460 -358 1802 3215 3664 2914 1063 -1373 -3320 -3983 -3235
1859c235J978K318J683P02k59j431k241k187r52M85J725K198J794P28k71j278
$$ -3235 -1257 1061 2744 3446 3187 1756 -485 -2672 -3624 -3139 -1414 784 2578 3306 3035 1757
1875A757k156k168j312J69J686K524K125R87j40j134k055k256j442k42J270K199
$$ 1757 -399 -2567 -3879 -3710 -2024 500 2625 3612 3472 2338 283 -1973 -3415 -3657 -2387 -188
1891a88K233J284p9j085j916k116j453k60J089K280K370J340Q0j038j838k180
$$ -188 2045 3329 3250 2165 249 -1867 -3320 -3580 -2491 -211 2159 3499 3579 2541 703 -1477
1907a477j674n98P47K041K426J610K75q84j688j888j467n97M19J744K376J667
$$ -1477 -3151 -3749 -3002 -961 1465 3075 3350 2466 778 -1110 -2577 -3174 -2755 -1011 1365 3032
1923C032M74q10j714k074j569p59K81J507K292J899Q75m11j472j888j644r33m
$$ 3032 3506 2696 982 -1092 -2661 -3420 -3139 -1632 660 2559 3434 3023 1551 -337 -1981 -2914 -2918
1940b918J109J997J972J089l28j450j904j715q42K1R43J872K105J366J73j190
$$ -2918 -1809 188 2160 3249 2921 1471 -433 -2148 -2990 -2969 -2026 -154 1951 3317 3490 2300
1956B300k018j983j157l04P93J702K021J407M43q72j913j900j220l39P50J616
$$ 2300 282 -1701 -2858 -3162 -2369 -667 1354 2761 3204 2332 419 -1481 -2701 -3040 -2290 -674
1972f74J959J684N36p93j934k183j353m64N08J463J939J807Q06m01j610k184j597
$$ -674 1285 2969 3505 2712 778 -1405 -2758 -3222 -2714 -1251 688 2495 3301 2900 1290 -894 -2491
1989b491m59N28J386J706J593Q10l52j368k128j764o97M32J295J902J653J027
$$ -2491 -2950 -2422 -1036 670 2263 3073 2721 1353 -775 -2539 -3236 -2804 -1509 393 2046 3073
2005C073k7j181j865j867r44K04R73J592J519J045K14r29j777j863j045L5J106
$$ 3073 3046 1865 0 -1867 -2811 -2607 -1634 -42 1477 2522 2736 1807 30 -1833 -2878 -2843 -1737
2022a737J641J588J136L47o35j614j997j455l57Q35J571J705J157N28m59j375
$$ -1737 -96 1492 2628 2975 2340 726 -1271 -2726 -3083 -2248 -677 1028 2185 2713 2254 879
2038H79j735j501n49N79J607J800J227N77m63j278j847j643p64L85J456J850J466
$$ 879 -856 -2357 -2906 -2327 -720 1080 2307 2884 2421 1143 -704 -2347 -3111 -2726 -1270 580 2046
2055B046P66k10j066j697j688j008K65J277J788J476O97k30r77j639j674j067
$$ 2046 2812 2602 1536 -161 -1849 -2857 -2592 -1315 473 1949 2646 2416 1439 -200 -1874 -2941
2071b941L3J204J838J783R32j57r47j481j579j177k91P85J696J692J070k6p82
$$ -2941 -2908 -1704 134 1917 2849 2692 1745 264 -1315 -2492 -2783 -1998 -302 1390 2460 2434 1652
2088A652j401j491j055l47P21J510J713J180L09p62j345j567j297o19M76J365
$$ 1652 251 -1240 -2295 -2642 -1921 -411 1302 2482 2791 2029 684 -883 -2180 -2799 -2323 -958
2104i58J713J315M64n04j172j396j148o79J44J092J708J493O34m56j343j495j272
$$ -958 755 2070 2534 2030 858 -538 -1686 -2365 -2221 -1129 579 2072 2706 2250 907 -588 -1860
2121a860o59Q9R00J573J585R97k7j075j522j469q56k0P95J463J539R62o0r17j425
$$ -1860 -2519 -2430 -1530 43 1628 2625 2598 1523 1 -1468 -2324 -2344 -1549 -86 1453 2415 2355 1438 13
2140A3j479q74j61P29J492J622J273J69q98j567j457j071j45N02J138J478J258
$$ 13 -1466 -2340 -2501 -1772 -280 1342 2615 2784 1886 319 -1138 -2209 -2354 -1852 -714 764 2022
2157B022N01o11j344j588j098j58N91J150J429J157M24l76j221j588j300m98M13
$$ 2022 2523 1912 568 -1020 -2118 -2276 -1685 -535 894 2051 2475 2099 878 -710 -2010 -2508 -2095
2174b095J051J420J322O98k25j049j392j324n19K12R14J094J333Q46q8r29j499
$$ -2095 -1044 376 1698 2396 2171 1122 -270 -1594 -2113 -1901 -987 107 1440 2286 2198 1269 -230
2191b30j466p19K36Q88J270J264Q98J74o51j182j593j014j57P46J332J225R18
$$ -230 -1696 -2415 -2179 -1291 -21 1243 2141 2315 1664 482 -1111 -2125 -2282 -1536 -204 1021 1939
2208A939J62n46j174j418j021k22O10J230J369J124L49m69j130j533j257m45N59
$$ 1939 2101 1555 381 -1037 -2058 -2280 -1670 -440 929 2053 2402 1933 803 -730 -1987 -2432 -1873
2225a873J121J319J103M79l35r12j358j238n79M21J092J386J127M60m03q09j273
$$ -1873 -752 567 1670 2149 1814 902 -456 -1694 -2273 -1852 -760 626 1753 2213 1810 1001 -272
2242b72j349p52J97R87J375J307O32r2q62j064j285q09J4P52J306J182O96r8o79
$$ -272 -1621 -2373 -2176 -1189 186 1493 2125 2033 1171 107 -1178 -1987 -1973 -1221 85 1267 1963 1865 1186
2261A186j089j284q36j29Q01J178J281Q88J11o11j030j209r72l32L96J085J333
$$ 1186 97 -1187 -2023 -2152 -1351 -173 1108 1996 2107 1496 466 -743 -1715 -2047 -1651 -566 767
2278G67R95R2m12j040j055r33m04L46J022J323J103L32m02r88j259j039m85J64
$$ 767 1762 1854 1442 402 -653 -1586 -1990 -1644 -622 701 1804 2136 1734 746 -513 -1552 -2037 -1873
2296a873Q56J227J209N76k20q52j219r95n60J31P58J196J169O24k08q40j197j137
$$ -1873 -1017 210 1419 1995 1775 923 -296 -1291 -1851 -1720 -962 234 1403 2027 1819 979 -218 -1355
2314a355o12L3O47J168J349Q15l6p40j151j131o72l9M78R44J169Q59J27n98j134
$$ -1355 -1967 -1934 -1287 -119 1230 2045 2009 1269 118 -1013 -1685 -1724 -1246 -302 867 1726 1853 1255 121
2333A21j102p37j40N30R75J180Q44L29m88r40j285q31k92L35Q10J119J045L64
$$ 121 -981 -1718 -1858 -1328 -353 827 1671 2000 1512 572 -713 -1544 -1836 -1501 -691 428 1473 1837
2351A837l15q80j155q58l09K26Q09J048R49M74j56p80j225j122m40J62P72J072
$$ 1837 1522 642 -513 -1371 -1680 -1454 -645 403 1352 1826 1670 890 -335 -1457 -1897 -1735 -963 109
2369A09R61O69n4n72j111j046o26N2O50R90J037N96K8n67j064j166n92LN37J011
$$ 109 1070 1739 1685 1113 2 -1044 -1670 -1618 -968 22 1059 1655 1683 1116 52 -1114 -1706 -1703 -1166 -155
2389a55J057P94J44m45r63j211p81j42M29R29J038P12J62k77q28j154p85k32L82
$$ -155 902 1696 1840 1395 432 -779 -1560 -1702 -1273 -344 694 1406 1568 1291 463 -691 -1476 -1708 -1326
2408a326R14J113Q00K29k82q29j037r19m04K50P91J019R08L54j20o38j052r00
$$ -1326 -412 701 1501 1730 1448 619 -418 -1337 -1741 -1491 -700 319 1227 1581 1461 823 -229 -1129
2426a129m59J60P33R85Q82M07j63n95r29r42n56M2N76J046R44N18j9m85q54r12
$$ -1129 -1588 -1428 -695 290 1172 1579 1416 821 -108 -1050 -1606 -1564 -988 58 1002 1520 1501 1016 162 -750
2446g50o94l8L63R66R28P12pm27q09j018o17k26M10Q84J047P32R7l20p54r32p54
$$ -750 -1444 -1482 -1119 -153 775 1487 1480 1053 244 -774 -1391 -1617 -1207 -323 724 1456 1553 1233 479 -453 -1207
2467a207l47K43P82J037P48K34k06q13r03p01l92L05O73R31R03K67k32o66r54
$$ -1207 -1554 -1311 -529 508 1256 1490 1284 471 -432 -1133 -1525 -1220 -547 384 1287 1554 1322 656 -298
2486b98p88m28J05O27R26Q81M26r4n95q60p83m12k0M32R03Q89M94n8n38q57p81
$$ -298 -1086 -1514 -1409 -782 144 1025 1451 1357 762 -98 -881 -1293 -1313 -881 22 911 1405 1347 809 -48 -829
2507h29n54L3L73Q18R47O05P4m39p70r35n24j26L10O81Q71O35K39l91p10q40o74
$$ -829 -1383 -1350 -977 -159 788 1393 1467 1028 258 -677 -1201 -1327 -1017 -336 535 1170 1409 1018 308 -532 -1206
2528a206j39K22O92R27O51L27k88o53r72p51k09J50O53Q09P37L36j57m82q76p52
$$ -1206 -1345 -1123 -431 496 1147 1474 1186 533 -439 -1190 -1399 -1249 -596 213 950 1286 1129 647 -229 -981
2548i81k89J37M41Q76P54M40m0n66q95q06m28K8N57P76P65N25M3m79p78p81n25
$$ -981 -1270 -1133 -692 184 938 1378 1338 772 -123 -929 -1357 -1329 -772 4 769 1294 1337 858 80 -701 -1226
2569a226rM29P09P42N28J9l04p65q19n44l5K82Q10P60N21K82l47p16p35p05j52
$$ -1226 -1235 -806 -97 645 1173 1192 888 123 -696 -1240 -1275 -993 -183 577 1098 1380 1033 317 -418 -1123 -1275
2590a275K38O73P36O27J64j85n88p35n99l12K61O00P44O08L31j83m92q24p02l73
$$ -1275 -1037 -364 372 999 1163 978 390 -345 -944 -1256 -995 -395 349 957 1288 1105 613 -211 -913 -1286
2610a286J32M79P72O94L86l1m82p10o56m59L9M77P08P53L57l0m31p08p79l78q8
$$ -1286 -1154 -675 97 791 1177 1146 664 -46 -702 -1161 -1122 -645 63 816 1173 1143 712 4 -775 -1153 -1241
2631a241M19O99P96M91N9l45n50q04n57j57L26O34Q21M49R2k24o75p03n36j50
$$ -1241 -822 -123 673 1164 1223 878 328 -476 -1033 -1190 -864 -230 591 1040 1132 908 233 -470 -1006 -1156
2651a156K45O08P30O25J43k46n36p21n98k10J15N47O94O36J85q7n39o26o37k08
$$ -1156 -911 -303 427 1052 1195 949 413 -308 -906 -1116 -1001 -454 240 876 1061 974 435 -191 -828 -1036
2671a036P7M46P07O18K92n0m69o95o61l03M6M01O29O66L76K5l20o86o65m02OL46
$$ -1036 -959 -513 194 812 1104 1054 585 -110 -771 -1074 -1028 -627 2 668 1044 1069 749 63 -602 -1004 -998 -652
2693f52N81O15M48M0l22o38o26m02j35K65O26O61N32J08k85n74o43m77k25K60
$$ -652 -71 544 992 1032 710 72 -554 -956 -1091 -826 -200 461 993 1101 816 242 -401 -878 -1103 -843
2713h43N68O62M69J69j76n42o30n02k25K04M76O63N56K19j27n06o69n56k72J02
$$ -843 -275 387 856 1025 849 307 -323 -825 -1050 -846 -370 293 849 1068 941 435 -234 -790 -1062 -960
2733i60M45O10O22K95l7m85o06n47l39J00L61O07N82L20om55n05o12l83L1K96
$$ -960 -515 95 717 1012 975 490 -116 -663 -1002 -902 -541 66 648 968 962 507 2 -610 -993 -962 -666
2754f66O50N22M58L6l22n32o02m31o3L23M74N65M20J03j64n74o68m18j06K28N35
$$ -666 -16 506 964 1000 678 146 -456 -887 -950 -627 -153 412 832 935 771 197 -471 -889 -995 -767 -232
2775b32N77M25K52k09n52n56n00k10K25M65N49N22J75j73m19n37m87k80J21M42
$$ -232 345 770 1022 813 261 -295 -795 -1005 -780 -315 234 756 931 758 339 -198 -685 -965 -844 -402
2795d02N74N13K61m7m69n49n36k41L7L85N60M52L34J6l92n29n24l24RL42M81N45
$$ -402 172 685 946 899 430 -119 -655 -896 -859 -474 86 538 872 888 496 -33 -557 -881 -872 -530 -49 496
2817D96L68M8l37m95n11m27q1L15N33N44L50M5k53m43n08m54o3J96M97N61L76
$$ 496 864 912 575 80 -431 -858 -939 -624 -91 453 803 848 595 152 -356 -810 -873 -677 -180 381 757
2838G57J52k04l90n61m71j50J33M71N10M61J60j29m15n38m76j82J27L83N73M76
$$ 757 909 705 315 -246 -717 -867 -734 -263 247 708 868 739 324 -214 -690 -872 -745 -362 211 687
2858F87J76j18l38n30m59k60P8L41M88M69K97l1k84n47m73k71n9L57M80M55L49
$$ 687 863 745 407 -123 -582 -842 -764 -423 65 534 831 800 516 -31 -504 -775 -834 -477 3 458 807
2879H07M8l29m59m90l92J8K72M90M43L32M5j78m96m86l48o7K05L74M78M06J00
$$ 807 855 526 67 -423 -815 -797 -525 -35 408 740 785 607 111 -375 -723 -790 -585 -211 267 673 773
2900G73j63m21m78l88j17J46L99N88L85J04j32m07m73m47j46K7L28N31M60K24
$$ 773 610 189 -289 -677 -794 -648 -249 339 724 828 696 289 -184 -631 -777 -750 -422 109 569 793
2920G93o8l87m85l57k70L8L89M56M48K03j06k45m30n36k22n8M20M34M22L50n3
$$ 793 725 338 -147 -504 -774 -736 -347 109 557 760 654 409 -21 -557 -779 -837 -417 17 439 789 736
2941G36k92l89m04l43m0K28M29M53K81Q0k70l75m76l62J8J55L80N00M50Kj65m38
$$ 736 444 55 -349 -692 -732 -504 -75 378 659 739 469 94 -382 -744 -726 -571 -191 309 759 761 596 158
2963A58m05l66j24J39L53M77L29J36j26l21n04l29q6O3L63M23M44J38j35l46l99
$$ 158 -247 -613 -737 -598 -245 232 561 697 571 250 -254 -583 -669 -606 -243 180 624 762 627 281 -118
2984a18m09j96J05J82M23M85K41j4l01l67m22k41rK40M56L33K44N0k37m22m46
$$ -118 -527 -723 -618 -436 -13 472 713 699 398 31 -391 -632 -641 -401 55 388 632 682 445 23 -423
3005d23k74n6K44M40M73K59Q1k39l81m21k79q4J81L37L96K92Q1j06l83n08k55
$$ -423 -697 -753 -509 -69 404 663 744 505 124 -297 -576 -660 -479 -142 254 546 627 521 138 -370 -625
3026f25j00J89L99L80L91R1q7l99l99m02j54J41L28L47L65J30p4k17m69l47j45
$$ -625 -725 -536 -137 243 634 725 638 239 -160 -562 -716 -575 -247 100 465 595 521 304 -165 -512 -657
3047f57J04L60L89K72K59q8l06m04m14k71K6L35L96L73K34pj82l55l38l03o4K88
$$ -657 -553 -193 196 468 727 639 333 -71 -485 -756 -730 -395 1 374 608 601 419 64 -274 -577 -641 -353
3069c53L74L47J96L6j79l85l45l35p4K22L62M59K23J21j52l23l88k89j32Q2M08
$$ -353 21 368 564 600 421 36 -309 -644 -718 -496 -134 325 548 669 517 194 -194 -483 -615 -533 -125
3090a25L86K05J82j20l79l67l14j12J46L32L82L53J08l3l69m31k98k85J43K64
$$ -125 261 466 648 528 149 -218 -532 -644 -498 -166 216 569 677 644 275 -156 -454 -739 -596 -332
3110c32M31L43J07o8j82m26k62k02N8K43L89M03P3k6k50m08l27j39o2K02L57L83
$$ -332 99 442 549 481 299 -127 -389 -591 -533 -290 99 502 575 549 299 -109 -436 -575 -637 -435 -78 305
3132C05K88M4k47k81l59j67j10J54L62L47K28%j43l45l10l10mJ17K97L16L40J55
$$ 305 593 637 390 109 -250 -417 -527 -373 -11 336 564 564 421 76 -234 -544 -548 -431 -134 182 522 677
3154F77j73k95l45k82j82J21K37L25K79K07j20k30l99l23o8P0K76L76K94K12j16
$$ 677 504 209 -136 -418 -600 -479 -242 83 362 569 449 219 -180 -503 -571 -501 -225 151 445 657 541
3175E41k16l66m07j40K0K67L74K53K04o5j76k67l42j55K6K27K43L81J89m4k17
$$ 541 325 -41 -448 -588 -568 -301 73 326 530 465 289 22 -320 -475 -449 -222 21 402 591 547 330
3196C30l67l48k09L8J51L69K92K09J07j25l32k89k97J4J21K86L14J44J11j51l13
$$ 330 -37 -385 -594 -556 -405 -36 256 465 572 447 115 -174 -471 -457 -336 -50 264 408 519 368 55
3217E5l11k70l3J54K28L89K40J76j02k38l59k97j79N3K92K69K12J51k0k23k71
$$ 55 -256 -526 -559 -405 -177 212 452 628 526 288 -71 -368 -547 -494 -202 67 279 430 410 187 -84
3238h4l27o6jK86L08K97J58%k11l35m11k15R8J73K56L53K20jj90k08l09k55l3
$$ -84 -411 -477 -478 -192 116 413 571 571 360 25 -386 -601 -503 -330 -74 279 499 498 308 100 -209 -464 -497
3261d97K20L61K50J89Lk16k47l67j90r6J73K87L80K07P2j26k14l17k47p1P4K66
$$ -497 -277 84 334 523 526 310 63 -304 -494 -590 -417 -130 250 457 529 403 189 -128 -375 -446 -372 -106
3283a06L14K15Jm9k42l18k65q8R7K51L22L26J01p3k40l16k07k13M3J33L12L20
$$ -106 208 423 424 375 133 -185 -450 -538 -441 -190 132 458 559 486 246 -70 -277 -490 -447 -314 -2 318
3305C18J23o7j42k94k39j32L2K12K50L01J81nk62k91k81j49m8P7L31L43J87K8
$$ 318 441 374 232 -62 -301 -433 -401 -189 61 362 543 538 276 -15 -296 -445 -493 -416 -85 258 445 473
3327D73j27k45k99j73p0P6L05K40L41l6j83l28k85j29j05J42K30L39K98O3r3k10
$$ 473 346 101 -198 -371 -441 -365 -60 180 521 485 302 -26 -311 -440 -545 -403 -173 166 464 527 434 224
3349B24l61k08j17J36J37L03K27J08j39k23l02j71j16J11J74L62J99J63j7k25
$$ 224 -137 -345 -462 -326 -189 114 341 449 310 87 -215 -386 -502 -391 -217 145 344 507 490 265
3369B65l15k44j19k7J87K20K25J56N6j60k46k97q9n1K20K68L44K7M3p6l38l24
$$ 265 -50 -294 -413 -440 -253 -33 192 348 404 244 -2 -299 -388 -439 -219 49 393 420 463 387 49 -275
3391b75j73k4P2K82K52K05R1r8k40k50k24l5J13K00K67J71J36j31j90l18k85o2
$$ -275 -448 -472 -400 -118 134 339 430 332 92 -158 -382 -417 -304 -104 163 334 470 339 149 -169 -454 -516
3413e16J45J88L15K37J51p8j99k65k83q1l1K56K35K18O3L3j50l79j90j02M6K04
$$ -516 -371 -183 132 369 520 442 243 -22 -305 -386 -417 -161 74 292 355 388 238 -141 -331 -433 -387 -183
3435a83K61K60J13l8j19k66k40k33j6J40L68J62J42m8o9j81k00j81l5J07K34L22
$$ -183 78 338 451 413 294 28 -212 -445 -461 -321 47 209 351 303 234 53 -147 -328 -363 -256 -22 300
3457C00P5M6o3k97k72j71p5R6K19L19J67M9l7k09j91k21j10R7J85K36K04jq0j81
$$ 300 375 421 358 61 -211 -382 -457 -361 -142 177 344 393 356 147 -44 -265 -375 -278 -93 143 347 346 266 85
3481H5j95j86j44JK65J91K81J12K7j62k74k31j77L9J66K27K09J07k8j84j89j28
$$ 85 -110 -296 -440 -439 -174 17 298 410 437 275 1 -230 -407 -368 -202 25 234 341 313 129 -60 -188
3503a88k16L6J88J83L12J46l4j12l21k09j30o2J10K81K50O7J22j22k56k09j26
$$ -188 -404 -368 -180 3 315 461 427 315 -6 -215 -345 -407 -297 -16 234 301 423 301 45 -164 -290
3524b90n6Q6L19J68Q4J12j46k27k25j69q4K5K08L43J24J54q9j85k61j96k9N4J54
$$ -290 -346 -260 59 227 311 423 277 50 -175 -344 -428 -403 -195 148 272 426 337 152 -109 -305 -334 -280 -126
3547a26J85K18M7K3k00k44k00n6j1J45L00J56J75l6j58k04k38j36l6K11J21K38
$$ -126 59 277 324 347 147 -97 -297 -353 -364 -219 81 237 412 376 218 14 -224 -360 -396 -185 -64 174
3569A74J15N8j85k49j34j27L8J31J91J67J81L8j04k29k66j21j15J30K39K09J17
$$ 174 289 347 162 -87 -221 -348 -310 -179 12 179 360 398 294 65 -201 -322 -437 -307 -68 141 258
3590B58J00n3k01j82j66q3P8J69K59J60J7p4k37j31j93j13K2K72J93J85Q5qk32
$$ 258 358 305 104 -78 -244 -327 -249 -80 179 339 356 282 45 -86 -279 -392 -370 -98 95 280 365 357 125
3613A25j71j92j27P0J23K15J75O4k4j25j78k37j02mK47J85J93J54mj40k30j95
$$ 125 -46 -238 -365 -295 -172 43 218 282 258 133 -45 -282 -384 -388 -141 44 237 391 387 247 17 -178
3635a78p4j02J30J87J90J04P4j17k05k08j05r1K25K43J66J42j2r8k03j96j35j42
$$ -178 -252 -354 -224 -37 153 257 331 214 9 -199 -304 -395 -170 73 239 381 369 271 68 -128 -263 -405
3657d05P8K38J98J10J49q5j06k00j84j29J15J72J16J81Q3k3k26j76j94n3l1K27
$$ -405 -327 -89 109 219 368 283 177 -23 -207 -336 -221 -49 67 248 331 308 82 -94 -288 -341 -372 -145
3679a45K27J83J12k5k07k08j35p2n6J74J87J56J11pj55k02j73p1L4J10K26J58
$$ -145 82 265 377 352 145 -63 -198 -270 -326 -152 35 191 302 295 140 -62 -235 -306 -272 -162 64 222
3701B22P5K6q9j86k13p5q9N1K20K07J07N7j03j65j77m5j17R4K16O3K03J04j25
$$ 222 297 323 234 48 -165 -240 -329 -278 -58 149 256 313 210 45 -132 -177 -294 -200 16 79 282 386 261
3724B61j82j74j80n8N4J81J13J92J50p0j28k21j14j07j1J58J83J85R1o0j69j94
$$ 261 79 -95 -275 -333 -279 -98 15 207 357 287 159 -62 -176 -283 -294 -136 47 232 323 263 94 -100
3746a00j38j29Q9J59J75J49J89n4j42k24j19j52NJ40K10R6J11M7j56j71j58j00
$$ -100 -238 -367 -278 -119 56 205 394 340 198 -26 -145 -297 -292 -152 58 154 265 312 156 -15 -173 -273
3768b73k2J41J89J51J20J0r0j91j53j72l7P6J98R9J49Q1p5r1j94j71p8J03J91
$$ -273 -295 -154 35 186 306 316 226 35 -118 -290 -327 -251 -53 46 195 276 201 110 -84 -255 -333 -230 -39
3791c9J25J04J44j21r8j80j81r3M1J53J90K00J08k4j53j43k19n3l3J32J59J55
$$ -39 86 190 334 213 115 -65 -246 -339 -298 -145 45 245 353 329 176 33 -186 -239 -272 -140 19 174
3813A74Q5L1j43j52k24j03K3J29K56J05P5O9j14j56k04q7n8J11J39J65J28K2q7
$$ 174 259 290 147 -5 -229 -332 -309 -180 76 181 256 325 211 55 -149 -236 -294 -183 -44 121 249 271 184
3836A84j58j81j14qJ03J18J93J28L9o8j24k11j58m1M2J79J43J14J23j10j22q2
$$ 184 26 -155 -269 -277 -174 -56 137 265 304 236 112 -99 -257 -298 -256 -77 66 180 303 193 71 -11
3858a1k28QJ9Q6K33N2R8J2j64j67j73k3n1J92J10K22P5l3r6j41j58j03j4R7J60
$$ -11 -239 -231 -212 -126 107 159 257 269 105 -62 -235 -258 -309 -117 -7 215 290 257 161 20 -138 -241 -255 -158 2
3883BJ80R2k5o4j74j49r8l5O8J92J67J36lo5j89j12j30j2L6J16J92R3J9l9j24
$$ 2 182 274 249 185 11 -138 -236 -271 -203 -11 156 292 289 224 35 -77 -207 -219 -183 -67 125 218 237 198 74
3908G4j61j02j00P3J31J86J13O5K8k57j49j24n6K7J29J51J16R3k3o9j98q2j03
$$ 74 -87 -189 -289 -216 -85 101 214 279 307 50 -99 -223 -279 -252 -123 28 144 237 214 145 -53 -135 -238
3931b38Q1M4J85Q2J10%j38r8j73r6rO4J98J97N2k2q0j30j74j12k6J33J05J67J55
$$ -238 -157 -113 72 154 264 264 126 28 -145 -241 -250 -186 12 209 261 239 159 29 -145 -257 -283 -150 -45 122 277
3956B77o6p6q4j95q4k0O5J40J54J31j3n7o5k07j11l6Q5P1J21J58O7n1p8j51k00
$$ 277 211 135 51 -144 -228 -248 -183 -43 111 242 229 172 107 -100 -211 -247 -162 -91 30 188 255 204 126 -25 -225
3981b25L4jJ00J47J49J6K1j02k36j02l3n9J51J91Q4P2K3n1j22k10o8m3J46J30
$$ -225 -191 -192 -92 55 204 220 241 139 -97 -199 -232 -291 -140 51 135 207 230 179 57 -153 -221 -264 -118 12
4005A2J24K3L2J5j76j72r1L1M8J76J26Q3K5j08o3j52j36l1NJ82Q0K06K1j19l2
$$ 12 136 159 191 206 30 -142 -233 -202 -154 22 148 231 256 148 85 -67 -203 -234 -229 -47 33 239 260 141 109
4030A09k05j03l4O3M7K02J08M3J2j22k32j3j31K2J27J20J43P6k5j34j18n3j42
$$ 109 -96 -199 -233 -170 -123 79 187 230 242 120 -112 -125 -256 -234 -107 13 156 232 207 73 -45 -98 -240
4053b40O2N3J69J19Q9m8j09j28j63j5k5J13J27J51L5L3o9j61j15q3m2O5J70J43
$$ -240 -178 -125 44 163 252 204 95 -33 -196 -211 -236 -123 4 155 190 223 154 -7 -122 -205 -247 -182 -12 131
4077A31J04K2n5j88q4j39n4Q0J83J08J21N4j03j09q5j48n6N2P8J68O6O0j4j34
$$ 131 235 257 202 14 -70 -209 -263 -183 0 108 229 283 180 71 -14 -162 -218 -166 -88 80 146 206 192 58
4101E8j28q0n7RP8J87J09Q8m3j51j31j04p1MJ08K04L2J15Qj40j43j32nj3O7Q4
$$ 58 -70 -150 -207 -198 -120 67 176 264 221 70 -61 -165 -236 -232 -124 80 112 227 235 95 -48 -180 -185 -198 -131 -47
4127d7R7J39Lp4j59o2j32k4J79M6J15J61M4j20j32j35p6j8N5J37Q4J04j3l5m5
$$ -47 50 189 192 118 -41 -103 -235 -259 -80 -34 81 242 286 166 34 -101 -177 -195 -140 -3 81 185 172 137 92
4152I2j83p0o0K3J72J08Q8Q2r1j14j37o4r5oJ21J58R3J2N5r6j32q4m8l7J38J40
$$ 92 -91 -161 -221 -198 -26 82 170 252 161 47 -90 -154 -249 -255 -134 24 117 129 184 88 -44 -128 -176 -213 -75 65
4178F5M0J08k8m3j74n4j10j3P5J39J45L6M7j25o2r2j33nL5J35R2P0O2r7r9r8r5
$$ 65 105 213 185 142 -32 -86 -196 -209 -134 5 150 186 233 108 46 -46 -179 -184 -149 -14 78 148 210 113 14 -84 -179
4205a79m1O2J50O5J12N1n5j32p1q3p7M7Q1J27J05Q0o1j29q4o4j22M5R8J28P8M8
$$ -179 -220 -158 -8 57 169 220 165 33 -38 -121 -198 -151 -70 57 162 242 181 52 -32 -96 -218 -173 -75 53 131 179
4231A79J9j54r7m0j37K7J07J24Q5P5K1q0j25j50m8l3J24J19Q8L9R2q0r3j07j06
$$ 179 198 44 -53 -93 -230 -203 -96 28 113 188 209 129 4 -146 -194 -227 -103 16 104 143 235 155 62 -45 -151
4256a51o0J16M9J20P7R4q6j44j22p7M2LJ14O4J43K3l5j54p3q4k7%J18J15P2M9
$$ -151 -211 -95 -46 74 151 245 159 15 -107 -184 -142 -139 -25 39 182 205 170 16 -57 -141 -168 -168 -50 65 137 186
4282A86kn8j75j18r3J05O3J08J01R3o2n2q1j43p0L2O0J25R7O6P1j75n0q4q1p2
$$ 186 184 126 -49 -167 -260 -155 -92 16 117 210 148 96 15 -128 -198 -166 -106 19 116 182 253 78 28 -56 -137 -209
4308b09Q5J44P7O5O0p0o5j95k6n1P4J32N5O7L8lj76n2j31l0N5J31P2J58l4pj42
$$ -209 -124 20 97 162 222 152 87 -108 -134 -185 -111 21 76 143 181 178 2 -50 -181 -211 -156 -25 47 205 171 164 22
4335B2j01p4oJ2J06R3J20K6o8m9p7j57j0j8P0J94J2J18n1q0j13j01m3j0J26Q8
$$ 22 -79 -153 -159 -147 -41 52 172 198 130 81 4 -153 -163 -181 -111 83 95 213 162 82 -31 -132 -175 -185 -59 29
4361B9P4J08r0J6j21j12l9n2Q8J16L9J28n5k9j06q8m0k9J9J08J25R2m7n2q1r8
$$ 29 103 211 121 137 16 -96 -135 -187 -99 17 56 184 129 100 -6 -94 -134 -163 -144 -36 89 181 134 82 1 -97
4387i7K4j30P0N1J35J19l2J9p1j06o1r8P9LJ31P8M9jj54p9p4m2R9K0Q7R1P7Oj04
$$ -97 -73 -203 -133 -82 53 172 140 159 88 -18 -79 -177 -98 -95 36 114 163 162 8 -71 -145 -187 -88 -68 19 110 187 193 89
4416H9j83Pp6RR1J28J1O9jl7j12o9j12L9P8O7N6J17k2l4n9j24p0j7M1P0J29Q9
$$ 89 -94 -87 -163 -154 -63 65 76 145 144 107 -5 -74 -186 -147 -69 -2 54 171 149 115 56 -68 -138 -155 -114 -44 85 174
4444A74o1%j14o3j03j2J03P9L5J19Ln2n7r0j23RjQ0N9J31M6k1j00o8q6jm7O9Q2
$$ 174 113 113 -1 -64 -167 -179 -76 3 38 157 160 108 51 -39 -162 -153 -154 -74 -15 116 162 141 41 -27 -113 -114 -161 -92 -10
4473a0N3J73q8q4o3n9m6o6R5J39P3K2L6q6m0j73k8pP6O7K2J14j1qj89P7j87J9
$$ -10 43 216 128 44 -19 -78 -124 -190 -95 44 117 139 175 89 49 -124 -152 -159 -83 -16 6 120 109 101 -88 -11 -198 -179
4501a79M7J09J13M6J3q8l0n8m7r9L3J32O1N6K2jn1j30j1q7J5Q5J58K2Nk4l0j55
$$ -179 -132 -23 90 136 149 61 31 -27 -74 -173 -140 -8 53 109 131 130 79 -51 -62 -149 -134 -49 109 131 136 112 82 -73
4529g3p0l5N2PP5J54L2j3n8r3l3n3k9N4N9J01L7J4n8j05l1j7k8l0J99M5P3l3q6
$$ -73 -143 -178 -126 -119 -44 110 142 129 71 -22 -55 -108 -137 -83 -24 77 114 128 70 -35 -66 -83 -111 -141 58 103 176 143 57
4558E7m3l7p7Ol6J05J16J1M9q2k0j17p0kQ9J04K5P0J8m4n4p7j40l7O0K3P9J29
$$ 57 14 -23 -100 -94 -130 -25 91 102 151 69 49 -68 -138 -140 -51 53 78 148 166 122 68 -9 -149 -186 -126 -103 -24 105
4586A05N1n0l4j01j8p7J3O2K9Q9O8M3j32o4r0Pr4J19J12Q1m4P5m1q8j15RJ9j3
$$ 105 156 106 72 -29 -47 -124 -111 -49 -20 69 137 180 48 -16 -106 -99 -193 -74 38 119 75 150 109 21 -94 -85 -66 -79
4614g9J09K8L5P6o8o7q4j10lQJ46O6QM8rq2n6r8j0P2rJ44M6L2p4j6r1n2n3K3J11
$$ -79 30 58 93 169 101 34 -50 -160 -163 -155 -9 57 65 113 104 22 -34 -132 -142 -70 -79 65 111 143 69 53 -38 -90 -143 -120 -9
4645iO0N9N1m5n6o6m4j4o3P3J48k0M6Pn6j04j2k9m5N3J15O5k0k4K0r8p8j4%J0
$$ -9 51 110 161 116 60 -6 -50 -64 -127 -54 94 74 120 127 71 -33 -45 -74 -119 -66 49 114 94 70 90 -8 -86 -100 -100 -90
4675i0N6J56ll4J3m7j12n4k5M1J35K8J7K8K3p2j26J9o3L3M4J26J6J6mp4q0n5l
$$ -90 -34 122 119 85 98 51 -61 -115 -140 -99 36 64 81 109 132 60 -66 -47 -110 -77 -33 93 109 125 121 47 -33 -88 -91
4704i1j8L9J54oP7p9m3o0k8m6k2J03M1O4M0Qo5o2o6l4k5O0Q8L3J4K9l8m6l9l1
$$ -91 -109 -70 84 78 155 76 33 -27 -55 -101 -123 -20 21 85 125 133 68 6 -60 -94 -119 -59 29 62 76 105 67 21 -18 -49
4734d9m1L3J13o3J18k5l2o1n7l9N9m5R4O5N0j6K2q9j23K0l3k2P6J09J8J5N8r3
$$ -49 -90 -57 56 -7 111 86 54 -7 -64 -103 -44 -89 5 70 120 104 126 37 -86 -66 -99 -121 -45 64 82 97 155 62
4762F2j09p8J4MO2J39j6J5K4p5oj17n3O7K7P1nK9k1N1p5m4q6J9Q6J6L3P7k7l6
$$ 62 -47 -125 -111 -107 -45 94 78 93 117 42 36 -81 -134 -67 -40 31 26 55 34 85 10 -34 -120 -101 -15 1 34 111 84 48
4792D8o1lq6M2j2Q6J7P6Jk5m7r7J0k4K0O7O2M9j6Mm5q3j22J00m0L4Q3O4Qk6j9
$$ 48 -13 -16 -102 -60 -72 14 31 107 108 83 36 -61 -51 -75 -55 12 74 123 107 111 66 -17 -139 -39 -79 -45 38 102 110 84 65
4823F5o5l7n4K2L8N7OM0pn1Qj06l7O8M4P3M0oj6K5j17r3NM5MM4N9RM9n8p8Mn5
$$ 65 0 -37 -91 -69 -31 26 32 72 65 14 22 -84 -121 -53 -9 64 104 98 82 107 -10 -103 -98 -53 -49 -5 54 63 112 54 -24 -20 -75
4856g5L7K3J2N3K6K6k3j17kj02O6J0N5R0l4mKl1m0p5J0M7kN6R6nl2Lj14k5Po5
$$ -75 -38 -15 -3 50 76 102 79 -38 -40 -142 -76 -66 -11 79 45 41 43 12 -28 -103 -93 -46 -48 8 104 99 67 70 -44 -69 -62 -127
4888a27J43L2K7L4qqp7q9L3kK3M1M8K3k4n8o2j8M5k2m5J53M2k4K4l9m7n1j05M6
$$ -127 16 48 75 109 101 93 16 -73 -40 -42 -19 22 70 93 69 11 -51 -69 -24 -46 -91 62 104 80 104 65 18 -33 -138 -92
4918i2Q1J8M7OP1o3j48M7j2MQJ8R7L2l5j4l4r6k3K8K3kK9L3R9Mn6n1m0k3K%J9
$$ -92 -11 7 54 60 131 68 -80 -33 -45 -41 -33 -15 82 114 79 65 31 -65 -88 -60 -37 -39 -10 23 122 126 70 19 -21 -44 -42 -42 -23
4951b3R7JQn3n7n3p2R5JO5L9O7m4K9q8j03K2l3J8P1M5K0lL4q6n2l7O6L8M6K8M3
$$ -23 74 75 83 30 -27 -80 -152 -57 -56 9 48 115 71 100 12 -91 -69 -102 -84 -13 32 52 49 83 -3 -55 -92 -26 12 58 86 129
4983A29o7nr4m3L9l5J0O8L4K2M4p7Kk4o9n2Q1NP3M9o6m0J8l5n8JN0JJ12RM6l3
$$ 129 62 57 -37 -80 -41 -76 -66 2 36 58 102 25 27 3 -66 -118 -37 -32 41 90 24 -16 2 -33 -91 -90 -40 -39 73 82 128 95
5015I5m4n1m1mj1J9N7M3kj5M5r0n7rK5q8J55j1O4j3L5j19p4Lj7L9M4M5K4K2m7
$$ 95 51 0 -41 -45 -56 -37 20 63 61 46 91 1 -56 -65 -40 -128 27 16 80 67 102 -17 -91 -88 -105 -66 -22 23 47 69 22
5046B2m0Jl6l9P6l7L2R5mOn5j5q2nJ1J2O1M2K9Qn8m2l4%J5N4M9j0m9Q4j09k8j7
$$ 22 -18 -17 -53 -92 -16 -53 -21 74 70 76 21 6 -76 -81 -70 -58 3 45 74 82 24 -18 -52 -52 -37 17 66 56 7 91 -18 -46 -63
5079f3qK2L7N2K2L1m3K3o6l9k6l0M6N8L7qJ2No1m0l0M0PN5mQ6k1p2k9j2k1ll2
$$ -63 -71 -49 -12 40 62 93 50 73 7 -32 -58 -88 -42 16 53 45 57 62 1 -39 -69 -29 -22 33 29 115 94 22 -7 -19 -40 -43 -75
5112g5Q4L6KL5o2m2k0n0M7J5L8N6K2l4j3J1o4p7L2n8J07O7oL7m8mm7MN6j46R2
$$ -75 9 45 47 82 20 -22 -42 -92 -45 -30 8 64 86 52 39 50 -14 -91 -59 -117 -10 57 51 88 40 36 -11 -7 49 -97 -5
5143eL4M4k6j6N3q2l7LQM0O0%j2o5R7j28Kk5PM4l1Q2l9J8pRo3J2J1m9Q3K7%k4
$$ -5 29 73 47 31 84 2 -35 -32 -24 16 76 76 64 -1 96 -32 -30 -55 -48 -4 -35 47 8 26 19 28 -35 -23 -12 -61 22 49 49 25
5177B5J3j0n9J6J7Oq2J24pK4M8j10N8q5j8nL4P4No7N1m8k7n6N6k5M1j6M4N7k9
$$ 25 38 28 -31 -15 2 8 -74 50 43 67 115 5 63 -22 -40 -45 -11 63 68 1 52 4 -23 -79 -23 -48 -7 -23 21 78 49
5208D9l4Pq8J7j6L1O6m9RO1K4k0o0n0Q0n4K0K2K8j6k1k7j4M1Kk2k0P1j2K2j7k8
$$ 49 15 22 -66 -49 -65 -34 32 -17 -8 53 77 57 -3 -53 27 -27 -7 15 43 27 6 -21 -35 6 8 -14 -34 37 25 47 30 2
5240Bj6m9J8LJ05p2L4N2o3k7J3o3M1J2J6K2Rk8L1j4on8k3O0LO6n1lJ0L4m2l3J9
$$ 2 -14 -63 -45 -42 63 -9 25 77 14 -13 0 -63 -22 -10 6 28 37 9 40 26 20 -38 -61 -1 2 68 17 14 24 58 16 -17 2
5273Bk7K3N3Mk8%Qr3pK2K2n5QR0J5j2M5j26K3o2K0J9L9M1J6NlJ7r7K8l6jJ05m7
$$ 2 -25 -2 51 55 27 27 35 -58 -65 -43 -21 -76 -68 22 37 25 70 -56 -33 -95 -75 -56 -17 24 40 45 42 59 -38 -10 -46 -47 58 11
5307A1L1Lk2k9j3L6m9jJ0R7k0j6L9m8m2J7q7J5M8L4L7j0Kn2O8n9Kr0O0K2N6j6
$$ 11 42 45 23 -6 -19 17 -32 -33 -23 74 54 38 77 29 -13 4 -83 -68 -20 14 51 41 43 -9 59 0 2 -88 -28 -6 50 34
5339C4l7M2m9m2j5j3N9J8K9M7Ql0n2r9R4rn6N3M5QMl3J6j09M4K5M5mK4jK1m3l5
$$ 34 -3 39 -10 -52 -67 -80 -21 -3 26 73 81 51 -1 -100 -6 -15 -71 -18 27 35 39 6 22 -87 -43 -18 27 23 47 46 67 24 -11
5372a1o0PO4RM0n4P4k0j4j01O2Lm2oK9R4rrLLl6n4n0J07j3K3mK3k6J6J4j11N6
$$ -11 -71 -64 0 9 49 -5 69 49 35 -66 -4 -1 -43 -49 -20 74 65 56 59 62 26 -28 -78 29 16 39 35 58 32 48 62 -49 7
5405Gl5M7n0L7%J2j1K5j16K9L8QJ9L5l1k4M8n3m3RJ1K4J9j6L8M0m7J1rn4QK3J4
$$ 7 -28 19 -31 6 6 18 7 32 -84 -55 -17 -9 10 45 14 -10 38 -15 -58 -49 -38 -14 5 -11 27 67 20 31 22 -32 -24 -1 13
5438A3k2L9L2l4j9m2nJ3l1M8J4M8m8mj7J2l1k9L2K5l3J6Q7o0jm5L0On8N6N9Jj2
$$ 13 -9 30 62 28 9 -33 -38 -25 -56 -8 6 54 6 2 -15 -3 -34 -63 -31 -6 -39 -23 64 4 3 -42 -12 -6 -64 -8 51 52 40
5471D0M3o9J2m0mm2N8J6j5J01p9m4J0Qk0J6PK5mN8p0J2nn9Q5m4n8J05j0K2j5k3
$$ 40 83 14 26 -14 -18 -60 -2 14 -1 100 21 -23 -13 -5 -25 -9 -2 23 19 77 7 19 14 -45 40 -4 -62 43 33 55 40 17
5503A7k1m3j8M0k8M2Q3j7n1L7m0ro1J9M6n1J06l3Qqj9K5j07J00p9Q1j4K6K1n2
$$ 17 -4 -47 -65 -25 -53 -11 72 55 4 41 1 -8 -69 -50 -4 -55 51 18 26 18 -1 24 -83 17 -62 19 5 31 52 0
5533@L9l8m1K9j6L0%J3J0o5R5p2l8J0J1J5%O3l3k1M6q6K8NQN4o9N9J7m6J2j5k7
$$ 0 39 1 -40 -11 -27 3 3 16 26 -39 56 -16 -54 -44 -33 -18 -18 45 12 -9 37 -49 -21 -16 -8 46 -23 36 53 7 19 4 -23
5566b3L4j6l1LO9m8Q2o8K1K6o8J9L3k3m%K8kk1l0qn3P8M1pr3K8%L1n3Q8o5K4K8
$$ -23 11 -5 -36 -33 36 -12 70 2 23 49 -19 0 33 10 6 6 34 32 11 -19 -27 -80 -2 39 32 -61 -33 -33 -2 -55 33 -32 -8 20
5600B0m1N5L5n1k7QJ9o7N2pM2k0KoRl2k0K4o4M6rj9R6j6j4k0n3M4k3RK6N0qk0
$$ 20 -21 34 69 18 -9 -1 18 -49 3 -4 38 18 20 14 23 -9 -29 -5 -69 -23 -32 -51 45 29 15 -5 -58 -14 -37 -28 -2 48 40 20
5634B0L3n9mj7l1J12n8oM4k3Pj1rm7K6kJ8J2qJ6K1j9rKm7L7j7k8KQ3k9J2m1L3
$$ 20 53 -6 -10 -27 -58 54 -4 -10 34 11 18 7 -2 -49 -23 -25 -7 5 -3 13 34 15 6 8 -39 -2 -19 -47 -45 38 9 21 -20 13
5668A3m9M9r6R1j0rL0K6j7l0L0n6QM5RJ6J1m3L3j6k9N1j9l6K0K3k9j5l9K0P5p0
$$ 13 -36 13 -83 8 -2 -11 19 45 28 -2 28 -28 -20 25 34 50 61 18 51 35 6 57 38 2 22 45 16 1 -38 -18 57 -13
5700a3J1QK3K9p8O2q7L0k7l0M7J7Ok6PN2n5N1k7J3l9j5Q7l1JLk5lj9N1rK3K9q1
$$ -13 -2 6 29 58 -20 42 -45 -15 -42 -72 -25 -8 -2 -28 -21 31 -24 27 0 13 -26 -41 46 15 16 19 -6 -9 -28 23 14 37 66 -15
5734a5P6o9K8pk8O9o4J5J1Om1K7j9RJ6l3o4O6j9J2Q0o0LK4p6L2Om1Q1k1K0j1j6
$$ -15 61 -8 20 13 -15 54 -10 5 16 22 -19 8 -11 -2 14 -19 -83 -17 -36 -24 56 -4 -1 23 -53 -21 -15 -56 25 4 24 13 -3
5767cK1k5K5pj00J18m9L3M1J4n5J2Kq0J14l4n8L5k0nM2kK6j7p2L9K7krJ7rq6P3
$$ -3 18 -7 18 11 -89 29 -20 13 54 68 13 25 27 -53 61 27 -31 4 -16 -21 21 19 45 28 -44 -5 22 20 11 28 19 -67 6
5800Fr3J27n0L4j8k4M5j6Ok5L1Oj0m3M7K1j5L1p5rK3L8QnJ5k4J5l8J0n5N3o5Q2
$$ 6 -87 40 -10 24 6 -18 27 11 17 -8 23 29 19 -24 23 44 29 60 -15 -24 -1 37 45 40 55 31 46 8 18 -37 16 -49 33
5833C3n5M7m5J5n2M8L4m8K4l8K4k3R9q5J5M3L3o7k3QK8L3J1p7J8jN7n1M1m5N3
$$ 33 -22 25 -20 -5 -57 -9 25 -23 1 -37 -13 -36 63 -22 -7 36 69 2 -21 -13 15 48 59 -18 0 -1 56 5 46 1 54
5864E4m4M2pm1Pk8k9O2p5RK4K2N5n3J3L1m9J4k5nP3Km5rRk3l9M9K8J5pjk8K8P
$$ 54 10 52 45 4 11 -17 -46 16 -59 -50 -26 -4 51 -2 11 42 -7 7 -18 -23 50 52 7 -2 7 -16 -55 -6 22 37 30 29 1 29 36
5899C6j4l2j4K7m4O0jn1LO8q3oL9L0m9R3m2j3qJ4p3P8%k2o1M6KN0Jl5j5j6J8O4
$$ 36 22 -10 -24 3 -41 19 18 -33 -30 38 -45 -51 -12 18 -31 62 20 7 -1 13 -60 18 18 -4 -65 -19 -17 33 34 -1 -16 -32 -14 50
5933E0No1nL8J2J6J8j03M2j3L3l9L5l6Kj0K0K5q4K1M4n6N7j5jq%j8rM3j4m2J02
$$ 50 55 -6 -11 27 39 55 73 -30 12 -1 32 -7 28 -8 -6 -16 4 29 -55 -34 10 -46 11 -4 -5 -13 -13 -31 -40 3 -11 -53 49
5966D9K9n9l4M9o9J2M4j0L7m4K1k5N5o6M9j10N6j8J3L2J8Mm7%jj9oM6J6N9n2K0
$$ 49 78 19 -15 34 -35 -23 21 11 48 4 25 0 55 -11 38 -72 -16 -34 -21 11 29 33 -14 -14 -15 -34 -40 6 22 81 29 49
5998D9l1On9j7P7n8M3ol9O6o4Ok4j1K0O1K3q2M7Kk4N2j19N2J5j4Q9k7mL5o6K0
$$ 49 18 24 -35 -52 25 -33 10 4 -35 31 -33 -27 -51 -62 -42 19 42 -40 7 9 -15 37 -82 -30 -15 -29 60 33 29 64 -2 18
6030A8o2K9o0M4MN3k0K2j1Rm6L2l3j0O5l6m7N6l0k3J0j9J6M7j6k4N5k7K0L1j2
$$ 18 -44 -15 -75 -31 -27 26 6 28 17 26 -20 12 -21 -31 34 -2 -49 7 -23 -46 -36 -55 -39 8 -8 -32 23 -4 16 47 35
6061C5k1n8M3nL1o%j3k6K9j5J5o6K1P7K2n8J0j7K2j09Q8M5m4jM2j4Ok6j2Mm0O5
$$ 35 14 -44 -1 -6 25 19 19 6 -20 9 -6 9 -57 -36 41 63 5 15 -2 20 -89 -1 44 0 -1 41 27 33 7 -5 -1 -41 24
6094B4l7Kj1L9j8j7P1p6K0m9M0N1j6pk2J4Mk0rk8N0Qm9Q4n2J7n1N2j8J2n0M4n9
$$ 24 -13 -11 -22 17 -1 -18 53 -23 -3 -52 -12 39 23 16 -6 8 12 -8 -17 -45 5 13 -36 48 -4 13 -38 14 -4 8 -42 2 -57
6127e7M7j9Rm2MQ9q2O2Om2O3k1qJ9l6kj8P6m1PNO7k1j8j6l0k5J1j2RK5K5pl9R
$$ -57 -10 -29 -20 -62 -58 31 -51 11 17 -25 38 17 9 28 -8 -10 -28 48 7 14 19 86 65 47 31 1 -24 -13 -25 -16 9 34 27 -12 -3
6162co2K9J1P7r6%LP7j8n6mK5M8l4j4Q0l2j2K3m1l2K3L2OJ6o3K0NL8o0O8o1M0
$$ -3 -65 -36 -25 52 -44 -44 -41 36 18 -38 -42 -17 31 -3 -17 63 31 19 42 1 -31 -8 24 30 46 -17 3 8 46 -14 54 -7 33
6195C3m6oO3j1J6k5j4lkn3O2j9L1k8j4O3m8m1nL3JJ9K0L6n5P9q7K8j04O9Rj7J7
$$ 33 -13 -19 44 33 49 24 10 7 5 -48 14 -5 26 -2 -16 47 -1 -42 -47 -14 -13 6 26 62 7 86 -1 27 -77 -8 1 -16 1
6228AN3k7Rm8Pk1mJK5pj2L9N2m0J0q5K3J6k8j3K6K5L8p7O1m1J9rm0K8L2j9K9j6
$$ 1 54 27 36 -12 -5 -26 -30 -29 -4 -11 -23 16 68 28 38 -47 -24 -8 -36 -49 -23 2 40 -37 24 -17 2 -7 -47 -19 13 -6 23 7
6262Gl5ML1qJJ4OJ5L1l6rl4K7p7K6N6L0Qk8k7L9k4l4K2rN8m5J6J1j0j2K5p7K6
$$ 7 -28 -24 7 -1 0 14 20 35 66 30 21 -13 14 -63 -37 19 49 57 29 2 41 17 -17 5 -4 54 9 25 36 26 14 39 -38 -12
6296a2j5PPP2n3J3J1l9J0j02O4L2k4P1qk1l8O8m1NMN%J0o1P0k4%j1j4l5J7jJ5
$$ -12 -27 -20 -13 59 6 19 30 -9 1 -101 -37 -5 -29 42 34 13 -25 43 2 7 11 16 16 26 -35 35 11 11 0 -14 -49 -32 -33 -18
6330a8R4r1M5p0Nl5Ml1R6k9LM0K9n0j1k6L4k4K2J6L1k1M0pn0k9j5L6K6j8k8J10
$$ -18 76 -15 30 -40 -35 -70 -66 -97 -1 -30 -27 13 42 -8 -19 -45 -11 -35 -13 3 34 13 53 46 -4 -33 -48 -12 14 -4 -32 78
6362G8l4p2J4n7Q7q8O6L2p5J11o6Nm9R7m7l1L1pQ4o4Rm6M4l2M9r7PL5L2oJ6l6
$$ 78 44 -28 -14 -71 16 -72 -6 26 -49 62 -4 1 -48 49 2 -29 2 -5 79 15 24 -22 22 -10 39 -58 -51 -16 16 10 26 -10
6394a0j3P2q6%J7j8M2J7L0o1j5M4l8j9M2q4N4M6L0j3Nl1k0j26QJ64J2Jj7K0m4
$$ -10 -23 49 -37 -37 -20 -38 4 21 51 -10 -25 19 -19 -38 4 -80 -26 20 50 37 42 11 -9 -135 -127 37 49 50 33 53 9
6425IL9p4j5KM9M5nl5Q7j31J5nl6M5j3M1O1k9n9M9j3Jn9N3k0J8L4k6lJ7j9Lp6
$$ 9 48 -26 -41 -39 10 55 50 15 102 -29 -14 -19 -55 -10 -23 18 79 50 -9 40 27 28 -31 22 2 20 54 28 25 42 23 26 -50
6458e0M1m2O0J4J0OQn1j6Rm1M1J2K8J9ql6oM1j53O8Jl0J20L1r0R1l6l4m3k2O7
$$ -50 -9 -51 9 23 33 39 47 -4 -20 -11 -52 -11 1 29 48 40 4 -2 39 -114 -46 -45 -75 45 76 -14 77 41 7 -36 -58 9
6490IoPkJ9m1K7j7n8rM9J2K6jL5m6j3L4j4n7JR3m3J4kL2K2p3j0n3M5K7NRM6K0
$$ 9 3 10 8 27 -14 13 -4 -62 -71 -22 -10 16 15 50 4 -9 25 11 -46 -45 48 5 19 17 49 71 -2 -12 -65 -20 7 12 21 67 87
6525H7m7n2J0L6r3J6Q2o6J00j08M9M5n3q0M0J1nP8l1O2l2k6n7Mj8qJ4P8j0M6n3
$$ 87 40 -12 -2 34 -59 -43 39 -27 73 -35 14 59 6 -74 -34 -23 -28 50 19 81 49 23 -34 -30 -48 -56 -42 36 26 72 19
6556A9KJ1k9n2M7l8J8R7l2M6o2J5j00l4Q2lM6j7K5MJ6l0n0l%L1m5K8K1K5qm0L4
$$ 19 21 32 3 -49 -2 -40 -22 75 43 89 27 42 -58 -92 -10 -13 33 16 41 45 61 31 -19 -22 -22 9 -36 -8 13 38 30 -10 24
6589B4n0K9k2PP6k2n0Q1n3m6L0m7M6LpJ2O8pn5K0r6J6J8L2L5k0NK0j6j4n2J4p
$$ 24 -26 3 -19 -12 64 42 -8 73 20 -26 4 -43 3 6 -1 11 79 72 17 37 -59 -43 -25 7 42 22 27 47 31 17 -35 -21 -28
6622b8M7m7N5J07r4k9n2K2p8NQ5mJ6L6nJpNj6on1O5j1J7j5N7l7l0j9k0k2jP3n
$$ -28 19 -28 27 134 40 11 -41 -19 -97 -92 -7 -11 5 41 36 37 30 35 19 13 -38 27 16 33 18 75 38 8 -11 -31 -53 -54 19 14
6656A4J7K1k2m5J4ql1qP3J9l0Kk2j1J5k9k3N9PM5m5j7J2k0k6n1R2K0K0K1j5n6
$$ 14 31 52 30 -15 -1 -9 -40 -48 25 44 14 16 -6 -17 -2 -31 -54 5 12 57 12 -5 7 -13 -39 -90 2 22 42 63 48 -8
6688hM6j3J1l9k1J3NN3rK1l4K8o3n1K4j2J7J8Q9j06N5Kn7l8OM5NM7k4M3J5ro5
$$ -8 38 25 36 -3 -24 -11 -6 47 38 59 25 53 -10 -61 -37 -49 -32 -14 75 -31 24 26 -31 -69 -63 -18 -13 34 10 53 68 59 -6
6721fq3N7m2Q4l3Q0m2K1Jl3j3j5L3j5M0L4m4M5l0p4L1o2Q7l4jR4j8Ok5n0j2l8
$$ -6 -89 -32 -74 10 -23 57 15 36 37 4 -9 -24 9 -6 34 68 24 69 39 -35 -4 -66 21 -13 -14 80 62 68 43 -7 -19 -57
6753e7k8Q8J8L9n0k6Q9q9J9jnOK9k9L5N5l9m2o8L9n6P4j5MN4rN0n2n2l2L4m2M4
$$ -57 -85 3 21 60 10 -16 73 -16 3 2 -3 3 32 3 38 93 54 12 -56 -17 -73 1 -14 -10 44 35 85 33 -19 -51 -17 -59 -15
6786a5J0M3M4o8LNo4j1N4J1jJ3J3l7rL6p4K6Jj1Q0k1m4P9k7l9o3M2J6m4J07lJ4
$$ -15 -5 38 82 14 17 22 -42 -53 1 12 11 24 37 0 -9 27 -47 -21 -20 -31 49 28 -16 63 36 -3 -66 -24 -8 -52 55 52 66
6819F6j6Ql9n1Ll1M7j0M6k5M3l4l7l5k6P0k5L8M0K4l7K1m1j6k0rk1K6N2J3K8n2
$$ 66 50 58 19 -32 -29 -60 -13 -23 23 -2 41 7 -30 -65 -91 -21 -46 -8 32 56 19 40 -1 -17 -37 -46 -67 -41 11 24 52 0
6851@J6J8m2l1K1K0m5Q1L8k6k2k4L1n8m0N5P1j9O3p6nM0j12mLOQ6k1k0L7Kk1m3
$$ 0 16 34 -8 -39 -18 2 -43 38 76 50 28 4 35 -23 -63 -8 63 44 107 31 26 66 -46 -50 -47 -41 45 24 4 41 43 22 -21
6884b1JpOM0J0oK4l3M1l5p2j5J30j16J69m5km0J4j08M8L4n1K7mN1Pm1j9rr9J0
$$ -21 -20 -27 -21 19 29 23 47 14 55 20 -52 -67 63 -53 116 71 69 29 43 -65 -17 17 -34 -7 -11 40 47 6 -13 -22 -121 -111
6916a11P1pL1Q3m4N0o5o3M1k7k1l8O7M6L0j4m0L5k0p1N4j7j0J09K1l0k8L1j23
$$ -111 -40 -47 -16 67 23 73 8 -55 -14 -41 -62 -100 -33 13 43 29 -11 24 4 -67 -13 -30 -40 69 90 60 32 63 -60
6945f0L8o0M7NN9k0K4O0j08j0Qj7L4Qn0L6O7o1L3r6K4J7l2O3nj8J16r4L8r2M7
$$ -60 -22 -82 -35 -30 29 9 33 93 -15 -25 -17 -34 0 8 -42 -6 61 0 33 -63 -39 -22 -54 9 4 -14 102 8 46 -46 1
6976Ak9lP5j1mN0m4Jm5K6j6o8M6K0N4o4O1m3m3J0Jj9N8j5QN0m8K1J4o0l7N3k9
$$ 1 -28 -31 44 33 29 79 35 36 -9 17 1 -67 -21 -1 53 -11 50 7 -36 -26 -25 -44 14 -1 7 57 9 30 44 -16 -53 0 -29
7009b9Q2n1M5k3j2J2j07Q7k6j1N6NL7rj5k5k9k4k5J7J7L7K9M7n2L5r7L6r2K4L9
$$ -29 53 2 47 24 12 24 -83 4 -22 -33 23 28 65 56 41 16 -13 -37 -62 -45 -28 9 38 85 33 68 -29 7 -85 -61 -22
7040b2L1M1n5P6m1m7l4L0m5J0J2N1QOPm6L6k2q8N1L0O3J6J3o3k1m9O0p3N7Qj1
$$ -22 9 50 -5 71 30 -17 -51 -21 -66 -56 -44 7 15 21 28 -18 18 -4 -92 -41 -11 52 68 81 18 -3 -52 8 -65 -8 0 -11
7072a1O5kn8j1M2p9k5M1Q3k8N5l5J3q9J8l1JL9J1N6K1p3N8m8j2l2m4rJ41n8L1
$$ -11 54 52 -6 -17 25 -54 -79 -38 45 17 72 37 50 -39 -21 -52 -51 -12 -1 55 76 3 61 13 1 -31 -75 -84 57 -1 30
7103C0M3ml2l7L2n3oj4L3R0k0L8r2rr2K6JM1P8n5M1m9M8l2%l3n6M4L6k6P5Om0
$$ 30 73 69 37 0 32 -21 -27 -41 -8 82 62 100 8 -1 -93 -67 -66 -25 53 -2 39 -10 38 6 6 -27 -83 -39 -3 -29 46 52 12
7136A2j9Rm3n4J00j1j4N1jM7p0rj7j3M%P9jk6K6j7l2r5P0n1Q0k7Q3pk4k2k6j0
$$ 12 -7 2 -41 -95 5 -6 -20 31 30 77 7 -2 -19 -32 -28 -28 51 50 24 50 33 1 -94 -24 -75 5 -22 61 54 30 8 -18 -28
7169b8l9J6O0K2j9P5p0N2p0k9LJ9k0M5J1N3j0j5Kj34N5JmP4J7l4M5m2p1NL1m7
$$ -28 -67 -51 9 31 12 87 17 69 -1 -30 -27 -8 -28 17 28 81 71 56 58 -76 -21 -20 -24 50 67 33 78 36 -35 -30 1 -46
7201d6l4O3J3N0PJ5m1k3q6pQ6NNK0J9J1n2mn0mLN9L8lL2k7m5l9k5L3j7P9n1L8
$$ -46 -80 -17 -4 46 53 68 27 4 -82 -89 -3 2 7 27 46 57 5 1 -49 -53 -50 9 47 44 76 49 4 -35 -60 -27 -44 35 -16 22
7235B2M9k4l2l4K5oJ7n2M5oK6pj4Lm5Ol7P9pK3K0Mk6ok8j9KRJ1N5l9K1k3j2k1
$$ 22 71 47 15 -19 6 0 17 -35 10 4 30 23 9 12 -33 -27 -64 15 8 31 51 55 29 23 -5 -24 -22 -13 -2 53 14 35 12 0 -21
7270b1Qj1LJ0O6L4l3j4l7L2m8j2j7pN2P6j5l3m8K9m6k3K9oJ0K9O7m5j4n5l9K6
$$ -21 -13 -24 -21 -11 55 89 56 42 5 37 -11 -23 -40 -47 5 81 66 33 -15 14 -32 -55 -26 -32 -22 7 74 29 15 -40 -79 -53
7302e3J2K0N2Kj5k1K8L2j01kK8L1m1O9k2M1k2l2l3j6j2M7k1J4K9K8m5rqQn5N5
$$ -53 -41 -21 31 33 18 -3 25 57 -44 -46 -18 13 -28 41 19 60 38 6 -27 -43 -55 -8 -29 -15 14 42 -3 -12 -20 -12 -67 -12
7334a2K8k0l4Q8l2j2m2J9j3l1L7P0K6o7NRJ5j03O0l5LR7j6Npq9Q6l4Jo8L1M5O9
$$ -12 16 -4 -38 50 18 6 -36 -17 -30 -61 -24 46 72 5 10 19 34 -69 -9 -44 -41 56 40 45 38 -51 35 1 2 -66 -35 10 79
7367G9Oq3m0R5j22J05n7J%K1PK4l5J4o1n0O1L3l3L0M7rQr1J3K2l8L3PK1RM3k6
$$ 79 85 2 -38 57 -65 40 -17 -16 -16 5 12 36 1 15 -46 -96 -35 -2 -35 -5 42 33 41 -50 -37 -15 -53 -20 -13 8 17 60 34
7400C4m6Nj9J1p5P1K9O6j9j5j0m3k1Ln2R3m6R6Ml7j0ppk0M8m6M1M9l3J6l0L0r2
$$ 34 -12 -7 -26 -15 -90 -19 10 76 57 42 32 -11 -32 -29 -81 12 -34 62 66 29 19 12 5 -15 33 -13 28 77 44 60 30 60 -32
7433c2J1l3Q7J1kL5m3k5J9k0j8nL7Mj5K2Oj1n5N5pm8K5J8k9RN6Mk3l6Qq4L9PL3
$$ -32 -21 -54 33 44 42 77 34 9 28 8 -10 -15 22 26 11 33 39 28 -27 28 21 -27 -2 16 -13 -4 52 56 33 -3 5 -79 -40 -33 0
7468@N0J9l3L1n0r7R1nl3P5%J0k0Pk2m4k9QL3N3J3k8PLk9l1l5J3O3k2M2ok2K6
$$ 0 50 69 36 67 17 -80 11 6 -27 48 48 58 38 45 23 -21 -50 -42 -9 44 57 29 36 39 10 -21 -56 -43 20 -2 40 34 12 38
7502C8m1l2nK2oJ9L6j2L2o3qj3J9lqJ3RJ7K1J1p3M2m0J5Mk5M7L5k9N4n9j7m5R
$$ 38 -3 -35 -40 -18 -24 -5 31 19 51 -12 -20 -33 -14 -17 -25 -12 -3 14 35 46 -27 15 -25 -10 -6 -31 16 51 22 76 17 0 -45 -36
7536c6K4m5J20l3L4Jm1J5m6o5N0M0Pm3LK0l3k0K8QrK7K1rL5M0o5k7J0K6n1k5N2
$$ -36 -12 -57 63 30 64 65 24 39 -7 -72 -22 18 25 -18 -15 5 -28 -48 -20 -12 -21 6 27 18 53 93 28 1 11 37 -14 -39 13
7569A3J7O2l7n5Rl7n8N4L9k0K1J6J8l0j9J2o3LjqQ8n8N2J3j3Mj0l9n3P0k7R6n0
$$ 13 30 92 55 0 9 -28 -86 -32 7 -13 8 24 42 12 -7 5 -58 -55 -56 -64 24 -34 18 31 18 22 12 -27 -80 -10 -37 59 9
7602IkL9n2oN1k5ok1M4N3o4m1Q0n2l0PK3p0R2J7knn8K0j2k8%N2m0J13m7o2K7K8
$$ 9 7 46 -6 -12 39 14 8 -13 31 84 20 -21 59 7 -23 -16 7 -63 29 46 44 39 -19 1 -11 -39 -39 13 -27 86 39 -23 4 32
7636C2r0L9qJ1Q4k5Lm4K6j9m2j7N3j7O2PN3k7p0kq4P4k6m7J29QOo7P2p8o1k7M7
$$ 32 -58 -19 -27 -16 68 43 46 2 28 9 -33 -50 3 -14 48 55 108 81 11 9 -75 -1 -27 -74 55 63 69 2 74 -4 -65 -92 -45
7669d5%J8O6qL7l6Kk8l8k3O6qM9n2K6Rl1k3K0rm5J03k8j4Nk8N2n0j0j7J3K1L7
$$ -45 -45 -27 39 31 68 32 34 6 -32 -55 11 3 52 0 26 35 4 -19 1 -8 -53 50 22 8 13 -15 37 -13 -23 -40 -27 -6 31
7702C1N1L0q7l0Ll9O3q4M8j0Q0l7nk9M6j11nM9L2O1o7J11m9o7N5o6k6lP4K1L7
$$ 31 82 112 25 -5 -2 -41 22 -62 -14 -24 56 19 14 -15 31 -80 -85 -36 -4 57 -10 101 52 -15 40 -26 -52 -55 19 40 77
7733G7k7k8L0jj3q3K3k0M2O8k6K1k2Qj00PK9j9P3k0j4L3K3o7j8K3k6j6J9N1O7
$$ 77 50 22 52 51 38 -45 -22 -42 0 68 42 63 41 49 -51 -44 -15 -34 39 19 5 38 61 -6 -24 -1 -27 -43 -24 27 94
7764I4l2l2Pk0j5o7M9M6l5J9J5M3p8j8Jl8N4j9K7K7rNL3k1o2K2PJ7n4M7O6m0O5
$$ 94 62 30 37 17 2 -65 -16 30 -5 14 29 72 -6 -24 -23 -61 -7 -26 1 28 19 24 57 36 -26 -4 3 20 -34 13 79 39 104
7797A04j33J6Nj9k2R2k4K8Kk7M8j34O2j5K2M4n1lK1PLl1Mk0ROR4q4Q0o6m5Rk5
$$ 104 -29 -13 -8 -27 -49 43 19 47 49 22 70 -64 -2 -17 5 49 -2 -5 16 23 26 -5 -1 -21 -12 -6 88 4 84 18 -27 -18 -43
7830d3M5n3M1qk1J05n4Jk1k7j1KM5L8jrNj4p7L1o7L7pO1j3M8jl1M5q6j9M7m9O2
$$ -43 2 -51 -10 -18 -39 66 12 13 -8 -35 -46 -44 1 39 38 29 34 20 -57 -26 -93 -56 -63 -2 -15 33 32 1 46 -40 -59 -12 -61 1
7864AP1mj4n9ok9K8n3K2O3KN5n0Rq7K3j3L0l8QP3M5nK6j13j1M2k0oLL4jR7r5m6
$$ 1 72 68 54 -5 -11 -40 -12 -65 -43 20 22 77 27 36 -51 -28 -41 -11 -49 -41 32 77 72 98 -15 -26 16 -4 -10 -7 27 26 123 28 -18
7899a8L2n6J1l%Q0Km4J2j0QrL5q9M9L4J0qJ7m7j6j0q5P1KN2m5O2p4L9j2j2LJ3
$$ -18 14 -42 -31 -34 -34 46 48 4 16 6 14 5 40 -49 0 34 44 36 53 6 -10 -20 -105 -34 -32 20 -25 37 -37 2 -10 -22 -19 -6
7933fk0M1k6O0k0Qj9J3p0K3JN2o7O6L0K0o6jl2Kj5K5j5PM1J7q5K5nm3M2m2N5N0
$$ -6 -26 15 -11 49 29 37 18 31 -39 -16 -15 37 -30 36 66 86 20 19 -13 -11 -26 -1 -16 -9 32 49 -36 -11 -16 -59 -17 -59 -4 46
7967D6m2KL1j3o0J4J9OJ7Rj3O4q7K6Kn8JM3K3j9P9o2k5L9n4n1M4M4p5P5N7nj15
$$ 46 4 6 37 24 -36 -22 -3 3 20 29 16 80 -7 19 21 -37 -36 7 30 11 90 28 3 42 -12 -63 -19 25 -50 25 82 77 -38
8000c8O7p7J5j7l1R0LJ3k9J1mlj9k1j2RP7M8n8K0l2k5qJ9o4R7M2k6mJ0m6%p9R1
$$ -38 29 -48 -33 -50 -81 9 12 25 -4 7 3 0 -19 -40 -52 -43 34 82 24 44 12 -13 -21 -2 -66 31 73 47 43 53 7 7 -72 19
8034A9o4J8K8L1JJ1j1l4pp4L6M2K3j3N7m1L6k6o7K7JL3J4K4o1R2j08L3j4L9j19
$$ 19 -45 -27 1 32 33 44 33 -1 -8 -82 -46 -4 19 6 63 22 58 32 -35 -8 -7 26 40 64 3 95 -13 20 6 45 -74
8065g4J29m7l3Q1M0m9q8R3q0qM4QPpO6n4n9l7M8L3m9N7JL1j8l4q1P4m8pN9n8M8
$$ -74 55 8 -25 56 96 47 -41 52 -28 -36 8 16 23 16 82 28 -31 -68 -20 13 -36 21 22 53 35 1 -80 -6 -54 -61 -2 -60 -12
8098a2M6k3lK4lm0j2qM6l0R7n2K3l8Pq2J0%M3k6M3K4k2qj8K1l3J1L9K1k4M2l3
$$ -12 34 11 8 32 29 -11 -23 -31 15 -15 82 30 53 15 22 -60 -50 -50 -7 -33 10 34 12 4 -14 7 -26 -15 24 45 21 63 30
8131C0K8o1k4Lm6P1N2Oj7pJn7K9m7J8k2KN6N1kJ4M1r4o3O7j5k5L5oj9k4R4o9L
$$ 30 58 -3 -27 -24 -70 1 53 59 42 35 36 -21 8 -39 -21 -43 -41 15 66 64 78 119 25 -38 29 14 -11 24 18 -1 -25 69 0 3
8165Cm6O3J9j06J09j6qj5qj3J4kL5n3J06n2J4n5N5n5m7L3n3O6M5K8
$$ 3 -43 20 39 -67 42 26 18 3 -5 -18 -4 -6 29 -24 82 30 44 -11 44 -11 -58 -25 -78 -12 33 61
8191F1
$$ Imaginary data points
##PAGE= N=2
##DATA TABLE= (X++(I..I)), XYDATA
0@%%%%%%%%%Qj6J6j6K4l2M0n6P2q5J01j20J44j72J97k33K73l17L72m28M92n62
$$ 0 0 0 0 0 0 0 0 0 0 8 -8 8 -8 16 -16 24 -32 40 -45 56 -64 80 -92 105 -128 145 -172 200 -228 264 -298
31b98O40p28Q25r34J053j184J326j483J656j845K052k280K528k794L087l409L760
$$ -298 342 -386 439 -495 558 -626 700 -783 873 -972 1080 -1200 1328 -1466 1621 -1788 1972
48A972m145M569n032N544o112O740p445Q237r134J0162j1352J2748j4414J6444
$$ 1972 -2173 2396 -2636 2908 -3204 3536 -3909 4328 -4806 5356 -5996 6752 -7662 8782
62H782j8981K2254k6668L2982m2820O0436j01771L81614K83834n76580k84796
$$ 8782 -10199 12055 -14613 18369 -24451 35985 -65786 315828 599662 23082 -261714
73b61714l3488K12825L4299j08952j26389J43284K35556Q6497j81984j69585J9950
$$ -261714 -295202 -82377 -48078 -157030 -283419 -140135 95421 181918 -66 -169651 -149701
84a49701K11110J53330k7148j35608J791J29947N4591j64575k29389j11780N5089
$$ -149701 61409 214739 187591 51983 53774 183721 238312 73737 -155652 -267432 -212343
95b12343Q0757j1681o1114Q4414K47382J82092q6867k44912j29235J34981K46945
$$ -212343 -131586 -143267 -204381 -119967 127415 309507 222640 -22272 -151507 -16526 230419
106B30419O7298k11273k45516j4759J67137Q5492j18554j89148l5122J72677J82787
$$ 230419 297717 86444 -159072 -173831 -6694 78798 -39756 -228904 -264026 -91349 91438
117I1438k0048j51810k2997J98645K33659L5700j98112k42942q0775O9369L7964
$$ 91438 71390 -80420 -103417 95228 328887 364587 166475 -76467 -157242 -87873 -49909
128d9909n9885l5328Q0039J18290J9893j12548j21849L0076J69842J16181m7645
$$ -49909 -109794 -145122 -65083 53207 73100 -39448 -161297 -131221 38621 154802 107157
139A07157q9431L3641J40109P1334j31690k59168j55034O5108J41592K8320o7229
$$ 107157 17726 51367 191476 262810 131120 -128048 -283082 -217974 -76382 -48062 -115291
150a15291K493J49001J79115J1672k02416k10473J8358K21551J82184j5901j44740
$$ -115291 -112798 36203 215318 226990 24574 -185899 -167541 54010 236194 220293 75553
161G5553j03165Q998K1988q7124j44912k8403J39681J68700N2696n8810m7708
$$ 75553 -27612 -18614 3374 -83750 -228662 -257065 -117384 51316 104012 45202 -2506
172b506N5972J01135o33j26821j04421L2128R9951K6698q4723r8589L277Q7161
$$ -2506 53466 154601 153968 27147 -77274 -45146 54805 81503 -3220 -101809 -98532 -11371
184a1371K6502j01626j04223M8628J82842J50194j1953j31007p6851P3574J09693
$$ -11371 15131 -86495 -190718 -142090 40752 190946 178993 47986 -28865 44709 154402
195A54402k7551j60146j26907J8116J05386N0591o1688p2117M8217J37706O5198
$$ 154402 126851 -33295 -160202 -142086 -36700 13891 -47797 -119914 -71697 66009 131207
206A31207q3309j29631k4946J14360J39254K6862q3597o9652L721l482q7675j19742
$$ 131207 47898 -81733 -106679 7681 146935 173797 90200 20548 24269 20787 -66888 -186630
218a86630l1638J02977J49544N9701n4560n1046M4339P7621r760j09665r2896
$$ -186630 -218268 -115291 34253 93954 39394 -11652 32687 110308 100548 -9117 -102013
229a02013L8457J42327Q8456o8540j41664o2010M0446L3157n4169q6473J2355
$$ -102013 -63556 78771 167227 98687 -42977 -104987 -64541 -31384 -85553 -172026 -159671
240a59671J57832J81835M0210j13675j23357j6818N9628K5265n7357o6117K2572
$$ -159671 -1839 179996 220206 106531 -16826 -33644 25984 51249 -6108 -72225 -49653
251d9653Q8620L1147q0333j04131j6764P4878P3615k798m4359J4947R7767P9342
$$ -49653 38967 70114 -10219 -114350 -131114 -56236 17379 14581 -29778 -14831 82936 162278
263A62278l3038j07855o6546K6067M9569k6848r9361n4494O9039J19709L6897
$$ 162278 129240 21385 -45161 -19094 30475 3627 -95734 -150228 -81189 38520 75417
274G5417p2545p9129J8276J00891O5756m6340r2114j1920Q8304P9505k7530j08699
$$ 75417 2872 -76257 -57981 42910 108666 62326 -29788 -41708 46596 126101 98571 -10128
286a0128q0271J0240M4749j1645o0996j1457R1288J25535M9406n7049q6744k4248
$$ -10128 -90399 -80159 -35410 -47055 -108051 -119508 -28220 97315 146721 89672 2928 -21320
298b1320L7648J6945m4512m2567L4321Q6292L4824p5405j23600n4035N3161P8811
$$ -21320 16328 33273 -11239 -53806 -19485 66807 101631 26226 -97374 -151409 -98248 -19437
310a9437J7154k5264J9038R1588Q5992j8190j21281j12275n615P1699M1230l3886
$$ -19437 -2283 -27547 -8509 83079 169071 150881 29600 -82675 -88290 -16591 24639 -9247
322i247m4738J9548O6082K1811o8027r1065r356Q7243R4678K0328l7938j7899
$$ -9247 -53985 -34437 31645 53456 -14571 -105636 -114992 -27749 66929 87257 49319 31420
334C1420L4544K9532m6007j02884o2477L4205P5775K3126m6144l9792L3138P6392
$$ 31420 65964 95496 49489 -53395 -115872 -81667 -5892 17234 -28910 -68702 -35564 40828
346D0828L0649m9568o4006N662P2276N3598k6492o8895k4340M3862M0815l5438
$$ 40828 71477 21909 -42097 -36435 35841 89439 62947 -5948 -30288 13574 54389 18951
358A8951q9147n0495L6538P2163K7642k4520r663N1259P0235P046p4734q3431
$$ 18951 -70196 -120691 -84153 -11990 15652 -8868 -18531 32728 102963 110009 35275 -48156
370d8156j1147N4276L9661k3395m4401M170N1080K2787n6292q8688k4695P1317
$$ -48156 -59303 -5027 34634 11239 -33162 -28992 22088 44875 -11417 -100105 -124800 -53483
382e3483R8319L9890k4342k3458K0313K7894l1722r4136p5033J6446Q3275N9194
$$ -53483 44836 84726 60384 36926 57239 85133 53411 -40725 -115758 -99312 -16037 43157
394D3157j3081m4634j0213K9712J2513m0099m8481J5539Q4348P8170K771o1051
$$ 43157 30076 -14558 -24771 4941 17454 -22645 -71126 -55587 28761 106931 109702 48651
406D8651n3035j548J4281k9496o4229k4492N6252Q5964L1931m1796n2347N382
$$ 48651 -4384 -5932 8349 -21147 -85376 -109868 -53616 32348 64279 22483 -29864 -24482
418b4482N2100K5746l6314m8421P173O0587M4404k7631p3920m1878K3662L7099
$$ -24482 27618 53364 17050 -31371 -24198 36389 80793 53162 -20758 -62636 -38974 -1875
430a875j1588m6790j5120M8645P0953K7146l1062l5245J0592L4606k902n4546
$$ -1875 -13463 -60253 -75373 -26728 44225 71371 40309 5064 15656 50262 47360 -7186
442g186n3634L563N4430M1603j8404m8857j3806L1776K2707k4984m2920J042O5621
$$ -7186 -60820 -57257 -2827 38776 20372 -28485 -42291 -10515 12192 -12792 -55712 -54670 10951
455A0951P8439J8395n0565n6480j2496J1101j4064m6063k9624L4287P8934M7476
$$ 10951 89390 107785 57220 740 -11756 -655 -14719 -60782 -90406 -56119 22815 70291
467G0291k6724n8192k2761K2106K3466q013k1083J3339N8945M8230k2310p7537
$$ 70291 43567 -14625 -37386 -15280 8186 173 -20910 -7571 51374 99604 77294 -243
479b43o2431n664K7587J2161j5688k664M6809O5063J5442m8814n7951j1322L4983
$$ -243 -62674 -68338 -40751 -28590 -44278 -46942 -133 64930 80372 31558 -26393 -37715 -2732
492b732L3551p442l0683k077L5172K0558l3610o1291l1016K5040M8471J8400j8875
$$ -2732 30819 23377 -7306 -9383 25789 46347 12737 -48554 -79570 -54530 -6059 12341 -6534
505f534p105L5925M4460J191m4710m6065n360L0301J6334k7938l6246P591M5174
$$ -6534 -13639 22286 66746 67937 23227 -22838 -28198 2103 18437 -9501 -45747 -38156 7018
518G018K8668k0103m5942j9791K8953M0943M002k4184k374L6177L7139o679n4654
$$ 7018 35686 15583 -30359 -50150 -21197 19746 23748 -436 -2810 33367 70506 63827 9173
531I173n8884j3103K8385J9462j1031p352K7533M6208K0216l0548n4568k2158
$$ 9173 -49711 -62814 -34429 -14967 -25998 -33350 -5817 40391 60607 30059 -24509 -46667
543d6667K8855L8068O578j3599J21K0951J3354k8704o5169m5670J7288N4367L5454
$$ -46667 -17812 20256 26834 13235 13356 34307 47661 18957 -46212 -91882 -74594 -20227 15227
556A5227J186m343J5442K5501j476m5810n1648l478M3133L8978L96k6278j7506
$$ 15227 16413 12070 27512 53013 51537 5727 -45921 -49399 -6266 32712 33108 6830 -10676
569a0676Q771J1067k2064m3200j1352M0715N4740K3705j4200k2640P32J7397n075
$$ -10676 -1905 9162 -12902 -56102 -67454 -26739 28001 51706 37506 14866 15598 32995 27920
582B7920l9813l5429N740L5207K5552p774k7378q614K3689K0554j5053l0715m486
$$ 27920 -11893 -47322 -41582 -6375 19177 11403 -15975 -24589 -900 19654 4601 -26114 -30600
595c0600K9899L5934R856k1163k1329O208J4783j4428m1566k9438J0126L8984
$$ -30600 -701 35233 45089 23926 2597 8805 23588 9160 -32406 -61844 -51718 -12734
607a2734L1631j719j6926M866K4845N189l0268l6516o142L2242M1332R401k7027
$$ -12734 18897 17178 252 5118 29963 35152 4884 -31632 -37774 -5532 35800 45201 18174
620A8174k5257J50M932j6240l0411j3435K6854N4208L6703o912k6250j1778P22
$$ 18174 -7083 -6933 -2001 -18241 -48652 -62087 -35233 18975 55678 48766 22516 10738 11460
633A1460q164k1552j8724P247L6101L1819o001l2696k2190P52O141m814j1217
$$ 11460 3296 -18256 -36980 -29733 6368 38187 32186 -510 -22700 -21948 -15807 -20621 -31838
646c1838O287L8223M4363P107l3643l6409j1059Q469M313j4397j8081R430L7166
$$ -31838 -25551 12672 57035 64142 30499 -5910 -16969 -8500 -4187 -18584 -36665 -27235 9931
659I931K5237j3049l2663j7530J0488K2383P186j2654n441J9554K3490j106k4731
$$ 9931 35168 22119 -10544 -28074 -17586 4797 11983 -671 -6112 13442 36932 35826 11095
672A1095k6218r548O884M266j0668p154J8620L2251J4796j1692k0523p791R761
$$ 11095 -15123 -24671 -17787 -13521 -24189 -31343 -12723 19528 34324 22632 2109 -5682 4079
685D079P796j3287j9871M363K9579K3752o529l2195l0500k991J8585R044r147
$$ 4079 11875 -1412 -21283 -16920 12659 36411 29882 -2313 -32813 -35804 -17219 -8175 -17322
698a7322j763K4332L4978J5772j8419l8337k5261L228J2327R61l488Q239J8979
$$ -17322 -19085 5247 40225 55997 37578 -759 -26020 -22792 -10465 -9504 -12992 -4753 14226
711A4226J3299r173k9985k4356L261K0021J3190N153J0351J7704J1431j1315l5197
$$ 14226 27525 18352 -11633 -35989 -32728 -12707 483 5636 15987 33691 45122 33807 -1390
724a390l3663m290J9874J5631p11m092Q207J9270J0263j7744l3104j3007J9784
$$ -1390 -35053 -39343 -19469 -3838 -4549 -8641 -434 18836 29099 11355 -21749 -34756 -14972
737a4972K8519J1432p451j0006K189R073n855k7024k4484J178K1054J9528N301
$$ -14972 13547 24979 17528 7522 9711 18784 12929 -14095 -38579 -37401 -16347 3181 8482
750H482m258J698J2471O286j4047k1207o298J0384J2032J860p037k681R789Q214
$$ 8482 4224 5922 18393 24679 10632 -10575 -16873 -6489 5543 7403 366 -2315 7474 15688
764A5688j2073k5626j4198R905K3079J6483N72l979Q044J3764m108k7206k8733
$$ 15688 3615 -22011 -36209 -26304 -3225 13258 13830 9851 17895 31659 27551 345 -28388
777b8388p431J6125K2681Q749o882m399P184M699j1964k1533j0770J2519K7810
$$ -28388 -35819 -19694 2987 11736 4854 455 7639 12338 374 -21159 -31929 -19410 8400
790H400K0677L51r341n002l942j3510k1237j4895M732K3871K4426O375q117o025
$$ 8400 29077 29428 20087 15085 11143 -2367 -23604 -38499 -33767 -9896 14530 20905 12788 6763
804F763K27l175j1824j2385J525K0252K3592N136j4513j5744n462o42o219j2574
$$ 6763 6990 3815 -8009 -20394 -18869 1383 24975 30111 15598 -146 -5608 -6250 -12469 -25043
818b5043o423J3525K7792J8508m108j5354q259K222K304p441j2567j714J5227
$$ -25043 -31466 -17941 9851 28359 24251 8897 638 2860 5164 -2277 -14844 -16558 -1331
831a331J7448J998j2597j3305l896L430M45o318k579J2280K0314J0979m447j1629
$$ -1331 16117 18115 5518 -7787 -11683 -8253 -7808 -14126 -16705 -4425 15889 26868 22421 10792
845A0792p902k502m457j1199r373N677J9081J6186R80j0903j0336j502K491l788
$$ 10792 2890 388 -4069 -15268 -24641 -18964 117 16303 17283 6380 -3956 -5458 -2967 -6755
859f755q232J875J8170K1340O575j3010k0994j3225j552N14l936j206J1355K0696
$$ -6755 -14987 -13112 5058 26398 32973 19963 -1031 -14256 -15808 -15294 -19230 -20436 -9081 11615
873A1615J5379j832j6675j6430m526L519K045O93O432J3056J0150l386j7172j8841
$$ 11615 26994 25162 8487 -7943 -12469 -8950 -6905 -6212 220 13276 23426 20040 2868 -15973
887a5973p499M146O245L644O054J2849J4431L975j2656j9778j0667L389P596J919
$$ -15973 -23472 -19326 -13081 -9437 -3383 9466 23897 27872 15216 -4562 -15229 -11840 -4244 -2325
901b325j891K750R531P621m954j6325j3986JJ0659R693K820J225O232Q839O87
$$ -2325 -4216 -1466 8065 15686 10732 -5593 -19579 -19578 -8919 774 3594 4819 11051 19890 20577
916B0577j2419j6901q592K522O176K904J083N034R445N821n732j3842r960J473
$$ 20577 8158 -8743 -17335 -14813 -8637 -5733 -4650 384 9829 15650 9918 -3924 -13884 -12411
930a2411Q409O219J492K294P149O070m762j6403j7177n849O924J1050P341M031
$$ -12411 -4002 2217 3709 6003 13152 19222 14460 -1943 -19120 -24969 -18045 -6995 346 4377
944D377N756P182J209j0333j6541j0044L245J1187R181L320J333J851j108r122
$$ 4377 10133 17315 18524 8191 -8350 -18394 -15149 -3962 5219 8539 9872 11723 10615 1493
958A493j5081j0898K285J3438J4373P266J396M73K48n244j3027j3834l523R226
$$ 1493 -13588 -24486 -22201 -8763 5610 12876 14272 14745 14993 9749 -3278 -17112 -20635 -11409
972a1409J3413P631m30l324j770j751o177r303m353O580J3627J1234K602l792
$$ -11409 2004 9635 9205 5881 4111 2360 -3817 -13120 -17473 -10893 2734 13968 16570 12778
986A2778m200l160n995r860p703J484R862J0887N016j329k522j95j241o289q351
$$ 12778 8578 5418 -577 -10437 -18140 -16656 -6794 4093 9109 7780 5258 5063 3822 -2467 -10818
1001a0818k222P466J2136P613j364o116m193k200n165q429n665L482J2084J3405
$$ -10818 -13040 -5574 6562 14175 12811 6695 2502 302 -4863 -13292 -18957 -15475 -3391 10014
1015A0014O063k594n476l938m307o518n814J80Q096J1559O498k111o427o116n326
$$ 10014 16077 13483 8007 4069 -238 -6756 -12570 -12390 -4294 7265 13763 11652 5225 -891 -6217
1030f217n684l907J551R378J3930R907m54p820q082n607m758m662k087M690J1558
$$ -6217 -11901 -15808 -14257 -4879 9051 18958 18504 10684 2602 -3005 -7763 -12425 -14512 -9822 1736
1045A736J1272K389p100r610o296j732N06J021L139Q117J0401M641n105j0452
$$ 1736 13008 15397 8297 -1313 -7609 -9341 -8835 -7814 -4675 3442 13843 18484 13379 2927
1059B927r424m922o68J045K514O273R193O135j273o793p452m030k65J053J002
$$ 2927 -6497 -11419 -12087 -11042 -8528 -2255 6938 13073 11800 5007 -2445 -6475 -6740 -5687 -4685
1074d685L583P509O598l95p385r387o316r36K011J537K935O981Q983M750k926
$$ -4685 -1102 6407 13005 12610 5225 -4162 -10478 -11414 -9403 -7866 -4931 2050 11033 15783 12857
1089A2857r013r187l930J222K084J771M163O547M717j213p269r562n743O71M138
$$ 12857 3844 -5343 -9273 -8051 -5967 -4196 -33 6514 11231 10018 2749 -6813 -12556 -11885 -7747
1104g747M710N894O885N083q0o664j0834q615j869K976M222N161O233N159J069
$$ -7747 -3037 2857 9742 14825 14745 8081 -2753 -11368 -13237 -10261 -6039 -878 5355 10514 11583
1119A1583m730r360q327j540M536O129N344M444L371Q11l802r291j0322m462L156
$$ 11583 6853 -2507 -10834 -12374 -7838 -1709 3635 8079 11450 12261 8459 -832 -11154 -15616 -12460
1134a2460O643O486M890L048J315j203n513q435n608Q90N535O526M598J632m78
$$ -12460 -5817 669 5559 8607 9922 8719 3206 -5229 -10837 -9947 -4412 2114 6712 8344 7866
1149G866j926m736p530n830k35M776O862O268L425Q86o11l260o996p174k801K608
$$ 7866 5940 1204 -6326 -12156 -12391 -7615 -753 5515 8940 9826 9215 5955 -1041 -8215 -11016 -8408
1165h408N707N653L076N94j91j937n423p115l873J793O584Q185N257O76j699k852
$$ -8408 -2701 2952 6028 6622 6431 4494 -929 -8044 -11917 -10124 -3540 4645 9902 10578 8879 6027
1181F027n101o858n464r05M367P772O772K592r24k727m651n782m275p01L691P221
$$ 6027 926 -5932 -11396 -12301 -7934 -162 6610 9202 8278 5551 900 -4882 -9157 -9858 -6167 1054
1197A054P084K820j408l621n282o468n202j610L315P667Q105M135r01l282m324
$$ 1054 8138 10958 9550 5929 647 -5821 -11023 -12633 -9318 -1651 6454 10589 9688 6406 2082
1212B082m804m151k200J118N403P552M875m30l985n191m985l465j357J188M530
$$ 2082 -2722 -6873 -9073 -7955 -2552 5000 9875 9445 5460 269 -4716 -8181 -9538 -8350 -3820
1227c820P245N943J737k516m955n660m301k088J07L113O049N700K153j752m042
$$ -3820 3425 9368 11105 8589 3634 -2026 -6327 -8415 -8308 -5195 854 6554 8707 6955 2913
1242B913m853l756j973o9K478N685O531L595p59m549o119m991k424n23J589M700
$$ 2913 -1940 -5696 -7669 -7738 -5260 425 6956 10551 9792 5243 -876 -5867 -8291 -8814 -7225 -2525
1258b525O461M736R02l006n690n530k789k46J827M327N672M482J134k842n836
$$ -2525 3936 8672 9574 6568 878 -4652 -7441 -7687 -5860 -1533 4139 8621 9755 6913 1077
1273A077o162l611o54J740M326O031N317K229j835n310o328m109q84J575L534
$$ 1077 -5085 -8696 -9350 -7610 -3284 2747 8064 10293 8458 3148 -3180 -7289 -8173 -6598 -3064
1288c064M943M574K406j133m661o378m668j076J860L954N118M687K528l83l771
$$ -3064 1879 6453 8859 7726 3065 -3313 -7981 -9057 -7197 -3243 1875 6562 9090 8707 4936
1303D936o024n229k275R12L244M635M433K794L31k817n331n170k507O86L123M580
$$ 4936 -1088 -6317 -8592 -7680 -4436 199 4632 7426 7757 4940 -391 -5561 -8068 -7382 -4259 321
1319C21M452K838O82k242m977n753l568l61K715M574M695L282J219j390m119n339
$$ 321 4773 7611 8293 6051 1074 -4679 -8247 -8608 -5893 -1319 3376 6658 7877 6487 2368 -2971
1335b971l975r84J975M278M764L492J278j314l926n411m363j599J641M237N133
$$ -2971 -6946 -7930 -5955 -1677 3087 6579 7857 6543 2617 -2794 -7157 -8756 -7115 -2878 2255
1350B255L985J842p50l321n206m650k359Q47L850N020M115J776n90k996m773m573
$$ 2255 6240 8082 7332 4011 -1195 -5845 -8204 -7357 -3507 1513 5628 7404 6814 3818 -955 -5528
1366e528k565M49L535N157M503K280l24k891m526m628k990j74K698M704M585K666
$$ -5528 -8093 -7644 -4109 1048 5551 7831 7507 4616 90 -4538 -7528 -7702 -5004 -300 4285 6951
1382F951J06k238m144m447l131o29K299M520M713K937N25k037l974m534l424j207
$$ 6951 7057 4819 675 -3772 -6903 -7532 -5233 -713 4000 6937 7462 5425 1451 -3083 -6507 -7714
1398g714J620M104M771L451J130j544l538m367l581j560J135L584M584L712J521
$$ -7714 -6094 -1990 2781 6232 7362 5818 2280 -2087 -5668 -7228 -6093 -2509 2075 5787 7308
1413G308j103l412m400l823j947O78L242M631M076K027o52k994m354l959k262
$$ 7308 6205 2793 -1607 -5430 -7377 -6699 -3457 1174 5250 7277 6625 3631 -723 -4682 -6944
1428f944K29K784M328M110K399j84k691m161m066k590j15K469M133M266K722K56
$$ -6944 -6715 -3931 397 4507 6906 6722 4031 -130 -4196 -6786 -6901 -4432 -299 3967 6689 6945
1444F945k282l912m188k845o28J967L945M147K989P60j922l751m069l079r42J574
$$ 6945 4663 751 -3437 -6282 -6910 -4943 -998 3149 6138 6898 4976 1225 -2844 -5923 -6865 -5291
1460e291L583M210L303J055j422l401m062l340j351J014L273M165L444J473j018
$$ -5291 -1708 2502 5805 6860 5438 2037 -2025 -5365 -6716 -5702 -2429 1736 5180 6653 5635
1475E635l114l988l421j740O92K940M135L677J834n93k823l913l566k164J83K522
$$ 5635 2521 -1467 -4888 -6628 -5936 -2996 1139 4816 6650 6057 3234 -679 -4245 -6409 -6226 -3704
1491c704L958L875K202j69k486l772l663k254j80K180L684L968K535J94k152l729
$$ -3704 254 4129 6331 6162 3676 -96 -3759 -6013 -6193 -4013 -329 3639 6174 6368 4216 487
1507D87l780k553n11J734L506L909K856O88j782l356l654k745q86J400L055L910
$$ 487 -3293 -5846 -6357 -4623 -1117 2792 5648 6336 4554 1198 -2456 -5201 -6087 -4687 -1632 2278
1523B278L024R56j405l215l786k816j124R44K783L739L334J572q03k905l782l062
$$ 2278 5302 6258 4853 1638 -2148 -4964 -6088 -5144 -2361 1378 4712 6284 5481 2576 -1206 -4268
1539d268j499O06K406L453L302J897m36k537l731l307j791L78K305L448L572K245
$$ -4268 -5767 -5161 -2755 698 4000 5897 5461 2924 -807 -4114 -5905 -5527 -3222 226 3798 6043
1555F043n7k290l746l443k111oJ874L099L460K464N26j801l496l582k266k11J729
$$ 6043 5986 3696 -50 -3493 -5604 -5610 -3736 -637 2823 5287 5813 4012 516 -3066 -5332 -5543 -3814
1572c814L136L352K619O98j457l314l817k766o48J548K931L425K696J153j117
$$ -3814 -678 2674 5293 5991 4534 1220 -2597 -5363 -6011 -4463 -1532 1893 4589 5742 4625
1587D625k800l564k763j037J198K688L233K584J326p34k476l669l146j240Q90
$$ 4625 1825 -1739 -4502 -5539 -4341 -1653 1580 4164 5490 4756 2280 -1389 -4535 -5775 -4885
1602d885K528L219K872J572j05k070l321l305j834L42K227L011K840J624N1j614
$$ -4885 -2357 862 3734 5306 5201 3131 -190 -3495 -5329 -4987 -2760 251 3091 4715 4766 3152
1618C152l039l285k033l8K004L144L060J948L68j352k870l379k580p27J577K975
$$ 3152 113 -3172 -5205 -5243 -3239 -95 2965 4913 5281 3929 1059 -2320 -4900 -5627 -4050 -1075
1634a075L188K189O65j023k583l186k625r23J314K948L301K304P16j013k494l210
$$ -1075 2113 4302 4967 3944 1361 -1825 -4450 -5373 -4059 -1111 2190 4494 5210 4197 1703 -1507
1650a507k797j345Q53K685L413K671J110o88k032k954k813j575L84K325L250K752
$$ -1507 -4304 -5649 -4796 -2111 1302 3973 5083 4395 2363 -591 -3404 -4979 -4595 -2270 980 3732
1666C732J183o58k064k864k633j687L2J989L259L047J675k45j824k682k725j886
$$ 3732 4915 4257 2193 -671 -3304 -4991 -4959 -2970 289 3336 5011 4766 2942 260 -2465 -4351
1682d351l90J430K813K991J799P2j522k458k555j919n74J188K699L094K176M93
$$ -4351 -4741 -3311 -498 2493 4292 4364 2842 384 -2171 -4090 -4664 -3476 -777 2317 4493 4986
1698D986j398k548k676k101j018O47K235L056K571R87r13k294k704k066j052M35
$$ 4986 3588 1040 -1636 -3737 -4755 -4108 -1873 1183 3754 4741 3828 1534 -1170 -3236 -4288 -3853
1714c853J952K819K737J275p23k361k933k340j235J89J830K870K912J705k51k055
$$ -3853 -1901 918 3655 4930 4207 1846 -1087 -3427 -4662 -4473 -2643 227 3139 4844 4593 2538
1730B538k850k477j366P9J496K505K629J857K3j881k879k618j405M7J528K456
$$ 2538 -312 -2789 -4155 -4076 -2580 -75 2554 4411 4434 2553 -326 -2944 -4349 -4302 -2774 -318
1746c18K687J974M61j415k844k788j764l52J262K156K408K065P92j073k475k687
$$ -318 2369 4343 4804 3389 545 -2243 -4007 -4359 -3097 -941 1467 3532 4324 3251 776 -1911
1762a911j815l52J093K086K335K046R52o93k220k835k308p72Q49J915K285K025
$$ -1911 -3726 -4078 -2985 -899 1436 3482 4434 3741 1521 -1314 -3622 -4394 -3545 -1630 655 2680
1778B680J319j48j685k621k366j189N23J758K258K024J344l5j553k587k604j505
$$ 2680 3999 3851 2166 -455 -2821 -4010 -3487 -1729 529 2553 3897 3862 2309 -278 -2882 -4387
1794d387K90J721K354K264J632L58j207k400k701j856k41J520K352K173J488L90
$$ -4387 -4097 -2376 -22 2242 3874 4232 3025 625 -2076 -3932 -4173 -2653 -301 1872 3360 3750
1810C750r42k174k515k017m14J368K437K492J752M86r52k080k571k131q00R19
$$ 3750 2808 634 -1881 -3898 -4312 -2944 -507 1985 3737 4223 3271 1191 -1380 -3511 -4311 -3392
1826c392K199K481J781N99n80j735k282k081r90P91K090K479J757O90p20j641
$$ -3392 -1193 1288 3069 3668 3088 1353 -929 -3010 -4000 -3209 -1119 1360 3117 3807 3087 1446
1842A446k093k087j385K34J905K527K181R93l34j468j889k008j348j11J287K207
$$ 1446 -647 -2734 -4119 -3885 -1980 547 2728 3721 3387 1919 30 -1978 -3326 -3437 -2150 57
1858E7K178J224j24j382j884k008j584k81J224K179K445J549J95j145j916k000
$$ 57 2235 3459 3335 1953 69 -1939 -3523 -3804 -2580 -401 2044 3593 3788 2643 727 -1273
1874a273j710p61P37J964K348J852M74j027j874j983j566p06O29J750K341K058
$$ -1273 -2983 -3744 -3007 -1043 1305 3157 3631 2604 730 -1253 -2819 -3525 -2896 -1146 1195 3253
1890C253P27q65j928k238j783q95L55J633K295K140J014o04j628k085j714r12
$$ 3253 3980 3115 1187 -1051 -2834 -3729 -3374 -1741 554 2694 3708 3104 1476 -609 -2323 -3235
1906c235K36J324K036K159J192l96j739k217j864r81K85J147J898K152J490O4
$$ -3235 -2999 -1675 361 2520 3712 3316 1577 -640 -2504 -3485 -3200 -2053 -155 1997 3487 3551
1922C551j389k013j988j210OR99J662J939J435K33j154j954j968j172j35R38J633
$$ 3551 2162 149 -1839 -3049 -3043 -2044 -382 1557 2992 3225 2071 117 -1851 -3023 -3158 -2220 -587
1939e87J925J696N60p86j901k152j520m38O98J371J738J636R36m07j534k077j792
$$ -587 1338 3034 3594 2808 907 -1245 -2765 -3203 -2505 -1134 604 2240 3176 2769 1235 -842 -2634
1956b634n81P09J446J849J614Q77l29j416k066j936j029M50J352J824J841J143
$$ -2634 -3215 -2506 -1060 789 2403 3280 2951 1535 -531 -2467 -3496 -3046 -1694 130 1971 3114
1972C114Q9j155k064j992j116K73J270J717J708J016J53j030j858k129j297k3
$$ 3114 3203 2048 -16 -2008 -3124 -2851 -1581 136 1844 2860 3013 1983 125 -2004 -3301 -3324
1988c324J373J891J794J162K63q79j631j908j530l82R72J736J679J310K87o93
$$ -3324 -1951 -60 1734 2896 3159 2280 649 -1259 -2789 -3171 -2199 -463 1216 2526 2813 2120
2004B120j445j891j483m27Q65J718J832J325L97n24j367j815j731p61M88J516
$$ 2120 675 -1216 -2699 -3126 -2261 -543 1289 2614 3011 2487 1120 -695 -2426 -3187 -2699 -1183
2020a183J834J477N58m09j019j483j674r53K17J329J823J628P53k73j207j592
$$ -1183 651 2128 2686 2277 1258 -225 -1899 -2852 -2635 -1306 517 2145 2898 2625 1418 -174
2036a74j643j189j4J079J846J854J086m6r67j497j656j194k89Q51J721J747J131
$$ -174 -1817 -3006 -3020 -1941 -95 1759 2845 2799 1832 335 -1321 -2515 -2804 -1953 -232 1515 2646
2053B646N4r62j435j721j180l44O41J730J923J383K71q31j443j697j305n27M12
$$ 2646 2700 1738 303 -1418 -2598 -2942 -2301 -571 1352 2735 3006 2175 732 -965 -2270 -2797 -2385
2070b385J448J757J498M63p08j413j543j190n05M00J182J725J631O53n37j387
$$ -2385 -937 820 2318 2781 2073 660 -883 -2073 -2578 -2178 -996 729 2360 3013 2476 1089
2086A089j757j424o53K68J037J599J583Q24j04j125j598j335q11J76P75J562J527
$$ 1089 -668 -2092 -2745 -2477 -1440 159 1742 2566 2462 1337 -261 -1596 -2407 -2231 -1456 106 1633
2103A633J001j22j040j647j507p53m7O76J375J612J312L00p96j587j613r59k19
$$ 1633 2634 2512 1472 -175 -1682 -2435 -2482 -1806 -431 1181 2493 2793 1997 410 -1203 -2162 -2381
2120b381O91J203J411J112M83n00j474j668j193l39O37J344J529J298N50m01j357
$$ -2381 -1690 -487 924 2036 2519 2019 545 -1123 -2316 -2655 -2018 -674 855 2153 2703 2302 945
2137I45j644j289n44K87J074J508J373P80j58j198j673j409n23M39J120J359J194
$$ 945 -699 -1988 -2532 -2245 -1171 337 1710 2490 2332 1134 -539 -1948 -2471 -2032 -912 447 1641
2154A641P80o2r19j587j655q74J49J111J509J331Q18K9p56j313j401r64r6Q64
$$ 1641 2421 2359 1440 -147 -1802 -2676 -2527 -1416 93 1424 2242 2271 1515 202 -1199 -2163 -2259 -1395
2172a395J331J300Q82J17o74j349j533r76j94P92J340J339R91L30l70j144j425
$$ -1395 -64 1236 2118 2235 1561 212 -1321 -2297 -2491 -1699 -359 980 1971 2301 1931 787 -638
2189f38j280m88N23J239J439R01K96l50q95j308j153o48L84J142J540J159M81
$$ -638 -1918 -2406 -1883 -644 795 1696 1992 1642 747 -561 -1714 -2362 -1978 -836 704 1863 2344
2206B344l23r76j358j238p60Q1R40J394J317O52k6q22j280j288p98LR49J345J332
$$ 2344 2021 1045 -313 -1551 -2311 -2230 -1290 104 1421 2073 2047 1225 -55 -1343 -2141 -2138 -1189 156 1488
2225A488P31j17q20j204j326r94j42P19J468J364R22J42p18j182j213q90k99M66
$$ 1488 2219 2102 1282 78 -1248 -2242 -2384 -1665 -197 1167 2089 2231 1513 331 -882 -1772 -2071 -1605
2243a605J159J391R31K73o17j206j301r25k47L94J129J427J099M16m89j075j240
$$ -1605 -446 945 1876 2149 1532 326 -975 -1900 -2147 -1753 -624 803 1902 2318 1829 754 -486
2260d86j020n61K11R28J269J101N99l55r66j170q90n44J24Q60J185J148P68j77
$$ -486 -1506 -2067 -1856 -928 341 1442 2041 1686 720 -450 -1340 -1884 -1760 -900 285 1433 2201 2024
2278B024r99j299j074n97o7P55J090J264Q39J19p42j269j124p02m6O71R54J168
$$ 2024 1025 -274 -1348 -1945 -2012 -1257 -167 1097 1936 2055 1313 44 -1080 -1782 -1828 -1157 -203 965
2296I65Q35K20o81j199j176q91j65N78J109J186R50M04n08j093j275q94k94M21
$$ 965 1800 2020 1339 140 -1036 -1927 -2092 -1514 -405 781 1731 2135 1627 534 -741 -1635 -1929 -1508
2314a508R95J004J031M12l66j031j225r58l52M83R38J074R31N63j86q86j207j193
$$ -1508 -513 491 1522 1934 1568 537 -688 -1646 -1998 -1515 -577 497 1428 1991 1805 919 -288 -1481
2332a481n26K49Q72J056J007N55n7o99j171r61o76K13P08J073R66O93p5o25j157
$$ -1481 -2007 -1758 -886 170 1177 1732 1675 976 -195 -1156 -1832 -1619 -911 162 1128 1821 1746 1121 -36
2351c6j148o91l3P12J006J034P10K33m52j005j070q67k07N32J066R96O94K34m18
$$ -36 -1184 -1875 -1908 -1196 -190 844 1554 1787 1335 330 -740 -1607 -1814 -1282 -216 780 1474 1708 1290
2370A290q96j033r22l30M00R88J099R13L53k89r07j073r23n08K77Q86J084Q06
$$ 1290 394 -639 -1561 -1891 -1491 -503 596 1509 1862 1573 666 -407 -1330 -1838 -1561 -675 409 1215
2388A215M35k18o72j075r50n08K20Q12J069R86N09k19p51r62r55o92kP54R99R98
$$ 1215 1650 1432 760 -315 -1265 -1773 -1553 -741 328 1314 1823 1604 853 -109 -1064 -1756 -1758 -1004 -5 993
2408I93O62l9o23r26q88o47r3N35J008R56O66N7n70r64r70o71k60N40R78R90P41
$$ 993 1655 1616 993 67 -821 -1468 -1561 -1026 -18 938 1604 1661 1091 127 -843 -1514 -1774 -1234 -256 734 1475
2429A475J77m55q53q88o81l52L10Q10R45Q24K64l72q24r02o89m74L73P26R88Q71
$$ 1475 1652 1197 344 -544 -1225 -1577 -1267 -457 488 1312 1576 1204 380 -522 -1211 -1685 -1312 -586 402 1273
2449A273L84k03p45r96q03m57P9O48R01R15N57j19o66r41p50n13N4N90Q84Q45
$$ 1273 1657 1454 709 -287 -1090 -1547 -1468 -820 81 996 1553 1434 768 -173 -923 -1436 -1382 -792 92 937
2469I37O23M4p32q97r27n41p1N23Q46R19P06J04m83q81q78n76j44M38P91Q61O78
$$ 937 1560 1604 872 -25 -952 -1493 -1564 -1041 -195 724 1430 1534 1051 170 -708 -1284 -1428 -990 -199 662 1340
2490A340J37m12q39r07o56k18M00P69R48O73L16k88p61q98q35j88K84O36P94P29
$$ 1340 1477 1065 226 -681 -1337 -1555 -1155 -386 562 1235 1551 1263 502 -396 -1231 -1419 -1135 -499 295 1024
2510A024L29j51o35r11p10l84K21O64Q00P58M54j02o39q39p93m97P0N06P92P90
$$ 1024 1353 1202 567 -344 -1054 -1438 -1217 -553 247 1005 1459 1357 718 -121 -914 -1411 -1341 -835 -43 747
2530G47N67M6n14p78q56n79O0M82Q22P57N16J20m80p95q50n80j57M61Q05P88O23
$$ 747 1314 1360 846 68 -788 -1367 -1307 -825 -3 754 1270 1390 910 115 -735 -1315 -1472 -1011 -206 582 1205
2551A205J93l53o71q83o57j79L33O62Q02O21K06k43o55p90p23k37K02P12Q65O66
$$ 1205 1398 1045 374 -509 -1166 -1345 -1012 -350 452 1073 1279 1036 381 -409 -1132 -1369 -1167 -455 410 1076
2571A076L00j64o40p48q01l23R0O15Q25O69L81j87n14p32p21l33K2N65P38P22
$$ 1076 1376 1212 572 -176 -977 -1300 -1210 -595 230 899 1280 1093 579 -153 -874 -1207 -1185 -620 118 840
2591H40M01Lm90p97p01m96q0M82O96P95M56N4m05n92p26n26j20L42O48P70N28
$$ 840 1241 1244 754 -43 -744 -1240 -1320 -838 -142 653 1109 1163 758 166 -560 -1086 -1206 -864 -216 554 1082
2612A082J31l52o62p38n57j67K49O45P95O03K12k31o43o47o24k88K37M97P27O53
$$ 1082 1213 861 199 -539 -1096 -1263 -1014 -369 426 1029 1241 1010 367 -280 -904 -1192 -955 -458 269 922
2632I22K30j52n42p95o15j99J00M98P85P24L25j57m85p16o87l70J4M40P11O45
$$ 922 1152 1000 458 -337 -952 -1151 -1051 -553 232 956 1281 1124 639 -77 -764 -1134 -1120 -680 31 676
2652F76M30J0m74o36o74m14M1L77O92O54M22L8m19o94o39m75n6K92O06P82M55
$$ 676 1106 1116 642 6 -668 -1082 -1041 -664 28 682 1104 1142 723 29 -610 -1085 -1141 -849 -243 539 994
2673I94J75k75o55o89m96j54L20M82P47M76J89k77n65o95n06j88K22N61O61N18
$$ 994 1169 894 239 -450 -946 -1100 -780 -298 449 925 1114 837 272 -423 -929 -1117 -895 -334 327 845
2693H45K60r1n90n83o67k22P4N22N79N17L83j4m35p09n57m21J15M41O38N70M08
$$ 845 1105 1014 424 -159 -826 -1048 -974 -452 127 644 1027 1013 578 -131 -688 -1109 -994 -553 85 655 1063
2714A063p4l75n97o55m45k4M57O17N67M47K2k99o02o52m05m7L35N85N34M68P7
$$ 1063 989 614 17 -638 -1083 -1107 -650 -33 534 981 1003 704 102 -550 -955 -1002 -667 -82 452 920 997
2735I97k32n99o55m41j42K75N33O18M81J51j89m87o29n55r7J05N14O11N32J87
$$ 997 765 166 -489 -930 -1072 -797 -264 354 835 986 797 310 -319 -874 -971 -866 -352 259 791 978
2755I78j61m47o55n05k46J72N06N40M99L35j09m42n97n73k98O5M25N88N16K91
$$ 978 817 370 -285 -790 -1036 -864 -358 182 681 1016 907 465 -132 -705 -1003 -938 -513 75 591 882
$$ [...]
8191E2
##END NTUPLES=NMR FID
##END=
