##TITLE=1H_Pr 4Cl-Am-D
 DMSO
 8 sc, 
 13.04.2022
##JCAMPDX= 6.0         $$ Bruker NMR JCAMP-DX V2.0
##DATA TYPE= NMR FID
##DATA CLASS= NTUPLES
##ORIGIN= UXNMR, Bruker Analytische Messtechnik GmbH
##OWNER= root
$$ XWIN-NMR		Version 3.5
$$ Wed Apr 13 14:14:48 2022 Russian Standard Time (UT+4h)  she@DPX200
##.OBSERVE FREQUENCY= 200.13135
##.OBSERVE NUCLEUS= ^1H
##.DELAY= (6, 6)
##.ACQUISITION MODE= SIMULTANEOUS
##.ACQUISITION SCHEME= undefined
##.AVERAGES= 8
##.DIGITISER RES= 18
##SPECTROMETER/DATA SYSTEM= spect
##.PULSE SEQUENCE= zg30
##.SOLVENT NAME= DMSO
##.SHIFT REFERENCE= (INTERNAL, DMSO, 0, 15.7039)
##AUDIT TRAIL= $$ (NUMBER, WHEN, WHO, WHERE, WHAT)
$$ ##TITLE= Audit trail, XWIN-NMR		Version 3.5
$$ ##JCAMPDX= 5.01
$$ ##ORIGIN= Bruker BioSpin GmbH
$$ ##OWNER= she
$$ F:/spectra/data/she/nmr/H-F/1/audita.txt
$$ ##AUDIT TRAIL=  $$ (NUMBER, WHEN, WHO, WHERE, WHAT)
(   1,<2022-04-13 14:13:41.65 +0400>,<she>,<DPX200>,
      <created by zg, POWCHK disabled, PULCHK disabled
       configuration hash MD5:
       00 E9 B6 7A A2 85 ED C7 34 08 36 98 17 FE 4E 26
       data hash MD5: 16K
       30 22 9E 50 B8 05 EC C3 43 6A 29 8B 02 76 1C 81>)
$$ ##END=
$$ 
$$ hash MD5
$$ 36 1F 69 5F 12 59 8C C5 23 F0 E9 7A 30 ED F5 7A
##$RELAX= 
##$RELAX= 
##$RELAX= 
##$RELAX= 
##$RELAX= 
##$RELAX= 
$$ Bruker specific parameters
$$ --------------------------
##$DU= <F:/spectra>
##$EXPNO= 1
##$NAME= <H-F>
##$PROCNO= 1
##$TYPE= <nmr>
##$USER= <she>
##$AMP= (0..31)
100 100 100 100 100 100 100 100 100 100 100 100 100 100 100 100 100 100 
100 100 100 100 100 100 100 100 100 100 100 100 100 100 
##$AQSEQ= 0
##$AQ_mod= 1
##$AUNM= <au_zg>
##$AUTOPOS= <>
##$BF1= 200.13
##$BF2= 200.13
##$BF3= 200.13
##$BF4= 200.13
##$BF5= 200.13
##$BF6= 200.13
##$BF7= 200.13
##$BF8= 200.13
##$BYTORDA= 1
##$CFDGTYP= 0
##$CFRGTYP= 5
##$CHEMSTR= <none>
##$CNST= (0..31)
1 1 145 1 1 1 1 1 1 1 1 1 1 1 1 1 1 1 1 1 1 1 1 1 1 1 1 1 1 1 1 1 
##$CPDPRG= <>
##$CPDPRG1= <>
##$CPDPRG2= <>
##$CPDPRG3= <>
##$CPDPRG4= <mlev>
##$CPDPRG5= <mlev>
##$CPDPRG6= <mlev>
##$CPDPRG7= <mlev>
##$CPDPRG8= <mlev>
##$CPDPRGB= <>
##$CPDPRGT= <>
##$D= (0..31)
0 1.2 0 0 0 0 0 0 0 0.06 0 0.03 0 0 0 0 0.0002 0 0 0 0 0 0 0 0 0 0 0 0 
0 0 0 
##$DATE= 1649844821
##$DBL= (0..7)
120 120 120 120 120 120 120 120 
##$DBP= (0..7)
150 150 150 150 150 150 150 150 
##$DBP07= 0
##$DBPNAM0= <>
##$DBPNAM1= <>
##$DBPNAM2= <>
##$DBPNAM3= <>
##$DBPNAM4= <>
##$DBPNAM5= <>
##$DBPNAM6= <>
##$DBPNAM7= <>
##$DBPOAL= (0..7)
0.5 0.5 0.5 0.5 0.5 0.5 0.5 0.5 
##$DBPOFFS= (0..7)
0 0 0 0 0 0 0 0 
##$DE= 6
##$DECBNUC= <off>
##$DECIM= 32
##$DECNUC= <off>
##$DECSTAT= 4
##$DIGMOD= 1
##$DIGTYP= 9
##$DL= (0..7)
0 120 120 120 120 120 120 120 
##$DP= (0..7)
150 150 150 150 150 150 150 150 
##$DP07= 0
##$DPNAME0= <>
##$DPNAME1= <>
##$DPNAME2= <>
##$DPNAME3= <>
##$DPNAME4= <>
##$DPNAME5= <>
##$DPNAME6= <>
##$DPNAME7= <>
##$DPOAL= (0..7)
0.5 0.5 0.5 0.5 0.5 0.5 0.5 0.5 
##$DPOFFS= (0..7)
0 0 0 0 0 0 0 0 
##$DQDMODE= 0
##$DR= 18
##$DS= 0
##$DSLIST= <SSSSSSSSSSSSSSS>
$$ [...]
##$SUBNAM2= <"">
##$SUBNAM3= <"">
##$SUBNAM4= <"">
##$SUBNAM5= <"">
##$SUBNAM6= <"">
##$SUBNAM7= <"">
##$SUBNAM8= <"">
##$SUBNAM9= <"">
##$SW= 18.05172834244
##$SWIBOX= (0..15)
0 0 2 0 0 0 0 0 0 0 0 0 0 0 0 0 
##$SW_h= 3612.71676300578
##$TD= 16384
##$TD0= 1
##$TE= 0
##$TE2= 300
##$TE3= 300
##$TEG= 300
##$TL= (0..7)
0 120 120 120 120 120 120 120 
##$TP= (0..7)
150 150 150 150 150 150 150 150 
##$TP07= 0
##$TPNAME0= <>
##$TPNAME1= <>
##$TPNAME2= <>
##$TPNAME3= <>
##$TPNAME4= <>
##$TPNAME5= <>
##$TPNAME6= <>
##$TPNAME7= <>
##$TPOAL= (0..7)
0.5 0.5 0.5 0.5 0.5 0.5 0.5 0.5 
##$TPOFFS= (0..7)
0 0 0 0 0 0 0 0 
##$TUNHIN= 0
##$TUNHOUT= 0
##$TUNXOUT= 0
##$USERA1= <user>
##$USERA2= <user>
##$USERA3= <user>
##$USERA4= <user>
##$USERA5= <user>
##$V9= 5
##$VALIST= <valist>
##$VCLIST= <CCCCCCCCCCCCCCC>
##$VD= 0
##$VDLIST= <DDDDDDDDDDDDDDD>
##$VPLIST= <PPPPPPPPPPPPPPP>
##$VTLIST= <TTTTTTTTTTTTTTT>
##$WBST= 1024
##$WBSW= 4
##$XGAIN= (0..3)
0 0 0 0 
##$XL= 0
##$YL= 0
##$YMAX_a= 111042
##$YMIN_a= -114347
##$ZGOPTNS= <>
##$ZL1= 120
##$ZL2= 120
##$ZL3= 120
##$ZL4= 120
##$ABSF1= 10
##$ABSF2= 0
##$ABSG= 5
##$ABSL= 3
##$ALPHA= 0
##$AQORDER= 0
##$ASSFAC= 0
##$ASSFACI= 0
##$ASSFACX= 0
##$ASSWID= 0
##$AUNMP= <proc_1d>
##$AZFE= 0.1
##$AZFW= 0.1
##$BCFW= 1
##$BC_mod= 2
##$BYTORDP= 1
##$COROFFS= 0
##$CY= 11.3945322036743
##$DATMOD= 1
##$DC= 2
##$DFILT= <>
##$DTYPP= 0
##$F1P= 2.36226072786647
##$F2P= -0.459571619588291
##$FCOR= 0.5
##$FTSIZE= 0
##$FT_mod= 4
##$GAMMA= 1
##$GB= 0.15
##$INTBC= 1
##$INTSCL= 1
##$ISEN= 128
##$LB= 0.24
##$LEV0= 0
##$LPBIN= 0
##$MAXI= 10000
##$MC2= 0
##$MEAN= 0
##$ME_mod= 0
##$MI= 1.114404
##$NCOEF= 0
##$NC_proc= 0
##$NLEV= 6
##$NOISF1= 3.799351
##$NOISF2= 2.8
##$NSP= 1
##$NTH_PI= 0
##$NZP= 0
##$OFFSET= 15.70392
##$PC= 1
##$PHC0= -18386.98
##$PHC1= 6.80078
##$PH_mod= 1
##$PKNL= yes
##$PPARMOD= 0
##$PSCAL= 0
##$PSIGN= 0
##$REVERSE= no
##$SF= 200.130013532006
##$SI= 16384
##$SIGF1= 3
##$SIGF2= 2
##$SINO= 400
##$SIOLD= 16384
##$SREGLST= <1H.CDCl3>
##$SSB= 0
##$STSI= 0
##$STSR= 0
##$SW_p= 3612.71676300578
##$SYMM= 0
##$S_DEV= 0
##$TDeff= 0
##$TDoff= 0
##$TI= <>
##$TILT= no
##$TM1= 0
##$TM2= 0
##$TOPLEV= 0
##$USERP1= <user>
##$USERP2= <user>
##$USERP3= <user>
##$USERP4= <user>
##$USERP5= <user>
##$WDW= 1
##$XDIM= 8192
##$YMAX_p= 0
##$YMIN_p= 0
$$ End of Bruker specific parameters
$$ ---------------------------------
##NTUPLES= NMR FID
##VAR_NAME=  TIME,          FID/REAL,        FID/IMAG
##SYMBOL=    X,             R,               I
##VAR_TYPE=  INDEPENDENT,   DEPENDENT,       DEPENDENT
##VAR_FORM=  AFFN,          ASDF,            ASDF
##VAR_DIM=   8192,          8192,            8192
##UNITS=     SECONDS,       ARBITRARY UNITS, ARBITRARY UNITS
##FACTOR=    0.0002768,     1,               1
##FIRST=     0,             0,               0
##LAST=      2.2672688,     0,               0
##MIN=       0,             -114347,         0
##MAX=       2.2672688,     111042,          0
$$ Real data points
##PAGE= N=1
##DATA TABLE= (X++(R..R)), XYDATA
0 0 0 0 0 0 0 0 0 0 0 0 0 0 0 8 -8 8 -8 8 -16 16 -16 24 -24 32 -40 46 -51 60 -71 80 -90 104 -118 133 -151
35 -151 170 -189 212 -237 267 -295 330 -366 406 -448 494 -546 602 -664 730 -806 886 -976
53 -976 1078 -1191 1319 -1464 1629 -1821 2049 -2322 2656 -3076 3621 -4367 5445 -7158 10312
68 10312 -18093 83261 68210 -36921 72778 111042 50228 -36875 565 42445 17150 -4300
80 -4300 -11223 -52991 -31344 -3606 -36492 -89490 -69582 13731 16803 -66890 -45038 26824 21403
93 21403 -22374 -31926 3011 22296 3310 13177 10638 -3497 27465 33474 -4325 -16253 2907
106 2907 26079 3579 -24489 3171 14532 2239 12665 3329 -6331 9182 23351 19866 -11687
119 -11687 -6374 43443 28846 -10408 1713 18021 12644 -11279 -23176 -13586 -28293 -25476 -6299
132 -6299 -36887 -49202 -10908 2136 -27990 -53883 -14407 30011 -7454 -25361 22451 45013
144 45013 32886 18413 26464 40505 24821 22695 27722 3337 9970 31680 12702 -13264 -16880
157 -16880 3963 -1445 -45271 -38073 -2880 -12278 -24414 -17121 -2412 1209 -15072 -9895 -2399
170 -2399 -15007 -768 10947 437 5578 13422 16667 7125 -10086 3999 7947 -9875 -998
183 -998 7782 5997 7077 625 4417 677 -10573 1163 189 -5702 9289 10741 7516 8481 5948
198 5948 11511 934 -6550 10050 4064 -5841 2094 1704 -1972 -11394 -15355 -5083 -16547 -22922
212 -22922 -8537 -11432 -12997 -7193 -5732 1847 -828 1343 13318 5502 7238 17709 9674 7890
226 7890 10658 12575 14087 301 2934 13508 -3461 -10000 -4273 -4116 -2037 -8593 -5142 5850
240 5850 -3065 -3283 -1959 -11659 -5399 -3719 -7645 -3155 -2508 6514 7427 -6985 -157 4587 -3351 -1623
256 -1623 -1165 5965 11721 2754 7220 7440 -2749 393 -4120 -8421 -2553 -3041 2248 2050 -4084 4734
272 4734 1618 -7536 -1553 -2259 -884 2169 -419 7614 5143 -1615 4263 -1548 -5697 -1034 -4351
287 -4351 241 1049 -1781 6207 1321 -1853 4117 -2554 -2551 1014 -1543 3043 -372 -880 7055 -1306
303 -1306 -3229 1776 -2937 -1076 -2840 -3872 3707 -754 -958 4066 -2266 971 1752 -4124 -603 -2653
319 -2653 -1719 2343 -5384 -1052 3514 -3162 -662 -1486 -2040 3040 -2646 711 6239 2127 8427 9052
335 9052 4301 8438 4676 3321 3918 -2939 1658 2484 -4597 -522 -3295 -6747 -5033 -12174 -10518 -8695
351 -8695 -12263 -4751 -3785 -4709 2540 -362 101 1903 -2226 3588 4384 2700 11279 9488 8596 11528
367 11528 5662 6806 3907 -1425 4656 2084 527 4979 -701 -560 -1050 -9095 -6562 -9003 -9970 -3454
383 -3454 -7252 -4372 1249 -3148 -768 -2678 -4270 2614 -692 -592 4944 1581 4352 3792 -2512 637
399 637 -2265 -3199 190 -4530 -975 3835 114 4042 3350 3320 9351 5166 5768 8866 4473 8037 5858
416 5858 374 3957 180 -1208 -862 -9215 -7178 -6680 -11606 -9625 -12383 -10647 -3715 -8628 -7835 -4500
432 -4500 -6220 -323 -2739 -4063 4935 5626 8566 11339 7277 13090 13349 7717 9439 5400 7725 11638
448 11638 3659 2989 2892 -629 -449 -9135 -12258 -5427 -8664 -8294 -7279 -8335 -1057 -2670 -6626 -2872
464 -2872 -5018 -1078 2675 -2155 1634 4123 3767 5324 -2790 -3115 2779 -1939 -2920 -2512 -2299 4827
480 4827 931 -1442 2196 -10 3258 4828 424 5400 7118 8110 10751 3517 3836 8377 2659 294
496 294 -2786 -3847 1729 -5031 -8523 -5183 -8779 -6735 -8077 -12602 -7511 -7393 -5413 -1373 -6054 -2405
512 -2405 4078 2866 3823 1256 3992 11941 5950 3476 7626 7401 10007 5774 1128 6054 3074 910
528 910 458 -5932 -3212 -829 -4365 -3813 -6824 -4073 1826 -5396 -7060 -2533 -1261 1683 -2291 -2113
544 -2113 5793 2842 448 520 -3467 -189 -930 -4539 -1294 -3504 -720 3293 -2666 -2174 -161 -191 3275
561 3275 -447 960 9402 7269 5939 6004 3604 6977 2955 -1027 2594 -448 632 2472 -2860 -2293
577 -2293 -3464 -5729 -2776 -8600 -8477 -2054 -4496 -4139 -4702 -4787 646 -3184 -4984 425 -714 1853
593 1853 3967 1970 5846 5271 4761 7386 2103 2921 6653 2345 2480 812 -21 3395 -1896 -3516
609 -3516 400 -2593 -1675 -2052 -4027 137 -1923 -2164 1386 -2428 -190 1373 -2601 -112 -1804 -2930
625 -2930 674 -3194 -1653 894 -2012 404 -355 -2219 1150 -1196 -965 2204 -143 3053 3695 1252
641 1252 4599 2143 525 3108 -80 1631 2716 16 3278 1054 -1508 1037 -2925 -3383 -1715
656 -1715 -4030 -1082 -2114 -3571 1242 -1747 -3085 -625 -3084 -780 -715 -2236 2402 953 698 4355
672 4355 156 830 2349 -84 2545 679 760 5007 969 211 2001 -1331 418 -1661 -3569 443
688 443 -2141 -1361 696 -2962 -117 588 -2198 -114 -1199 2 2630 -1459 579 2299 -534 1628
704 1628 -737 -968 1868 -1084 -138 1178 -1822 2175 1179 -1206 1786 -43 529 1458 -2433 613
720 613 237 -2698 382 -1416 -1355 789 -1928 -75 -76 -2429 1499 -184 -1028 2894 618 1562 2160 -1015
738 -1015 1775 75 -2066 1233 -1138 -493 2013 -740 1314 93 -1547 1898 -787 -900 2216 -354
754 -354 1570 1765 -1014 1175 -1201 -2364 62 -2978 -1400 741 -1690 226 -430 -1414 1062 -2015
770 -2015 -1567 1347 -1377 1099 1153 -446 2734 333 200 1989 -733 1528 2185 95 3056 2123 1095
787 1095 2525 -711 439 1023 -2520 -167 -1082 -2586 -86 -2989 -2399 -785 -3457 -1019 -1651 -3302
803 -3302 319 -1062 -941 1249 -740 1391 1911 -493 2573 1442 317 2879 366 1741 2430 -80
819 -80 2324 1289 -527 2070 -771 -664 781 -1533 648 186 -1271 1558 -821 -1170 816 -2207
835 -2207 -507 -397 -2409 473 -925 -1803 351 -2414 -1608 -749 -3115 -395 -784 -1303 1833 -264 768
852 768 2156 -277 1768 1549 335 3337 1493 2011 3999 957 2599 2537 -301 1946 526 -143 1818
869 1818 -1342 -520 220 -2970 -1224 -3080 -4163 -1866 -3673 -2732 -1007 -3238 -192 -606 -1787 787
885 787 -268 371 2238 -114 1940 2516 478 2373 603 252 2238 -397 646 1550 -443 2217
901 2217 999 -222 2118 184 365 1501 -1330 681 414 -1319 477 -1702 -1209 541 -2653 -1349
917 -1349 -1077 -2610 -370 -2166 -2464 195 -1685 -653 60 -1977 588 -53 -1001 1503 -362 1535
933 1535 3213 775 2962 2561 1659 3969 1174 682 2723 315 1457 993 -1133 811 -1508 -2493
949 -2493 -1202 -3538 -1753 -1498 -3092 -382 -1525 -1788 82 -2212 -1627 247 -1408 451 83 -467
965 -467 2294 286 249 1744 -504 1204 1429 -258 2203 1061 824 2790 -197 879 1659 -487 1455
982 1455 -162 -420 1962 -691 -269 691 -1470 176 -483 -2357 19 -1876 -1743 -68 -2996 -1342
998 -1342 -447 -2346 46 -1496 -1152 1385 -1208 445 1648 -53 2166 821 106 2545 235 1040
1014 1040 1796 -456 1375 887 -431 1832 -123 -11 1272 -1533 -40 -448 -1821 444 -1587 -1609
1030 -1609 390 -1672 -973 -143 -1754 570 -576 -1070 1592 -164 682 1644 -344 1211 450 -1000
1046 -1000 1098 -775 -84 1651 -756 761 633 -744 1224 -715 -761 1549 -679 372 595 -841
1062 -841 903 -877 -1191 702 -1524 -745 387 -1193 771 210 -384 1172 -610 -68 1095 -1465
1078 -1465 454 868 -647 1114 -429 -641 1133 -904 141 610 -1030 1513 149 -601 1237 -563
1094 -563 56 639 -1121 402 119 -1218 951 -961 -661 633 -1091 200 -104 -1162 1233 -215
1110 -215 -390 1106 -336 755 677 -760 979 -81 -358 1472 -698 317 1350 -274 1023 394
1126 394 -42 1582 -580 -896 481 -1287 -139 -322 -1988 280 -1467 -1446 -90 -1944 -309 147 -1290
1143 -1290 718 131 -17 1935 -182 416 1781 -406 1255 765 151 2379 525 655 1322 -907 736
1160 736 155 -1483 484 -666 -863 370 -1949 -313 -127 -1934 -151 -724 -1116 943 -503 26 786
1177 786 -956 709 138 -971 596 -762 -284 652 -1067 434 259 -879 991 -146 -48 1570 131
1194 131 1155 1359 176 1811 729 230 1560 -165 493 960 -762 731 -494 -1260 148 -1843
1210 -1843 -1203 -709 -2452 -1255 -1365 -2485 -692 -1858 -1403 318 -1289 368 1325 -88 2178 1127
1226 1127 1218 2690 1159 2190 2385 535 1869 1056 -12 1017 -737 -89 578 -1343 -83 -245 -1478
1243 -1478 -43 -1255 -1214 -192 -1439 131 102 -1416 671 -537 -841 331 -1221 -382 229 -1002 747
1260 747 -81 -687 905 -606 -141 521 -993 645 414 -185 1439 595 611 1732 277 1536 1327 236
1278 236 1946 975 497 1257 -461 -70 52 -1883 -417 -1626 -2247 -965 -2266 -1810 -1015 -2332 -667
1295 -667 -692 -1294 528 -427 127 1459 -105 1654 1631 407 2131 1170 1013 1987 192 1263 1153 -630
1313 -630 860 -158 -841 186 -985 -645 -273 -1984 -492 -797 -1490 170 -671 -403 738 -803 320
1330 320 529 -630 532 29 -431 692 -834 -120 61 -1303 502 -269 -779 660 -309 385 1083 -155
1348 -155 1387 832 162 1695 592 840 1558 70 1150 877 -368 1127 -509 -589 444 -1333 -591
1365 -591 -449 -1837 -642 -1598 -1872 -596 -1712 -949 -231 -1176 336 470 -343 1344 499 818 1939 607
1383 607 1277 1277 249 1508 208 -177 694 -916 -61 -67 -1377 167 -31 -866 372 -869 -129 265 -892
1402 -892 339 21 -619 494 -361 -203 758 -628 601 258 -439 847 -127 -387 895 -448 229 177
1420 177 -819 280 -309 -508 564 -434 146 620 -735 779 295 -45 932 -94 324 704 -640 389
1438 389 171 -621 495 -348 -700 339 -1080 -364 -208 -864 618 -159 -466 900 -512 49 571 -1001
1456 -1001 577 9 -320 935 -82 320 1016 -629 486 346 -538 862 -344 -78 444 -824 -90
1473 -90 9 -1081 80 -487 -704 282 -902 -239 -2 -604 555 -86 -323 979 -548 295 911 -402
1491 -402 915 350 -301 1143 95 251 734 -530 261 247 -706 367 -600 -680 56 -1262 -649 -48 -1173
1510 -1173 240 -368 -678 698 -187 290 719 -342 749 586 -196 960 150 149 755 -404 314 337 -659
1529 -659 498 -128 -595 444 -835 -169 193 -860 256 -159 -565 444 -712 -55 739 -568 661
1546 661 459 -451 989 -152 -163 538 -705 -149 58 -839 320 -668 -1146 96 -1124 -239 94 -329
1564 -329 761 234 149 1448 532 960 1540 520 1087 903 95 729 -295 -277 -46 -1245 -535 -568 -1589
1583 -1589 -613 -1034 -1323 -368 -1378 -481 -47 -766 468 109 222 898 717 602 1205 723 1278 1001 169
1602 169 1385 276 266 623 -875 63 -119 -1265 -342 -908 -1053 -69 -1129 -173 382 -559 451 64
1620 64 -49 1184 129 443 832 -211 458 36 -645 56 -667 -610 43 -1040 -410 -512 -1021 128 -594
1639 -594 -608 551 -81 550 828 384 1087 836 802 1588 890 967 1179 -262 271 -63 -859 -28 -996 -953 -508
1660 -508 -1564 -1288 -992 -1573 -614 -1119 -721 414 -361 582 707 242 1312 690 541 1531 577 800 1128
1679 1128 -27 827 88 -290 407 -640 -601 -129 -1040 -249 -298 -944 30 -458 -171 362 -558 336 451 51
1699 51 886 359 334 836 -164 115 210 -710 101 -168 -1082 -223 -945 -878 -284 -930 -1 -181 -558 676 266
1720 266 361 1196 356 997 1331 659 1354 648 300 742 -128 13 121 -742 -190 -734 -1237 -398 -1284 -1047
1740 -1047 -427 -1223 -452 -315 -933 64 -377 -3 810 4 719 858 374 1397 464 628 974 128 434
1759 434 221 -676 82 -466 -883 6 -856 -662 -233 -797 -1 36 -415 297 63 232 859 195 745 338
1779 338 -265 728 100 -14 464 -775 -405 30 -953 196 -235 -526 421 -757 7 195 -331 305 175
1798 175 70 812 202 603 915 122 638 389 145 542 26 -110 126 -983 -174 -307 -974 -327 -524 -1007
1818 -1007 -280 -697 -46 393 -564 567 371 103 664 217 549 826 -69 756 405 -226 635 -172 -200 343
1838 343 -424 -299 -49 -693 86 -680 -663 159 -754 -166 220 -444 387 -178 -27 515 -26 147 690 96
1858 96 193 258 -341 316 161 -281 237 -593 -179 276 -617 -40 -149 -203 339 -351 66 561 -369 585 170
1879 170 -312 465 0 38 258 -525 304 -128 -187 285 94 -383 322 -237 33 365 -253 64 -289 -168 224
1900 224 -351 22 431 -402 179 116 -160 819 24 -246 424 -310 458 226 -181 428 144 -271 264 -454
1920 -454 -180 96 -640 385 -210 -332 391 -234 -70 210 -517 76 0 -536 550 -89 35 369 -219 522
1940 522 267 -123 612 -43 82 469 -387 176 1 -556 114 -481 -733 66 -759 -54 -73 -472 -151 66
1960 66 -386 311 -298 139 513 -36 591 564 -18 679 43 -51 582 -485 134 229 -359 4 -279 -111 87
1981 87 -530 -165 44 -505 -50 -330 -389 325 -377 164 655 -275 321 468 -12 823 28 98 315 -274 -130
2002 -130 -112 -685 49 -470 -512 -21 -627 168 243 -172 493 470 -74 784 242 404 906 22 737 285 77
2023 77 624 -86 -75 322 -317 -63 -106 -807 -149 -546 -424 -170 -871 -410 131 -660 418 -1 -65 763 217
2044 217 561 708 93 1003 564 344 432 -164 -56 210 -568 -110 -354 -777 2 -520 -615 277 -570 -105 217
2065 217 -416 681 50 -32 547 -72 222 488 -285 346 31 -243 392 -279 -24 83 -786 -224 -127 -601
2085 -601 -193 -430 -441 250 -155 297 589 25 813 738 334 1068 108 592 788 -274 266 -110 -508 -27
2105 -27 -771 -462 -571 -1083 -563 -788 -1009 -84 -606 5 412 -498 311 502 73 867 564 446 882 408
2125 408 679 658 176 418 341 -199 464 -360 -421 307 -1117 -232 -261 -765 19 -285 -337 23 -354 126 429
2146 429 -28 323 227 0 785 29 213 -20 -249 153 -250 -450 225 -477 -398 -27 -735 150 -8 -189 450
2167 450 304 157 708 54 536 659 30 863 208 66 497 -299 -20 227 -577 -62 -425 -792 -124 -626
2187 -626 -735 -347 -800 -287 -178 -563 275 -312 330 656 225 917 660 193 833 381 158 892 -149 177
2207 177 487 -480 215 -387 -478 182 -693 -359 -4 -507 -27 -340 -578 254 -209 -142 516 -347 168 191 -9
2228 -9 550 77 -225 444 -112 38 62 -615 -147 -376 -449 201 -413 -143 47 -510 149 131 13 716 182 54
2250 54 821 -356 434 415 -55 247 -150 -225 349 -325 -319 81 -575 -18 -179 -455 185 -553 -324 -18 -524
2271 -524 202 292 -83 315 -71 -38 590 -260 128 536 -25 366 -115 -8 432 -248 -90 135 -300 165 -239
2292 -239 -385 46 -247 48 327 -443 344 155 -135 519 -216 -125 286 -279 -97 80 -433 362 -90 -70 143
2313 143 -320 -40 126 -312 599 -203 -150 215 -253 -31 36 -699 211 -99 -323 403 -247 98 446 -424 475
2334 475 352 -170 218 156 -217 291 -382 18 -7 -423 233 -81 -219 261 -374 32 174 -243 356 381 -291
2355 -291 285 -202 21 341 -127 192 -31 -251 163 -48 112 257 -327 325 152 -127 218 -91 -445 225
2375 225 -463 52 36 -270 160 37 -303 268 -5 65 301 -357 255 337 -50 543 119 126 379 -494 43 53
2397 53 -416 254 -213 -369 233 -632 -232 60 -510 44 -101 -638 399 -86 -155 386 -181 337 212 167 645
2418 645 81 152 554 -78 336 347 -304 378 -198 -155 1 -547 -280 -49 -399 90 -122 -451 579 -250 -195
2439 -195 132 -19 316 83 -324 123 23 -224 270 -228 122 246 -82 198 -185 -381 253 -355 -22 187
2459 187 -364 263 122 -73 349 195 141 715 -96 234 173 -97 523 94 -14 72 -421 -77 -171 -683 -139
2480 -139 -613 -726 -143 -788 -301 14 -229 251 115 -25 404 86 64 456 -152 460 206 48 564 166
2500 166 43 222 -116 112 -106 -272 109 -148 -385 -47 -309 -263 82 -399 -84 -335 -178 209 -363 -99
2520 -99 489 -200 145 92 92 101 -174 -331 331 -177 6 68 -430 70 -266 82 177 -188 179 369 24 529 278
2543 278 14 438 240 139 480 -248 186 190 -284 386 -408 -367 104 -354 -334 -184 -560 66 20 -150 -86 -256
2565 -256 -36 232 -167 209 248 -85 465 68 255 383 186 431 125 -219 381 -116 62 198 -324 74
2585 74 130 -302 -76 -105 -221 83 -243 49 8 -340 112 -196 -252 140 -33 -86 303 -298 230 -35 -208 202
2607 202 -181 205 127 -291 85 162 -222 409 -103 -65 235 -95 221 79 -72 529 -23 -170 426 -107 194
2628 194 263 -280 89 -31 -370 124 -419 -31 108 -427 200 181 -145 156 -373 15 200 -338 211 202 -386
2649 -386 186 -112 120 341 -100 332 492 -277 333 262 -248 405 -148 44 97 -324 192 -18 -354 23 -177
2670 -177 -207 -23 -344 121 306 -241 78 -40 -130 251 -41 144 92 -274 363 -41 -283 269 -271 -89 269
2691 269 -247 164 25 -278 179 -227 15 186 -529 66 161 -418 167 -130 -190 212 -42 67 199 -86 280
2712 280 100 -131 85 -169 -99 271 -233 167 -64 -42 348 124 72 373 -36 -101 38 1 293 43 -154 217
2734 217 -227 -232 -110 -356 28 -225 -93 37 -156 -260 367 -161 113 52 -129 279 38 -278 286 -315 -44
2755 -44 -35 -196 227 -46 -267 330 -106 197 272 -191 385 -5 -86 -13 -154 42 295 -521 183 2 -446 34
2777 34 -178 -377 144 -273 31 262 -192 32 -41 -23 354 -397 353 267 -125 346 48 1 405 62 60 203
2799 203 -312 53 164 -454 53 -149 14 -127 -405 264 -48 -126 199 -54 7 498 -319 65 5 -233 223
2820 223 -52 -211 273 -413 110 146 -196 187 -234 188 300 -179 26 239 63 399 186 -207 494 -293
2840 -293 -38 190 -288 3 167 -346 461 -157 -145 29 -284 -378 44 -402 -70 102 -361 233 -319 -108 211
2861 211 -173 120 21 -257 419 -222 51 75 -257 423 128 -297 337 -30 -127 177 -116 2 387 -122 213
2882 213 284 40 256 -232 190 245 -312 21 31 -449 188 -37 -71 37 -148 108 16 -239 -40 -249 -116 288
2904 288 -252 216 327 -182 400 163 -90 477 65 209 390 -105 204 -1 -197 159 -212 -34 153 -276
2924 -276 119 -74 -372 19 -211 -203 394 -304 145 383 -252 -30 -47 -369 231 -148 -61 446 -365 10 -153
2945 -153 -84 307 18 -54 427 -239 269 27 -3 112 13 -88 145 -338 -231 82 124 226 -101 37 361 -175
2967 -175 -251 187 -155 -9 -56 -293 213 -82 -312 -73 -369 201 -61 -42 -93 -169 -13 277 -92 333 470 -45
2989 -45 386 -214 226 242 -294 28 278 -52 293 49 -132 248 -106 -124 131 -357 167 -204 -497 150 -186
3010 -186 -114 184 -209 -91 -151 -229 241 -38 18 341 -65 253 274 -403 169 60 -226 101 -171 119 251 -8
3032 -8 15 284 -124 270 -62 -51 161 -235 -118 -12 -240 -111 -57 152 138 29 163 297 -355 196 8 -228
3054 -228 329 -391 221 155 -88 324 -76 57 233 -81 -36 188 -88 222 -28 -174 185 176 -253 192 -232
3075 -232 -24 109 -173 -15 -204 -195 95 -216 117 87 -253 78 -127 -320 152 -99 -282 223 18 0 25 -1
3097 -1 -16 271 28 366 162 224 425 -47 -152 -117 -248 100 -195 -376 321 -434 108 -19 -326 247 -266 -21
3119 -21 141 -201 235 -35 -79 162 104 24 199 -116 -55 170 -315 375 -196 -172 203 21 80 156 -61 35 46
3142 46 -291 287 -34 -351 150 -30 -190 250 -219 422 32 -67 -29 -13 168 46 -180 67 -34 -62 -28 -202
3164 -202 4 268 -88 22 75 -48 222 -63 102 346 283 115 64 6 -25 89 -3 79 -104 -213 -25 -419
3186 -419 -34 134 -299 -57 -266 -106 -56 -408 178 -148 -30 118 -41 59 120 -332 249 76 -78 347 -83
3207 -83 127 107 -200 151 -122 -200 153 -61 -93 27 -74 129 230 -142 385 94 -171 27 -149 -138 141 -599
3229 -599 428 226 -100 -65 -279 -233 272 -310 -88 102 -320 175 -46 -194 210 79 193 222 -135 103 106
3250 106 -361 184 212 33 116 32 137 337 -69 96 -12 -301 -34 -221 -56 14 -348 -71 -378 -430 -86 -251
3272 -251 -21 -213 -438 67 87 -135 234 211 -95 256 273 358 7 132 424 226 242 56 -194 88 81 -55
3294 -55 100 101 -60 -67 -151 92 -25 -400 154 114 -287 349 -154 130 113 -321 42 -225 -2 258 -60 -481 176
3317 176 -293 -281 13 -102 256 37 125 363 -48 207 204 -252 480 174 176 344 131 87 237 122 140 -71 -189
3340 -189 -153 -369 -169 -47 -374 34 -38 -216 80 -287 -13 273 -80 -149 225 -173 251 -76 95 427 97
3361 97 138 417 -187 322 -174 61 130 -94 -128 111 0 117 127 57 88 24 -53 313 -24 53 322 -361 139
3384 139 119 -173 127 -265 -14 100 -262 233 90 -341 -97 -176 -369 155 -147 14 255 82 220 108 -68
3405 -68 343 -35 32 262 42 174 287 15 309 -237 -69 66 -259 55 -203 -476 33 -47 12 82 -453 176
3427 176 11 -12 259 175 -78 0 -134 -33 34 -54 315 -76 -15 222 80 291 100 -66 189 -64 -97 239
3449 239 -81 52 58 -458 284 128 -31 92 -190 -152 111 -111 194 54 -83 201 126 98 41 -74 104 94
3471 94 -262 -166 359 -263 228 -102 -84 201 -186 -17 161 -133 162 270 -162 66 -317 -116 -13 -162 167
3492 167 83 -231 -10 86 -56 158 -194 21 -44 -271 54 -396 1 136 38 -65 213 25 259 232 -259 153
3514 153 -214 331 364 -117 311 -59 -115 37 -144 86 101 -329 307 26 -320 207 -128 -31 112 -386 -88
3535 -88 -136 -421 227 -4 -56 35 -108 212 55 -292 224 17 -34 251 -105 14 258 5 243 -34 -77 118
3557 118 -122 128 66 -95 -106 -97 -12 -96 -131 -117 34 -129 -34 153 -74 287 -207 103 222 -46 35 278 45
3580 45 16 -27 -227 102 -4 -143 173 -128 63 118 -103 132 -50 232 536 -115 2 6 -80 186 311 -96
3602 -96 332 -342 -17 -20 -424 5 40 -91 83 -143 36 75 -350 144 -228 -178 117 -234 -213 235 -131 45
3624 45 209 164 251 112 28 257 39 110 170 -150 64 -77 -234 -90 -175 -407 -176 -240 -197 43 42 0 -230 -100
3648 -100 375 -33 -47 71 -328 159 255 -243 265 -115 94 73 -175 -50 -111 20 -13 -152 141 392 -293 116
3670 116 190 -14 142 -33 239 -85 -137 49 213 -164 29 50 -18 -83 -76 23 -44 -399 -121 -141 -273 27 -180
3693 -180 -122 99 -73 103 123 205 400 129 324 261 -120 286 184 -166 90 -105 110 118 -157 201 223 -91
3715 -91 -181 108 -130 143 -322 -179 3 14 50 -84 -129 266 181 36 387 -94 209 136 18 135 25 58 262
3738 262 -224 222 237 -110 -48 -105 36 245 32 -88 68 46 60 239 -164 205 132 100 114 47 264 -204 -357
3761 -357 132 -163 -319 55 -216 -55 -62 -186 -95 62 -22 20 -250 -155 94 -70 187 108 20 398 204 58 122
3784 122 5 -7 -163 173 168 -121 -235 46 -205 -91 -212 -129 -173 -15 -251 145 -400 46 94 -31 193 -20
3806 -20 -136 35 145 33 190 73 39 -348 -222 489 -92 -226 -18 -173 -51 -63 -148 213 -117 -237 -20
3827 -20 -206 219 -140 -6 471 -162 -10 225 -32 91 194 64 281 7 -137 -62 -167 -89 88 -221 -60
3848 -60 -165 -247 247 262 -255 273 -305 83 260 -270 279 177 103 62 -1 -95 374 -62 149 120 -52 -3 -368
3871 -368 -108 114 -364 188 -110 -65 -56 -112 -8 113 -137 -194 95 -252 234 50 -85 112 -127 117 130 5
3893 5 21 95 -205 50 117 -39 89 -92 55 -189 -54 -28 -174 68 309 -200 43 -130 -106 16 202 -124
3915 -124 30 -129 112 168 -149 -12 -323 -127 144 4 8 34 -78 -39 178 -15 194 -180 -5 98 81 112
3937 112 125 12 237 -55 90 153 -252 -29 -37 -167 149 15 -177 -199 198 175 -80 -6 60 -1 -163 335 -171
3960 -171 -55 225 -267 188 13 -134 135 -114 -56 7 250 32 -111 -337 12 16 -2 107 -231 -37 -42 -289
3982 -289 -162 177 -187 26 -122 -132 -37 -186 96 94 -123 195 -224 -25 370 -147 19 260 -8 68 264 -175
4004 -175 165 0 -140 -3 16 -1 -166 -202 61 -183 -280 154 -405 -80 -221 -212 142 -82 141 67 -19 37 -63
4027 -63 -11 242 292 20 201 -68 -171 70 -200 -164 -21 76 29 -92 35 -19 56 88 213 -189 72 -13 -170
4050 -170 -84 -222 -12 124 -18 -48 -68 -86 266 -40 -142 63 -120 -82 -62 -20 315 44 23 68 -262 209 73
4073 73 -99 367 36 113 62 103 287 -115 -3 -7 -63 -103 -6 -63 36 281 -223 31 -98 153 275 -124 96 195
4097 195 -311 63 -189 -98 83 -5 -68 55 -184 -84 64 -186 185 100 -140 98 -100 51 12 -106 135 134
4119 134 -178 -143 -264 -189 304 35 74 201 -18 258 11 -196 -51 104 93 58 -329 181 11 159 67 -39
4141 -39 60 71 -186 155 104 -85 169 -70 -232 138 45 -14 347 205 237 26 46 -28 -216 154 239 -93 157
4164 157 -31 -60 81 -106 -197 206 -179 259 -19 -87 172 -180 -68 169 -98 -44 186 24 143 -52 -185
4185 -185 -10 123 41 12 -66 217 157 221 130 -36 -16 43 202 244 8 76 314 -141 31 87 -11 155 45 -219
4209 -219 55 -166 -58 15 -57 138 -61 -47 47 -37 -19 -38 -115 11 60 59 329 -65 124 314 -55 -56 66 -171
4233 -171 -64 57 -294 288 175 86 270 -152 153 251 -160 52 -41 -72 373 -67 113 -20 31 -224 21 31
4255 31 196 -11 -144 197 57 132 37 -143 277 35 223 399 -140 15 34 -12 184 -60 47 122 -110 191
4277 191 69 -95 4 -202 -74 217 -121 148 110 -186 7 -96 -53 307 -69 7 197 -352 409 130 -59
4298 -59 -33 179 -196 82 -124 20 102 -308 -17 144 -18 46 -134 34 89 -36 128 -41 -186 -69 -229 -19
4320 -19 179 90 -26 371 55 17 -107 -173 365 3 -110 45 128 136 -55 -218 74 -47 -73 -6 -16 144 -165
4343 -165 -105 168 -184 31 -90 -94 309 4 18 83 11 -264 -14 -41 15 38 -149 -67 -98 -117 280 71 -253 86
4367 86 -129 81 159 -308 191 -60 -10 115 -53 57 -19 -1 287 143 181 1 -93 -41 -152 -201 43 -170 -14
4390 -14 105 -60 -12 210 60 40 -296 15 153 26 230 24 -293 -7 10 -105 185 132 -148 76 6 48
4412 48 154 -213 -72 246 35 195 24 212 125 -25 231 94 60 252 -202 -321 174 -296 -37 79 -96
4433 -96 82 76 115 136 -231 -31 82 108 289 202 -213 17 -30 -4 -150 -149 156 101 -212 88 -185 -200 -44 -114 -2
4458 -2 38 92 -159 142 -271 127 -44 300 64 183 199 79 315 -4 42 -175 125 -95 145 119 37 -57 -2
4481 -2 -125 183 -1 108 -122 88 151 -288 8 170 -63 -96 134 89 55 -143 5 201 -2 -185 -5 -102
4503 -102 116 -279 -206 154 -52 -53 -9 -127 -6 -21 -88 175 -44 25 139 34 60 235 20 181 -120 -136 357
4526 357 -133 -218 -40 -100 -19 58 -46 -151 -136 110 150 -190 -74 46 -101 -156 -205 131 -65 20 -3 102 -32
4549 -32 208 22 -102 67 50 -144 -136 -32 -131 -109 0 -59 -107 -104 205 -48 -77 71 -167 -181 -275 -94 -117 1 178
4574 178 143 -345 95 -218 -147 232 -125 50 14 131 -40 -226 -52 91 -111 -164 -132 -147 -82 -162 -136 155 54
4597 54 2 -65 314 165 333 9 0 -142 163 -46 -196 55 -253 -38 -94 82 -24 -37 -96 -78 -189 28 65
4620 65 171 189 13 -204 -216 94 -68 13 132 -43 -230 -24 1 221 20 151 61 96 -132 15 -67 191 81
4643 81 39 2 -90 -14 162 -159 -23 -83 -250 -56 -178 87 117 57 34 -153 -144 -40 -117 60 -96 -4 -49 84 -195
4668 -195 157 62 45 228 -36 -95 -50 -253 218 -56 -78 127 -320 -74 -1 -122 137 288 158 57 -165 -17
4690 -17 -56 57 -111 -42 61 5 -305 283 66 -173 116 154 -45 352 227 113 68 -7 60 81 -108 -62 -230
4713 -230 64 244 74 -10 194 87 13 60 -241 268 -58 -90 8 -211 -44 -159 18 -4 -155 -18 181 -169
4735 -169 86 210 -189 153 -216 -366 57 -121 -9 98 130 44 165 -151 -61 138 123 115 -98 -227 43 10
4757 10 52 12 -257 98 -10 -29 9 154 96 -5 -135 61 -110 76 78 -138 65 -161 207 45 -122 161 149
4780 149 -167 239 -277 -303 368 45 -86 123 6 -139 99 30 87 -34 96 -26 -125 -328 112 -57 253
4801 253 58 119 137 -94 -177 -67 24 180 59 -133 171 -311 -66 -83 279 27 22 -98 127 -13 40 -15 -138
4824 -138 386 80 -8 131 54 61 -249 -125 -50 34 5 55 -134 -95 81 116 159 289 -81 47 80 -26 134 -54
4848 -54 -45 -180 -68 177 -180 -332 29 84 -21 228 135 -76 28 -35 36 -26 90 -153 55 200 75 -121 135
4871 135 -166 -112 208 -139 -8 34 63 50 -149 -153 145 -237 114 298 -201 -55 -66 -169 -153 -174 -174 3 -41 -14
4895 -14 192 -223 -11 237 139 241 -91 62 230 -131 91 72 -135 112 72 -6 -11 60 367 135 -227 46 101
4918 101 -107 -133 -12 -45 -53 -61 140 -205 -233 -26 -211 17 165 66 -127 84 -32 -65 -109 125 -68 -68 66 160
4942 160 -34 207 119 136 -207 306 18 61 -294 96 226 -311 70 70 123 161 -223 103 -31 -51 45 -16 264
4965 264 -4 -79 -17 -32 -26 90 110 -199 46 84 -68 258 -37 38 142 96 228 185 -116 291 34 151 -49
4988 -49 202 -91 -13 -81 72 -64 -21 146 99 -1 -51 199 -6 -65 -107 185 45 -58 118 169 24 -173 -122
5011 -122 49 -209 132 153 122 204 -165 -215 -90 -134 -146 147 -80 205 212 35 78 -129 309 -229 -93 -6 219
5034 219 67 142 113 -43 -209 -1 100 -86 -86 78 -59 -213 199 148 -32 -67 -111 21 -89 -169 -13 89 -160
5057 -160 -10 78 -70 -106 -181 64 -153 260 -99 -90 -38 -94 40 -89 101 6 61 -48 -86 31 75 25 79 60 89
5082 89 27 2 45 -118 252 -160 37 266 187 -187 -40 -190 -24 32 -82 -31 171 -35 -72 15 66 -86 -145 168
5106 168 -78 -374 -10 81 71 307 -40 114 -52 130 206 -122 40 126 -108 -131 7 -212 246 -15 -69 73
5128 73 188 -9 255 97 59 189 -111 65 -291 -35 -61 72 73 100 -31 189 -131 -142 263 -55 130 18
5150 18 -134 85 -132 -15 15 164 66 151 -105 158 94 -20 -51 -41 42 -37 66 195 -237 -64 18 -143 -142 -62
5174 -62 -158 108 25 -52 -4 -95 -70 117 -39 23 75 -45 -11 -229 66 -152 41 32 -175 -1 87 -47 -239 -67
5198 -67 -89 -51 -62 -112 192 176 -166 133 151 142 23 9 0 163 -18 82 -35 -20 89 -103 178 214 -135 131 144
5223 144 -194 -14 65 -219 120 -50 131 40 -200 26 143 78 105 -52 -124 -5 -133 88 -123 99 -114 16
5245 16 -32 355 -28 -97 37 -15 -96 13 -124 3 -76 33 -135 -137 72 -191 18 40 -113 -201 342 -74 236
5268 236 94 42 324 -49 161 137 54 97 30 -79 328 -66 -87 -141 102 217 105 -87 -107 81 114 283 8
5291 8 35 -140 89 63 -189 -111 3 -8 -64 -20 -86 -16 149 -150 -247 -225 119 -8 96 148 105 -155 124 -81 30
5316 30 29 -312 116 129 155 127 -59 -121 36 40 -190 141 -115 51 136 -48 186 -261 159 157 -218 -107 -196 -286 -73
5341 -73 50 20 0 -23 177 88 -312 117 -17 215 6 126 159 -126 -194 126 64 -181 -43 -195 180 -170 46
5364 46 3 29 -63 48 -10 40 -52 -111 23 33 -225 190 -80 -86 35 -202 274 -128 170 -40 -52 118 12 -43
5388 -43 61 134 -105 33 125 -134 -123 -20 184 -266 99 61 -5 -7 105 -305 3 -11 -48 -72 97 161 -60 198
5412 198 -51 161 -129 -77 110 -18 270 -111 14 193 49 -72 -64 29 96 84 14 -54 -84 -138 29 -145 -71 -141
5436 -141 -161 30 301 90 216 -92 -184 -18 -180 12 -96 -137 53 -17 15 119 -131 94 194 -56 -35 -86
5458 -86 -10 6 153 -179 101 -192 40 -89 -101 287 83 -70 -102 -14 13 395 131 43 -157 87 185 -107 -61
5481 -61 65 69 -53 -168 70 51 -119 134 -147 -92 84 43 3 122 -58 -73 -24 -151 48 165 -77 -39 160
5504 160 -5 144 57 -65 65 -462 148 147 43 168 -55 -68 -73 -264 79 31 75 183 -217 -17 -67 -86 90
5527 90 -101 5 -196 -169 -168 -111 33 -46 161 -183 -140 -86 48 -71 -168 -30 -136 62 95 -159 -35 79 -7 18
5551 18 -108 118 -34 91 84 132 -9 16 -17 -65 270 79 34 -176 66 -47 -82 8 49 77 -22 116 89 199 42
5576 42 91 120 327 38 156 -60 109 -106 -125 -65 10 -429 27 86 39 156 -97 -6 -192 90 -59 17 29 -79
5600 -79 30 111 205 11 166 143 -8 -162 -6 13 -121 -8 53 -204 -23 116 34 15 -135 0 -28 138 9
5623 9 32 -22 -37 -108 96 20 253 -34 -274 146 32 102 -119 -54 6 -17 -51 59 -3 -95 -16 -176 188 14 -177
5648 -177 108 -120 318 6 -118 92 -325 33 108 -108 -101 -69 -118 181 -58 -53 325 -112 18 11 47 -133 93
5671 93 107 -87 -5 -46 -136 -46 -10 -42 -119 -41 -4 -3 18 -179 -38 -40 -147 -13 246 123 229 -65 146 179 -44 -49
5697 -49 -115 -119 -101 93 51 170 -240 69 -102 -168 -110 -297 -337 47 -35 22 24 64 187 284 -91 193 197 -208 77 101
5723 101 -40 -55 44 -9 93 203 -129 65 -38 -100 -152 -79 0 251 -17 -179 20 -308 -174 30 33 205 162
5746 162 17 46 -306 -6 100 -66 -85 139 55 137 -55 57 122 114 -172 12 93 16 157 -119 84 76 -97 23
5770 23 -137 -288 -42 -188 94 238 50 137 -48 38 -213 -81 212 -144 -324 9 21 -23 -29 -134 -337 187
5792 187 -64 175 71 -112 138 74 113 73 -124 -239 -309 -62 -153 67 171 160 226 118 83 138 -18 211 6
5815 6 81 -173 -218 120 -100 -221 403 120 -1 229 -15 60 -5 205 127 -69 167 -18 -2 90 39 -108 -95 138
5839 138 0 -89 229 -105 74 89 -99 -98 -61 -57 -161 176 -23 57 99 -41 -51 -326 -338 118 85 -67 36 -47
5863 -47 78 -297 36 -58 4 15 -49 -30 -126 109 -83 17 70 159 148 93 40 32 169 111 107 -40 75 77 118 42 -78
5890 -78 -47 58 48 169 -211 209 -45 182 333 39 -238 232 34 53 45 31 89 141 -358 24 218 -118 216
5913 216 -242 -226 -199 -62 21 203 -147 112 154 -50 -130 176 -259 76 -55 -25 158 -159 181 -96 209 15
5935 15 -42 -169 -176 26 -150 -28 -49 187 96 94 21 27 -104 -139 -165 19 47 -56 69 -152 -31 -40 -63 209 157 -17
5961 -17 -106 -116 -19 45 -45 122 34 62 175 -264 55 61 -87 -116 -174 -143 -44 -107 83 208 165 125 -59 -210 -33 -345
5987 -345 -91 45 -156 -207 -183 83 220 -39 -214 -5 214 160 -10 88 175 -118 -123 -25 -124 17 4 -174 136
6010 136 162 -57 111 -131 45 -237 181 42 -45 -77 108 -104 -131 -35 50 43 169 87 299 -33 31 238 111
6033 111 32 -96 -130 89 145 3 -22 -13 -22 -49 -12 -55 -139 0 7 60 154 -196 -78 99 -49 -163 -101 -408 -71 194
6059 194 56 -142 135 95 -28 -256 -46 66 126 83 148 -94 75 -77 222 -1 -187 73 56 -45 -73 -95
6081 -95 -188 301 -42 -226 -57 -130 -291 -299 227 67 40 -13 -52 120 -13 61 -89 122 -52 140 9 8 -23 179
6105 179 35 -5 -101 103 208 -114 95 57 195 68 146 199 23 112 -113 -167 -119 -109 30 -335 88 -61 10
6128 10 34 129 168 -12 -217 -73 163 95 126 -79 -17 -154 -158 173 -31 63 156 6 40 138 -34 -93 -64 -103 74
6153 74 -18 158 203 -164 19 14 2 71 107 -15 -235 -128 44 -135 -236 175 -166 -192 63 -128 64 -8 63 188
6177 188 -2 20 167 -123 -34 -135 148 -69 128 218 174 189 -65 205 -342 120 420 62 -28 -34 -17 -3 53 61
6201 61 20 -39 63 153 -42 21 136 198 96 67 -106 66 -77 -44 34 -231 41 28 -40 -12 -55 -274 41 -51 112
6226 112 -66 213 -59 -4 163 42 -34 9 -15 -91 242 37 -25 -40 -56 120 -144 3 80 65 -146 131 -121
6249 -121 86 3 315 -29 37 -30 -80 212 -88 128 154 244 -252 -11 22 -3 21 25 24 46 -102 101 46 -39 -89 -4
6275 -4 12 -2 32 -152 -18 67 -77 46 65 264 -50 -120 56 102 -145 15 -110 80 34 -30 -244 48 -86 27
6299 27 73 147 -42 59 74 161 181 163 -28 -131 114 -94 -19 -77 -79 -16 -27 -193 -5 -38 19 -53 -150 122 -74 -64
6325 -64 -100 -21 -16 -230 211 108 -2 71 -88 70 -82 95 -101 -314 253 -141 203 104 -101 299 161 -76
6347 -76 101 -4 -68 179 19 8 103 244 117 22 -214 98 120 -118 162 42 -226 33 -74 -185 57 187
6369 187 -170 56 100 7 59 -168 48 85 47 -282 -88 -252 -140 152 -95 61 62 1 -122 -66 -109 146 43
6392 43 42 -79 -85 13 19 -27 30 -130 -52 35 -68 29 26 -29 -67 -137 106 69 132 152 47 29 -70 125 -18 170 -132 -236
6420 -236 -179 116 -25 172 -192 -21 23 131 -5 63 -70 207 -4 -99 -18 25 -145 182 148 106 81 -95 304
6443 304 -22 -281 3 88 52 -226 -47 -235 53 119 -245 55 65 -75 22 -120 -131 62 18 87 194 -77 77
6466 77 -268 -124 64 -119 65 210 7 -131 -142 165 -81 101 22 95 192 341 13 -146 5 42 -102 120
6488 120 152 54 -70 78 58 -174 -16 87 67 14 108 152 225 18 -44 -11 57 -77 -52 93 -13 58 -140 143
6512 143 26 38 206 -18 -371 197 -60 203 -17 89 -112 -94 -7 179 160 122 -67 -173 225 -177 -144 -41
6534 -41 -45 -2 71 -29 -87 116 20 -15 42 220 35 -21 121 60 -90 -23 26 100 -7 -182 -121 106 -111 86 17
6559 17 13 195 90 -131 -2 165 93 -104 -39 153 12 -32 -163 32 -42 -24 170 210 -93 231 114 19 -39 111
6583 111 193 -35 21 -115 114 -91 140 -21 63 54 -379 -114 -224 16 -130 -3 57 -10 50 41 -31 -63 27 49 194
6608 194 269 57 -53 114 112 -98 -214 135 84 59 154 -22 5 155 288 -55 105 -120 88 167 287 102 -129
6631 -129 -37 8 -95 -84 123 171 15 -37 26 -139 -53 142 75 -42 223 -162 51 51 165 214 107 71 -95 39
6655 39 1 215 -74 -25 -232 127 -46 -54 63 -77 38 -18 234 189 66 -132 -102 179 320 184 39 -6 -87
6678 -87 218 -33 -221 -13 -33 -131 250 -221 29 307 -146 231 111 17 -112 -283 4 193 55 -68 6 -79
6700 -79 115 -13 6 310 -5 19 42 -90 20 7 -196 450 -74 139 -15 19 -48 263 -348 -120 111 87 147
6723 147 -66 98 24 79 -47 51 -27 23 -56 17 52 -154 27 -80 -117 22 -81 -210 178 -97 -19 183 -122
6746 -122 228 1 177 -40 70 -94 32 -5 -104 15 -158 -11 -63 -141 183 0 16 60 -109 -114 207 144 -137
6769 -137 -37 76 -71 16 212 78 250 -95 -63 -40 59 -292 202 0 -60 183 -143 -57 135 -17 -272 243
6791 243 53 151 55 54 -91 -24 -10 -150 93 83 143 -144 146 -142 121 -204 -123 103 -197 -136 51 280 -227
6814 -227 -84 -34 34 10 -83 26 71 94 83 -139 -116 -186 -47 -179 -111 75 -50 11 -75 -71 91 3 -87 -39 -103 110
6840 110 9 111 -119 6 106 -131 103 -86 146 202 -14 -66 -154 -203 57 129 -3 4 -164 142 30 68 -172
6863 -172 -44 296 218 -50 216 -56 146 -16 -117 182 3 -3 -43 140 -32 -258 -174 23 -180 57 33 188
6885 188 -8 5 -93 27 10 59 -71 230 70 -284 51 57 48 294 40 -303 -32 58 72 -100 -154 -3 -152 -86
6909 -86 49 127 -65 70 21 44 -161 -147 92 86 34 -52 62 83 124 -167 -50 64 12 73 -12 202 227 22 64
6934 64 86 -74 95 33 9 -6 128 11 324 45 -21 -79 -127 -146 -103 -65 -116 -180 153 209 -219 87 48 -16 50 78
6960 78 90 32 57 -14 -30 53 90 80 -21 -115 40 -109 27 -14 -181 160 5 -1 89 181 -99 -205 -182 -48 12 -255
6986 -255 14 -78 202 193 143 -186 -70 -42 114 129 403 24 93 39 245 270 -305 107 -24 -92 117 46 192 -63
7010 -63 -203 54 -122 108 34 170 -53 -1 146 15 96 -35 57 -102 180 66 -166 4 -313 214 -154 156
7032 156 -66 351 255 -351 -141 54 -72 196 24 -46 96 20 -239 -7 -26 -138 118 209 57 109 3 183
7054 183 19 35 166 97 60 30 -63 17 83 8 135 137 -112 110 65 176 -98 164 89 -65 -177 -9 -6 195 108
7079 108 -57 -24 -58 -136 220 115 -59 216 -49 -11 68 -61 74 75 67 58 149 -119 113 20 91 118 89 156 69 54
7105 54 -90 -77 83 47 4 32 -137 67 195 42 30 -61 1 -109 316 -83 -144 43 7 -64 -119 101 -108 -249
7129 -249 69 -3 -316 59 -147 224 119 276 -290 -315 76 80 -25 125 157 -14 92 30 15 53 -61 113 80
7152 80 -51 120 -143 -17 12 26 224 110 -47 -19 81 160 24 393 69 70 80 -76 46 -176 9 117 -18
7175 -18 -55 7 -12 -186 -298 109 -42 79 -12 214 -213 -25 -167 -168 -126 -18 -155 28 -29 12 -380 150 90 -142
7199 -142 109 -184 -150 247 -5 -241 23 64 196 210 -110 198 93 -21 27 -257 -62 72 -266 -121 47
7220 47 -99 239 76 -31 17 -296 -96 98 -35 265 -11 -7 -112 -118 -15 21 -22 79 0 -9 -201 185 77 -82
7244 -82 -192 37 181 -51 -29 -115 32 68 193 29 -186 77 -29 35 190 -24 -174 -151 -221 125 264 -63
7266 -63 -38 204 70 -124 78 -72 112 -113 -142 20 41 -122 1 -20 148 -58 27 28 -15 -74 -226 83 233
7289 233 50 -377 106 120 -211 66 234 109 148 81 -74 -107 -53 -28 -168 -73 -41 49 20 -102 -30 73 -58 185
7313 185 106 -68 -32 276 -36 -120 -93 157 -292 -6 272 155 150 -155 2 -124 -56 -174 99 31 -149 23 5
7336 5 160 -126 -131 138 47 84 -173 289 -193 -182 196 -91 81 97 64 -111 -106 99 -184 -31 84 50 216 -275
7360 -275 -79 -31 71 -65 208 245 68 88 -97 199 347 101 -61 127 -58 13 2 -4 133 -182 134 -116
7382 -116 -194 106 -58 136 247 -118 -60 -96 -24 115 9 135 0 95 113 -99 256 140 -324 6 -114 78
7404 78 -19 -32 43 -73 -85 -168 135 -13 -11 -7 -3 83 61 -49 131 -56 -229 123 142 247 -229 -200 117 121 -198 87
7430 87 37 6 -25 4 -8 96 37 -71 57 -10 165 -200 190 -82 9 328 -37 46 16 -19 15 -123 -130 40 54
7455 54 58 93 -12 121 28 45 211 13 -51 37 298 124 354 45 -37 -141 -127 42 147 58 -14 -87 144 363
7479 363 -32 -181 -119 53 -198 111 -300 7 32 -26 99 -212 60 146 -54 -53 -156 -9 158 -96 -29 -13 212
7502 212 -327 -68 17 231 -83 89 198 92 82 93 -22 176 170 142 -71 162 -38 -161 -289 -234 -145 -184 -121
7525 -121 -43 126 -31 164 -86 112 -5 -15 57 -36 178 81 2 -23 -24 -46 -1 -14 -51 71 108 -60 -38 62 -202
7550 -202 153 47 -158 105 -174 196 -76 160 74 -47 225 87 -46 35 128 -66 37 -29 -120 -147 94 54
7572 54 -52 -6 37 -153 -19 256 30 103 -10 -67 28 17 -51 253 168 -168 -8 4 -40 26 -174 16 -117 98
7596 98 9 -62 -91 16 124 107 240 37 -23 19 -365 -100 84 -64 54 -170 190 -16 -225 110 -157 -45
7618 -45 87 25 -35 112 -293 -47 21 -20 -5 117 213 -22 9 157 -2 -44 114 -56 -39 -43 91 265 -166 -67
7642 -67 -20 -145 -58 -81 -151 -1 138 -20 -53 -222 -178 -216 155 22 214 -37 189 78 150 64 12 61 252 91
7666 91 -116 57 -105 80 -195 -314 197 5 -55 100 79 -139 23 -70 -138 16 -6 112 -14 -101 -106 -2 -25
7689 -25 82 -3 55 -98 167 -19 -110 278 -135 37 101 -164 223 -85 15 59 -112 -263 -5 58 -9 34 78
7712 78 177 53 -177 -201 122 202 138 -122 40 326 144 -191 -210 -14 148 -7 5 -177 -319 -207 5 -263
7734 -263 -47 334 38 -38 173 -39 -21 91 -90 0 122 -155 -43 99 150 -98 313 2 64 -107 168 56
7756 56 88 -112 -284 80 -83 145 145 -66 24 237 76 144 18 -17 -94 2 -184 -137 -203 -52 -103 -8 -2 -262 -159
7781 -159 -114 -41 -18 -201 -43 62 -6 168 -95 -5 -24 -409 -125 -156 -19 -157 -59 -3 188 53 -84 -178 -176 74
7805 74 69 -164 114 -117 109 68 15 38 -58 176 -110 -76 -301 99 -45 238 282 -210 123 -20 188 146 -68
7828 -68 177 74 -16 240 -253 -79 -106 -157 196 -9 -33 104 134 79 53 158 132 -128 -4 165 -155 31 197
7851 197 -141 15 116 -73 -229 31 12 94 252 11 130 87 -115 -142 -3 -226 68 69 -5 -131 -76 -70 89
7874 89 -19 -52 260 247 -54 48 186 -31 -192 -52 235 -283 -105 57 -143 -2 -23 41 -25 -69 -77 -16 119
7897 119 -90 42 2 102 1 4 -107 229 139 -48 143 -44 37 122 85 99 -350 -29 -146 -267 27 104 -41
7920 -41 242 -7 32 67 106 7 183 11 219 80 136 -3 -74 -18 -35 127 -149 209 145 -47 -105 19 97 58
7944 58 2 -86 -37 127 69 -134 130 -257 101 -15 88 0 72 181 55 -111 64 308 66 51 104 -322 72
7967 72 -134 -275 42 53 193 -146 -102 61 155 46 189 207 160 163 125 -58 -206 -91 -26 -121 -95 -60 -60 -158 -43
7992 -43 -166 -99 8 -63 -24 -43 68 12 -22 185 128 315 -2 99 79 370 -111 -120 155 -63 108 -245 209 -118
8016 -118 -267 306 221 -138 -13 -53 -34 -25 -36 63 250 69 -100 -85 143 242 -129 59 -103 -44 22 -98 74 -85
8040 -85 91 11 65 -58 107 -115 -50 65 97 112 98 -85 -36 -350 -124 77 241 -25 10 31 17 -131 -125 11
8064 11 121 -16 -81 -115 -58 -118 -95 153 -49 -49 142 -33 155 -82 9 81 -116 2 205 27 -61 2 15 -89
8088 -89 63 48 205 356 -42 191 50 315 -6 56 102 264 135 22 -14 86 51 56 51 -253 -113 275 -123
8111 -123 -117 252 44 37 3 -91 77 -153 -22 73 66 134 110 -161 17 159 63 37 -61 168 175 235 160 -140 183 99
8137 99 -50 -159 -177 234 48 73 -5 -44 -96 23 62 -15 51 -3 -101 -269 84 -63 -30 218 121 -245 98 101 -247
8162 -247 -172 -35 -48 175 44 116 150 131 -85 -27 -247 85 -154 119 -69 -175 -297 -28 -25 12 86 46 -94 -99
8186 -99 159 -147 20 -78 198
8191A98
$$ Imaginary data points
##PAGE= N=2
##DATA TABLE= (X++(I..I)), XYDATA
0 0 0 0 0 0 0 0 0 0 0 0 0 0 0 0 0 0 0 -8 8 -8 8 -8 8 -16 16 -16 19 -24 24 -32 33 -40 44 -49 56 -64 71 -79 89
39 89 -99 109 -122 134 -149 164 -182 201 -220 242 -267 295 -324 357 -396 437 -485 539 -603 678
59 678 -765 871 -1005 1178 -1405 1727 -2213 3025 -4621 8936 -43750 -114347 34873 108651
73 108651 42203 -21713 28492 91246 58842 23032 39598 27582 45215 75577 34019 -23009
85 -23009 -15797 33645 18188 -73321 -61828 22212 11789 -40068 -40565 -6550 6092 -26500 -31269
98 -31269 -16808 -24522 2496 22057 -10413 -14879 11242 25081 2796 -29726 -6125 15321 -6006
111 -6006 -2312 -1229 -13757 1177 11781 1567 -19894 -16131 30202 25257 -16928 3618 35992
124 35992 32374 17549 12198 29347 25693 14083 25250 -1214 -24807 7799 14524 -23541 -46676
137 -46676 -19186 12486 -33662 -73229 -29786 -8013 -30681 -36834 -16933 11222 9191 4479 18628
150 18628 6175 7999 36658 25214 7301 21426 46127 44437 2871 -3089 27785 7879 -21947
163 -21947 -14591 -1548 3282 -9368 -10505 760 -14690 -16433 -5922 -21497 -19369 -2393 2684
176 2684 1755 -6896 4802 14179 -9052 -9888 2724 -2994 -672 147 3489 7922 -2900 1727 2659
191 2659 -12802 -4054 695 -7255 -1792 1881 8026 7032 -1765 12513 13284 -1159 8568 13661 9327
206 9327 8567 6405 15192 8485 -5460 4382 167 -13575 -10840 -13193 -12670 -14305 -18429 -7238 -10018
221 -10018 -14360 -1234 -4932 -8300 1074 2961 6338 2067 5205 20992 10688 921 11403 9829
235 9829 4822 -1598 -3689 7835 2293 -1875 6140 3 1508 4231 -6819 -6660 -5363 -3530 134
250 134 -9980 -3983 8105 -2549 -5849 -4332 -4347 78 -6987 -3151 8139 3449 7506 9497 786
265 786 3392 412 -3341 -2068 -6710 2230 6617 -3528 1883 3322 -2902 -2684 -7462 -2871 1949
280 1949 -3473 5080 6905 466 4820 419 -3408 -1662 -6284 -344 1255 -3011 5526 3336 -2228
295 -2228 2232 -2066 -1473 -1396 -3858 5155 2669 -2270 5630 1992 -533 525 -3478 1403 -140 -4372
311 -4372 2963 -747 -1489 4149 -1834 270 2153 -1062 2911 -2382 -3433 3326 -3588 -3318 228 -3177
327 -3177 372 -3590 -6553 -1048 -7259 -5742 3 -3778 2553 5661 3946 8858 4246 4930 9144
342 9144 2138 5546 8754 4928 9370 5477 2115 3286 -5535 -6110 -5621 -11832 -6024 -5286 -7383 -2910
358 -2910 -7458 -6661 -4947 -11036 -5816 -3638 -5619 2819 2961 3994 7379 2330 6176 5944 668 6774
374 6774 6511 5875 11225 5717 6435 6714 175 1605 -2957 -6398 -61 -3971 -4866 -1510 -4928 -855
390 -855 -2936 -7704 -1365 -3136 -2614 1924 -2239 2259 3439 -1166 1366 -3037 -5267 -695 -6337 -5808
406 -5808 -2889 -5244 7 -1537 -3169 3200 1158 3299 7209 3140 8326 9957 8022 11812 7238
421 7238 7142 10873 3906 2629 1267 -3140 885 -4488 -8692 -4355 -7853 -7000 -8239 -14564 -9344 -9138
437 -9138 -12049 -8323 -10012 -4241 1824 -1872 1786 3416 3659 9905 5388 4553 11629 11324 13587 10502
453 10502 5566 10973 6310 -889 -677 -4092 -710 234 -5966 -2447 -2466 -4367 -1496 -7978 -8154 -1625
469 -1625 -2392 856 -1121 -1894 6470 2463 -3255 -2368 -4178 -676 -1389 -6868 -1168 -1494 -2869 -349
485 -349 -6748 -5094 -762 -2092 1730 227 1421 10969 7973 5270 6947 6539 11302 7763 1774 7272
501 7272 6079 3832 3386 -3422 -1786 -1748 -6421 -5086 -9916 -10685 -4500 -8111 -9598 -8711 -7376 141
517 141 -3306 -7758 -175 1438 2026 2019 -536 6759 8849 5349 8019 4674 4970 8690 2521 974 854
534 854 500 5581 -766 -5270 936 -642 -2191 -5045 -7171 763 933 -2820 1796 950 2470 3589
550 3589 -2526 -1020 -1673 -3155 1183 -3108 -4862 -544 -2702 -2478 -5808 -8475 -894 -1927 -4460 444
566 444 1145 5251 5750 1477 5783 5084 3141 6955 3605 4102 6625 4448 6358 2359 -1848 3258
582 3258 -109 -3982 -3106 -3922 -380 -2444 -7687 -3510 -4551 -7032 -4576 -7508 -5025 -2039 -3685 1049
598 1049 -260 -1290 4957 2566 1305 3201 2504 6399 3675 201 5707 3453 1009 2198 -1197
613 -1197 1419 1015 -2447 1335 -769 -1210 2501 -962 1 1166 -1287 1638 -743 -2969 935 -2144
629 -2144 -1805 127 -2934 -144 -867 -3717 -633 -3140 -3274 -394 -3344 23 1631 -1207 2521 983
645 983 -67 2437 -614 1615 3321 971 5188 3959 1548 4034 592 344 342 -2917 1220 392 -2455
662 -2455 1163 -948 -1868 -844 -4704 -2403 -1805 -3936 443 -969 -1827 1841 -645 -431 -314 -2046
678 -2046 2456 998 -837 3952 2141 2441 3000 -539 2058 1012 -1290 1321 -1400 -748 1955 -1862
694 -1862 -994 -585 -1713 814 -1994 -2315 2135 -756 -32 376 -1479 2115 176 -1594 1120 -1623
710 -1623 -241 1362 -2448 547 1034 -181 1893 -250 687 3058 -1383 477 728 -1426 1568 -511
726 -511 -1109 1099 -1798 -335 -350 -3297 5 -656 -1671 1401 -331 1269 2170 -1326 1379 371 -1880
743 -1880 1133 -905 -165 1470 -1011 1420 780 -2096 1262 -729 -925 1939 -339 1838 2441 -263
759 -263 2342 150 -1261 1151 -1889 -936 695 -1320 1054 -434 -2055 766 -2111 -2350 -490 -2584
775 -2584 -94 -80 -1916 1486 -842 -1278 1166 -2237 -178 1571 -320 2391 1617 1640 4310 886 1757
792 1757 2934 51 2198 1142 -353 2240 -677 -720 627 -3059 -810 -1338 -3399 -866 -2350 -2351 -203
809 -203 -3172 -957 187 -2244 500 -422 -1078 1432 -898 460 1898 -232 2306 1629 96 2764
825 2764 189 231 1488 -878 1338 1015 -460 2587 616 -93 1977 -975 643 639 -1503 1390 174
842 174 -765 1200 -1914 -1409 -758 -3615 -1395 -2218 -2843 199 -1936 -1566 -200 -2563 -612 -684 -2055
859 -2055 1088 117 551 2956 422 1734 2749 560 3211 1884 1169 4085 1604 2519 2970 336
875 336 1698 -39 -2133 12 -2489 -1988 -794 -3769 -1297 -1538 -3302 -822 -2710 -2091 319 -2079
891 -2079 -50 496 -1082 1705 46 -935 1426 -749 328 1104 -1258 1566 1071 -170 2349 11
907 11 922 2752 -47 1930 1641 -45 2621 638 -127 1878 -872 362 201 -2098 426 -1253 -2173
924 -2173 -204 -2765 -1283 -98 -3225 -1237 -1863 -2916 -509 -2727 -1921 473 -1170 990 948 9
940 9 2823 1301 1135 2979 1099 3304 3024 1198 2948 1415 789 1765 -1313 -400 -9 -1730 324
957 324 -937 -2072 278 -1819 -2061 -1007 -3014 -520 -1025 -2276 719 -853 -853 573 -1996 -140 203
974 203 -1289 1045 -57 -305 2140 -26 789 1212 -390 2193 763 -330 2676 861 1650 2062 -355
991 -355 1536 1098 -500 1557 -689 -877 988 -1642 -681 -747 -2274 62 -1846 -2494 36 -1899 -899
1008 -899 -468 -2149 517 -2 -1035 1526 -724 82 1334 -775 1327 1279 -71 2453 781 889 2188
1025 2188 -10 1172 828 -1017 1471 -131 -1023 771 -1312 -581 -234 -2373 100 -769 -1769 560
1041 560 -955 -88 984 -987 665 31 -1253 1122 -808 -614 1306 -667 811 440 -970 1387
1057 1387 0 -990 1331 -246 937 1184 -686 1451 67 -1000 749 -1314 -640 559 -1384 450
1073 450 -58 -993 1317 -874 -717 1217 -737 478 531 -578 1672 -137 -590 846 -1447 254 461
1090 461 -1267 860 291 -583 1211 -399 348 1211 -979 634 384 -905 1113 -516 -528 581 -1210
1107 -1210 216 0 -1439 630 -672 -649 826 -960 408 470 -1120 720 -167 -901 1353 -219 -87
1124 -87 927 -734 1702 831 -294 2051 613 409 1054 -571 631 555 -812 761 -685 -1142 463
1141 463 -1697 -826 -595 -1657 266 -979 -1464 658 -919 -402 339 -1290 436 389 -492 1899 125
1158 125 837 2143 -220 1210 1091 -318 1327 91 16 1502 -844 45 245 -1619 131 -450 -1224
1175 -1224 433 -993 164 727 -1100 568 189 -983 604 -908 -326 655 -1350 105 -279 -1744
1191 -1744 323 -724 -1273 614 -1107 147 619 -559 1351 717 318 1804 390 1304 1821 279
1207 279 1524 1202 327 1876 -72 34 1052 -1121 16 -715 -1920 -523 -2180 -2240 -939 -2752 -1577
1224 -1577 -1097 -2291 -121 -728 -910 1258 -243 999 2042 779 2087 1177 722 2196 532 567 1803
1241 1803 -116 1061 590 -501 768 -768 -458 338 -1288 -63 490 -1076 514 -359 -658 451
1257 451 -1276 -477 276 -1517 296 -23 -990 425 -1025 -565 -3 -1666 -218 -378 -1436 317 -701
1274 -701 -458 912 -613 768 1279 -41 2093 1179 1014 2809 1186 1592 1777 166 1503 309 -680
1291 -680 659 -1096 -894 -521 -2208 -1078 -1307 -2206 -902 -1894 -1665 -284 -1671 -373 -35 -965 1043
1308 1043 174 66 1936 217 1175 1805 345 1521 1060 116 1547 -182 77 727 -933 107 -42
1325 -42 -1052 489 -723 -716 735 -1092 304 81 -862 674 10 -446 1041 -877 -142 229 -1316 -77
1343 -77 -674 -1195 35 -1043 -491 -96 -1330 273 140 -766 878 18 590 1589 212 1473 1438 261
1361 261 1836 801 564 1610 329 653 719 -894 325 -613 -1449 -593 -1712 -1547 -964 -2017 -612
1378 -612 -765 -1077 301 -939 -417 839 -322 689 1247 11 1471 708 99 1499 -267 575 656
1395 656 -540 151 -125 -668 701 -697 -253 624 -788 342 40 -694 652 -631 -399 588 -586
1412 -586 302 439 -588 641 -4 -148 698 -536 151 462 -964 507 -323 -799 262 -900 -453 172
1430 172 -647 269 122 -495 1023 -58 9 812 -333 728 734 -288 1081 -59 -201 519 -586 -148
1448 -148 -22 -808 330 -480 -583 527 -513 -184 97 -937 130 67 -796 867 -328 4 656 -516
1466 -516 437 369 -278 1041 226 -41 1093 -128 422 520 -738 469 -251 -834 275 -729 -437 -20
1484 -20 -1148 -42 -247 -894 343 -327 -108 252 -578 320 326 -347 794 160 109 1108 -43 584 931 -84
1504 -84 1045 165 -347 818 -685 -441 -111 -1435 -161 -634 -1118 247 -951 -444 59 -917 163 189
1522 189 -423 836 131 259 780 -163 694 487 -414 631 28 -247 467 -618 109 370 -578 454 -10
1541 -10 -624 369 -636 -536 419 -450 241 -5 -228 1091 -106 -98 750 -57 530 278 -689 331 -534 -959
1561 -959 -140 -1260 -809 -469 -1185 -83 -805 -597 667 -172 451 1028 425 1190 1068 253 1597 658 618
1580 618 1275 -71 327 171 -527 255 -509 -1120 -294 -1547 -791 -645 -1456 -348 -980 -936 -15 -738 -154
1599 -154 597 -355 906 847 347 1254 709 880 1490 193 704 523 -585 393 -302 -815 90 -937 -255
1618 -255 -121 -1091 126 -216 -380 494 -84 541 879 -43 828 525 -27 758 -216 -303 431 -802 -99 -206
1638 -206 -1313 -166 -1018 -1395 -263 -1129 -437 57 -813 407 259 203 1214 660 1231 1495 694 1261 1121
1657 1121 440 1219 304 -190 437 -784 -219 -600 -1303 -576 -1230 -1405 -457 -1302 -731 -369 -822 365 -1
1676 -1 -82 790 231 707 1015 52 1115 578 57 985 33 52 563 -622 2 56 -898 290 -654 -625 289
1697 289 -704 -177 78 -470 496 161 -12 1162 157 620 762 -108 536 160 -633 329 -626 -831 -575
1716 -575 -1218 -704 -556 -1306 -256 -737 -501 328 -190 263 647 293 1232 609 691 1468 734 704 1019 155
1736 155 808 205 -172 489 -875 -448 -176 -1283 -575 -793 -1118 -439 -837 -862 -23 -714 3 -66 -316 730
1756 730 332 366 1089 549 880 1061 83 885 238 -511 489 -241 -190 -225 -1020 -101 -231 -1131 -36 -541
1776 -541 -274 446 -492 324 442 45 727 315 112 518 -373 60 196 -509 -69 56 -766 -48 -750 -557
1796 -557 82 -1217 -281 -60 -616 445 -195 54 670 171 594 890 175 976 437 425 869 112 458 507
1816 507 -466 254 -360 -726 30 -1215 -754 -304 -1140 7 -224 -735 126 -486 113 504 -81 470 418 -123
1836 -123 878 356 137 577 -68 -41 375 -232 379 -132 -322 250 -714 -352 -60 -871 186 -33 -402 321
1856 321 -295 -100 689 -82 284 481 -143 713 216 -241 604 -583 -270 -124 -650 117 -333 -590 168 -540
1876 -540 -299 252 -261 261 256 -250 768 -17 -33 721 -229 248 116 -112 474 -248 -107 834 -410 -25
1896 -25 417 -338 405 -133 -447 357 -285 -383 397 -827 -32 55 -340 341 -310 -125 574 -341 387 456 -607
1917 -607 299 -104 -195 459 -354 221 126 -552 244 -198 -224 494 -535 -80 319 -358 509 1 -443 296 -518
1938 -518 -85 260 -283 110 194 -162 526 66 -17 784 -116 380 445 -51 357 28 -295 365 -636 -100 108
1959 108 -664 -119 -265 -533 118 -534 -306 229 -387 -8 383 73 337 70 -269 504 -132 487 248 -214
1979 -214 476 -25 8 354 -256 -238 157 -673 -207 -213 -591 242 -467 -352 475 -300 216 455 -230 388 325 165
2001 165 550 11 159 300 -597 211 -323 -438 94 -716 -463 -477 -737 -23 -148 -504 290 -298 253 486
2021 486 -320 769 590 26 967 149 288 675 179 691 397 -224 290 -323 -535 197 -967 -414 -384 -1183
2041 -1183 -438 -300 -585 230 -561 75 372 8 613 443 241 978 479 132 804 -167 423 134 -454 211
2061 211 -315 -346 70 -447 -219 10 -393 267 36 -238 545 -295 4 411 -36 392 389 23 453 4 -40
2082 -40 511 -424 -143 -155 -693 -190 -504 -478 -173 -824 -124 -117 -302 389 343 -8 840 516 658 1000 353 997
2104 997 418 119 936 120 -77 -70 -492 -364 -327 -898 -498 -875 -888 -245 -777 -340 -408 -632 66 60 -223 323
2126 323 -143 476 568 46 663 463 116 850 208 8 466 -503 -161 82 -641 51 -442 -660 273 -675
2146 -675 15 -75 -507 462 64 65 485 -144 221 546 -367 160 239 -297 390 -475 -90 -7 -991 -231 -209 -841
2168 -841 213 -344 -547 52 -387 200 279 -120 451 509 429 765 281 629 854 149 665 176 -375 333 -319
2189 -319 -513 -77 -832 -193 -646 -781 149 -672 -622 109 -361 27 262 -353 646 142 305 971 94 440
2209 440 643 96 463 -49 -300 292 -384 -161 188 -495 -163 -192 -353 196 -363 -291 294 -127 409 293 -529
2230 -529 525 46 -68 348 -63 355 311 -431 201 -273 -288 69 -550 -516 216 -696 -100 -326 -351 290 -182
2251 -182 -308 618 -17 401 522 -206 575 56 -26 526 -271 228 278 -341 147 -102 -485 266 -392 -274 350
2272 350 -493 -110 -197 -524 44 -242 -145 -54 -355 173 231 -261 244 121 -30 437 -204 138 420 -261 401
2293 401 -33 -202 132 -212 -85 -87 -630 -31 176 -250 393 145 56 414 -150 315 362 -584 420 -129 -7
2314 -7 346 -140 18 317 -345 196 122 -229 356 -160 -2 229 -430 195 -100 -160 565 -436 -140 303 -355
2335 -355 134 245 -134 274 165 142 417 -283 239 219 -312 475 -81 -158 239 -220 -159 321 -166 136 35
2356 35 -338 121 -28 -41 123 -552 142 43 -355 336 -246 -111 209 -201 252 273 -176 186 63 -83 194
2377 194 -91 -159 97 -348 168 -241 -428 -157 -302 21 143 -325 218 213 25 630 90 55 688 94 378
2398 378 372 -205 225 -32 -97 294 -147 138 264 -436 45 -207 -526 83 -308 -350 147 -400 -128 92 -356
2419 -356 509 -100 -22 426 -28 131 155 102 518 202 190 279 -307 -164 102 -547 301 -18 -305 255 12 -35
2441 -35 327 -205 309 199 -306 517 -9 -117 173 -158 104 238 -406 238 -125 -362 144 -348 43 122 -284
2462 -284 -143 172 -623 235 -96 92 316 38 662 500 164 415 379 130 615 64 364 394 -314 -5 -293
2483 -293 -359 59 -606 -333 -7 -712 -213 -42 -427 268 -284 -388 185 -285 257 -4 -293 381 77 110 620
2504 620 -163 339 52 -144 473 7 -146 384 22 41 304 -327 100 -171 -239 307 -474 -61 356 -70 230
2525 230 189 -270 485 -8 -45 77 -112 -13 108 -452 94 -265 -522 280 -362 -21 -1 -276 361 311 -187 438
2547 438 -182 130 313 -57 212 199 -6 358 -160 108 498 -278 -86 -108 -614 157 -45 -481 62 -629 -229
2568 -229 -163 -544 -76 -321 -85 513 -91 2 233 -32 462 319 -6 521 312 -65 298 -69 212 156 -367
2589 -367 196 -202 -10 340 -398 131 141 -187 110 -74 -308 97 -158 -118 143 -46 493 211 -175 506 69
2610 69 70 168 -309 -17 132 -282 312 -363 -65 351 -268 -32 90 -145 186 -140 -148 640 106 414 565 -234
2632 -234 480 -212 29 257 -288 -192 -79 -582 4 -75 -413 256 -355 -601 265 -264 -87 214 -362 302 -76
2653 -76 -85 329 -144 148 285 -150 148 104 -296 396 -39 116 402 -612 120 217 -528 -69 -184 -185 -180 -423 -40
2676 -40 -103 -273 259 4 -294 189 -176 -168 369 -126 105 -51 -307 422 -270 135 573 -554 101 168 -227
2697 -227 623 115 8 52 -401 -45 -60 -239 107 41 -149 112 -92 123 26 -286 416 103 -225 389 -350
2718 -350 -49 111 -337 82 -93 -145 387 57 -71 64 -13 13 88 -289 354 0 159 339 -338 220 114
2739 114 -467 42 58 -391 114 -249 37 -34 -192 -90 44 -62 249 -123 -177 -216 -437 95 -5 -274 336
2760 336 -115 -154 293 35 289 213 64 356 128 12 431 -9 -148 68 -292 7 -49 -326 213 -192 -9
2781 -9 94 -136 74 5 -234 -48 -119 -191 269 -475 -140 -47 -345 333 197 -55 152 -45 2 349 -321 398
2803 398 274 -224 266 -255 24 -26 -239 172 80 -356 343 -227 -11 253 -274 95 24 -217 -58 -93 -246
2824 -246 65 -58 -93 -12 -340 184 13 -275 369 -24 -11 237 -98 481 142 -313 331 143 1 416 -194
2845 -194 294 208 4 219 87 -98 416 -68 -145 167 -152 19 -137 -403 -92 -352 -142 45 -412 124 -129
2866 -129 -327 225 -117 -251 228 -19 166 367 -91 191 350 -199 207 -12 21 349 30 265 109 23 433
2887 433 -26 64 440 -86 -67 104 -286 -77 -62 -358 14 -286 6 -44 -395 -3 15 -209 104 -369 -109 36
2909 36 -351 -32 -70 -337 301 91 5 192 -175 351 272 -16 609 -60 188 231 -261 9 -123 -153 305 -39
2931 -39 -25 -33 -507 -2 -28 -346 41 -258 -409 332 -179 -177 117 -213 -57 12 -150 187 -22 6 161 -2 38
2954 38 158 -57 514 224 181 114 -240 110 305 -158 194 -56 -119 292 -71 166 234 -119 44 243 -376 77
2976 77 -253 -346 95 -220 -114 -172 -369 205 87 -561 173 -161 39 158 -301 146 147 -217 388 -194 -91 -49
2998 -49 -254 184 206 185 163 -127 -33 167 -220 -27 201 -140 36 -145 -230 69 -71 -1 335 -411 229 -97
3020 -97 -35 164 -269 -190 121 -518 341 75 -316 115 -71 -149 289 -25 107 226 -174 96 16 -185 233 -235
3042 -235 -100 265 38 117 -97 60 138 -84 -207 301 -349 -74 140 -62 268 -42 43 29 -265 123 210 -455
3064 -455 190 -385 -234 184 -258 -12 278 -113 239 112 -145 417 2 -25 120 -191 435 -86 -128 250 -112
3085 -112 108 162 -271 -32 130 -26 118 -421 -79 189 -178 -106 -97 -523 442 -109 -252 50 8 201 167 -236
3107 -236 374 256 -45 376 -219 109 233 -111 -205 -82 -333 125 -59 -88 215 4 11 -175 -343 227 -83
3128 -83 -151 214 41 -217 66 -340 149 191 -269 265 -58 -159 190 65 255 45 164 450 -392 21 344
3149 344 -102 -184 79 -99 172 -135 -117 380 -18 -58 135 -128 50 -204 -259 89 -247 16 -116 -185 163 -137
3171 -137 -313 349 -133 -80 198 -18 183 289 -212 234 44 -146 287 17 175 178 -249 -42 -155 113 173
3192 173 -51 -100 191 -363 299 -104 -384 152 76 -38 -92 -180 71 14 -152 250 -245 127 254 -22 -196 139
3214 139 -67 261 -162 -184 62 44 1 280 -314 157 332 -205 208 -70 -38 82 -151 149 -36 -406 127
3235 127 -21 -180 201 -200 163 -162 -135 -178 -356 -346 29 -140 -76 -199 -539 88 -39 -139 225 -77 233
3256 233 531 -62 315 535 27 413 60 -4 269 95 -110 167 -170 78 -122 -278 -67 -89 -201 -112 -262
3277 -262 -13 -100 -335 -76 -448 -201 3 -6 157 148 -262 80 12 -28 305 -39 122 480 -100 308 138 30
3299 30 118 -230 -122 163 -304 36 -67 -122 269 -210 -132 240 -64 33 -206 -300 144 -202 -95 -32 -150 73
3321 73 -211 -294 -105 -264 -286 179 -184 88 291 -278 140 293 80 515 191 156 339 12 239 253 9 606
3343 606 -35 -83 54 -215 64 275 -308 -27 -381 -131 -44 -452 -348 22 -227 118 202 -253 168 -26 78
3364 78 296 -37 160 246 -181 99 -66 -64 90 -181 167 163 -8 44 -94 -180 220 -153 59 164 -384 146 -53
3387 -53 -160 104 -94 9 328 -346 -71 -78 -202 45 -208 -157 168 -101 117 -185 -187 12 -260 -53 -13 -37 60
3410 60 217 144 403 297 9 332 34 55 438 72 135 144 92 288 -245 7 226 -96 -4 157 -211 -62 -290
3433 -290 -203 54 -128 45 -111 -307 192 -18 -233 196 -107 -81 179 -128 343 118 -78 225 -134 5 78
3454 78 -237 -46 -159 -28 274 -61 -52 19 -240 -24 256 -70 232 172 114 254 -83 68 39 -371 175 16
3476 16 -282 224 6 -132 165 55 307 -12 -215 215 27 195 268 -136 -9 58 -50 297 -71 -181 198
3497 198 66 -135 168 -264 275 6 -24 387 -157 -310 133 -93 82 -105 92 95 -187 -52 155 -136 146
3518 146 -3 -109 245 241 51 203 99 -24 285 -63 183 222 -149 -45 245 41 152 -152 318 293 -306
3539 -306 194 -154 -224 -5 -127 80 114 -251 13 39 -67 299 -209 165 196 15 348 -32 -6 328 -144 -260
3561 -260 295 -361 -97 72 235 18 -75 28 -28 -384 35 20 -346 -34 -232 -121 -41 -242 18 197 -279
3582 -279 352 -57 49 51 -65 173 21 -70 -50 62 96 46 -180 -67 117 47 79 213 -41 276 71 202 116
3605 116 -304 73 80 -170 81 -57 -13 -3 -244 -221 -259 -179 22 -246 -359 31 -191 -222 217 -114 52 -255 -443
3628 -443 207 128 196 555 -3 115 546 -38 226 39 73 119 -192 -99 187 -148 54 -110 -202 -243 -182 -35 12
3651 12 -317 -335 95 -23 197 145 5 8 -68 -181 -2 -136 242 245 27 374 34 64 5 -105 42 397 -236
3674 -236 417 -98 10 183 -228 -60 84 -37 273 -56 70 210 -5 266 -124 -209 -87 -43 -157 -35 -167
3695 -167 -171 -23 -386 135 -212 -311 376 -110 -158 -27 -122 282 63 -104 299 184 139 409 157 -153 206 -31
3717 -31 310 80 -70 -67 -223 164 104 -167 -33 -165 -183 -158 -50 -140 419 -278 148 37 -62 229 -181 -8 277
3740 277 -118 187 144 -182 212 11 -176 120 -59 -174 -122 -267 162 129 121 35 -133 40 312 204 270 99
3762 99 -51 10 -243 -131 277 39 62 2 -109 157 -72 -245 -156 -291 -99 -156 -307 -58 -6 -322 381 -147
3784 -147 84 139 38 157 -60 58 173 -26 -42 168 -156 9 -148 -424 315 -208 -133 -197 -292 -134 19 -190
3806 -190 93 18 -168 29 -215 13 113 -253 -286 -102 -206 70 -90 -5 112 -171 341 -157 -240 -27 44 -301
3828 -301 69 18 76 189 -126 45 -143 60 -2 256 -111 200 14 12 186 3 261 -92 47 -40 -314 -41
3850 -41 -165 41 24 69 -70 157 123 -83 21 -328 125 -70 -110 182 20 67 67 -61 99 -41 -94 70 -27
3873 -27 29 244 -107 77 58 -92 -227 -128 12 -60 -161 40 344 -206 -50 28 89 231 -28 -91 246 -163 5
3896 5 -28 81 87 144 -128 9 -151 189 -185 -233 311 -70 -210 31 123 5 297 39 161 232 -97 161 -228
3919 -228 -110 -59 -33 49 21 -268 117 16 -190 90 -159 180 -10 -128 238 -95 -155 136 -206 173 179 19
3941 19 41 53 -172 -250 -217 127 -67 31 39 -19 88 237 -49 -140 65 -252 50 -145 139 80 36 82 4 80 -76
3966 -76 -13 -62 85 8 -82 311 53 -36 389 345 143 -108 -126 -113 -181 -190 31 -107 -64 -65 -116 3 26 139 95 -215
3992 -215 -112 -42 -86 197 -108 -70 -48 -389 -76 -31 -89 147 15 6 137 10 74 211 45 -72 -11 -206 23
4015 23 -106 -114 258 -109 -124 -50 8 -139 -166 -156 123 -275 -19 244 -49 327 21 -192 66 177 -111 132 37
4038 37 -120 247 -32 206 -117 -26 26 -23 182 307 207 52 -52 55 135 78 18 25 -188 237 -14 -138 261
4061 261 -64 107 -49 -263 227 -50 -162 142 -98 97 84 -114 76 121 -273 -39 -143 -32 95 -46 -158
4082 -158 -36 25 72 26 -34 174 -74 -92 -56 -271 -80 119 112 159 -108 -134 94 -167 -265 -78 -131 92 -174 -76
4106 -76 -52 23 244 56 -138 51 138 -289 76 -190 -72 96 -218 233 53 -55 85 140 -40 61 -100 -160
4128 -160 -98 -58 371 -99 93 175 -8 -59 -7 -252 132 -193 -153 63 -134 -85 140 -111 -175 196 -27 0 6 120
4152 120 219 -331 -8 33 -143 95 -93 110 374 -85 81 -114 -194 132 -52 -384 144 -188 -98 14 3 -116
4174 -116 -104 44 151 -224 127 70 91 190 -9 -366 41 -97 -301 363 -415 65 115 56 -22 24 168 -135 52
4197 52 97 79 -41 63 0 -149 247 -170 -29 1 -412 4 -16 -273 -46 222 298 292 264 243 4 -228 249 75
4221 75 -53 47 -117 -174 -83 -174 162 -29 -235 8 -62 -126 151 116 361 249 -236 188 -98 -23 -177 -144 1
4244 1 69 -32 -1 3 -76 -92 -96 -156 160 -216 134 14 89 -54 72 -102 220 48 46 112 139 97 30 190 -141 -66
4270 -66 1 136 -95 183 118 243 92 -176 -213 7 29 415 -42 -59 247 -124 21 31 -116 14 -111 105
4292 105 228 107 -161 297 -58 -44 -235 59 265 -396 61 -37 -162 -240 90 -176 340 98 -339 98 -75
4313 -75 59 -34 -133 45 139 -111 356 87 -96 110 -32 7 24 -125 24 74 70 28 -97 -10 181 -62 115 -7
4337 -7 -380 112 -138 163 164 -104 147 -130 -305 230 240 42 155 6 57 99 -225 297 83 -126 -150 8 24
4360 24 68 38 -138 81 -222 35 -128 -336 110 -278 -88 -53 -187 250 -142 -166 -18 -307 124 -103 -279 302
4382 302 1 -330 418 -71 31 -3 -4 104 -46 -153 279 -54 129 84 -113 194 224 139 -1 141 -55 -23
4404 -23 -133 -40 53 -375 138 -229 -47 146 -138 41 -27 -205 30 186 72 106 -73 -183 61 -75 -143 -42
4426 -42 -229 -22 -111 -131 -221 -180 151 337 -39 79 -20 -155 -22 23 -199 92 -383 -179 105 -38 23 15 -71 -32
4450 -32 -199 -91 -105 9 138 -253 -28 231 -257 -30 267 -101 78 69 -69 143 -283 35 156 -139 6
4471 6 -217 182 57 -234 -137 61 -38 -134 104 -12 110 -62 -214 120 -77 75 -248 53 74 74 36 -129 -27
4494 -27 24 171 -104 -7 -77 -258 196 -166 116 188 -14 57 -125 -232 57 -245 3 -87 -190 307 134 56 27
4517 27 -12 -37 -25 2 92 12 -14 -20 123 -133 23 146 21 97 -126 27 218 -81 85 -258 15 520 -85 46
4541 46 -23 -43 68 -84 -164 191 -119 28 236 -145 141 -139 -174 -130 -194 -39 -60 -83 18 101 2 -311 96 137
4565 137 124 -190 215 11 -201 99 59 213 -84 -36 177 86 -273 62 39 -176 272 34 -202 -118 -140 146
4587 146 -64 -169 308 65 -63 93 -181 123 -2 -135 65 -133 -192 37 -209 40 22 26 108 -16 203 116
4609 116 0 241 243 -41 155 -52 -118 141 32 124 92 -131 -13 10 0 245 247 -214 27 -110 -213 203 -268
4632 -268 86 -42 -127 78 -59 220 10 -169 35 -207 -141 184 -47 -220 123 -276 -131 53 -131 227 7
4653 7 -226 296 120 116 38 -182 -26 126 140 65 -187 -41 350 -230 -66 -20 -128 139 -114 146 14 80 -31
4676 -31 -45 15 112 -74 53 194 -137 250 -20 -77 83 106 76 101 106 117 23 34 -218 -121 -243 60 11 93 262
4701 262 -189 316 -40 -263 197 12 -212 88 -104 -31 -141 -12 250 6 66 52 -59 180 -328 144 49
4722 49 -88 14 168 -123 -11 174 -43 -189 -56 -171 -17 -36 -250 -58 -150 172 -105 -79 126 -45 33 95
4744 95 -33 -134 96 -53 -58 -222 -20 16 -80 104 45 -231 -77 261 -118 -44 -103 -109 67 -215 158 43 60 -42
4768 -42 -22 -145 78 -281 -147 -17 -136 51 -213 -247 98 -8 18 100 -32 113 -206 128 -15 -236 92 201
4790 201 -237 -109 145 -230 118 95 -185 145 -92 221 -145 -142 139 -158 96 13 -160 -151 -102 61 20 -37 -47
4813 -47 224 -94 12 159 -138 -109 -61 -149 99 94 -103 266 -133 158 61 -160 99 -26 73 -130 3 -153 106
4836 106 -45 -147 44 -72 71 174 -137 36 -51 -228 35 -103 89 -297 -172 -73 39 -104 227 -68 65
4857 65 169 -86 48 -18 -142 -70 -60 -16 67 93 178 -111 -71 89 145 43 -137 -133 330 -60 75 -51 18 69 -106
4882 -106 50 281 -65 16 143 -178 -310 84 -19 -204 -61 -319 -87 -377 -151 -122 -41 2 -68 -256 69 64
4904 64 151 -27 -80 -142 53 137 242 104 -345 -35 285 -6 221 24 1 95 26 208 -213 87 103 -111 67
4927 67 77 -300 -37 -29 -17 -124 -127 -70 -190 -32 125 132 -7 -74 54 30 -119 103 26 -17 -41 38 79 -24 109 -151
4953 -151 131 -113 -88 -91 -131 8 -26 13 256 -7 -141 90 -106 -47 -7 -346 110 -185 -91 -58 -137 -49 19 -29 -115
4978 -115 360 -144 -36 -53 -86 27 -114 64 108 -64 15 -55 -5 149 136 -88 237 21 34 -146 -163 241 61
5001 61 -259 134 -111 -56 209 -136 16 -36 -207 329 -54 -82 -94 -79 -121 -28 -23 124 24 -218 -93 -117 -100 -38
5025 -38 -61 -17 -39 84 2 -64 203 154 -97 121 25 4 82 9 68 -24 -157 -114 -156 -231 190 -46 -126 -40 -254 15
5051 15 261 -18 -1 176 4 -3 -48 33 -12 -326 -14 78 -105 -140 -151 64 60 -132 249 169 -309 6 235 41
5075 41 -62 -281 158 27 76 -59 150 -43 269 -210 179 117 -33 129 -137 -239 179 -8 -178 -72 -62
5096 -62 -129 -58 -76 391 -103 -116 20 189 -160 7 44 63 211 33 123 74 99 95 5 -145 29 142 318 65
5120 65 120 21 46 32 184 -17 126 -6 -53 211 28 -3 144 -117 -76 86 -33 18 -49 -128 190 -166 -145 -27
5144 -27 -97 11 -76 39 -17 -106 -200 146 -138 -116 -149 -46 115 -40 -57 104 -77 205 -21 -261 87 -354 -115
5167 -115 -228 -112 125 115 -104 225 -18 -135 70 -27 122 -55 -57 74 146 -48 -67 19 138 -34 -228 -121
5189 -121 188 -161 224 -36 50 -162 115 39 40 13 41 74 64 125 57 69 -5 185 50 43 -13 111 -98 113 199
5214 199 127 275 -201 -11 53 -165 -190 -56 -130 108 -214 -209 270 -96 -137 -221 -44 -108 310 -66 360 -60 304
5237 304 95 -12 137 52 -118 -35 -131 -279 16 -141 133 136 -331 253 43 -155 23 48 -21 197 28 78 139
5260 139 38 -162 55 34 71 -249 -102 243 -53 48 101 -44 140 -74 -102 -182 140 -35 -87 10 -184 -177 -328
5283 -328 57 53 124 24 -2 53 -42 65 -53 -140 121 -109 -125 -156 89 -197 139 68 143 40 170 226 -91 -104
5307 -104 94 -4 -15 -26 -180 -137 19 -16 -17 -83 53 43 -193 76 106 30 -186 12 8 193 -82 146 20 -69 176
5332 176 -120 -110 10 107 245 65 -261 -106 56 118 -58 -46 116 44 21 -248 55 -57 184 132 -92 82
5354 82 42 159 -95 -264 98 43 -36 30 -76 49 127 -82 -130 -163 -326 241 -142 -22 42 43 137 -4 -14 -125
5378 -125 51 152 235 44 -117 -142 -33 16 -47 117 220 -157 -132 202 1 -197 33 -116 323 -94 -162 -122
5400 -122 -112 216 89 119 0 -74 63 -113 13 -198 28 -54 37 -34 179 -126 -405 64 27 1 -66 19 -41 128
5424 128 -68 -123 -22 -202 -1 -8 -39 64 -80 133 58 14 15 121 -93 -74 60 -223 127 137 -189 157 -13
5447 -13 153 -105 -219 5 322 115 -291 10 202 211 -11 230 420 -46 214 9 -23 -108 -32 -56 245 35
5469 35 -26 -150 -139 246 72 -117 349 6 -184 67 138 -54 -36 -84 192 7 -76 9 -238 7 21 110 36 -33
5493 -33 -102 131 -106 71 -72 68 237 -37 -183 246 -56 32 120 93 39 -281 113 175 -126 88 -186 -252 -161
5516 -161 -248 201 89 -178 -103 67 45 154 190 74 57 -131 53 98 -26 161 -50 79 123 -197 162 126 -200
5539 -200 46 -49 102 5 54 271 152 -10 -19 40 -288 -21 -142 -146 -95 -75 126 -42 5 181 14 -265 10 -105
5563 -105 157 -36 -138 134 93 147 229 -155 -126 74 -76 190 44 65 195 17 131 58 -35 74 -168 120
5585 120 25 -16 19 -149 -25 72 132 33 69 -63 142 193 99 37 204 -49 147 83 110 15 126 -50 0 83 -124
5610 -124 15 -149 90 -330 110 122 -7 137 92 -84 6 -84 9 32 -142 -87 156 -134 -69 -99 169 -8 79
5633 79 47 -194 -290 -242 -117 -137 143 -164 30 103 -3 49 -248 2 160 -130 -266 168 3 25 59 -110 81
5656 81 159 113 267 -82 68 229 -80 133 117 142 182 -3 149 -166 17 -58 -5 97 95 -158 -14 227 -123
5679 -123 -157 220 -115 -50 162 27 109 -174 -9 -44 199 64 -89 -201 210 59 -189 12 -117 -86 -88 204
5701 204 44 23 -254 99 -17 129 137 124 26 -162 -47 11 -250 227 307 157 -90 -123 -124 -16 48 -190 -160 24
5725 24 105 223 -35 -138 -8 -70 82 -24 -75 17 -9 54 246 -161 -197 170 114 -204 -179 -60 80 -160 -159 259
5749 259 59 149 -130 52 -65 -20 -127 4 -32 162 -20 91 -196 33 75 10 -56 -187 78 7 -5 210 -41
5772 -41 77 -134 23 136 -24 140 112 73 -281 138 197 47 -37 153 -19 -73 -20 -291 72 8 -45 202 -225
5795 -225 23 32 192 38 -157 -313 -53 50 -124 80 -30 -103 56 126 241 -60 -247 21 127 -206 6
5816 6 -177 -57 191 -129 99 -99 -136 9 33 -13 37 -149 69 -149 150 147 -95 407 1 202 143 73 -83
5839 -83 -24 -23 149 22 -2 62 -25 101 58 -74 34 10 12 -57 57 147 -62 -49 159 94 -130 109 -46 -74 2 31
5865 31 -135 -6 143 35 162 18 -36 108 -242 108 -168 17 54 -3 -111 -195 151 -1 46 228 -175 -288
5887 -288 198 6 -42 90 -158 -8 112 281 109 -28 -198 78 -86 167 108 -77 99 44 -96 174 -7
5908 -7 -29 101 -198 29 247 -80 -105 139 11 26 -200 337 -120 -348 127 71 8 -123 -13 24 51 29 82 -38
5932 -38 -172 174 82 -82 4 259 -28 93 -75 -167 113 93 -26 46 32 -115 -59 -9 -86 -279 86 25 57 -157
5956 -157 -98 -126 -52 163 70 -2 -206 88 -71 -118 239 -146 246 -39 -228 35 120 157 -87 -66 -107 -173 35 -64
5980 -64 49 -7 226 87 182 -228 -66 57 -100 -314 48 167 -88 111 -119 -50 -58 103 -110 -36 74 8 -89
6003 -89 -41 61 17 -124 -21 -50 -33 61 -9 185 -65 119 27 110 -118 -95 -29 -182 -12 227 1 164 244 -32
6027 -32 -336 99 -42 53 -254 -102 -163 -63 17 46 39 144 -33 27 164 -30 28 96 17 -93 51 -29 -56 216
6051 216 -185 24 87 -322 16 -353 41 244 -78 131 35 166 169 1 25 -212 -66 132 -2 -188 23 -183
6073 -183 98 128 -46 -121 33 -169 155 -114 95 86 46 69 19 15 -155 -83 157 109 -207 -231 77 158 -60 -35 -107
6098 -107 357 88 98 -203 120 115 -32 17 34 33 53 306 -55 316 -369 -38 181 -101 107 7 -184 0 43
6121 43 -86 -49 174 119 -3 8 263 -176 1 74 -35 -138 49 -96 -27 103 31 -48 206 -143 -104 58 57 -93
6145 -93 -276 -61 -128 -24 194 -81 333 106 -27 21 189 49 -145 -140 75 100 -39 117 17 -137 -31 18
6167 18 -219 24 -32 22 -41 -105 12 257 159 60 116 -19 23 225 51 132 79 55 7 114 173 -120 170 32 -77
6192 -77 188 -46 31 38 -19 -83 93 -24 4 -104 -33 -193 -193 43 98 -261 182 -64 79 27 124 -118 1 -157
6216 -157 -108 139 -100 37 268 -86 315 153 -256 98 -115 44 79 -167 34 -25 60 -18 89 -1 -52 -127 77
6239 77 105 57 242 -126 60 41 -122 -108 37 109 133 -28 -164 -69 4 82 97 -88 -85 -89 -164 -211 -1 60 -21 -19 -75
6266 -75 158 83 -120 -29 -63 69 -138 8 15 -115 174 51 120 261 110 -175 -176 61 -66 -160 -94 88 -115 -25
6290 -25 11 -53 -131 -35 146 -103 63 81 -102 202 119 44 31 192 172 -58 33 55 35 -58 81 -61 -50 236 54
6315 54 160 168 -106 -10 -101 76 -215 98 63 -17 78 -101 18 3 88 19 -18 -40 82 -6 -17 -56 -51 -82 75 -232
6341 -232 28 -94 -90 70 -33 51 66 338 106 -17 -76 -19 -130 -50 -182 -1 23 -43 3 182 -12 21 171 11
6365 11 -187 -171 88 -63 90 -61 27 181 -38 -276 22 48 -190 -87 -142 -152 -115 100 119 5 -66 -27 40 54
6389 54 -79 75 87 123 -76 -190 -53 79 40 21 -186 -87 -236 -16 114 58 -194 35 112 56 -181 -239 -38
6412 -38 -20 82 -131 -39 -3 38 -174 -146 2 -52 -220 -15 9 -142 78 -103 132 174 -34 -329 -155 -182 -223 174
6436 174 55 -114 57 -48 -168 70 -113 129 -66 -34 -186 85 99 188 -171 -142 283 68 82 -53 58 -277
6458 -277 85 -62 -101 6 179 -9 -38 -180 142 247 74 77 -113 -334 4 58 -171 246 87 -137 171 90
6480 90 -240 -9 -139 86 96 -19 118 8 -197 25 12 172 69 -56 -180 44 64 -58 -279 -52 -40 -34
6502 -34 -30 -72 -176 -59 214 -93 14 -278 86 112 -11 104 -114 -24 255 -124 -99 215 -68 -85 -6 -92 -196
6525 -196 -170 205 247 4 -106 103 -166 -111 -7 -113 -8 -67 159 43 -273 -64 -207 81 -67 -52 -95 61
6547 61 -175 134 26 136 -73 126 274 -22 -7 -109 105 -5 -13 69 140 -28 -117 -34 148 37 131 -13 -45
6570 -45 50 77 -267 -53 3 54 -27 18 -45 2 31 -23 -81 183 -134 -159 -108 -72 -120 -11 -62 57 15 53 -10 51 70
6597 70 -10 -81 -82 172 52 -80 141 -88 -93 -60 112 99 158 -154 -58 61 -61 249 70 -5 -106 53 106 89 83
6622 83 -140 9 -141 1 70 -275 -13 126 -67 12 16 51 37 13 -398 -54 -134 -131 -44 187 -52 -73 -42 15 20 -138
6648 -138 -60 102 46 -114 8 -232 -283 70 156 -172 -192 2 308 73 81 32 106 34 -94 -23 -322 -90 -66 -158
6672 -158 155 237 67 8 -40 -236 300 40 118 191 -8 23 82 28 -12 -100 -73 -84 165 -159 -58 84 68 35 -75
6697 -75 78 -128 270 -155 -143 -16 -276 -87 -218 -152 213 37 -9 57 -171 -79 -133 -65 90 -48 -163 -102 81
6720 81 -44 -278 -27 -49 36 -282 230 100 62 459 52 -150 149 -137 70 -9 -7 93 -179 -20 -87 113 28
6743 28 -14 158 192 158 19 246 169 11 42 73 -63 42 -67 -60 147 -33 -2 -57 -6 64 -198 -187 -37 -8 -164
6768 -164 45 82 26 31 264 130 -88 -52 -33 -198 110 -140 -72 36 64 160 -89 4 242 -124 16 -24 13 130
6792 130 -34 -17 -19 152 110 70 132 30 63 -19 78 -35 82 73 -74 87 254 179 -85 119 124 22 87 139 -99
6817 -99 89 327 9 57 55 57 113 43 138 61 132 32 69 22 -15 -77 142 59 48 -106 -162 -58 -33 40 -148 18 96
6844 96 104 35 25 124 53 -244 -175 22 -80 132 155 193 3 -57 -192 -37 -28 -50 -81 -70 -51 42 217 -156 -120 75
6870 75 55 -65 126 266 -21 123 -68 -39 -76 -85 -106 172 19 -106 -115 158 -104 -296 -14 -53 -73 126 116 -235
6894 -235 -92 -21 27 -114 -173 46 79 95 204 141 -73 61 39 20 -65 49 86 -43 -32 -24 32 -95 -61 28 184
6919 184 104 -146 245 -75 -51 -53 -20 49 -98 -8 64 -34 54 106 -217 -38 91 -39 -57 120 222 -61 95 170
6943 170 -135 -124 -253 -95 -38 50 -144 126 78 24 -48 -75 -90 -19 -57 -29 108 -26 99 -223 -79 90 54 -2
6967 -2 -262 43 -94 -5 -63 35 -162 -81 259 3 -158 16 120 -4 78 82 64 -39 -144 113 119 70 -148 198
6991 198 46 132 69 154 -289 -4 -141 -231 -89 -83 46 -60 8 121 168 -4 123 -16 291 233 -110 -8 11
7014 11 -104 -166 -60 -18 87 157 -167 -198 251 -206 36 45 100 129 93 50 259 169 236 -235 106 250 -157 189
7038 189 170 256 62 -37 -174 -242 11 -18 -25 98 -30 -93 -31 46 -118 162 -78 -126 -62 13 66 171 -121 94 292
7063 292 76 38 -198 -74 -23 104 116 -146 150 -86 -48 100 50 -71 -10 145 -214 -153 -87 -180 53 -138 53
7086 53 -33 185 -6 -72 -80 -60 32 261 -2 -177 138 218 62 -31 127 126 324 -27 2 102 196 -2 12 152 -55
7111 -55 41 86 121 63 274 31 23 120 74 120 172 42 -214 -107 -50 -56 -9 -68 81 56 -68 137 -85 -31 80 -342
7137 -342 -83 -88 -8 6 52 218 -192 -20 -38 -73 23 -79 -97 129 -179 -121 -23 -61 350 192 -247 -197 102 -1
7161 -1 142 178 -20 74 129 185 -226 129 -129 103 29 -27 -111 -5 122 -34 -258 -241 244 -48 -141 166 -130 36
7185 36 84 215 -148 132 -44 -56 -267 -11 8 146 6 -98 -116 -60 25 -25 106 93 -120 32 -22 -152 63
7208 63 -21 -37 -33 -141 131 -128 -202 0 18 231 -21 -111 22 29 25 -9 -267 -71 -139 -127 -75 31 -78 154 40
7233 40 -170 184 81 -54 -204 79 112 -48 -78 -209 1 -156 -14 -125 34 -62 -63 -52 63 -75 -149 -60 -27
7256 -27 85 -17 -116 45 53 -161 213 -44 -39 -27 -68 -258 41 103 73 170 277 -70 -25 -56 88 27 -148 18 60
7281 60 209 58 47 163 67 45 75 -240 20 27 26 -20 71 22 8 -53 43 -48 8 -33 -62 -141 -86 -6 264 91 -144
7308 -144 200 -80 -55 178 8 -78 269 -126 -33 -70 4 -61 345 -144 130 119 -248 -88 -79 157 110 108 -204 119
7332 119 -112 168 127 -22 228 63 244 75 116 -68 -80 -167 61 156 39 123 -110 -169 -179 76 -17 22 162
7355 162 -48 -104 20 4 -103 132 -172 -133 -33 -148 -16 -171 215 141 155 -31 -65 211 -71 155 43 -272
7377 -272 21 80 118 -55 59 281 -71 -132 141 -236 -28 67 -176 1 2 -79 39 -10 90 123 -139 97 -24
7400 -24 -177 173 120 -23 8 130 2 108 1 -33 -48 -212 141 -139 98 208 81 54 224 194 31 157
7422 157 -200 96 -28 68 170 68 -81 299 55 12 1 183 -26 -299 113 -42 -246 -23 286 -86 202
7443 202 -47 367 16 192 -147 198 15 128 112 30 289 -57 143 182 -52 105 273 115 79 10 -74 179
7465 179 109 169 110 127 192 97 0 13 -82 -17 38 84 83 -110 60 72 4 -4 -46 -375 -19 -53 232 197 -115 127 15
7492 15 12 -77 44 -33 137 -33 -47 -12 76 85 132 198 17 -107 183 201 -184 -161 -20 -154 23 -226 -35 48 -159
7517 -159 -218 1 -38 -77 7 -98 36 -117 109 158 18 -88 48 -85 -73 -168 191 91 -13 -60 88 79 -81
7540 -81 50 68 30 164 93 -138 -31 -133 -94 -148 -36 -219 101 4 -191 87 -39 -34 -140 -80 -122 83 -47 -102
7564 -102 40 -231 67 -368 -95 135 80 81 -171 115 -287 -188 83 165 -34 -23 -98 -68 -81 -18 -24 39 -53 -80 36
7589 36 -192 87 7 135 -70 -122 -348 69 -78 -92 -144 -240 15 -126 -202 138 28 100 92 -103 89 -22 20 97
7613 97 87 79 234 -42 -95 -159 -35 56 -4 49 -8 100 168 185 -93 -69 -26 66 238 -193 -42 -7 48 4 25 238
7639 238 173 -218 -5 53 160 91 -21 -59 116 -303 -210 168 -248 65 -81 -127 -346 105 124 -214 -353 34
7661 34 60 8 -43 -212 104 273 -90 37 140 231 248 71 187 114 -25 -143 -94 -129 156 -14 -23 71 -117 -110 105
7686 105 -55 -26 -164 -223 -45 -102 -109 -137 -27 49 -22 8 125 186 -38 -164 50 147 -41 14 51 -141 12 33 -197
7711 -197 -2 -3 219 262 144 35 94 407 -87 -67 -112 -12 79 -34 -54 -87 84 105 -46 -13 151 136 37 48 100
7736 100 82 -76 -149 42 123 67 -93 52 45 -116 -143 -61 -102 180 129 -142 300 60 -202 137 -25 -203 265
7759 265 -76 295 -24 70 -93 157 147 -25 -48 101 -39 -288 -104 -111 346 112 25 -69 -23 -4 -99 72 45 60
7783 60 104 10 -103 -2 -47 -71 347 37 135 -188 203 70 -113 -160 59 -4 239 -23 111 14 30 13 96 106
7807 106 -60 166 -68 39 66 252 -98 -14 -162 114 94 -66 -206 139 -239 163 -171 -27 175 -39 -52
7828 -52 68 180 92 219 91 111 -48 -393 -133 -67 184 104 -60 -87 156 -96 28 14 -17 27 165 228 185 -182
7852 -182 67 86 -14 -21 214 10 -59 -9 369 -136 293 9 -6 108 -101 -288 188 174 307 -152 82 -39
7874 -39 -3 -225 161 20 -144 248 -238 126 30 128 138 -245 16 -112 -16 -7 123 -230 116 76 129 -4 -274
7897 -274 84 250 -272 -133 -146 14 48 -46 -36 29 -80 34 107 2 -55 100 104 -4 281 -128 41 75 194
7920 194 -104 -167 -41 -125 -53 135 99 -97 65 127 84 -84 -57 -115 30 -103 -64 11 53 286 -48 174 -75 148
7944 148 -115 -23 24 -80 199 -140 127 -161 143 -114 -146 -105 -134 206 9 -19 -262 -187 19 -26 157 -45 -21
7967 -21 -94 -119 75 88 -10 16 332 -168 -68 197 -144 25 25 86 188 26 -103 327 29 -24 179 -220 -135 53
7991 53 -85 -145 -156 -38 -137 -63 -16 52 -121 104 96 94 166 -190 121 255 42 73 59 21 19 127 -80 179 118 -33
8017 -33 146 76 -148 182 -200 23 2 11 45 -55 -40 198 97 144 -40 -291 -156 -102 -123 47 78 -233 -115 -40
8041 -40 9 48 221 -83 -67 182 129 26 -172 -64 -221 -104 -124 135 -103 -78 -166 -48 261 20 74 76 57 -1
8065 -1 393 133 43 104 -74 -67 72 156 -49 39 -31 -160 42 13 18 -163 -37 103 -81 -32 47 63 7 9 279 70
8091 70 3 114 -152 -5 13 -80 -241 55 -23 -78 -66 119 2 52 -118 -112 41 -152 69 -54 23 -169 -15 203
8115 203 -58 215 -303 59 -246 -5 -38 62 -47 117 86 -142 128 125 18 10 -41 113 266 -62 73 14 -181
8138 -181 90 -124 18 32 -115 81 -132 208 28 10 38 91 197 81 -56 91 -90 -95 94 -115 18 -75
8160 -75 59 -121 -95 3 -223 200 127 -35 -127 49 69 3 -196 -76 -96 38 -88 -40 -8 162 -161 -243 -90 39
8184 39 -84 119 -127 8 -53 57 -21
8191b1
##END NTUPLES=NMR FID
##END=
