##TITLE=1H_Pr 4989-Am
 CDCl3, 8 sc, 
 4.9.2020
##JCAMPDX= 6.0         $$ Bruker NMR JCAMP-DX V2.0
##DATA TYPE= NMR FID
##DATA CLASS= NTUPLES
##ORIGIN= UXNMR, Bruker Analytische Messtechnik GmbH
##OWNER= root
$$ XWIN-NMR		Version 3.5
$$ Fri Sep  4 12:10:41 2020 Russian Standard Time (UT+4h)  she@DPX200
##.OBSERVE FREQUENCY= 200.1315066352
##.OBSERVE NUCLEUS= ^1H
##.DELAY= (6, 6)
##.ACQUISITION MODE= SIMULTANEOUS
##.ACQUISITION SCHEME= undefined
##.AVERAGES= 8
##.DIGITISER RES= 18
##SPECTROMETER/DATA SYSTEM= spect
##.PULSE SEQUENCE= zg30
##.SOLVENT NAME= CDCl3
##.SHIFT REFERENCE= (INTERNAL, CDCl3, 0, 15.7039)
##AUDIT TRAIL= $$ (NUMBER, WHEN, WHO, WHERE, WHAT)
$$ ##TITLE= Audit trail, XWIN-NMR		Version 3.5
$$ ##JCAMPDX= 5.01
$$ ##ORIGIN= Bruker BioSpin GmbH
$$ ##OWNER= she
$$ F:/spectra/data/she/nmr/H-F/1/audita.txt
$$ ##AUDIT TRAIL=  $$ (NUMBER, WHEN, WHO, WHERE, WHAT)
(   1,<2020-09-04 12:09:49.51 +0400>,<she>,<DPX200>,
      <created by zg, POWCHK disabled, PULCHK disabled
       configuration hash MD5:
       00 E9 B6 7A A2 85 ED C7 34 08 36 98 17 FE 4E 26
       data hash MD5: 16K
       CA F3 73 D2 51 1F 35 0E 13 A5 DF 6B 92 84 87 E0>)
$$ ##END=
$$ 
$$ hash MD5
$$ 8D 7E 89 02 F7 D7 52 80 FB 62 AF 2D E4 29 07 8A
##$RELAX= 
##$RELAX= 
##$RELAX= 
##$RELAX= 
##$RELAX= 
##$RELAX= 
$$ Bruker specific parameters
$$ --------------------------
##$DU= <F:/spectra>
##$EXPNO= 1
##$NAME= <H-F>
##$PROCNO= 1
##$TYPE= <nmr>
##$USER= <she>
##$AMP= (0..31)
100 100 100 100 100 100 100 100 100 100 100 100 100 100 100 100 100 100 
100 100 100 100 100 100 100 100 100 100 100 100 100 100 
##$AQSEQ= 0
##$AQ_mod= 1
##$AUNM= <au_zg>
##$AUTOPOS= <>
##$BF1= 200.13
##$BF2= 200.13
##$BF3= 200.13
##$BF4= 200.13
##$BF5= 200.13
##$BF6= 200.13
##$BF7= 200.13
##$BF8= 200.13
##$BYTORDA= 1
##$CFDGTYP= 0
##$CFRGTYP= 5
##$CHEMSTR= <none>
##$CNST= (0..31)
1 1 145 1 1 1 1 1 1 1 1 1 1 1 1 1 1 1 1 1 1 1 1 1 1 1 1 1 1 1 1 1 
##$CPDPRG= <>
##$CPDPRG1= <>
##$CPDPRG2= <>
##$CPDPRG3= <>
##$CPDPRG4= <mlev>
##$CPDPRG5= <mlev>
##$CPDPRG6= <mlev>
##$CPDPRG7= <mlev>
##$CPDPRG8= <mlev>
##$CPDPRGB= <>
##$CPDPRGT= <>
##$D= (0..31)
0 1.2 0 0 0 0 0 0 0 0.06 0 0.03 0 0 0 0 0.0002 0 0 0 0 0 0 0 0 0 0 0 0 
0 0 0 
##$DATE= 1599206989
##$DBL= (0..7)
120 120 120 120 120 120 120 120 
##$DBP= (0..7)
150 150 150 150 150 150 150 150 
##$DBP07= 0
##$DBPNAM0= <>
##$DBPNAM1= <>
##$DBPNAM2= <>
##$DBPNAM3= <>
##$DBPNAM4= <>
##$DBPNAM5= <>
##$DBPNAM6= <>
##$DBPNAM7= <>
##$DBPOAL= (0..7)
0.5 0.5 0.5 0.5 0.5 0.5 0.5 0.5 
##$DBPOFFS= (0..7)
0 0 0 0 0 0 0 0 
##$DE= 6
##$DECBNUC= <off>
##$DECIM= 32
##$DECNUC= <off>
##$DECSTAT= 4
##$DIGMOD= 1
##$DIGTYP= 9
##$DL= (0..7)
0 120 120 120 120 120 120 120 
##$DP= (0..7)
150 150 150 150 150 150 150 150 
##$DP07= 0
##$DPNAME0= <>
##$DPNAME1= <>
##$DPNAME2= <>
##$DPNAME3= <>
##$DPNAME4= <>
##$DPNAME5= <>
##$DPNAME6= <>
##$DPNAME7= <>
##$DPOAL= (0..7)
0.5 0.5 0.5 0.5 0.5 0.5 0.5 0.5 
##$DPOFFS= (0..7)
0 0 0 0 0 0 0 0 
##$DQDMODE= 0
##$DR= 18
##$DS= 0
##$DSLIST= <SSSSSSSSSSSSSSS>
$$ [...]
##$SUBNAM2= <"">
##$SUBNAM3= <"">
##$SUBNAM4= <"">
##$SUBNAM5= <"">
##$SUBNAM6= <"">
##$SUBNAM7= <"">
##$SUBNAM8= <"">
##$SUBNAM9= <"">
##$SW= 16.880792210976
##$SWIBOX= (0..15)
0 0 2 0 0 0 0 0 0 0 0 0 0 0 0 0 
##$SW_h= 3378.37837837838
##$TD= 16384
##$TD0= 1
##$TE= 0
##$TE2= 300
##$TE3= 300
##$TEG= 300
##$TL= (0..7)
0 120 120 120 120 120 120 120 
##$TP= (0..7)
150 150 150 150 150 150 150 150 
##$TP07= 0
##$TPNAME0= <>
##$TPNAME1= <>
##$TPNAME2= <>
##$TPNAME3= <>
##$TPNAME4= <>
##$TPNAME5= <>
##$TPNAME6= <>
##$TPNAME7= <>
##$TPOAL= (0..7)
0.5 0.5 0.5 0.5 0.5 0.5 0.5 0.5 
##$TPOFFS= (0..7)
0 0 0 0 0 0 0 0 
##$TUNHIN= 0
##$TUNHOUT= 0
##$TUNXOUT= 0
##$USERA1= <user>
##$USERA2= <user>
##$USERA3= <user>
##$USERA4= <user>
##$USERA5= <user>
##$V9= 5
##$VALIST= <valist>
##$VCLIST= <CCCCCCCCCCCCCCC>
##$VD= 0
##$VDLIST= <DDDDDDDDDDDDDDD>
##$VPLIST= <PPPPPPPPPPPPPPP>
##$VTLIST= <TTTTTTTTTTTTTTT>
##$WBST= 1024
##$WBSW= 4
##$XGAIN= (0..3)
0 0 0 0 
##$XL= 0
##$YL= 0
##$YMAX_a= 214270
##$YMIN_a= -221906
##$ZGOPTNS= <>
##$ZL1= 120
##$ZL2= 120
##$ZL3= 120
##$ZL4= 120
##$ABSF1= 10
##$ABSF2= 0
##$ABSG= 5
##$ABSL= 3
##$ALPHA= 0
##$AQORDER= 0
##$ASSFAC= 0
##$ASSFACI= 0
##$ASSFACX= 0
##$ASSWID= 0
##$AUNMP= <proc_1d>
##$AZFE= 0.1
##$AZFW= 0.1
##$BCFW= 1
##$BC_mod= 2
##$BYTORDP= 1
##$COROFFS= 0
##$CY= 11.3945322036743
##$DATMOD= 1
##$DC= 2
##$DFILT= <>
##$DTYPP= 0
##$F1P= 16.9975609425685
##$F2P= -3.02152046262296
##$FCOR= 0.5
##$FTSIZE= 0
##$FT_mod= 4
##$GAMMA= 1
##$GB= 0.15
##$INTBC= 1
##$INTSCL= 1
##$ISEN= 128
##$LB= 0.24
##$LEV0= 0
##$LPBIN= 0
##$MAXI= 10000
##$MC2= 0
##$MEAN= 0
##$ME_mod= 0
##$MI= 1.114404
##$NCOEF= 0
##$NC_proc= 0
##$NLEV= 6
##$NOISF1= 3.799351
##$NOISF2= 2.8
##$NSP= 1
##$NTH_PI= 0
##$NZP= 0
##$OFFSET= 15.70392
##$PC= 1
##$PHC0= -9973.545
##$PHC1= 14.2009
##$PH_mod= 1
##$PKNL= yes
##$PPARMOD= 0
##$PSCAL= 0
##$PSIGN= 0
##$REVERSE= no
##$SF= 200.130013532006
##$SI= 16384
##$SIGF1= 3
##$SIGF2= 2
##$SINO= 400
##$SIOLD= 16384
##$SREGLST= <1H.CDCl3>
##$SSB= 0
##$STSI= 0
##$STSR= 0
##$SW_p= 3612.71676300578
##$SYMM= 0
##$S_DEV= 0
##$TDeff= 0
##$TDoff= 0
##$TI= <>
##$TILT= no
##$TM1= 0
##$TM2= 0
##$TOPLEV= 0
##$USERP1= <user>
##$USERP2= <user>
##$USERP3= <user>
##$USERP4= <user>
##$USERP5= <user>
##$WDW= 1
##$XDIM= 8192
##$YMAX_p= 0
##$YMIN_p= 0
$$ End of Bruker specific parameters
$$ ---------------------------------
##NTUPLES= NMR FID
##VAR_NAME=  TIME,          FID/REAL,        FID/IMAG
##SYMBOL=    X,             R,               I
##VAR_TYPE=  INDEPENDENT,   DEPENDENT,       DEPENDENT
##VAR_FORM=  AFFN,          ASDF,            ASDF
##VAR_DIM=   8192,          8192,            8192
##UNITS=     SECONDS,       ARBITRARY UNITS, ARBITRARY UNITS
##FACTOR=    0.000296,      1,               1
##FIRST=     0,             0,               0
##LAST=      2.424536,      0,               0
##MIN=       0,             -221906,         0
##MAX=       2.424536,      214270,          0
$$ Real data points
##PAGE= N=1
##DATA TABLE= (X++(R..R)), XYDATA
$$ [...]
1780c77O3J66l41N30p62P15j36j2n20P14L19p62M42j82M48n68M78k52K36L68m86
1801H1j03j0P19j015P02J25k11M48m40K01n35R00o87Q6k99L13J88m64N08l61M79
1822F25m68Q1l09M10J77p09L24l10O69p95J46j22J46K8r9j83Q9M07n19M1Q1j11
1844d01J63j74M14n49P25n66P4l3K39k13n96Q12j62L39n95P40l98J35K18o21O10
1865A61m64N23p03N87j01J25K94k79Q9o0L65l78L35k69K17J03m11M56o81O05l32
1886A82K04J36m1n9n56O56o18M42n97N95j2j23N7m46M84n74O45q15O18j5k90J44
1908A7p9O5n71P06o41J63J25J5O1k05L60o55M38k66L02j91J79l17j78N30n55P32
1930C5m27K19k83K58K77k01L82m32K70r7K99j78k15K22k69Q25o85N66o50K96j06
$$ plain form
1780 -377 -314 -148 -489 41 -721 -6 -142 -154 -674 40 359 -403 39 -143 305 -263 215 -37 199 567 81
1801 81 -22 -32 687 -328 374 499 288 736 296 497 -38 862 175 261 -38 275 463 -1 507 146 625
1822 625 157 238 -71 339 516 -193 131 -179 490 -305 -159 -281 -135 -107 -206 -389 -300 107 -412 -371 -290 -401
1844 -401 -238 -412 2 -547 178 -388 -314 -347 -108 -321 -917 -105 -267 72 -523 217 -181 -46 172 -449 161
1865 161 -303 220 -483 104 3 128 422 143 232 172 537 159 494 225 442 545 134 590 -91 514 182
1886 182 386 522 481 422 -134 522 -96 346 -251 344 332 209 266 -180 304 -270 375 -440 178 163 -127 17
1908 17 -62 3 -568 138 -503 -340 -215 -200 -139 -344 16 -639 -201 -467 -165 -356 -177 -494 -672 -142 -697 35
1930 35 -392 -173 -456 -198 79 -122 260 -172 98 1 300 122 -93 129 -140 685 0 566 -84 212 106
1951A06K58M6n01P38p27M92j35J05m20J31J98k34L92l73K43k92N22l85r5K32k84
1972A7J78l69L44m78L88J4j97J73l34L52m84M04j95N7r1J8O6k75N99p39K48o0
1994c64L06l75L17k40K31K61p12M89m48M76L2k25L39k04M25q51R82o66J77Mq7
2015a33K35k66M84m39M96l65R3J23o4K37k67L97o33L64J36j51m9J89L0o00O17
2036D34m93M24j60M10l71k33L72k20J89o53O01l91Q0K3k25L48k71J72k98L85j04
2057A9j05j6j66K41k86M36o19M21k93M38n85m1N17m26L69l45M25k98M24j82m87
2078e59N27j48K00n18P05m74O9J97r9K81m42M32l80L14r7K52m45P7J91%L80o31
2100a68M79p6L06o31J44K68k36M62o89N72l39L18M1o46P87l43Q4m56J93J61k3
$$ plain form
1951 106 364 410 -91 647 -80 412 277 382 -38 93 291 57 449 76 319 27 549 164 69 301 17
1972 17 195 -174 170 -308 80 94 -103 70 -264 88 -396 8 -187 -130 -221 -203 -137 -412 187 -552 -304 -364
1994 -364 -58 -433 -116 -356 -125 136 -576 -87 -535 -59 -27 -252 87 -117 308 -543 439 -227 -50 -46 -133
2015 -133 102 -164 320 -119 377 12 105 228 164 401 134 531 -102 262 398 247 198 387 417 -183 434
2036 434 -59 365 205 615 244 11 383 163 352 -301 300 -91 -11 12 -213 135 -136 36 -262 123 19
2057 19 -86 -102 -268 -27 -313 123 -496 -75 -368 70 -515 -556 -39 -465 -96 -441 -16 -314 110 -72 -559
2078 -559 -32 -180 20 -498 207 -267 -198 -1 -100 181 -261 171 -209 105 8 260 -185 -108 83 83 463 -168
2100 -168 311 235 541 -90 54 322 86 548 -141 431 92 410 451 -195 592 249 333 -123 70 231 208
2121B08k63Q2K33k26j13m65O34j14j1k70j4N07n96L94j76J86j94L26l84n4L41
2142C1k70j4j58J18k2J52k73j36M78J25R2n58L48R4m32L15l3L69k94J64m92P26
2164C30j76j20k49J82N03o43L05l36M28J55l78J08j81P00o64K98m63Q36l83j28
2184A24R2j70N44m91J92k93L52l43J70Q4l0J77n43K80j13K39l18k55K44q3M37
2205B96p25Q08n51J28j02j38R4L7J94m83N46p54P81l70k22K51Q9K85p12L74j74
2226c48M59l38R7k31K55R9m91M12j44J71l20P3M83l28M03m38K7L7K97l45n9K16
2248a3l1N45n43L22l59N05m96J94J80j21J61l64J86OL78m46J25R2j70J40j49k0
2270A22L3J41m26L17J47k94K14k56J05j67K52l70J02M11l84k39o9M18m60L67j78
$$ plain form
2121 208 -55 27 260 34 -79 -544 90 -24 -35 -305 -319 188 -408 -14 -190 -4 -198 128 -256 -310 31
2142 31 -239 -253 -411 -293 -315 -163 -436 -572 -94 31 123 -435 -87 7 -425 -110 -143 226 -68 96 -396 330
2164 330 154 34 -215 -33 470 -173 132 -204 224 379 1 109 -72 628 -36 262 -201 635 252 124
2184 124 216 46 590 99 291 -2 350 7 177 261 231 408 -135 145 32 271 -47 -302 -58 -141 296
2205 296 -429 379 -172 -44 -146 -284 -190 -153 41 -442 104 -650 131 -239 -461 -210 -121 164 -548 -174 -348
2226 -348 111 -227 -130 -361 -106 -7 -498 -86 -230 -59 -379 -306 177 -151 252 -186 -159 -122 175 -170 -229 -13
2248 -13 -44 501 -42 280 -79 426 -70 124 304 183 344 -20 166 172 550 104 229 321 151 291 142 122
2270 122 155 296 -130 187 334 40 254 -2 103 -64 188 -182 -80 331 -53 -292 -361 57 -403 -36 -214
2291b14j28K99R6j62n4K01k28M6k73K60J26n38L93m26O31n23O40m56M36K3j73
2312b4J00l71L68k92K76j05O0J14m0J56l75N30k79J46j33J45Q3l68K90k92O07
2333E96m58K42k98J22K54j62Q9m53L97q5J6j53k28M41l27j08r3M11j44l6r3M7
2355b3J56o02M71k98N2k46L14m6o9J36j09J91l80O69m83J88l38J87jj29M45m89
2377d04L69j79J07j8J21Q5k17K02k34J78k70L25l5P0L5k89K58j00L96l92J66k30
2399e6L40K6j34M0q6J86j25j93J38k32L36m47N59m13L20k79P5j8J27L1m82L85
2421I8j28J86k91J19l1k1O6j68L36m9Ok78K33k29j50J4J7L26m12L80j44k9j01
2444b50J84k40j52N26l3j38l91M93n5j10K10l45L27j83K34k52K32j04J0M5k12
$$ plain form
2291 -214 -342 -43 53 -109 -163 38 -190 -144 -417 -157 -31 -569 -176 -602 29 -494 146 -310 126 149 -24
2312 -24 76 -295 73 -219 57 -48 12 126 86 242 -133 397 118 264 131 276 359 -9 281 -11 596
2333 596 138 380 82 204 458 296 385 -68 329 244 260 107 -121 320 -7 -115 -208 203 59 23 -70 -23
2355 -23 133 -469 2 -296 -244 -490 -176 -222 -291 -155 -264 -73 -453 216 -267 -79 -417 -230 -231 -360 85 -404
2377 -404 -35 -214 -107 -125 -4 81 -136 66 -168 10 -260 65 30 100 135 -154 104 4 400 8 174 -56
2399 -56 284 310 176 216 130 316 191 -2 136 -96 240 -207 352 -61 259 -20 55 37 164 195 -287 98
2421 98 -30 156 -135 -16 -47 -68 -2 -170 166 117 123 -155 78 -151 -301 -287 -270 56 -356 24 -120 -149 -250
2444 -250 -66 -306 -458 68 35 -103 -494 -1 -56 -166 44 -301 26 -157 77 -175 57 -47 -37 8 -204
2465b04N50n39O13n55J21p3k6J91o3J70k89L18j54J88M3q0k59j35L96l14L06k79
2487g4J56j2PJ77l87O44p13L11j39K41k83O3ko7K61k52J2k42P8k6K58J05k96O9
2511a11r4L05j22j69k98J94K41j21N6m1J02j08j5J33p5O0J0J37m19K87m5j4k78
2534c85L67L8k33K87n16P90l38M4J38l02K48m17N42m10K71J7j4Q9j31K0j06M9
2556D8j03L60j2J10j56m49L22l28N35l04J14o3R2j73k49L95R6j6P5l48j28M07
2578B25k65j53J60j28K91l05K85k11K16l68ML3p2K89n26M42R5j56j28O7J31m4
2600a18O5j2J26j09mj29j04J99k0M3r7K72j25P3j60k09M70k87L53l94J25J73j53
2623b2K55j64m7k17L03J2J40m9k66K79P2n9k81K43n9N8N8O9k07j46J98j08j9m5
$$ plain form
2465 -204 346 -193 420 -135 -14 -87 -113 78 15 185 -104 214 60 248 291 211 -48 -183 213 -101 205 -74
2487 -74 82 70 77 254 -133 511 -202 109 -30 211 -72 -9 -11 -78 183 -69 -57 -299 -221 -247 11 116 -180 -111
2511 -111 -205 100 -22 -191 -489 -295 -54 -175 -119 -160 -58 -166 -181 -48 -123 -63 -53 84 -335 -48 -93 -107 -385
2534 -385 -18 20 -213 74 -442 348 10 54 192 -110 138 -279 263 -147 124 141 127 216 85 105 -1 48
2556 48 -55 305 293 403 247 -202 120 -208 327 23 137 74 166 -7 -256 139 235 219 294 -54 -182 225
2578 225 -40 -193 -33 -161 130 -175 110 -101 115 -253 -249 -216 -288 1 -525 -83 12 -144 -272 -205 -74 -118
2600 -118 -53 -65 61 -48 -52 -181 -285 -86 -106 -63 -160 112 -13 60 -100 -309 161 -126 227 -167 -42 131 -22
2623 -22 233 69 22 -195 108 120 260 211 -55 224 296 237 -44 199 140 198 256 325 118 -28 170 62 43 -2
2647bJ37j64J78k40J89k44r6M67j75k4j11k9J0J6N07q68O33n77M12m29J33J2Q7
2670a78Q9j6J37j51M6n2j60nRK36N9j6j23L64l82MNM7J57j7Lk25M55l13R1j61
2696i7K46K07j09O1r4k1k4r4r3lL28j18R9k12M03m15J79n5l02L29l65L48m41N00
2720B57j98j2j13K65Q3k97O0j56J56R2R4j70k09L01n91M50l03J00J22r8Q7Q0M
2743Dn10K62l20P07l19k82J38P1K87J7j84n2K14j15R9j18L0j08j0K70M9m2j48
2766f0N6L16j82l3l05L49k9J09k44K3J41K4M0l28K83J95j01k66J27J49j80m8k88
2789b52O74l45J2O6N0j41M3J50m07L03l91R8j42M30j57k17L86m46L61j98J58l25
2811b90N19m98K26j21k43J69j8J97j40K18j28j94K88j54L18m1O5n63K57K04l91
$$ plain form
2647 -2 135 -29 149 -91 98 -146 -242 225 50 26 -85 -114 -104 -88 419 -449 184 -393 19 -410 -277 -265 -178
2670 -178 -89 -105 32 -119 -73 -125 -285 -290 -281 -45 14 -2 -125 239 -143 -139 -134 -87 70 53 56 -169 286 -27 64 -97
2696 -97 149 356 247 308 214 193 169 75 -18 -21 307 189 288 76 479 64 243 188 -114 215 -150 198 -243 257
2720 257 59 47 -66 199 282 -15 45 -111 45 137 231 61 -148 153 -438 12 -291 -191 -69 -167 -80 0 4
2743 4 -506 -244 -564 143 -176 -458 -320 -249 38 55 -129 -181 33 -82 17 -101 -71 -179 -189 81 130 88 -60
2766 -60 -4 312 130 97 -208 141 112 221 -23 0 141 165 205 -123 160 355 254 -12 115 264 84 36 -252
2789 -252 422 77 89 155 205 64 107 257 -150 153 -238 -140 -282 148 -9 -226 160 -286 75 -123 35 -290
2811 -290 229 -269 -43 -164 -407 -238 -256 -59 -199 19 -109 -303 -15 -169 149 108 173 -390 -133 71 -320
2832c20M36j60K12k71J21K2N9k46J07L38l05J78k72K46j34O7J19l32M74k08j5
2853A16k81L04q3J13R5n6j02l85N40k95J05j57K41j16o8R4R1j24k68N95l88R6
2875F7Ml33K82j29k8k64M49l05L36J05m05K01j37L72l68J08J2j65J15q6J19j80
2897b30J02LJ68j70l7J95j29L67l74K05j75J39p3N6J38p0J35l69L24j78J72j34
2919F5q4J67j06N39m37%n7j10P5j15J46m8N3k03K64O5j14j35K26j10k27L86l45
2942a05J61k64M87m97K69Q2j21K05m19M41j37J8l02R9R1j83J48k12K76q1K31k16
2964b9j98P6L9L7k56L33k59j5Q5MJ41q4J21Jk61R8K87m5l4p4q7K42k06L4j22K22
2990E0J6k1J24j29l7k58M30k47L97k85J30l14J23J95J8N6j70P2O1j69J32j68K39
$$ plain form
2832 -320 116 -44 168 -103 18 40 99 -147 -40 298 -7 171 -101 145 11 78 197 -135 339 131 116
2853 116 -165 139 56 169 264 208 106 -279 261 -34 71 -86 155 39 -29 65 156 32 -236 359 -29 67
2875 67 71 -262 20 -109 -137 -401 48 -257 79 184 -221 -20 -157 215 -153 -45 -33 -198 -83 -169 -50 -230
2897 -230 -128 -125 43 -127 -164 31 -98 269 -105 100 -75 64 -9 47 185 115 250 -119 205 27 199 65
2919 65 -19 148 42 581 144 144 87 -23 52 -63 83 35 88 -115 149 214 100 -35 191 81 -146 240 -105
2942 -105 56 -208 279 -218 51 133 12 217 -202 239 102 120 -182 -83 8 -175 -27 -239 37 -44 187 -29
2964 -29 -227 -151 -112 -75 -331 2 -257 -272 -187 -183 -42 -126 -5 -4 -265 -167 120 75 41 -33 -120 122 -84 -50 -172 50
2990 50 66 45 169 40 3 -255 175 -72 325 40 170 -144 -21 174 192 248 78 150 211 42 174 6 245
3013B45k09J39l18J18R0j74M61m29J88k15K24l97J54n6J58J72m26N19k63PK9j01
3035h4L9J1L5o7M0l4n4k18L32O8j47O2r4R4j78J92j69j0K01j89J83k99K97L8M3
3060I2j18P3j42K10N3k76P2K4K55j86j22M5J40O0j22%j90J81j68L61q0J3J82k86
3084G1N1j10k3N1J37q6L6J05l49J72P2J57m54J36o7K15nj07k7k20L65k01k23M30
3108A26k08K20n50K48M6k08K41n5K44l53L18j89K21j75J62o1n8r8R8L2j50J58
3130Ik62Q1J2K54m2l0J47k01J61j78J04l2k09J37J97n5q4N45p13M82l37K73K2
3153B81p7J06k83J88k36K09l82M68k58J44J33l95K52j31L4k34K6K22n8o5r1Q6
3175f1l35N55j86l4j80KL00l83L08k68K80m61K68K52q4p5l8J93k87K92l59L43
$$ plain form
3013 245 36 175 -143 -25 65 -109 352 -77 111 -104 120 -277 -123 -179 -21 151 -275 244 -19 -12 17 -84
3035 -84 -45 -34 1 -66 -26 -60 -114 -332 0 68 -79 -17 -111 -17 -195 -3 -172 -182 19 -170 13 -286 11 49 92
3060 92 -26 47 -95 115 168 -108 -36 -12 243 57 -65 -20 120 180 58 58 -132 49 -119 242 162 175 357 71
3084 71 122 12 -11 40 177 91 127 232 -117 55 127 284 -170 -34 -101 114 109 2 -25 -245 120 -81 -304 126
3108 126 -82 138 -412 -164 -118 -326 -85 -140 104 -249 69 -120 101 -74 88 27 -31 -129 -31 1 -149 9
3130 9 -253 -172 -160 94 52 22 169 -32 129 -49 55 23 -186 -49 148 93 9 554 -159 323 -14 259 281
3153 281 204 310 27 215 -21 188 -194 274 16 160 293 -102 150 19 53 -181 -155 67 9 -56 -147 -61
3175 -61 -396 159 -27 -61 -241 -239 61 -322 -14 -282 -2 -463 -195 57 -27 -102 -140 53 -234 58 -301 42
3197D2j97l8j17K66J71j90L2O4q2K25k94K01k85L15J0l8k17K85l03N02k22j32
3219bK05l04L94k76Jo8J23K70l29K78m15L28k28M4K01j65qJ1J93j38M0j54K3R8
3243A22l9j09p4K46j63J21j21L5k3L0q4K4K15l38K81j49L5j68P8O4j80J85p6J49
3267F1j30M3j22J57J27k80j43M1R1J45k63N0M19l08j02L54l63J9J66K3Pl5L51
3290C08l27J05k00L45j71P8k36L15o7l91L00J16K5o3p7l8J19K00l59K83l59K65
3312A71j09j97K00k46K71k5N3j37o9J29M7j99J15Qk10L25k72KJ6j8N4L12k47J75
3336A49k29j02L47n61L42O1l25K90j08Rk11J77J46J82j08j74qr6K36o3K00n3p8
3359B3k6k5MJ18n2pj62K32p1J58l28J27j53J66j4M8K47j00k65J84q9r0L39j28
$$ plain form
3197 42 -155 -193 -310 -44 127 -63 -31 33 -49 176 -118 83 -202 113 123 85 -132 153 -150 352 130 -2
3219 -2 203 -101 293 17 18 -50 73 343 14 292 -123 205 -23 21 222 57 49 60 253 115 155 1 24 122
3243 122 83 -26 -100 146 -17 104 -17 18 -5 25 -59 -35 180 -158 123 -26 9 -159 -81 -17 -197 -12 -88 61
3267 61 -69 -26 -148 9 136 -144 -287 -246 -155 -10 -273 -223 196 -112 -214 140 -223 -204 -38 -15 -8 -43 308
3290 308 -19 86 -114 231 60 138 -98 217 150 -241 59 175 200 137 60 22 141 341 -18 265 -94 171
3312 171 62 -135 65 -181 90 65 118 -19 -88 41 88 -111 4 12 -198 127 -145 -143 -127 -145 -91 221 -26 149
3336 149 -80 -182 165 -396 -54 7 -318 -28 -136 -127 -338 -161 -15 167 59 -115 -123 -219 17 -46 154 101 23
3359 23 -3 -28 -24 94 42 35 -127 105 34 192 -136 -9 -162 4 -10 38 285 185 -80 104 15 -75 264 136
3383A36j92K99l27QK11j18j74J76Q8l50L06l11M96l06k6N1L2q1j48J32j13J63
3405d8R3N7l96K58j85L19l34J75k25J45L01l64j3K8L46j52l5k11p8N51L7j67j12
3428a0q0j43K45j53J27M4j78K82j96qP9jP0L9n5k03K52l46J89o3L73k4k14J72
3452A98k26J04O2j0j57ml2NJ87l81N02l69K60k68M06l34K1J43j65O79o45J03j52
3475g3J0j28Q0mn1j1k9Q8n3j0K52k62J67r9J04j12J5R1j73mk9K96l43K43M5J82
3501A92m41p8M31nL5Q5j53j22n2j5K92j84pP9r7K96l07M5L9j27K07OJ25p3J15
3526B86l70L29l18J05j53J59j74L45j09r3o1J91o5m7O6j38J3m7R2O9l36L17k33
3549a72J54L41n99J42N4K70k18p2k4R4K22k83l3j79K63k7K03l70J27J24j46P2
$$ plain form
3383 136 -56 243 -84 -76 135 17 -157 19 107 -243 63 -248 248 -58 -84 -33 -1 -82 -230 -98 -211 -48
3405 -48 45 102 -294 -36 -221 98 -236 -61 -286 -141 160 -204 -217 -189 157 5 -30 -241 -319 232 269 102 -10
3428 -10 -90 -233 12 -141 -14 30 -148 134 -62 -70 9 8 78 117 62 -141 111 -235 -46 -109 264 240 26 198
3452 198 -28 76 138 128 -29 -33 -65 -60 127 -254 248 -121 139 -129 277 -57 -36 107 -58 621 -24 79 -73
3475 -73 -63 -191 -111 -115 -166 -177 -206 -118 -171 -181 71 -191 -24 -123 -19 -131 -116 -25 -198 -202 -231 65 -278 -35 10 192
3501 192 -249 -327 104 99 134 219 66 -56 -108 -123 169 -15 -22 57 -40 256 -51 -6 33 -94 113 119 244 171 286
3526 286 -84 245 -73 32 -121 38 -136 209 100 7 -54 137 72 25 91 -47 -34 -81 11 80 -256 61 -172
3549 -172 -18 323 -276 -134 -80 190 -28 -100 -124 -30 192 -91 -124 -303 -40 -67 136 -234 -107 17 -129 -57
3571e7k5J99k82K59k83q3Q2K43M6K6Lj29J74k95J66r8J03l4r8oK87k47K74j66
3595E9j96K01j29o6J59PJ61k03p5O6j24J19l3J61n7j4j36K79k45M9N3l5P1p3M5
3620D4k9m4J93r7k10N8j0j02J96mQ0n7o1L8q2mk57J35o2M01n7j00J56l07M85k96
3646GR5k94R9K13j87L26l11J15R4k37J99l5M7n03J28J54O5J55l43K67m5j19J97
3669H7n3Rj07L11K1M0j57Om48L78j7J26j09k43J01K10J73n04J71rO7k64R6M18
3693C03k40J70q8k49o5L35l76J12q7J19N7O6j14j42M0K55mj0k96J05l13M98n3
3716B3j00j51J65n1j10Q5j70L96l18K48j81K10j38p0L36k94M05l30J08J31j89
3737Ek10P4r1J68J17JK5j51J07r7N1J02p8k3J37k2%J20K5l76M19l71L68l43J00
$$ plain form
3571 -57 -82 117 -165 94 -189 -272 -190 53 99 125 128 -1 173 -122 44 -54 49 15 -83 -89 198 -49 225 59
3595 59 -137 64 -65 -131 28 35 196 -7 -82 -16 -140 -21 -54 107 50 36 -100 179 -66 -17 36 1 72 -1 44
3620 44 15 -29 164 67 -143 -85 -95 -197 -1 -5 75 18 -43 -5 -87 -91 -348 -213 -275 126 69 -31 125 -182 303 7
3646 7 102 -192 -93 120 -67 259 -52 63 157 -80 119 84 131 -372 -244 -90 -25 130 -213 54 9 -110 87
3669 87 34 43 -64 247 268 308 151 157 -291 87 70 196 87 -156 -55 155 328 -176 -5 -14 53 -211 -115 303
3693 303 63 233 145 -104 -169 166 -210 -98 -185 -66 -9 57 -57 -199 -159 96 92 82 -214 -109 -422 76 23
3716 23 -77 -228 -63 -114 -224 -139 -309 87 -231 17 -164 46 -92 -162 174 -120 285 -45 63 194 5
3737 5 -205 -131 -222 -54 63 64 89 -62 45 -52 -1 101 23 0 137 115 115 235 260 -116 303 -68 300 -43 57
3762E7k6r0Q3m9J57k73J70R0o6M4j19Q5j39J4j34N9l5K15k4k43J52k00L51m8j03
3787g2J89O4r3j56Oq8K35m4O5j32j37J18k30K57p3j67L17j80k9L32j57O2J6o8
3811C5J14k9KJ30j72q0M3M8l2o0k08M15j00MR7k70K17j17j9K08j09j85oR0M9r8
3837c3m6JL30j53j04l5P5J9j5j25J04l53L34j05J4n0O4K56l88J69j05K76k93J77
3861A4k57L89k49J02j69J55P7j96L9r5L23o7P1j53j06J32k53J70J66k20K72lk76
3884a34N9L9k18K64L3j76K76k18o6L71m0R8l08Q9j30J51k9r7O0o0m3K93n9%j04
3909E1j41K74k26P5m1M0J47k73k9N1O1j95M39k00q1p2pQ9k16L37j91J86l90K73
3933c9N7Km8o2PL3J24j42P9m4J5K06k77R3k08K38J61k03l27K2L64k83M64l79K23
$$ plain form
3762 57 31 -59 24 -25 132 -141 29 119 53 97 -22 63 -76 -62 -196 -137 -172 43 19 -224 -72 -272 79 31 -72
3787 -72 117 181 88 -68 -62 -150 85 41 106 -26 -163 -45 -275 -18 -91 -258 59 -121 -150 182 25 87 103 35
3811 35 149 120 122 252 80 0 43 91 59 -1 -209 206 106 110 207 -63 154 37 18 226 117 -68 -74 16 65 -33
3837 -33 -79 -78 252 99 -5 -40 35 54 39 -86 18 -335 -1 -106 -92 -142 -78 178 -210 -41 -146 130 -163 14
3861 14 -243 146 -103 -1 -170 -15 62 -134 -95 -190 133 66 137 -16 -122 10 -243 -73 93 -127 145 142 -134
3884 -134 -75 -36 -254 10 43 -133 143 -75 -141 230 190 288 -20 69 -61 90 61 -36 24 -36 -79 214 155 155 51
3909 51 -90 184 -42 33 -8 32 179 -94 -123 -72 -11 -206 233 33 -48 -120 -127 -38 -254 83 -108 78 -312 -39
3933 -39 18 20 -28 -90 -83 -50 74 -68 11 -33 -18 188 -89 4 -204 34 195 -8 -335 -313 51 -232 232 -147 76
3958G6J05j28p1j6K2o0J83r2L44k29j4j99J44j33p8L62k34J42L7k38j55K24J98
3981A90k94J85J25j63L1J86m75N1K30j01l4J8l7L74k61Q7k66L21P1l56J3J55j48
4004i8J1o4Q8J44l11J67J3R2m53K43p4M55k30j15L01j13K71m04Q2Q1L8r7r9J01
4028B9r5J33j94PK23k11k1j38L82j75k3J33o9J84j08r5J11J16j76M2j01K09j25
4051C8k2P2j4L5n8q5j07L3j4j0K60k36K42j04j3k4K07j54j71J76k44L61l40K47
4075G5k96J81K38k59J43j60K94m39M20l45K73j37M1J5k91J69J08J4J56j73J61
4096A88k65k19L59M3q8JM2j72K29j41J9k44K98j70J43j33L37q4m1p3j63J66L5
4119F7p0j3Q1O8K7j11J08k42J1L23o34K73K20j11J49j55K5l04L22k9j31J39K23
$$ plain form
3958 76 181 53 -18 -34 -12 -72 111 19 363 134 120 -79 65 -68 -146 216 -18 124 161 -77 -232 -8 190
3981 190 -104 81 206 43 74 260 -215 -164 66 -35 -69 -51 -88 286 25 112 -154 167 238 -118 -105 50 -98
4004 -98 -87 -151 -63 81 -230 -63 -50 42 -411 -168 -242 213 -17 -132 169 56 327 -77 5 86 124 27 -72 29
4028 29 -66 67 -127 -120 103 -108 -129 -267 115 -60 -83 50 -19 165 57 -38 73 189 13 55 -46 163 38
4051 38 16 88 74 109 51 -34 -141 -108 -122 -132 128 -108 134 30 17 -7 200 46 -125 51 -193 168 -172 75
4075 75 -221 -40 198 -61 82 -78 216 -223 197 -148 125 -12 29 44 -247 -78 30 44 200 27 188
4096 188 -77 -296 63 106 18 19 61 -111 118 -23 -4 -248 50 -120 23 -110 227 143 102 29 -134 32 67
4119 67 -3 -16 65 133 160 49 157 -85 -74 249 -385 -112 108 -3 146 -9 16 -288 34 5 -126 13 236
4142B36k76K44J22k19k23P6r4L40l95N2J57kk00K35Mr0K0K35M1l67J01J23j47
4165b7M4j18J13j57J39J02j69J06k89L38k85P5J61l04J79J05M6J06k19J44M0j30
4187@J38j82J44k0n6j1k04K71j28M2R1P1k79J34J73j9J6M5Q0l82j79K51J59j78
4211b3K9p1L7QP0J37j45J95l01k22M86r4j16K56l96L2K23k15R3j37J69J63l87
4234b09K13K2J6n2j11m8Q5j02K03O5k72j1L61j70K06m48L12j18J5L0k0j94J64
4257f3P2n5M0j86N8Q7p2J53J74k00k6J16n2o3J48k7j35n5J78j38Q3J6j69J05J44
4282A33j73N0j85M5J3JK19l30L42j58J33k5o9O8k47J26j27k14M07K14k55L1K52
4305B51j81k54K4j8P8K26k63PK97k36L45k78r1J21J21n8N6p2k18K67j80M0n5P2
$$ plain form
4142 236 -40 204 326 107 -116 -40 -134 206 -189 -137 20 18 -182 53 57 -33 -13 222 263 -104 -3 120 -27
4165 -27 17 -101 12 -145 -6 96 -73 33 -256 82 -203 -128 33 -271 -92 13 59 165 -54 90 130 0
4187 0 138 -44 100 80 24 13 -191 80 -48 -6 85 156 -123 11 184 165 181 226 306 -76 -255 -4 155 -23
4211 -23 6 -65 -28 -20 50 187 42 237 -64 -286 200 106 -10 246 -150 -118 105 -110 -17 -154 15 178 -209
4234 -209 4 26 42 -10 -121 -169 -84 -186 17 82 -190 -201 160 -10 196 -252 60 -58 -43 -13 -33 -227 -63
4257 -63 9 -46 -6 -192 -134 -47 -119 34 208 8 -18 98 46 -17 131 104 -31 -86 92 -46 37 53 -116 -11 133
4282 133 -40 10 -175 -130 -117 -116 103 -227 115 -43 90 65 -4 64 -183 -57 -184 -398 9 223 -32 -1 251
4305 251 70 -184 -160 -178 -100 126 -137 -130 167 -69 276 -2 -93 28 149 91 147 75 -143 124 -56 -16 -71 1
4329Aj8L9j05j0J16n2l6j13J60K0O9J34j11k63J24N9r3Q4j41J51p3L85k81Q9l66
4354b31P9K89K8J9l57L52R3m18Q7j92K15J9J73j6j89j03K87k6j09j16P5K03j65
4377cL0O2j38j39K32M3m19K11K9M5K10k55lJ58l59M36r0J7j72j02J35K17k30K60
4401A75n1n6m7j63J39L2j26J06J85j69l6o7o0L53l07J54j66R8J94r8p5q2Q8JL
4426B5k1j89K55j32J00L7q4R1o4K00j15m5q7K9o8K7J80J11m2m5l11Q3J26p5j43
4451a57J79J56j56j34J90k62K85j51n1n0P7J13J03kj9o2j58j7P6j12k5L62Q0l93
4475a28K30j52J01O4M3L4j73m43O37m23L34J60m14N0J0R3l66M10J7k52L03l44
4497b09K88j0r6J00k22NjJ53J5j15L0rJ91Rm3j21j45K24L2pN7q9j72J67m7MN9
$$ plain form
4329 1 -17 22 -83 -93 23 -29 -65 -178 -18 2 71 205 94 -169 -45 14 -79 5 -136 15 -58 327 46 135 -231
4354 -231 -152 137 165 184 -173 179 272 -146 -59 -251 -36 -17 156 140 -49 -152 135 109 0 -116 -41 162 -3
4377 -3 27 89 -49 -188 44 87 -332 -121 -92 -47 163 -92 -95 63 -296 140 50 67 -105 -207 -72 145 -85 175
4401 175 124 68 21 -142 -3 29 -97 9 194 25 -11 -78 -138 215 -92 62 -104 -6 188 90 15 -67 21 22 25
4426 25 4 -185 70 -62 38 75 -9 82 18 218 103 58 -29 0 -68 -41 139 250 208 163 -148 -65 61 -14 -157
4451 -157 22 178 22 -112 78 -184 101 -50 -101 -151 -74 39 142 140 121 59 -99 -116 -40 -152 -177 185 265 -128
4475 -128 102 -50 51 115 158 192 19 -424 213 -210 124 284 -130 -80 -70 23 -343 67 84 -168 135 -209
4497 -209 79 69 -27 73 -149 -144 -145 8 23 -92 -62 -71 120 129 86 -35 -180 44 76 69 126 37 -135 32 -15 -11 48
4524D8o6K8J95j72k64R5J71j1KnK23n56L09m5O8j4q8J9l8k9J57J20k83L45q6k06
4550h3L23j67L04n01J37j11J13M3P6k14J45j54O6j89L32r2q3j13J54J07l4l9R7
4573A17j20J10j50R8m9K02j5k7n2r4lj12K30k91J13j50n0L46k21J52M4l6k71J62
4597f7J81M5N7m74K98N0l15K97j02N3r4J75j30n2J38m16L82m5K41l1l73K62l6
4620D4m6l3J44Q9k69J87j71J95j71P2o0O8j08L0r1J87j34J09O9Jm1j5Mj35Q5r6
4646h6J67j26N%M1R8p3p2O7JL8k42N3o2J48j20M26k43p4K05J02k27j49J62J80
4671B19l71J46J2j31J00JR6j54j1Q1O3q9J58k17L6k9O2K1JL8q4j55N5Q4Q1J99
4697B12k92L1k6j24q3L59j73J91j31R8J93k25L6m8J38j69j35J15J44m0jk29J50
$$ plain form
4524 48 -18 10 205 33 -231 -136 35 24 26 21 244 -312 -3 -48 20 6 -82 -63 -101 -130 27 147 -136 209 123 -83
4550 -83 240 73 377 -124 13 -98 15 58 134 -80 65 -89 -23 -212 120 28 -55 -168 -14 93 59 20 117
4573 117 -3 107 -43 55 6 208 193 166 114 20 17 -95 135 -156 -43 -193 -243 103 -118 34 78 42 -229 -67
4597 -67 114 159 216 -258 40 90 -225 72 -30 23 -71 104 -26 -78 60 -356 26 -19 222 191 -182 80 44
4620 44 -2 -35 109 198 -71 116 -55 140 -31 41 -19 49 -59 -29 -120 67 -67 42 111 112 71 56 60 -75 10 -86
4646 -86 81 -45 -40 -40 1 99 26 -46 21 22 60 -182 -129 -191 -43 -163 263 20 -54 151 253 26 -123 39 219
4671 219 -152 -6 6 -125 -25 -24 72 -82 -93 -12 51 -38 120 -97 -61 -90 -28 -7 -6 32 -52 -207 -152 -68 13 212
4697 212 -80 -49 -75 -199 -282 77 -96 95 -36 62 255 30 66 18 156 -13 -148 -33 111 71 70 -159 -9
4720iQ5m3K2k27K07K31n27K45o4K6j80J91J77j26k01K15l12M43r1l18L52Qj81
4743g7J16K10j1n5l17J09j92J61J67k44R4j2J18j59k3K08J48n79N78j85k09K26
4765G2Q9K0j65qq1L11k47J59j98K25k26r2J91P3j89K2K06p6j61j74K60J51p8o4
4789B0j8J3l7j46l5Q7P6j0pJ12p5J6N0l6k89K85L3J92k07J25j67R0j6j03j83O0
4815a70J68k50J08J44j96O4L2P5JJ00j92K15j62l8m2R5K70j55J4l3J68j23Kk50
4839a55o6K01j92J53N4l1j63LK44N3j92K40o2l04O2K16m9KJ4j01N3J09j78N0O
4864c3l1r0L58p2K1J14m52J43K67q7j25m1j07j71L52j0m1k28K64k58K83m6J52
4887A62j3O3m05M53k47j34Q3m9K07j88r4K30L2r3Q8j50j33M06k88R1j61P4J5r3
$$ plain form
4720 -9 76 33 55 -172 35 266 -261 -16 -80 -54 -234 -43 134 8 -193 22 -290 153 62 -256 96 104 -77
4743 -77 39 249 238 183 -134 -25 -217 -56 111 -133 -39 -51 67 -92 -115 93 241 -338 240 55 -154 72
4765 72 161 181 16 8 -73 238 -9 150 -48 177 -49 -141 50 123 -66 -44 162 86 -75 -249 11 162 84 20
4789 20 2 15 -22 -168 -203 -116 -40 -50 -57 55 -20 -4 46 10 -279 6 39 231 24 149 -18 72 56 -47 -230 -170
4815 -170 -2 -252 -144 0 -196 -132 -100 -25 -24 76 -116 99 -63 -101 -143 -48 222 67 81 48 216 93 95 -155
4839 -155 -221 -20 -212 -59 -5 -36 -199 -196 48 101 -91 149 87 -217 -155 61 12 14 28 -73 -20 89 -89 -39 -33
4864 -33 -64 -154 204 132 153 267 -185 -42 225 138 13 -28 -135 -306 46 36 -5 -233 31 -227 56 10 162
4887 162 149 212 -193 260 13 -121 -38 -87 120 -68 -162 68 100 7 95 -55 -188 218 -70 21 -140 -66 -51 -144
4911a44K43n9j03L95k26j12j11r0M9N0K84m3j12O2j2J17j70L32l03J13j03o5r6
4934a04L7J43j78pJ26j48l4M64k32j23k7j11L72m84J92J60L3j48k2J5L6J76k85
4957a49kO0L4J64j00j26M17l10J19M0o9j65K21l32K25n3P4j24j33L21m6J99p3
4980A92NJ8l95r1L40L7p1k40L74j35R3k36n8L5k3K86J38J2k52M5q1P5J12q6j05
5005a1J19r1JP9k67K14q5J92j36L00m45pL43k32o7j02L12k30K21l10Q0J7J68k03
5029a40M5l4J52j91R6M2l19L99l24K37j0J06r1l9O1J37k11K67o9Kj34j83K01j94
5053a94R2J66j67N7K35k35q2j65J23O6K10k96J56R1l2o4k2L95j76j08PJ35l87
5076a95L61q3Q2P6m9j32K0j26K54j48j53j2J14J74k14O1p7J21j20J80Lq9p6j89
$$ plain form
4911 -144 99 40 -63 332 106 -6 -117 -207 -158 -108 176 133 21 83 71 188 18 350 47 160 57 -8 -104
4934 -104 -67 76 -102 -109 17 -131 -165 299 67 -56 -83 -194 178 -306 -114 46 79 -69 -91 -76 -40 136 -149
4957 -149 -151 -91 -57 107 7 -119 298 -12 107 147 78 -87 134 -198 27 -26 48 -76 -209 112 66 265 192
4980 192 197 215 -180 -271 69 106 35 -205 169 34 127 -109 -167 -132 -155 131 269 281 29 74 -7 68 180 94 -11
5005 -11 108 17 18 97 -170 44 -41 151 15 315 -130 -137 206 -26 -93 -195 117 -113 108 -202 -122 -105 63 -140
5029 -140 -95 -129 23 -168 -72 -30 -349 50 -274 -37 -47 59 -32 -71 -10 127 -84 183 114 116 -18 -201 0 -194
5053 -194 -102 64 -103 -46 189 -46 -128 -293 -170 -104 106 -190 -34 57 25 -39 -61 334 158 50 57 192 -195
5076 -195 166 83 165 241 192 60 80 -46 208 60 -93 -105 9 183 -31 30 -47 74 -46 134 137 48 -28 -217
5100b17K71k65K58j54K40j60m8K0n8l5N05l26Mq3K9K5K45l18R9r0k3J45j39K5
5124e0O4J15k30Q0j39L18j0k61j33K63L4q4P7J26k90K3J19k69L71l91M40j71K30
5147B32l51J12j03M9J59j98K93k77M15m57J90q4q7J67j09m3J45k4j55L88j28p4
5169F0o8k16M46l47J91n0J28j3j57k9l9K93k0R8m5k06L34o48N87m76k4M0L13k23
5193g1n4N5q3J53K30k13k9J30j02J15p3J33j86n1Q1L23l53J81k55J80k7k80K63
5216F7j63M2K17k35K48lj51k67L02j73J39Q8L5l40M9M26j3p7j61k2r0J50l04J25
5240a11R3RJ28n4j44n1K29l7j11K50k90K10j74J40j67j40M1K69n2j81M9j93J35
5263a52R7j7L1j6O5k32l3K39l0r5K80L1m1l1j59J67j88J87j8j32L10k85qJ0j92
$$ plain form
5100 -217 54 -211 47 -107 133 -27 -75 -55 -113 -148 357 31 35 -48 -19 6 251 -67 32 -58 -81 64 -75 -50
5124 -50 14 129 -101 -21 -160 158 148 -113 -246 17 51 -33 44 170 -120 -97 22 -247 124 -267 173 2 232
5147 232 -119 -7 -110 -61 98 -100 193 -84 331 -126 64 -20 -107 60 -49 -92 53 29 -126 262 134 60
5169 60 -8 -224 222 -125 66 16 144 131 -26 -55 -94 199 179 277 232 26 360 -288 299 -177 -201 -161 152 -71
5193 -71 -125 -70 -153 0 230 17 -12 118 16 131 58 191 5 -46 35 358 5 186 -69 111 84 -196 67
5216 67 -96 -54 163 -72 176 173 22 -245 57 -116 23 111 146 -194 -145 281 268 191 30 8 -82 68 -236 -111
5240 -111 -18 -9 119 65 -79 -130 99 62 -49 201 -89 121 -53 87 -80 -220 -179 90 38 -143 -94 -287 -152
5263 -152 -55 -72 -41 -57 8 -224 -257 -18 -48 -143 137 168 127 96 -63 104 -84 103 85 -47 263 -22 -30 -20 -212
5288b12J09J52m6k1j40P0K11j14k32K76p2k8j46M6Q5kJ75k55J68k2n4K78k63p2
5312a09J75j35K40Q9l22J99j78K3N1Q4j61J36n6l1K52k26j96J21j17L29l39l1
5334b02J26P3L65l77J02j1O3j72m9k4J90j66K30k23O5j4J6J01P8j36j98J57q2
5357h8j96K43J05q5L01k85P9r3K3rN3Q4j19J93k49pK81k08L23l94j71m2J67K39
5381A45k10o8K71j13j77p5L27p7j2j88K41j08p6K0J52P9k22J93j88J3J01k28K45
5404D5K18r7j49j73K26j25J36pr3L9r7J18r1jq5J31j15N9q3K71j89R2J54l40K22
5429F6l0J28k91J01K3J24p7k88K74l4n6n5RK55Qk04L7N2J2p5Nj55J42L5j5R4J07
5456A92j5m73L47j43K73k1k44J41J3n8j01J42J18l11P7rJ40k44k7K53jK2j3r9
$$ plain form
5288 -212 -103 49 3 -18 -158 -88 123 9 -223 53 -19 -47 -193 -147 -62 -64 111 -144 24 2 -52 226 -37 -109
5312 -109 66 -69 171 260 -62 137 -41 -18 33 117 -44 92 36 5 257 31 -165 -44 -161 168 -171 -202
5334 -202 -76 -3 362 -15 87 76 139 -33 -82 -106 84 -82 148 -75 -10 -24 -8 93 171 35 -163 -6 -88
5357 -88 -284 -41 64 -21 280 -5 74 -19 4 -5 48 132 13 206 -43 -50 231 23 346 -48 -219 -261 -94 145
5381 145 -65 -133 138 25 -152 -227 100 23 11 -177 64 -44 -120 -100 52 131 -91 102 -86 -73 28 -200 45
5404 45 263 166 17 -156 70 -55 81 74 -19 20 -77 41 -50 -51 -136 -5 -120 -61 -144 127 -62 30 184 -156 66
5429 66 36 164 -127 -26 -3 121 44 -244 30 -4 -60 -115 -106 149 157 -47 -10 42 54 -21 -16 -171 -29 6 -9 85 192
5456 192 177 -296 51 -92 181 160 -84 57 70 12 -89 53 171 -140 -63 -72 68 -176 -203 50 49 71 58 -41
5480d1j41R8j7J07k13L23N9j30p4K2J25k5k5L0j37K6J59r5j48M38j52o2k00P5
5504Br0P7j8j9J75k82J71P0k5Lj51J4J51k33j0K10r6J95j89J98p2j75K98j75R1
5529A20j40OJ04j83K12j20j62K61j26j34l5K56j02m5l8J45j55k8K87j28N5n9o2
5552g1J96j47J36j64O4k19J4M35m07J14J16j79L0J44j9N3J9j0j80J25l12jK95
5575C2oK31k74M2J2j79J49K85l6k75LR4o1Lm7L5K7Rm5j24J61p7J49j23j89K24
5601B0N9m00L15k87K97l5l0J47k30J82K9j03P0j19K47j56J21K5r2kr5J2m0P0N6
5626F1l31L00j02R1J8k06J14J57j70J0L28l43J60m1n2K40j85p1J7J27k77J49j29
5649a35KK6K90m36L00L6p6OJ18k50J28l2J29j94J71j31K00j86O3P2m4J07j23k95
$$ plain form
5480 -41 -182 -84 -101 6 -207 116 175 45 -29 -7 118 93 68 98 -39 -13 146 51 -97 341 189 127 -73 2
5504 2 -88 -11 -29 -48 127 -155 16 86 61 64 -87 -73 78 -155 -165 45 -51 144 -45 153 81 -94 204 29 120
5529 120 -20 -14 90 -93 119 -1 -163 98 -28 -162 -197 59 -43 -88 -126 19 -136 -164 123 -5 50 -9 -71
5552 -71 125 -22 114 -50 14 -205 -191 244 -163 -49 67 -112 -82 62 43 96 115 105 -75 50 -262 -263 32
5575 32 26 257 -17 25 37 -142 7 292 256 -19 -16 78 17 20 -27 8 35 44 -1 -125 36 -41 108 -15 -204 20
5601 20 79 -321 -6 -293 4 -31 -61 86 -144 38 67 -36 34 -85 162 6 127 152 60 58 -37 -25 -65 5 61
5626 61 -270 30 -72 19 37 -169 -55 102 -68 -58 270 -73 87 46 -6 234 49 -22 -5 122 -155 -6 -135
5649 -135 -133 -107 183 -253 47 83 7 13 131 -119 9 -23 106 -88 83 -48 152 -34 29 101 57 164 41 -254
5673b54M33nk47m5P5l2J85K4J9k04K5J01l7J06j35j58K40r1Q5j34m1J89j59J65
5697A05l58K11K3p6M0N6K1L6k18J7K24M5j03o4j25J50K9o6M0ql2L4R8J92k20q5
5723c4R8j19j01k7J67q8J19p2m3J54Pk33L37N1l16P6q0K81k44lM10l56p9K99j3
5748A91m37J31m8J38J34j51R0j52L9K87m6m01L54rj12j14MN60l57q7M7k8M4K3
5772A00k49N8QJ38j58J21j02j07J45L7l9K9K58k70J78j37O7r9K45l70K99j14J66
5795B04k1k66J28Lj41K67j2l02J4K1J84j30J30K7k61K04L6q0j32R5L5L4j20j28
5819b11K10j70J96n2J55l29J38m7P4J10j96J19J52k83l3j33R8L63o2j77J98PP2
5842A99k41J21j87K7N2J1K21j25q6j0Q2n9m3r1J80j02M2j0j1L8j21J83k04R4L8
$$ plain form
5673 -254 179 174 -73 -118 -43 -75 110 134 153 -51 -26 75 38 144 9 -149 91 0 85 -49 -90 99 -60 105
5697 105 -253 -42 -19 -95 -55 1 22 58 -160 -143 81 126 23 -41 -166 -16 13 -53 -13 -21 -53 -19 79 271 51 -34
5723 -34 64 -55 -156 -183 -16 -104 15 -57 -100 54 61 -172 165 216 -100 -24 -104 177 -67 -70 340 -16 -95 204 191
5748 191 -246 -115 -163 -25 109 -42 48 -104 -65 222 176 -225 129 120 8 -106 -102 458 101 14 61 33 77 100
5772 100 -149 -91 -83 55 -103 18 -84 -191 -46 -9 -48 -19 239 -31 147 10 77 -22 223 -147 152 38 204
5795 204 183 -83 45 48 -93 174 162 -140 -126 -105 79 -51 79 106 -155 49 85 5 -127 -32 3 37 -83 -211
5819 -211 -1 -171 25 -27 128 -201 -63 -110 -36 74 -122 -3 149 -134 -167 -300 -202 161 99 -78 120 127 199
5842 199 -42 79 -108 -81 -29 -18 203 78 -8 -18 64 5 -38 -129 51 -51 -9 -19 -30 8 -113 70 -134 -40 -2
5867bj37j9L00k35J21M6N9k50K50j46j72K35J42k07N3k28R7J15j15K84q3l1j5
5890F2k10J81l58K80J14j02M7k43J92Q8j13O3O7j49L5J7j2o5K03n0J03j28pj05
5914i0M6O7j0M7j12R9j4n9J41l00q1J97N0K6P8p1L1j25K42o2k18J19J5l68J36
5939b16K92k11J31J16j23j09K83j10k52R1Q6j2O6kj87K13k04M31k90n4J73n9L5
5962H8j25q1k5K45n3l4j53L44k92J91j32j01M06l51p4O7L0l5K20l7r9Q4o9Q5k02
5987a03J29k94K47J92J8p2J5j76k9R6k08K01k0j49L59k5k91O8j85R7L56l73J59
6010A2mK4K4j6j77L22o5j45J3j32R5M7j34J83k24K24l01M03K2l76J87J17j78O4
6034a5J50k40K63j25j48J20o5J23q1J49L4j96J11q1O3r5J30Q0k14k9K7J6Q8k29
$$ plain form
5867 -2 -139 -158 142 -93 28 74 133 -117 133 -13 -185 50 192 -15 38 -190 -93 22 -93 191 108 77 62
5890 62 -148 33 -325 -45 69 -33 14 -229 -37 51 -62 1 68 -81 -46 -29 -41 -106 97 47 150 22 15 -90
5914 -90 -44 23 13 60 -52 47 33 -26 115 -185 -266 -69 -19 7 85 14 45 -80 162 100 -118 1 16 -352 -216
5939 -216 76 -135 -4 112 -11 -120 163 53 -199 -108 -22 -34 32 30 -157 56 -148 283 -7 -61 112 53 88
5962 88 -37 -118 -143 102 49 15 -138 206 -86 105 -27 -128 278 -73 -147 -80 -50 -85 135 98 -1 83 14 99 -103
5987 -103 26 -268 -21 171 189 117 132 -44 -73 23 -185 16 -4 -153 206 181 -110 -42 -227 -130 226 -147 12
6010 12 8 32 56 40 -137 185 120 -25 -12 -144 -49 -2 -136 47 -177 47 -254 149 171 -205 -18 99 -79 -15
6034 -15 135 -105 158 33 -115 5 -60 63 -18 131 165 -31 80 -1 62 -33 97 177 -37 -66 -39 -23 65 -164
6058a64J1J00J37j62j03Q3J37j75R3q5L72j3j28LK8J40l20j08oK53j75K0o3J38
6082A3j63R1R0l22K21J53r2J49k28O3j40M6J51j40j26K71J31j67O9M3k6j55J66
6105I8l46J00J19O6P6j52o0J50J7k25L37k96J87p0j58J52r3J31J81m4j4Mj30J31
6129A61j11J29j80j78L19j6j36L2j37m0J83m1L49j71j56k29L40l34J07M1mK14
6151A42j43Lq4J60j00q5OL13k72L4o2L23l28L42m77J95Ql6K5L6j23J12N0k2n0
6176c3k05M74k66j05J33M2O8O5O6k52lJ33k66K34j78m6J68O5oR8l39K66o3k2P8
6201A06j28L3j3j14r3P8j66K38j24oJ89n8p0J28J5Q1J22m62J93J81J52k05R6j84
6225a1j65J39j27J66K9k57K57q9O3k38L28l23M37l56K31j26m0p6K64j37J58k80
$$ plain form
6058 -164 -153 -53 84 -78 -181 -98 39 -136 -43 -128 244 231 103 106 134 274 -46 -154 -160 93 -82 -62 -125 13
6082 13 -150 -59 31 -291 -70 83 -9 140 -88 -25 -165 -119 32 -108 -234 37 168 1 70 113 87 -68 98
6105 98 -248 -148 -29 37 113 -39 -99 51 68 -157 180 -116 71 1 -157 -5 -98 33 214 170 156 160 30 161
6129 161 50 179 -1 -179 140 124 -12 20 -117 -157 26 -15 334 163 7 -222 118 -216 -109 -68 -72 142
6151 142 -1 2 -82 78 -22 -107 -101 212 -60 -26 -88 235 -93 249 -228 -33 -25 -61 -36 0 -123 -11 39 17 -33
6176 -33 -238 236 -30 -135 -2 40 108 173 239 -13 -16 117 -149 85 -93 -139 29 94 88 186 -153 113 50 28 106
6201 106 -22 11 -2 -116 -209 -131 -297 -59 -183 -189 0 -58 -128 0 15 96 218 -244 -51 130 282 77 173 -11
6225 -11 -176 -37 -164 2 31 -226 31 -58 5 -233 95 -228 209 -147 84 -42 -82 -158 106 -31 127 -153
6247a53O6M8pQj17J93P3Q1o2j93K26k02J42j41j63J41J36q0K74m58j2J72K4o2
6271f6J7K72l88J47r4Q4O3j86J83q3J42j11M5p2k2J01j27p2J07O1l7l1j79K93
6295D7O7k03K52l9l38K64k70J34J70j57Q9Q8k77K99k12k0L12m43K95k71K44Kj05
6318g2k03J22R8P9N6k05M2J67j92J92K1J14k59kk22K16L44k45j07n4K05O0k6M7
6342A76j70R8k96J03J1J33j9k01J63J60k14K62k95K04j42l7J07J79l02R7J2p4
6364d5J38j30J10K2L2j85j0K09J6J34k24k18J39k1r2R7J10J19o4j94K61j24k13
6387a33J51r6PJ49k01K8J77j66K6pJ00J26j76R9l3J70j7l13l1L61l18N3j05L14
6411A65n2j64J88n0Q3j49l8j11J33j61K20Qk62J50J42Q9j21nj04J22j80R7o5R0
$$ plain form
6247 -153 -87 -39 -46 -38 -155 38 111 192 130 -63 163 -39 103 -38 -201 -60 76 -4 270 -188 -200 -28 -4 -66
6271 -66 -49 223 -165 -18 -112 -28 35 -151 32 -51 91 -20 25 -47 -69 32 -95 -167 -60 1 -36 -67 -246 47
6295 47 114 -89 163 124 -214 50 -220 -86 84 -73 16 104 -173 126 -86 -106 206 -237 58 -213 31 33 -72
6318 -72 -275 -153 -55 24 80 -125 -83 84 -108 84 105 219 -40 -42 -264 -48 296 51 -56 -110 95 155 129 176
6342 176 6 104 -192 -89 -78 55 36 -165 -2 158 -56 206 -89 115 -27 -64 43 222 -80 17 29 -45
6364 -45 93 -37 73 95 127 -58 -68 141 157 291 67 -151 -12 -33 -125 -28 82 201 137 -57 204 80 -133
6387 -133 18 -78 -71 78 -123 -95 82 -84 -58 -65 35 161 -15 84 51 221 204 -109 -140 221 -97 -44 -149 165
6411 165 113 -51 137 87 170 21 -17 -128 5 -156 64 72 -190 -40 102 191 70 65 -39 83 -97 0 -65 25
6435B5j27q1R1n5L7K74pm0m9p7J27j09O9k6L92o09K3M3P4J88q0M3k21J78k00K41
6461A24n7n8k79J51J77j3m1o5M1n4J73k04K7L29j70k36K22j91Q4J48nj99J52P
6485F3m2j79M01j35J36l10K58k26k6N8RP3j38J07J17k05%j0O4j48J51j43R7J26
6509I8p0j86m2K29R3N0k49J60l08L2J41J45k59Q2J25j21J56p2J87l25K50J0j30
6532dJJ06M7k02J94j71R7k10L43Ll23K55j86o8K62j62j34J44n4N1n9j9R9j63K8
6557a25J59NJ27j83Lj29K07k13k11K74q3K56k7o0m4Po0o8L06k29K84j30R0m9k12
6582a05M4j02M4J24k8J56r2K42k87O7k85K13J1Lj50R8J57Q9n20K79J68j40L34
6605C20j55M7k52L0K48J5j57J2k01J69j69k4j36M56m56M6J6j56K25K82j79m1J76
$$ plain form
6435 25 -102 -183 -92 -147 -110 164 157 117 68 -9 118 9 78 52 444 -165 -142 -99 -25 163 83 126 -95 83 -117 124
6461 124 67 9 -270 -119 58 45 4 -61 -20 -74 99 -105 -78 251 81 -155 67 -124 -40 108 103 -96 56 63
6485 63 21 -158 243 108 244 -66 192 -34 -60 -2 7 80 -58 49 166 -39 -39 -49 15 -133 18 -125 -28 98
6509 98 28 -158 -200 29 122 172 -77 83 -225 -193 -52 93 -166 -84 41 -80 76 4 191 -134 116 126 -4
6532 -4 -3 103 150 -52 142 -29 68 -142 201 204 -119 136 -50 -118 144 -18 -152 -8 -62 -11 -70 -89 10 -153 -125
6557 -125 34 39 166 -17 -14 -143 64 -149 -360 -86 -169 87 60 0 -44 -37 -97 -165 141 -88 196 66 156 107 -105
6582 -105 -61 -163 -119 5 -23 133 41 283 -4 63 -222 -9 2 5 -145 -47 110 199 -321 -42 126 -14 320
6605 320 165 212 -40 -10 238 253 96 108 -93 76 -93 -117 -253 203 -253 -207 -191 -347 -122 160 -19 -60 116
6628A16P4k56J95J7l13K09n8J9j21K30k47L11k52P7n3Lj33J19K7K32j73j60K67
6651A30j30J28j56N9k01J98q4L3Q2Q1k02J84r2O8p2J31J5k44J84j24k12J19J11
6674FN4o2J02k37J03r7K42j17J6o3l6J99m1Kj58K40j33m4p2J9K61j80lrjJ35k39
6701a13J70k10L03q4J8k47m6L33K51m13j8J94k77J78K91n42K65L1j08pj6J18j25
6724e4j43L01J57j32L3j76J8L6j73p1J73j45L26J47k88k24Q4O9rk37K33k8R7q9
6748i5j5J40j9j06K5J19L0j11k85J21L07j71J66k75Q4o0Q8J65l18K99k36J62k24
6771b09L81q5K1q2J40m9j46j5j43K32L6j27o1K16l78M54lm13N4P3L6J69r5K6n2
6796b0j70Q5Q1K8q2J47j12J0J43k62N3J99k05M07l70j34R3J59j93K35j05l3kj39
$$ plain form
6628 116 190 -66 129 146 -167 42 -16 3 -118 112 -135 176 -76 1 -52 -49 -182 -63 -36 196 23 -137 130
6651 130 0 128 -28 31 -170 28 -56 -23 59 140 -62 122 30 98 26 157 172 -72 112 -12 -224 -105 6
6674 6 60 -2 100 -137 -34 -131 111 -6 10 -53 -89 110 69 71 -87 153 20 -24 -96 -77 184 4 1 -8 -9 126 -113
6701 -113 57 -153 150 66 84 -163 -209 124 375 -38 -56 138 -139 39 330 -212 53 84 -24 -31 -47 71 -54
6724 -54 -197 104 261 129 162 -14 4 40 -133 -204 -31 -176 150 297 9 -215 -131 -62 -71 -308 -75 -103 -6 -95
6748 -95 -110 30 11 -95 -70 49 79 -32 -317 -196 111 -60 106 -169 -85 -145 -57 108 -210 89 -147 15 -209
6771 -209 172 87 108 26 166 117 -29 -44 -187 45 81 -46 -107 109 -269 185 182 -231 -177 -104 -68 101 6 32 -20
6796 -20 -190 -105 -24 4 -78 69 -43 -33 110 -152 -99 100 -105 302 -68 -202 -109 50 -143 92 -13 -46 -48 -187
6820a87J49LK70l60J45k00J50P9j17Q6j51K18l5R3mj61J27k89J97j55J68j5j7
6843fj11K51j10J57m80L60P8j96j93L44J1k32J57k92K53q7Q2L4J66j00p4j26J64
6866E0j05J91k17p4M42k04P3k17r4K26j54O2l7q0J09J09k2j80J21J4Rl0o9l2J62
6891E3k7O6k16J59J79j46J43k04J55m6Ol93K31J3J70j24Rj6j62Q9J06j57K43q1
6915E0K4j40O9j07N04m90j8J29J29j25J42J99m28J71K0k19j74K68J48k91J31k1
6937b9L0n6n4K98m72J04J99q5K41m6K24k64j51j3K64j72j89K77j33J49k29R1l3
6960d9N3N3N9k15M0k1J43K3q8P1p8p9J06M1Oj50J85k13OQ5k8k43N8N3J15K34j11
6987E6J49j35k7m6j57J70q3j28J20J60k56k5k2O2K95n6n5l08L56k92J93o2J31
$$ plain form
6820 -187 -38 -35 235 -125 20 -180 -30 49 -68 18 -133 85 50 143 139 -22 105 -184 13 -142 26 11 -6
6843 -6 -117 134 24 181 -299 61 139 -57 -250 94 105 -127 30 -262 -9 -96 -14 20 186 86 12 -114 50
6866 50 -55 136 -81 -155 287 83 156 -61 -155 71 -83 -21 -58 -138 -29 80 58 -122 -1 13 22 -8 -77 -109 53
6891 53 26 92 -124 35 214 68 211 7 162 116 122 -271 -40 -27 143 19 28 12 -150 -61 45 -112 131 50
6915 50 74 -66 3 -104 400 -90 -108 21 150 25 167 366 -62 109 129 -90 -264 4 152 -139 -8 -29
6937 -29 1 -55 -109 189 -283 -179 20 -65 176 130 354 90 -61 -74 190 18 -171 106 -27 122 -107 -16 -49
6960 -49 4 57 116 -99 -59 -80 63 86 -2 69 -9 -88 18 59 65 -85 100 -113 -107 -22 -50 -293 -235 -182 -67 167 56
6987 56 205 70 43 -3 -160 10 -73 -201 -81 79 -177 -202 -224 -162 133 77 22 -286 70 -222 -29 -91 40
7010D0j87K21j11q7O6J37J47m14J88j19L28l20j3O8K24l15L3o6J65k02K52j05
7032g0K0J16j08j38L51k22k8J39k43J85j51O4J60q0J6lj54J28Q8o8r1J22R3L3
7056A59k13P0o2K31k00R4q6J48r4JJ42q8K6r2M0l46L00n6J42m7j04K4lp7J89j76
7082g8m5J38K2p0K07j03%L7k46Q3Pp2K69O8k29j35K11l01L65l25J00J41J71l9
7106A76j22J44l06P2RO7J66l7j57k72J62Q9n4J92k78J88r8K2k04K88j05M6J17
7129A05%p9J44k88J18j39J79j30K7KK67m09J95J34Rj42q3k6K46j91L7J70k28L00
7153B18j40j0k13J31Q9j06j24L61m22j5K28J41k3k15J93j50L08m09J07Q8J96m17
7175a84J95O8r2j2J21j10j34j08J85N7n4n0j64N03j21j76l6K47k42k3K14J08j08
$$ plain form
7010 40 -147 74 -37 -124 -58 79 226 -188 0 -119 209 -111 -124 -56 168 -147 -114 -180 -15 -217 35 -70
7032 -70 -50 66 -42 -180 171 -51 -79 60 -183 2 -149 -85 75 -5 11 8 -146 -18 70 2 -89 33 126 159
7056 159 -54 16 -46 185 -15 79 -7 141 47 48 190 102 128 36 76 -270 30 -26 116 69 -35 -11 -14 -91 98 -78
7082 -78 -123 15 37 -33 174 71 71 108 -138 -55 -48 -120 149 217 -12 -147 64 -237 128 -197 -97 44 215 176
7106 176 54 198 -108 -36 -27 40 206 169 12 -260 -98 -9 -63 129 -149 39 -59 -37 -241 47 -58 -12 105
7129 105 105 26 170 -118 0 -139 40 -90 -63 -61 206 -203 -8 126 135 -7 -90 -116 130 -61 -24 146 -82 218
7153 218 78 68 -145 -14 75 -31 -155 206 -216 -231 -3 138 115 -100 93 -57 251 -158 -51 37 233 -184
7175 -184 11 79 -13 -25 96 -14 -148 -256 -71 -14 -68 -118 -282 221 100 -76 -112 135 -107 -130 84 192 84
7198H4K2p9J67j78k61L24j50K3J37l1o9k10K71l43M30l2k16K35j05j53n3L51J05
7221B69j78j01l3J35o2l0l3j37J14R0R2k91K14K17k90R3K9qk17NK66j61j40J11
7245d6P0K1j40K0J87m9Q9j06j16K06l22K43R3j38N3o5J27l5m3k23J93M0K0m8m6
7270a5Q3j12R2Jn4P4j55J48k73n8N35l65q3o7L63J95m00J19l7J57o8j22k1K3J05
7295F5j36j14J39J86k46K3R7k6j8J39j49K84m98L57jp8J2o6n9K68k92Q8j00K15
7319I0N9j70L8j23L43l13J03j02Q5p1Mk4P6J25k16M1J37j76L31l63R2J08j80n4
7343a60K34o9L53l57L25l02k0qk93K36j16J57J62K5k80L75j56o9k81L44R3k56
7365f3j27K51j88q6K3J53r2oq0K39j36J33j41J42l21J34L24Ok87O6M4J17j19q
$$ plain form
7198 84 106 27 194 16 -245 79 -71 -48 89 58 -11 -221 50 -293 137 105 -111 124 19 -134 -187 164 269
7221 269 91 -10 -43 92 30 0 -33 -170 -56 34 126 -165 49 266 -24 69 98 90 -127 -122 144 -17 -157 -46
7245 -46 24 45 -95 -75 112 63 152 46 -70 136 -186 57 150 12 65 0 127 92 49 -174 19 59 79 31 -15
7270 -15 68 -44 48 49 -5 69 -86 62 -211 -269 266 -99 -182 -249 114 309 -91 28 -9 148 80 -42 -63 -40 65
7295 65 -71 -185 -46 140 -106 -83 14 -12 -30 109 -40 244 -254 103 102 24 36 -30 -89 179 -113 -25 -125 90
7319 90 149 -21 17 -106 237 -76 27 -75 10 -61 -57 -81 -5 120 -96 -55 82 -94 237 -126 -34 74 -106 -160
7343 -160 74 5 358 1 326 24 4 -4 -297 -61 -177 -20 142 167 -113 262 106 37 -244 100 193 -63
7365 -63 -190 61 -127 -213 -190 -37 -129 -135 -215 24 -112 21 -120 22 -299 -165 159 165 -122 -56 -12 105 -14 -22
7389b2k60L32j26J55j59L94k17j64J22q4M0j12J07L33l52K21j86k6m5j0K8J19
7411H8j49J88k54R3J27j52P3Q1P5k18o6N3Q9q1j92M46j18j08J64j30J09J26m48
7434b04K64q9n1K52j82p2K41k05l68L92J26k56P6L9M7L2J3m3J3oN6j00Kj95M36
7459B18k42rJ59q5Jl42K58j35L79j94j29J54K5J5J28k48Lk6N0q1Q5j24K27j45
7483e8J08j99K72k7k10Q8j71L41p3j21j49M11k06p0J94Nj82QJ73l46P27o98l56
7506e39Q86q11R9K32J12R9j65M1M8K53p5j81K64L1m14K62m4j1M8j25PJ6J09k3
7530A19K1j00n7P3j5j11J01j27J14j85L25k3N4m0k54m9n6M54m06L14k67l5J98
7553D8j43j3J72J7j92K94j07j67O9j30K86j35M1q8k8L7L9R6J9l00J35K55k51N0
$$ plain form
7389 -22 -282 50 -76 79 -80 314 97 -67 55 -29 11 -101 6 339 -13 208 22 -4 -49 -59 -31 88
7411 88 -61 127 -127 -34 93 -59 14 95 170 -48 -114 -61 28 -53 -245 201 83 -25 139 9 118 244 -204
7434 -204 60 -29 -80 172 -10 -82 159 -46 -414 -22 104 -152 -76 -37 10 42 55 12 25 19 75 -25 -23 -218 218
7459 218 -24 -33 126 41 42 -300 -42 -177 202 8 -121 33 58 73 201 -47 -44 -70 -20 -101 -16 -140 87 -58
7483 -58 50 -149 123 96 -114 -26 -197 144 71 -50 -199 212 6 -64 130 135 -47 -39 134 -212 515 -183 -539
7506 -539 347 -464 -365 -133 -21 78 -87 -46 2 255 180 -1 263 294 -120 142 98 87 135 10 17 33 142 119
7530 119 140 40 -17 56 41 -70 31 -96 18 -167 158 135 189 149 -105 -154 -210 244 -162 152 -115 -150 48
7553 48 -95 -108 64 81 -111 183 76 -91 -22 -152 134 -1 40 -48 -76 -39 0 96 115 -185 -50 205 -46 4
7577Dj47k89L38O3k52K95j18P7q4K41J1m0j32K8m9J94l62K76K2k23K17o3k94K22
7601f5o6Q5J61M7j07k16j4K23n0j74J24o4O4R7k7J34n8j10J50j60J08o2O9j24
7625c5K12k63J40j6o4J07j42J99j32p9J43k39J91L5j47J87l4l0J40m77J80K22
7647I8R5o0j12nj3J19j98M7L34n32K41J92k24J45j00J9k50J50L10j65M2l42L23
7670A14j19O5j82J60j18M6J51j08m3p1L37j27j39J43op5rm2n1jJ82k50L27j86
7694bpj90K89k44J62j16J47k44o0K17j21J9K66k04j41K89L2N4l60L74j24j1n5
7717c0l1R6k02K88k1L8k03l2J60o8K33k10k3r5P2M6k1k08N6J65k56K95j04q2R7
7742d0J01q7K46q8k31J25l3k2L9Q4n6J30k79L8K67k16K26k45J05J8Q0j04J08k86
$$ plain form
7577 4 -143 -432 -94 -31 -283 12 -106 -29 -113 128 139 99 -33 -5 -54 140 -222 54 76 -147 70 7 -287 -65
7601 -65 -131 -46 115 162 55 -161 -175 48 -2 -176 -52 -116 -52 45 18 152 94 -16 134 -26 82 20 89 -35
7625 -35 177 -86 54 38 -26 81 -61 138 6 -73 70 -169 22 57 -90 97 63 33 173 -304 -124 98
7647 98 193 133 21 16 3 122 -76 -29 305 -227 14 206 -18 127 27 46 -204 -54 256 91 133 -209 114
7670 114 -5 60 -122 38 -80 -34 117 9 -34 -105 232 105 -34 109 103 28 19 -23 -74 -75 107 -143 184 -2
7694 -2 -9 -199 90 -154 8 -108 39 -205 -265 -48 -169 -150 116 -88 -229 60 92 146 -214 160 36 25 -30
7717 -30 -61 35 -167 121 100 138 -65 -97 63 -5 228 18 -5 -100 -28 18 -3 -211 -155 10 -246 49 -55 -137 -40
7742 -40 61 -26 220 132 -99 26 -7 -29 10 94 38 168 -111 -73 194 -22 204 -41 64 82 162 58 166 -120
7766a20m4J77J9M0K1n8l3J18J7k9p1j03m5K61mj63r0K68j63q5q7Q6R0k88N03j95
7792B2N8r4J82j07q4m5j36L37q9j28J90j5j09N4j44M1l6J96o5j06J61j50j7J12
7816B8o0nR0k08K1q3M14l73P9o9J34Ll9J29L4k30J09q5l5J04L0J16p4j32k1K09
7842H6j35J6O0K80m95J54n4J22p6L7m7J68r8j95K9j4J95N4q6m3L03l23L22r7l8
7867A25j60O6j29q9l9NL33j01l14L79j28k2o0J16P4n0J87k32J35m4j74L85j72
7890I1l20K61j22K05p0j39J6K7J1jk67N25k29J77r0Q9j25M74K43J71j23q07M6
7913D3O1J36n00O27o07N50o3J23l52n9K97l07L32nJ9j91n9n85K65O43o48L6L63
7936A19l6K37p89J09J18j4j25P13j66P0j2j80P23j085M90N30o61j28l25K96J83
$$ plain form
7766 -120 -164 13 32 72 93 35 2 120 137 108 37 -66 -111 150 146 -17 -107 161 -2 -87 -174 -88 2 -286 217 22
7792 22 80 -14 168 61 -23 -68 -204 133 44 -84 106 91 -18 36 -108 -67 -103 93 28 -78 83 -67 -84 28
7816 28 -32 -37 53 -155 -134 -217 197 -176 -97 -166 -32 -29 -68 61 95 -135 -26 -111 -146 -42 -12 104 30 -102 -123 86
7842 86 -49 -33 27 307 -188 -34 -88 34 -42 -5 -52 116 18 -177 -148 -162 33 87 1 -42 261 -62 260 163 125
7867 125 -35 31 -98 -187 -226 -221 112 11 -303 76 -52 -74 -134 -18 56 6 193 -39 96 52 -122 263 91
7890 91 -229 32 -90 115 45 -94 -78 -51 -40 -41 -308 217 -12 165 75 164 39 513 756 927 804 -3 43
7913 43 104 240 -260 367 -240 310 247 370 18 -41 256 -51 281 276 295 104 45 -540 -275 368 -280 -244 119
7936 119 83 320 -469 -360 -242 -256 -381 332 166 236 224 44 767 -318 172 702 41 -87 -412 -116 67
7957F7J17n25L50k57L80j8j40j19P4rK02j04J92j31p3J13j59n9J05J28j74p7J99
7980H2j34K31j79j37P3K09j76K09k24J56l30L68j65o6J11K99m17k4K22k05m5J45
8002CK01l55K33Q3m07L11j53QJ07j90P0K15l75L20k73J70MO6M0j74o5N6M15l46
8026c6j96K93j07J7L17l30p6J53j79J88p3Mq0J11j38m5K00p8N3j91L57k88O7K80
8050B23q8j10R0k27K69l18J29o9r4K23O6o4Q8j41j45K69j67N6o9J8P2m6K45j70
8074D0j06q2j22J65Q3j73K87k22J56j12J25N2r4o0o4K6K62L8k57QQ0J14m05K11
8098e0J83m1m67K21j53J76o0L19p9j0j07K56j56R6k67K75k9J1J9o1k33J17J8J3
8122ip3J03Q0j30J54r0M7j51K05j16k43L65k55J56j09P5K53j72l9j6np1L6j54
$$ plain form
7957 67 184 -341 9 -248 132 114 -26 -145 -71 -80 122 18 210 79 6 119 -40 -99 6 134 -40 -117 82
7980 82 -52 179 0 -137 -64 145 -31 178 -46 110 -220 148 -17 -83 28 327 -90 -114 108 -97 -142 3
8002 3 204 -151 82 165 -242 69 -84 -76 31 -159 -89 126 -249 71 -202 -32 -28 38 78 -96 -161 -105 310 -36
8026 -36 -232 61 -46 -29 288 -42 -118 35 -144 44 -29 -25 -105 6 -132 -177 23 -55 -2 -193 164 -124 -57 223
8050 223 135 25 115 -112 157 -161 -32 -101 -195 28 94 30 118 -23 -168 101 -66 -10 -79 -61 11 -35 210 40
8074 40 -66 -148 -270 -105 -22 -195 92 -130 26 -86 39 91 -3 -63 -127 -101 161 199 -58 -50 30 144 -261 -50
8098 -50 133 92 -375 -154 -307 -131 -191 128 49 39 -68 188 32 128 -139 136 107 118 137 76 -157 -40 -22 -9
8122 -9 -82 21 101 -29 125 35 82 -69 136 20 -223 142 -113 43 -66 9 262 90 51 35 30 -41 -5 -159
8146a59Q7J30J10m2m4j10O7J24N6Q4l20j64K57j03RM0L1j52Q4m7K04k20Lo9J5
8171a29p3K07J19j1P4j17k77K71J01k37Q0j04J09J26lk07o4L35q2k01
$$ plain form
8146 -159 -72 58 168 126 82 -28 39 163 219 303 -17 -181 76 -27 -18 22 53 -99 -15 -62 142 -78 -75 -144 -129
8171 -129 -202 5 124 113 187 70 -207 64 165 -72 8 -96 13 139 136 -71 -135 200 118 -83
8191h3
$$ Imaginary data points
##PAGE= N=2
##DATA TABLE= (X++(I..I)), XYDATA
0@%%%%%%%%%%%Qj6J6j6K4l2M0m8N6p2Q8j04J20j36J60j86K10k43K83l24L68m20
33b24M76n36O05o80P62q54R51j057J175j304J446j600J768j951K151k370K611
50A369k876L167l491L850m252M706n219N808o490P293q252R419j0878J2763j5304
65h387J8924k4527L4404n6728J93627j5781l63438L13224P5843k40563M9722J39128
77A15448j18218j2165K5104L8297p963q4492M5355R5496j36811l9518J72401m8805
89D4129j32923O2342N6674j6120n7197j7168P2336L889j03764Q2511N5876j26294
101g5709K9540R0208q0434k7377P5324k4418k3456N81J5005N5157n5933m9585
113g1097R0901J6330q7422M5784L2089l9817J5764q917J1757K8455n7876N35Q8182
$$ plain form
0 0 0 0 0 0 0 0 0 0 0 0 0 8 -8 8 -8 16 -16 24 -24 32 -40 48 -56 64 -72 88 -98 112 -131 152 -172 196 -224
33 -224 252 -284 321 -359 403 -451 500 -557 618 -686 760 -840 928 -1023 1128 -1242 1369
50 1369 -1507 1660 -1831 2019 -2233 2473 -2746 3062 -3428 3865 -4387 5032 -5846 6917 -8387
65 -8387 10537 -13990 20414 -36314 157313 141532 -221906 91318 167161 -73402 -23680 115448
77 115448 -2770 -14935 10169 48466 40503 -43989 1366 96862 -39949 -79467 92934 44129
89 44129 -88794 -26452 30222 14102 -43095 -60263 12073 15962 -87802 -5291 50585 -75709
101 -75709 -46169 44039 -36395 -63772 11552 -12866 -36322 -35741 -20736 34421 -21512 -71097
113 -71097 19804 36134 -51288 -5504 26585 -13232 2532 -6385 5372 33827 -24049 -23514 64668
126F4668p9622k1698J28015q9140p1448J47747k4113j25502J04869J8385r6854
137d4693O9612J5670p3961M6373L4089p5498J7568M7626k5605k3829p23L2695
149A9324j983l5345J3394K1470m5763K0203M5769o6138k904O4030k3845m2159
161c3947L4286Q445j0015n839k1100L5610J0788l9791O144K8945k5515N516K3440
174A6967l3196K380K4680p59j6826l337J1692J3546k4186j3267M1655j6440j9121
187a6212K4787q883j1864L6949k1775l7543N6138m789m4543L3725J4280m4996
199b4726K2736K8673m4138N932K9468j3757k0021J8785J3658j5490j1442J2121
211A799J3195k2185O403R088j4344O204J3271j7811L31K4273k5963K82K4037j7018
$$ plain form
126 64668 -14954 -36652 91363 2223 -69225 78522 54409 -71093 33776 52161 -44693
137 -44693 24919 40589 -33372 13001 47090 -28408 -10840 36786 11181 -12648 -13371 19324
149 19324 17341 -18004 -4610 16860 -28903 -8700 37069 -29069 -31973 32057 8212 -33947
161 -33947 339 8784 -1231 -7070 -28170 7440 18228 -21563 -15419 13526 -11989 -6473 16967
174 16967 -16229 -13849 10831 10072 -6754 -10091 1601 15147 -9039 -22306 19349 2909 -16212
187 -16212 8575 -308 -12172 24777 3002 -34541 21597 16808 -27735 5990 20270 -24726
199 -24726 -1990 26683 -17455 -11523 17945 4188 -15833 2952 16610 1120 -10322 1799
211 1799 14994 -7191 -788 8300 -6044 160 13431 -4380 -4049 20224 -5739 -5457 18580 1562
225A562j0581K2979q720j9106K6469k814j7169K192J2374J37j0814q42R012M356
239I035j8534R625O546j0025r57K617p95r46K488n632Q918j0502j463K1240j2969
254a354j8954K2537J1116l2616J2640J5932j8839j442J4293n692q147J3157l795
267a164l277P14Q021p15r824O172K989m053j889Q509j2050L662J2877j3736O26
282c138J3821o273j2222J8876m775j1011J0843r66p643L028P704r659J941J177
296A703J919k37l433N937l373j155P81L372p788K695J720p665O954k52l328P98
312a352N845q760M440M977j0512L524L162l326l621Q065n126k555M142j228J563
327g62k985L967j434P65j038K686k264l016N079n293K664J955j181k868P039j463
$$ plain form
225 1562 -9019 13960 5240 -13866 12603 9789 -7380 -5188 7186 7323 -3491 -4333 4679 9035
239 9035 -9499 126 6672 -3353 -4310 -1693 -2488 -3434 -946 -6578 2340 -8162 -9625 11615 -1354
254 -1354 -20308 2229 13345 -19271 -6631 9301 -9538 -10980 3313 -2379 -10526 2631 -1164
267 -1164 -4441 -3727 4294 3579 -6245 -73 2916 -1137 -3026 5483 -6567 -2905 9972 -3764 -3138
282 -3138 10683 4410 -7812 11064 6289 -4722 6121 5155 -2488 540 8244 -1415 526 1703
296 1703 3622 3385 -48 5889 2516 1361 2142 5514 -2274 421 2141 -5524 1430 1178 -2150 -1352
312 -1352 4493 -4267 173 5150 -5362 -1838 1324 -2002 -5623 2442 -2684 -5239 -1097 -2325 -762
327 -762 -3747 220 -1214 -449 -1487 1199 -1065 -4081 998 -4295 -1631 324 -857 -3725 3314 1851
343A851o143R242l847l935K180O014p267N86N400m123k60o01M800m730N37K198
359A902J215j466n10K409n206L921l125m15K643K33m294K914O974j0632K217N914
375D694l462p207Q467K797j0396L363M509J24r099N204N268o112l136P081M082
390F177j0621M322L225k687m258L566J514l671J253r8N937n503k575N508K699
405D788r441m58J3296q860o362P959N677j2993J661R952q768j400O879J019r049
420f100P657J004o707K736P24j907l00L237n400N708K955p119J044M830l44n867
436c849M701j523K795n55l177K724J575j256k850N101l725K978J864l857Q82J566
452C394J192l048P72n704R101L472j4263J987J5707p414j6323J7237J592j4942
$$ plain form
343 1851 -4292 4950 1103 -2832 -652 5362 -1905 -1319 4081 -42 -302 -903 3897 -833 -296 1902
359 1902 3117 1651 1141 3550 -1656 2265 -860 -1275 1368 1601 -2693 221 7195 -3437 -1220 4694
375 4694 1232 -5975 2492 5289 -5107 -1744 2765 2889 -6210 -1006 4262 -1850 -4986 2095 6177
390 6177 -4444 -122 3103 416 -3842 -276 1238 -2433 -1180 -1278 4659 -844 -3419 2089 4788
405 4788 -4653 -5111 8185 -675 -7037 922 6599 -6394 -4733 5219 -3549 -4949 1930 2949 -6100
420 -6100 1557 2561 -4146 -1410 -686 -2593 -2893 344 -5056 652 3607 -3512 -2468 2362 2018 -3849
436 -3849 852 -671 2124 1569 -1608 1116 2691 1435 -1415 3686 -39 2939 4803 946 1828 3394
452 3394 4586 1538 2310 -3394 5707 9179 -5084 -3097 12610 5196 -11127 6110 7702 -7240
466g240O221R043j3261m94J5188j1452n449O157K924k665l160m170P741Q881k0729
481a2465J318J9387q555j7035J8193N925k0394J0235J1229j2716p225J7830r86
494D741j4962L920J2628m33j5398O843J2916o163j2169J1231Q277j4800K542R178
508H351m455p306J1026j227r062N760L465j418m930J201L239N103j1869m498J8228
523A1608n580j7564J0593J3413j9763K788J3240j4429k21J4199j0314j1219J7424
536D175k565q531M009j558J068P058q206r248J8736n74j3488N083O758l744q62
551a889K730p084N322M927k975o553K924R475k693p623j15J1231l580m900R00
566I7P68L273J94l570o045J0057K699q594l274Q075J916p792L719j877j553N398
$$ plain form
466 -7240 -1019 8024 -5237 -5731 9457 -1995 -7444 -1287 1637 -1028 -4188 -8358 -617 8264 -12465
481 -12465 -11147 8240 -315 -17350 843 6768 -13626 -3391 7838 -4878 -12103 5727 4741
494 4741 -10221 -6301 6327 5894 -9504 -2661 10255 4092 -8077 3154 11431 -3369 -827 8351
508 8351 3896 -3410 7616 6389 -2673 3087 6552 5134 204 1405 4644 9747 -2122 -6620 11608
523 11608 6028 -11536 -943 12470 -7293 -4505 8735 -5694 -5915 8284 -2030 -13249 4175
536 4175 1610 -6921 -2912 -4470 -3402 3656 -4550 -13798 4938 4364 -9124 -4041 2717 -1027 -1889
551 -1889 841 -6243 -921 4006 1031 -5522 -2598 6877 4184 -3439 -3554 7677 4097 -803 97
566 97 865 4138 4332 762 -5283 4774 7473 -1121 -4395 3680 5596 -2196 1523 -354 -1907 3491
582C491Q14j2696N098J2630j2709l336Q166j56m462N462o254j185J1865q700n461
597g433Q662J183p899P074j576n570R847j818q056L908R202q268l060N124K432
612C752j998m711M929O5r42N46L31m267N124M271j0971K345O741k137o059L619
628F38n06Q65L417p817P8O053K127r171k38N990N53l683k442L536j503L834j963
645b32o602L185R337o225r457J0846R78l547O00j594j271P749p06j1220P096N349
661D286l375l408K175K14K298J161o304K007M289J745n847j557N734J406m033
676G91k003M203k299L705k278n564N288M776p241l096R429m972j664L657k500
691B32k626N179n6q070M843L378k613m749M188K459m030J8J048O83k622L406l852
$$ plain form
582 3491 4305 -8391 -3293 9337 -3372 -6708 1458 1302 -3160 2302 -3952 -5137 6728 -1972 -7433
597 -7433 1229 2412 -5487 1587 11 -5559 4288 2470 -5586 -1678 7524 -744 -3804 1320 3752
612 3752 1754 -2957 1972 2037 1095 1641 1972 -2295 2829 7100 -3871 -1526 5215 3078 -2981 638
628 638 132 997 4414 -3403 -3325 2728 4855 -4316 -4554 1436 1989 -1694 -4136 -600 -2103 1731 -232
645 -232 -6834 -3649 5688 -537 -9994 852 1830 -1717 -1117 -2711 -3982 3767 3061 -8159 -1063 4286
661 4286 911 -2497 -322 -108 2190 3351 -2953 -946 3343 5088 -759 -2316 3418 4824 791
676 791 -1212 2991 692 4397 2119 -3445 1843 6619 -622 -3718 5711 739 -925 2732 232
691 232 -2394 2785 2729 -5341 -498 2880 267 -4482 -294 2165 -1865 -1847 -799 -116 -2738 668 -3184
708c184n23N064k089l765K850L290n465L509m15k770M092J178n118k00P860n077
724g63k867K634K750j730j157J628j357K632J17r28l309M475J514m990Q87J710
740A246M77j206K228m906K614N231n549k590N057K221o624K741P13k015J511O61
756A810k609j533O100k496l030R39L287j820j811K280k395J383Q37j676k934M951
772A283O94n561L061J435j563j099L449l417o02L963k367j974J408L147m559J295
788a407J427r58M8R35j26k220M036k118j670J566J635k981j85M259l503J13K035
805H86J62k970L156R50m046K461Q04j078j794L517j850o93K286j704K21O81J584
822B573m223L137J209k912N6K239o24l748M937j294k341J395K670k894j526M499
$$ plain form
708 -3184 -3707 1357 -732 -4497 -1647 1643 -3822 -313 -728 -3498 594 1772 -3346 -3546 4314 -763
724 -763 -3630 -996 1754 24 -1133 495 -862 1770 1887 959 -2350 2125 3639 -1351 -464 1246
740 1246 1723 517 2745 -2161 453 5684 135 -2455 2602 4823 -1801 940 1653 -362 1149 1810
756 1810 -799 -2332 3768 1272 -1758 -819 2468 648 -1163 1117 -1278 105 942 -734 -3668 1283
772 1283 1977 -3584 -523 912 -651 -1750 1699 -1718 -2320 1643 -724 -2698 -1290 1857 -2702 -1407
788 -1407 20 -938 -890 45 -81 -2301 1735 -383 -2053 -487 1148 -1833 -2018 2241 -1262 -1149 886
805 886 1048 -1922 1234 2184 -1862 599 1403 325 -1469 2048 198 -495 1791 87 308 989 2573
822 2573 -1650 1487 2696 -216 -160 2079 1455 -2293 2644 1350 -991 404 3074 180 -1346 3153
838C153k818o64M71J098k235J065O29k249J876n07l14r21K702k128p26K475j826
855i19o74J8K500l936R31K263j062j769J874K062m302K284Q96j289j447L209j001
872c62k371L861j839p64J577J298l587K811J953m454K279K088k296j701N001k695
888G99k226L983p71j665N94K656l172J028O55j320M82j62m3r06K393k481J87J133
906A164k39j228k01K469k764j72Q03J353k808K21K552k204q27Q22K635m364J711
923a077K502k436j367K269N09l660L934j499r34K444o74k417L018J525n746M337
939G28J708m714R66M916m548j698O427l828k229K851J515k836J211Q50j848K256
955A727j895p8M96Q21j533M31R34j679J500n56M94j749J640M14j290j018J285
$$ plain form
838 3153 335 -329 142 1240 -995 70 699 -1550 326 -181 -495 -1416 1286 -842 -1568 907 -919
855 -919 -1593 -1575 925 -3011 -2080 183 -879 -2648 -774 1288 -3014 -730 166 -1123 -2570 639 -362
872 -362 -2733 1128 -711 -1475 102 1400 -2187 624 2577 -1877 402 2490 194 -1507 3494 799
888 799 -1427 2556 1785 120 714 3370 198 1226 1881 561 1043 881 838 -68 2325 -156 31 1164
906 1164 925 -303 -504 1965 -799 -971 -168 1185 -1623 -1402 1150 -1054 -1881 -1059 1576 -2788 -1077
923 -1077 1425 -1011 -2378 -109 400 -3260 674 -825 -1759 685 11 -2406 612 2137 -3609 728
939 728 2436 -2278 -1312 3604 -944 -2642 3785 -43 -2272 579 2094 -742 469 1319 -529 1727
955 1727 -168 -246 250 1071 -462 -31 903 -776 724 168 662 -1087 553 967 -323 -1341 -56
972e6K049l565P02J541L80k913J495J919k799J546P81p70j814L681j646k521L294
989A304r49j084J151J235l694M049N16n197K838K866l567j899N392l627p85L019
1005A568j950r67K129J66l545L343o98n09J54m54k8R1J341l095J640M55M77k064
1023a946K27K550p30j448j49K572k294Q11K9j004R92J469o77l059L282R67j167
1040D25j205J175R19l98P16l032J939K088q77l655K911K145l477J551O8j050O46
1057H89K435l904j032M762j705k207M38K076j252P44j774j052K853p43j295o95
1073a462K325q02p63m26M40N72j126J038k477J088J771n75k739K056K417l343
1089b006P13O13K83m53Q60j386K77K489k729l02J035J726j897J80P27L51O05n59
$$ plain form
972 -56 1993 -1572 -870 671 1051 -1862 -367 1552 -1247 299 1080 310 -1504 2177 531 -1990 1304
989 1304 355 -729 422 1657 -2037 2012 2528 -2669 169 3035 -532 -2431 2961 -666 -1451 1568
1005 1568 -382 -1349 780 946 -2599 744 46 -463 -309 -763 -791 -700 641 -2454 -814 -359 118 -1946
1023 -1946 -1719 831 101 -1347 -1496 1076 -1218 -407 -378 -1382 -390 1079 402 -2657 625 1592 425
1040 425 -780 395 1314 916 1632 -1400 539 2627 1750 -1905 1006 3151 -326 1225 1293 243 889
1057 889 3324 -580 -1612 3150 1445 -762 -324 1752 500 1244 -530 -1582 1271 528 -767 -1462
1073 -1462 863 61 -702 -1128 -688 -116 -1242 -204 -2681 -1593 178 -397 -3136 -1080 1337 -2006
1089 -2006 -1293 -680 -397 -850 10 -1376 -1099 1390 -1339 -1641 -606 1120 -777 -597 130 481 1086 527
1107E27q4j494L536j114k542R90K846j224k371K470q39Q54k3j390o02K727L65
1124B632l548J639N85L93j582m51k55J399J322k760j32J345K365l385j534K003
1140C6J020j342j385J215j054L207j709k841J614K647j797k272K502r04J302l6
1156B03k064k93K465R2l545J727J725P70k171K83P67P2L23j259j5L57K714k997
1174h46n40K407qq25r4P74j335K610j520j489K004J051j833j610K848j265K19
1191E48m75O96K27j38O20j616J063J73J09k394J465J231j860K74R2K03k51J372
1209A339k721J022K530k104j234J172J088j900O38j177r6J459pq61j007K885m68
1226E58j005j232J717K6j165N32j160J618L02m33k248K378J299k460P57K29P12
$$ plain form
1107 527 443 -1051 2485 1371 -1171 -181 2665 1441 -930 1540 701 1555 1532 142 -460 2267 2632
1124 2632 -916 723 1308 1701 119 -332 -587 812 2134 -626 -758 587 2952 -433 -1967 36
1140 36 1056 -286 -1671 -456 -1510 1697 -12 -2853 -1239 1408 -389 -2661 -159 -1063 239 203
1156 203 -1861 -2154 311 403 -3142 -1415 310 1080 -1091 -808 -41 31 354 -905 -920 -563 2151 -846
1174 -846 -1386 1021 1013 188 94 868 -467 2143 623 -866 1138 2189 356 -1254 1594 329 548
1191 548 73 769 996 858 1478 -138 925 1098 1207 -1187 278 1509 -351 -77 15 218 -33 1339
1209 1339 -1382 -360 2170 66 -1168 4 1092 -808 -170 -1347 -1443 16 9 -852 -1859 1026 558
1226 558 -447 -1679 38 64 -1101 -569 -1729 -111 191 -242 -2490 -112 1187 -1273 -516 -287 425
1243D25j62N43k152Q61J779j891q21P68J882j274K83k18O50J89J8m52j523K391
1261A296k80j328j67J747p74p17J271j378J240O50n23j460J871n1j836O52k29
1278a6K70o28J058j061M18Q64r68j64J02J251j861K90N34j90o77M00K80j390J866
1297C78r04p63N66J206r94m06J650j363L04k41K30q15J140pj176J151K25N9j486
1316a246J692o13jK10j26j80M0J391j943M75M12L04q05L04R44j188J196l03l80
1335A83P9P82q82o60J721j209m6Q5O50j198J094L72j604J179%r5q57J451r48k82
1355a85P76p86K43j81Q68j373R22K33n22j19J69K19r58R83o10J25l45K69J49o22
1375g45Q39j44K0n87Q86p99j18Q07r36N33k31N04j164J252j72r77R57L41p04m98
$$ plain form
1243 425 263 806 -1346 -485 1294 -597 -1418 -650 1232 -42 241 23 673 862 880 428 -1095 1296
1261 1296 1016 -312 -479 1268 494 -223 1048 -330 910 1560 1037 -423 1448 1397 -439 213 -16
1278 -16 254 -374 684 -377 41 905 -63 -227 -125 1126 -735 -445 89 -101 -778 -378 -98 -1488 378
1297 378 -526 -1289 -723 483 -511 -917 733 -630 -326 -567 -337 -1152 -12 -19 -1195 -44 181 240 -1246
1316 -1246 446 -167 -168 42 -84 -264 -224 1167 -776 -301 111 415 -390 -86 858 -330 866 563 183
1335 183 262 1044 162 -498 1223 14 -32 53 703 -495 599 971 -633 546 546 451 -406 1045 97 -185
1355 -185 591 -195 48 -133 735 -638 284 517 -5 -124 45 264 -694 289 -321 -196 -541 -272 -123 -745
1375 -745 94 -50 -30 -617 269 -530 -648 159 -777 -244 -475 29 -1135 117 -55 -1032 -75 266 -438 -936
1395i36K034j881K15Q99k73j060Q24R16k324J756J56n21j42J124n21o18J347j135
1413a40L22K21K4o11O55K53j144J153o09O84o35P31j26q0J06l87J70q46R22o92
1433b9k7K63M35k22l19N69q69K87l0K02r15P83J30j250J277p74k68k28J153j243
1453a075K35J094q48K26J60K15j479J087p9j145Q15M36o8m76J458j520N69L53
1471d2k21r0J38P80j188O48m11N16k93L34q5k61J172n64M13m51N52n32o35P17
1491D97j36j04l6O08o55O90K29q12J92J22K13j157J252l37k77j30M9o36K9J464
1511A065j748P60M93k99n80M73M1q27O64p89j27J10R11p03l61J141n44m7o08J019
1531D4q19P97l29n76Q09l66K60j281J340m31O42m99J79K68m18R07j175L26M97
$$ plain form
1395 -936 1098 -783 -568 331 58 -1002 -178 738 -1586 170 326 -195 -337 787 266 -352 995 -140
1413 -140 182 403 427 -184 471 724 -420 733 124 808 173 904 778 698 804 417 587 -259 663 -29
1433 -29 -56 207 642 420 101 670 -199 88 58 260 -655 128 258 -992 285 -489 -757 -985 168 -1075
1453 -1075 -840 254 -594 -368 -208 7 -1472 -385 -464 -1609 -794 -358 -426 -902 556 -964 -395 -42
1471 -42 -263 -353 -215 565 -623 25 -386 130 -163 171 86 -175 997 433 846 395 947 415 -220 497
1491 497 361 257 221 829 174 864 1093 281 473 595 808 -349 903 566 289 159 208 -428 -399 1065
1511 1065 -683 77 570 271 -309 164 205 -622 42 -747 -874 -764 147 -556 -917 224 -320 -367 -975 44
1531 44 -775 22 -307 -883 -74 -440 -180 -1461 -121 -552 90 -409 -230 38 -380 527 -648 -322 175
1550A75J90q06L49R44j120O11n59P35m08N73n38m66J380m17p3l86M16m10L34l88
1570A36l61O92J07L92j295J389m72k81l53K68J54k52O51j151Q18J02k27r53O23
1589a3O18j028L94j82L99j83l0n38r7R17j020J19o1J118o26k76K84j29J33l74
1609e75K98q52J488m98m99j02O71M99j109N83q16J297k32m03m85J020N43j261
1627d33J0L20N50m27K03k73N24O43j018j35K12J128j036k76L93L57R9o53J50p34
1647c96J536o94p12L42O89K50j069O74q04O47k47k48p8J16O79j242L72j00Q68
1666E83j210M72L3K0N42o74q1k44R38r11j54L16J05q4l87N96m18Q48r77K76J19
1687b92L41j57r16J058o4J07q71M44M26k54K84q30P18K91M4r84P75K60j58j68
$$ plain form
1550 175 365 -441 -92 852 -268 343 -216 519 111 684 146 -320 1060 643 570 184 600 190 524 136
1570 136 -225 467 574 966 -329 1060 588 307 -46 222 376 124 775 -376 442 544 317 -636 -13
1589 -13 605 -423 -29 -211 188 5 -25 -563 -660 257 -763 -644 -705 413 -213 -489 -205 -334 -201 -575
1609 -575 -277 -1129 359 -139 -638 -740 -69 430 -679 -96 -912 385 153 -250 -735 285 828 -433
1627 -433 -423 -103 447 20 223 -50 474 1117 99 -36 176 1304 268 -8 385 742 841 188 338 -396
1647 -396 1140 446 -266 76 765 1015 -54 620 -184 463 216 -32 -110 6 685 -557 -185 -285 583
1666 583 -627 -155 -122 -102 440 -234 -315 -559 379 -532 -686 -370 -265 -349 -736 -140 -558 290 -687 -411 -292
1687 -292 49 -108 -1024 34 -30 77 -794 -350 76 -178 106 -724 -6 285 329 -655 120 380 222 54
1707E4k69N61K36K39j388P53O73On66m96J108n33K15q15K60O26k08j71q85J374
1727G74Pq73j7M30J59k33K26j016J004q1k53p61O30L98n51L2l65M75K43m73m13
1748f58L66N9J98j27q42J062k18l7l82K14L16k42J28q36J265n00J87l89N88r3
1768E9m99L38o71Q11j31J02k29L57J55l49M7j95P83p80N04k36K60lK09l01j10
1789A21R75q65j35L66K67l68K2K29p71R32n72m41K49O18l93j87M08k87K55o06
1809a83J33n6L95k50m80J65J22M96q86M59k70J97M9m12M05k0K07p93J79j46M07
1830b82k52k92P09n42O79m61L68j78L00m1p07Q36m48N16o33M70l04J01L68o46
1850d39M07J17L10n32N39j01l5l7Qp8j77P42n15K00k5o6J42l53N91p32O45m84
$$ plain form
1707 54 -215 346 582 821 -567 186 859 865 299 -197 911 378 593 -222 38 664 456 285 -600 774
1727 774 781 -92 -109 321 480 247 473 -543 461 380 127 -634 -4 394 -157 -125 -490 -15 228 -245 -658
1748 -658 -292 -233 -35 -162 -1004 58 -160 -197 -579 -365 -49 -291 -163 -999 266 -234 -47 -436 152 59
1768 59 -440 -102 -773 38 -93 9 -220 137 292 -57 -10 -205 578 -202 302 66 326 323 532 231 121
1789 121 1096 231 96 462 729 361 383 612 -159 773 201 -240 9 627 234 47 455 168 423 -183
1809 -183 -50 -106 289 39 -441 -276 -154 342 -544 -85 -355 -158 -109 -521 -116 -136 71 -722 -543 -689 -282
1830 -282 -534 -826 -117 -659 20 -441 -73 -251 49 8 -699 137 -311 205 -428 42 -262 -161 207 -439
1850 -439 -32 85 395 -137 402 301 266 229 237 159 -18 724 209 409 384 318 460 107 698 -34 611 127
1872A27K04j07J41k9l18M39n58M12m99N21l81pK47m34L03k20L70n20L55k46j00
1893c00K1J00J91p07R02p61L00k76L55l22l7R81q74K30j59K0j84K98j21k24P21
1914A54l06K15l86N45k08j59K47l36K05q6L99m18K65N9J9j02J20K89m42O43m97
1935B20J08K6k63J13k9L18n95N49l54M47k33P1n9k12N9j79L38m90N34m43M3M48
1957D17m18J02l98O38p22O27p9l75K01l45J44m11O23l97J13K45k14P1l15N91o56
1978e58L70k30L40l60K74J44l59K67l33L49l28L97l90K89K50m66O83n25J71j07
1998a22M33k72J56J87m08P53q32N77l05K66l38M35j91m36N96l50L33l71J88j42
2018A57K04J77n27J72j44K04m28M83k78k3J17l48M63l66M86m53Om4k3L51k81Q0
$$ plain form
1872 127 331 224 365 336 18 457 -101 311 -188 333 -48 -55 192 -242 61 -159 211 -309 46 -200 -300
1893 -300 -279 -179 12 -695 207 -554 -254 -530 -175 -497 -534 447 -427 -197 -356 -336 -520 -222 -343 -567 154
1914 154 -152 63 -323 222 14 -145 102 -234 -29 -115 284 -134 131 190 209 107 227 516 74 717 220
1935 220 328 354 91 204 175 493 -102 447 93 540 307 378 319 107 166 -13 325 -165 369 -74 -31 417
1957 417 -1 101 -297 341 -381 246 167 -208 -7 -352 -208 -619 4 -393 -280 -35 -249 -178 -493 98 -558
1978 -558 -188 -418 -78 -438 -164 -20 -379 -112 -445 -96 -424 -27 -417 -128 122 -344 339 -186 -15 -122
1998 -122 311 39 195 382 -26 727 -105 472 167 433 95 530 339 -97 499 149 482 111 299 157
2018 157 361 538 11 183 39 243 -185 298 20 -3 114 -234 229 -137 349 -104 -98 -142 -165 186 -95 -15
2040a5m60M22j90J75k30o1K50l72N39o05P59j92j35m89L10M06o03N29m61L69k93
2061c47K41j71K5J23o7L42n48N95k42L89k49Q5p8j86M24m25N05j73n1n0n7L63
2083D48n82O84o82O04m33J53l12Q1L07l79M89k59J97l47N18l45l04N31m34O8j74
2104a71L26k12L93k75l65N07l08L15n53O44l14l51K04N4K66k27m6m09O08l36Q5
2125a65j42K79J45n19K64l78N15m30J92J16k0J18l51M39n22K79j41K69j15Q1M65
2146C79m22Kl41O97j49L2l0j27N96p81L67k20L78l69K69o2r8K52nM2l22K38JM3
2170C70k90K09l9l20L71k04J12m1j24p4Q3K24k54K29l83N00p70L63n0J99q7m43
2192d19N20k95L90m77K02r1k59L26n51N04n7J38n53K83K69p5J73o16J92K48J83
$$ plain form
2040 -15 -475 -53 -243 -68 -298 -359 -109 -481 58 -547 212 20 -115 -604 -294 112 -491 38 -423 -54 -347
2061 -347 -106 -277 -252 -129 -196 146 -402 193 -49 340 91 176 98 -88 336 -89 416 243 192 142 85 448
2083 448 -134 550 -132 472 39 192 -120 -39 268 -111 378 119 316 -31 487 142 -162 369 -65 3 -171
2104 -171 155 -57 336 61 -304 203 -105 210 -343 301 -13 -364 -160 -106 160 -67 -113 -522 86 -250 -165
2125 -165 -307 -28 117 -402 -138 -516 -1 -431 -239 -123 -143 -25 -376 63 -459 -180 -321 -52 -167 -86 379
2146 379 -43 -41 -382 315 166 198 168 41 637 -144 223 3 381 12 281 219 121 373 368 410 88 326 327 370
2170 370 80 289 250 -70 301 97 209 168 44 -30 53 277 23 252 -131 369 -401 -38 -88 111 24 -419
2192 -419 101 -194 196 -281 -79 -170 -429 -103 -654 -150 -207 -69 -622 -339 -70 -145 28 -588 -396 -148 35
2213C5m53R7K34R1K05m86L53k64L24m53M7L36J05j0m42Q55n17M19n47J99Q6j16
2235I8L21l53K52j10M50n06J48N8j58L21n60M69j54L15n43J49K25k56Q3k94M21
2256C76k71oj89J3K33k01R5l55P10o50J33j36K28n8j64L28m26O41r16L34O0L39
2278A18k79J62l01k51O61l61L2K1M4n9lK98n33O48o19L57j25L15l7l11K88k77
2300b12O26n63K78l65M05J39j92r3J34J52m23N11m50M39m3l02O5KM29j93Q7o96
2322b65M74k3j34q1J04K60l20L60n69K40K28k73o5j77M39k80K41l18O9J50l90
2343c30K96j14J29j82L08n28M01k12q2J78k11J53k85L78k60K57m8j0J05k13J42
2364a28k47K91k6L3K02m85K85k85M77j20Q1k01J25J51k34M00k93K78n01L98q9
$$ plain form
2213 35 -418 -321 -87 4 209 -277 76 -188 136 -317 -270 66 171 161 -281 574 57 476 -71 128 214 98
2235 98 419 66 318 208 658 152 300 358 200 521 -39 430 276 591 48 197 422 166 249 -45 376
2256 376 105 99 -90 -77 156 -45 50 -305 405 -245 -112 -248 -20 -78 -242 86 -340 301 -615 -281 -221 118
2278 118 -161 1 -300 -551 110 -251 -219 -198 -154 -213 -216 82 -451 197 -422 -65 -190 125 88 -223 65 -212
2300 -212 414 -149 129 -236 169 308 116 23 157 309 -114 397 -53 386 343 41 106 108 537 344 431 -265
2322 -265 209 186 52 -29 75 335 15 375 -194 46 274 1 -64 -241 198 -82 159 -159 -90 60 -330
2343 -330 -34 -148 -19 -201 107 -421 -20 -232 -314 -136 -347 -194 -479 -101 -361 -104 -152 -162 -57 -270 -128
2364 -128 -375 -84 -110 -77 125 -360 -75 -360 117 -3 78 -123 2 153 -81 319 26 304 -197 201 112
2385A12K17J95o57M50l36K03k40N70m57m9L49l35J81j48J40l05J50K0r7J24k70
2406a83L08k96M22m60N76l30j63J13k62J65o8L16m77K25j41j0J30p4J09k28L27
2427an09L57o9KR7NJ45l75K74j47Q0P6j55J03J98Qm19M56o3M4k50p8K70j17L00
2452B32n29N64l05J33j62J3K44m2j18m6K76j94J15J80j76l9L7J12o7M5k32L82
2474D23m77O1P7j88J21o1J9k03P7j69L37qj57K45l96L82l71J94q2j02J81j88K72
2497a3k22K70k77n9K48k39K36j86N4J03L16n00K02L8j11J27l40L62j42L22m61
2518b72J20N5O2J48j55J27k87M44m39J22N7N2kL6J10q1lj46P3O1k3J61k70L47
2542B97l83L38m35K59J26j32o3J71M5n65L52O8L3k67J72J79j32j07rL05k33k9
$$ plain form
2385 112 329 524 -133 317 -19 184 -56 514 57 8 357 22 203 55 195 -110 40 60 -37 87 -183
2406 -183 125 -171 251 -209 367 37 -126 -13 -275 -110 -178 138 -339 -114 -255 -265 -135 -209 -100 -328 -1
2427 -1 -510 -153 -222 -220 -123 -118 27 -348 -74 -221 -141 -65 -220 -117 81 89 -330 126 63 107 -143 -221 49 -68 232
2452 232 -297 267 -38 95 -67 -54 190 148 30 -16 260 66 181 361 185 146 183 295 228 273 41 423
2474 423 -54 7 84 -104 17 -44 -25 -228 -151 -320 17 9 -148 97 -299 83 -288 -94 -176 -278 -97 -285 -13
2497 -13 -235 35 -242 -301 -53 -292 -56 -242 -188 -85 231 -269 -67 -29 -140 -13 -353 9 -133 189 -272
2518 -272 -152 -97 -35 113 -42 85 -202 242 -197 -75 -18 34 32 68 178 97 94 -52 21 82 59 220 -50 297
2542 297 -86 252 -183 76 202 70 7 178 223 -342 10 78 111 -156 16 195 63 -44 -53 252 19 -10
2564a0M3k29K15k20K67m45M08l22K80j78O5N9L8J15l45J67p9K50k67j01K52qj33
2587a78j69M43l93M05j32K9ql2J58l96N74l02J91l93L37j98J06K20m90L55j35
2608hL44l12R9O6j91J87r9M4j86L61o2k83L06k95K93k37K08k37k5J83n3k26K3
2631a00K28j53J82j74K7K1j14J63k03M57j24j23l68K65q2o2M3l1K25n19N01r7
2653c8l2j25J11Q2l27N00n45L66k48J51J34k17J2n4L50j78L46n76N25o7l02J8
2675a14P8L8P6K08l38J48l00L89J3l4L8k19L00n6J16o8q4k29KL67l62J72k44M89
2699C86k76l6M82o52L47l13K06j55Q8q9k77M65n51J50O0M44l31J18j64j62J73
2720h7l30N22o03L37M6O9rR1k33k76J82n3M23l18R1K37k99P9j78J55Q0N9j94L98
$$ plain form
2564 -10 33 -196 19 -201 66 -379 29 -293 -13 -191 -126 -67 -29 86 -259 -92 -171 79 -188 -289 -37 -45 -178
2587 -178 -347 96 -297 108 -24 5 -3 -35 123 -273 301 -1 190 -203 134 -64 42 262 -228 127 -8
2608 -8 336 24 123 189 -2 185 86 130 -56 305 243 -40 266 -29 264 27 235 -2 -27 156 103 -123 -100
2631 -100 128 -25 157 -17 10 31 -83 80 -123 334 210 87 -281 -16 -98 -160 -117 -148 77 -442 59 -38
2653 -38 -70 -195 -84 -2 -329 171 -374 -8 -256 -105 29 -188 -176 -230 120 -58 288 -288 237 170 -132 -114
2675 -114 -36 2 78 286 -52 96 -204 185 198 164 202 -17 283 227 343 275 191 -38 -36 331 -31 141 -103 386
2699 386 110 74 556 -96 251 -62 144 -11 77 -12 -289 176 -375 -225 -165 279 -52 66 -98 -260 -87
2720 -87 -417 105 -498 -161 -115 -46 -55 36 -197 -473 -291 -344 79 -239 -148 89 -210 -131 -309 -154 -74 -15 -209 189
2744A89k45O9Lj27J50J36M8j76j42K48Lj01o1L37l46J19k51M76k44J94P2l34K22
2767B39J1j48k06L51p0k64J78l2J02P1j29j78J3K73j69j32j78K23q6O3n3J18J09
2790A06k28J34j72J74j47J14r4J36p9j1K12o02N03m65L01r9K93j29j44L04k98
2811a91J92j80Q9l40K80J91J32j14j13q9J33J93J26j02k59J88j59q6L41l29L72
2832B75j76R2L6k32K98l02M62o07K89Q5J5j49J6k12K93M2m16L57q2J82j6k17J3
2855D6L0K19m62L23k39N1n1j85L19k70J68k63M24j45l58K20P8J56l80J05l7K09
2877d2nk45M46o4j00k38K82j73j6l3J46J53k53L62l04R5k10J88j2K08l07R4K89
2900B61j55n4j21K94j30p1j91J40K12%O6j20J90l14j02K43j01N2j39K92l14J42
$$ plain form
2744 189 -56 13 16 -111 39 175 223 47 -95 153 156 55 -6 331 -15 104 -147 329 85 279 351 17 239
2767 239 250 102 -104 247 177 -87 91 59 161 232 103 -75 -62 211 42 -90 -268 -45 -131 -68 -121 -3 106
2790 106 -122 12 -160 14 -133 -19 -113 23 -56 -67 145 -457 46 -419 -118 -217 76 -53 -197 107 -191
2811 -191 1 -179 -90 -430 -150 41 173 59 -54 -143 -10 183 309 207 -52 136 -23 -109 232 -97 275
2832 275 99 191 227 -5 293 -9 453 -154 135 220 235 86 102 -110 183 225 -191 166 84 266 250 33 46
2855 46 76 295 -167 156 -83 -32 -83 -268 51 -219 -51 -314 110 -35 -393 -173 -95 61 -319 -214 -251 -42
2877 -42 -47 -292 154 90 -10 -248 34 -139 -155 -188 -42 111 -142 220 -84 11 -199 -11 -23 185 -122 -28 261
2900 261 106 52 -69 225 95 24 -167 -27 185 185 251 131 321 7 -95 148 47 99 -40 252 -62 80
2922H0k23K98r4j96K79k72P5j13K97k64J52J26j14j12pL71m26J8J45j96Q8n1J02
2945c7m04N25m73M64j64q5n0Q8K60l36n7J23K61l96J91J12l01K14J06j6j96K69
2967I8K25k78M4j86K40k80R4j11L79k43J53M6k20L45l23L33j97K3N6j08r3J19
2989A16k3p3Q2M2r8k9Q1O0j13N1k98L33l39K37m9P9J74m43L57m47N21l36N7jJ89
3014A30Rn41N33n11M65k62L50l60J08mm08N19k20rO4J45p8J23j50o8J94k28L48
3037A49j09Mj21NK45k4j63l89P17k21K49m51K06j42j25L27l90K90m1O7L0J15k58
3060c0J28J45j51N5K7J28j73J29k55n4K11k83L75n2j48j20R3j00O4q2J80l1j50
3083i4J38k40J87J20l26M34k14k96J24J96j37Qj8j01K39k42P1J22k28l7K97P5
$$ plain form
2922 80 -143 155 61 -135 144 -128 -53 -166 131 -133 19 145 31 -81 -88 283 -143 -125 20 -176 -88 -139 -37
2945 -37 -441 84 -389 75 -89 -174 -224 -136 124 -212 -269 -146 115 -281 -90 22 -279 -65 41 25 -171 98
2967 98 323 45 89 -97 143 -137 -43 -154 225 -18 135 181 -39 306 -17 316 119 142 198 90 -3 116
2989 116 93 20 102 144 46 17 98 158 45 96 -202 131 -208 29 -20 59 233 -210 147 -300 221 -115 -58 -59 130
3014 130 139 -402 131 -380 85 -177 173 -187 -79 -83 -491 28 -192 -201 -137 8 -70 53 -97 -165 29 -199 149
3037 149 40 44 -77 -72 173 149 -14 -403 314 93 342 -109 97 -45 -170 157 -233 57 16 83 113 228 -30
3060 -30 98 243 92 147 174 302 129 258 3 -51 160 -123 252 200 52 -68 25 -75 -11 -93 87 56 -94
3083 -94 44 -196 -9 111 -215 219 5 -291 -167 29 -108 -100 -118 -219 20 -222 -151 -29 -257 -294 3 78
3105G8j05l58L10l5k45M16N1k64J6J16J11j30K50k41J53j7K13k41K09j06j42K7
3127F6p3J57j09J76l1J5J83k93J2j24J38q2J35j83r6K31p6r1L9J40j01Pn2j96
3151b08L42k86K76k59J13ko1P7m4O6k89M30j82J4k82L01n3r6O8l16K76k18L24
3174iQ7l77M26j44K20k59J09k45N0M0n2J60m1J83l39O23m48l9M1J38J13m39K18
3197A6Q6O4l22L20k33L26j65Q3l1k25K84l53L07k7N2p6l73M01q7J50J0j40L0j31
3221c4p3J04J13k7J06n39M09J56k20N7l79K94j81K71NK22m13O1J43r4o8J3o1k
3245a37L00k21j22J92J09k18k8K98j74J9o0p7J79k63K29O6j80q5RL87k29j61J05
3268f2K15k53j1P1Q4k39M79k06j04K6J75nM5l2J5J7J2l20L02K4k41K3K35r7J60
$$ plain form
3105 78 -27 -385 -75 -110 -355 61 112 -152 -136 -20 91 -39 211 -30 123 106 319 78 287 181 39 66
3127 66 -7 150 41 217 186 201 384 91 103 -21 117 35 170 -13 -109 122 46 -45 -6 134 33 40 -12 -208
3151 -208 134 -152 124 -135 -22 -24 -85 -8 -52 14 -275 155 -27 -13 -295 6 -47 -143 -75 -391 -115 -333 -9
3174 -9 78 -299 127 -17 203 -56 53 -192 -142 -102 -154 6 -35 148 -191 432 -16 -55 -14 124 237 -202 16
3197 16 102 166 -156 164 -69 257 92 175 144 -81 203 -150 157 130 182 106 -267 134 47 197 207 67 97 -34
3221 -34 -107 -3 110 83 189 -350 59 215 -5 52 -327 -33 -214 57 62 284 -129 -68 75 -19 -87 -74 -135 -137
3245 -137 163 -58 -180 12 121 -97 -125 173 -1 18 -42 -119 60 -203 26 92 -88 -173 -164 223 -6 -167 -62
3268 -62 153 -100 -111 -40 44 -195 284 78 -26 0 175 170 215 183 198 215 227 -93 209 233 -8 15 250 153 313
3293C13k2m33J45M6J76j54Ok86P9J26R9J40j83k6j29j37R9J34J14m10J65R7L42
3316C01m42K21j59L8m4j38N65q07L73m0J77k01OL45j39o8q6K21j75j88J90o0o2
3339a72J28K20k68J73q1J08o2m0M7N2p2R3M9k62K53N2l02j22K16J65j98K79l10
3362e4J92J69k28l2j20K40j67J0O4N4j95LJ28J26M0j49n4j8N8mq9k03J82n0p1
3387a68J42Q7j67K35k06L0j20l5P1k26M86j64j11j9kJ62rk29L05k82M0L31l27
3410a76L12k69K99l97J90L81k13k24N8O2J9M8j74K4JP4qJ04pj84K92njn6J83k48
3436H5m5J15l49M63j47k53K54l5j36p8J09kK02k87K15P3p5p4k11j33K07J18j91
3459a75qJ20j23Q4O3j13J08o5J90j93j94L35l0k56J6K59M1l18K78o3J41j69MP1
$$ plain form
3293 313 291 -142 3 49 225 71 77 -209 -130 -4 95 235 52 26 -103 -240 -141 -7 107 -303 -138 -41 301
3316 301 -141 80 -79 -41 -85 -223 342 -465 -92 -132 45 -156 -150 195 56 -12 -98 123 -52 -240 -50 -110 -172
3339 -172 -44 176 -92 81 0 108 46 6 53 105 33 126 175 -87 166 218 -84 -206 10 175 -23 256 -54
3362 -54 138 307 79 47 -73 167 0 10 74 128 -67 -64 64 190 230 81 27 9 67 63 -26 -229 -47 -97 -168
3387 -168 -26 61 -106 129 -77 -47 -167 -202 -131 -357 129 -35 -146 -165 -167 -5 -14 -243 62 -220 -180 151 -176
3410 -176 136 -133 166 -231 -41 340 127 -97 -39 23 42 90 -84 -60 -59 15 7 111 104 -80 212 207 206 150 333 85
3436 85 40 155 -194 269 122 -131 123 88 -48 -126 -17 -19 183 -104 111 184 109 35 -176 -309 -102 16 -175
3459 -175 -183 -63 -186 -102 -39 -152 -44 -109 81 -112 -306 29 -1 -257 -241 18 59 -259 19 -44 97 -72 -68 3
3483Cq0J12j24j05K38J70j76l8K02j07J11k71o1J29k34L49J96j38l76K16J70j39
3505D7o3R3k22K50N1k74N01m30R4p2N5O3P2p0OO2j68R8j09l9j82M3J82o2j6j97
3531b87L84l6k40J01k4J48j14N8K3r3n6NK07l80J75O2J72k37K82k41J62j23m24
3554d76O42l26M35n24L01j9j73J31J53r3l22N96l42J02%j81J50J14L9k00N3j63
3576a03K01K2j80RJ85k59K61q3k54K30J81j90M2nJ40j02J28l31K49j11k0Q2l16
3599b24K78k1J40n1l4O4l5k08K02Pk33K3J4k37L91J61k64p5m2J79O9j42R3j76
3623a21L7n4K16j67J72j51l05K64K00J0k94j3J27M7QO7J49l69K56j01J04K83l04
3646F1q8J69r4k17J05J35j26j1j3R8Q2Q7M4k99N7J32j53J2J71j10j2j81O3K58
$$ plain form
3483 3 -77 35 -89 -194 44 214 38 0 202 95 206 -65 -126 3 -231 118 314 176 -200 16 186 47
3505 47 -16 77 -145 105 156 -118 383 -47 47 -25 30 93 165 95 101 163 -5 93 -16 -55 -237 -194 -12 -74 -90 -287
3531 -287 97 61 -179 -78 -102 46 -68 -10 13 -80 -136 -131 76 -304 -129 -67 105 -132 150 -91 71 -52 -476
3554 -476 166 -160 275 -249 52 33 -140 -9 144 51 -271 325 -17 85 85 -96 54 168 207 7 60 -103
3576 -103 98 120 -60 -51 134 -125 136 53 -201 29 210 20 62 57 197 95 223 -108 141 30 10 92 -224
3599 -224 54 33 173 122 88 152 117 -91 111 118 -115 -92 -78 -315 76 237 -27 -102 -144 35 104 -38 55 -121
3623 -121 -84 -138 78 -89 83 -68 -373 -109 91 101 -193 -206 -79 -32 -24 43 192 -177 79 -22 82 365 61
3646 61 -27 142 48 -169 -64 71 -55 -66 -79 19 101 188 232 -67 -10 122 -31 -19 152 42 30 -151 -88 170
3670A70k37R5j51J81k50L64j73M9k06J24O3m30M79O6p9j65J03Q3k7Jj20K0K19
3693A79n0k41J55K61l24K8j61O1k31K36kq9J06J18j09o8J26l8k03J89JO7k47J41
3717i5K47N5l27J63P1j12J9O2M5k13J56k46M64l1k36p4o8K24o8J90j5j35o3J80
3741A93k08K2K33m77K73l9j5l3L6L09m14J92j27J99j45k7Oj17M08l56KJ51r3L3
3765Fl04M10j00n6j74J23Q1M1Q9k09l5k4J75j18Q8j14K09k83K48k09N5J64j39
3788g6L62k51j31J52l1o8J98k10j2K9K19K4M4j88j97L36r9j55K68k45L22k38J25
3811A78j26m3K8j32J70r0P7q9L7j69K07J24j17n0l6p6K2J46j68J13r8J5J12J37
3835A72j29j80L22l91J26o4N4j16O0L33m37L73k19J08P0l06K19J69l4l40M80l40
$$ plain form
3670 170 -67 28 -123 58 -192 172 -1 48 -158 -34 29 -401 78 144 65 -100 3 86 59 60 -60 -40 179
3693 179 129 -112 43 304 -20 8 -153 -92 -323 -87 -89 -178 -72 46 -63 -131 -5 -43 -246 -57 -56 11 -236 -95
3717 -95 152 207 -120 43 114 2 21 83 128 -85 71 -175 289 258 22 -52 -120 104 36 226 211 76 13 193
3741 193 -15 7 240 -237 36 -3 -18 -51 -15 294 -120 72 -55 144 -1 -28 -22 -139 269 -87 -85 66 -27 6
3765 6 -298 112 12 -44 -218 -95 -14 27 116 -93 -128 -152 23 -95 -7 -121 88 -195 53 -156 -101 63 -76
3788 -76 286 35 -96 56 25 -43 155 -55 -67 -38 181 205 249 61 -136 200 101 -54 214 -31 291 53 178
3811 178 52 9 37 -95 75 -15 62 -27 10 -159 48 172 55 5 -31 -107 -85 61 -107 6 -92 -77 35 172
3835 172 43 -137 185 -206 -80 -144 -90 -206 -146 187 -250 123 -96 12 82 -224 -5 164 130 -210 270 -70
3857g0M6j78K91k29J79M3n5n0j01Q7J04N4L3j63P4J39n8l9n4L02k84j93p9M25
3881B24k16K69l63K36j01k69L23K74k63N4j77J03j18J98n03M91j75m5j62Q9Q9
3902d2l5j64J32J59j78K50j19%q7K55k30p1oK10O6l28K62m45M83k31K47o4M0R0
3926A94k97Lj50L17n3j24K80l80L75j04k47K38q8R6k26L7j7R7L7J67j06j28J6
3949f3m6L04j67k9K11p7k03P3k4j9J08M8n1J04Nk70P0L7J83k68p6M01k23n6j58
3974a86J18l9pJ41M5j76k4N1j43K83M8j96j94O1n8K35J48j64K86k45R0p4K02j82
3998B0j15O1M6j67Qk8J65l3L4q3J42j14j81K29MJ74k52K30r8n8J38m25N48j93
4022E2K51n64L48K6P0j34Rn8j0K41n1j20j09o5j3J92j79o2m2L7J82J23l5J39k80
$$ plain form
3857 -70 -24 -202 89 -140 39 82 27 -23 -124 -37 67 121 154 -9 65 204 146 107 53 355 71 -122 -201 224
3881 224 8 277 -86 150 49 -220 103 377 114 168 -9 94 -24 174 -329 162 -13 -58 -220 -131 -42
3902 -42 -77 -241 -109 50 -128 122 3 3 -84 171 -59 -130 -136 74 140 -188 74 -371 112 -119 128 64 104 194
3926 194 -103 -100 -250 67 14 -110 170 -210 165 61 -186 52 -36 60 -166 -129 -146 -49 -12 155 49 -79 -63
3949 -63 -109 195 28 -1 210 133 -70 3 -21 -40 68 116 65 169 174 -96 -26 11 194 -74 -150 251 28 -28 -186
3974 -186 -68 -107 -114 27 72 -104 -128 -77 -220 63 111 -85 -279 -218 -276 -41 107 -57 229 -16 74 0 202 20
3998 20 -95 -34 12 -155 -147 -175 -10 -43 -9 -92 50 -64 -245 -16 -12 162 -90 140 42 -16 122 -303 245 52
4022 52 303 -261 87 113 183 49 58 0 -10 231 180 60 -49 -114 -127 65 -114 -176 -218 -181 1 124 89 228 -52
4047e2Q5j72J37j7P7l51L07Q5k14oJ41k54J14Q5K40k30j9l5K29l57J12N9k3lj25
4072a87K38n8qJ23K3l45P1J44l1J4P9K16l13j77Q5K28j65J21j16K43k04J49o4
4095F6k00M83k95m2qK4J36j74k5l9P5j66JN7k2L9R3J20j15J09k18k0n0L51k12
4120c2M5Pj79J07J40j5P1o0O8j60K32l48J77J5M17m05J0J14l26nj7j3m6j03L95
4145H9r8Po9J2p2J74j41j18J57K5lq8Q9J5K14n45M51k95J91j53R9J92l2k77J58
4170a8J52j04L23m64OL7J70k17K02k92Q1J01J0j62J14o3M49m24J77K45l13L5J89
4193B34k87q2M29k14L8k42K00l01J98o0M5L08n76K42K94l61Q1j33R5O6N5j91k4
4216a86J47l7O8J6l43P8L00p8n1P5r8R6N7k23K83j0o1jr8J56q9J18j6J19k00l
$$ plain form
4047 -52 33 -139 -2 -19 58 -293 14 99 -115 -121 20 -234 -120 -35 205 -25 -44 -79 150 -207 -95 -36 -59 -62 -187
4072 -187 51 -7 -15 108 131 -214 -143 1 -30 -16 63 279 -34 -211 -126 102 -63 58 -58 185 -19 130 66
4095 66 -134 349 54 12 4 28 164 -10 -35 -74 1 -165 -164 -107 -129 -90 3 123 8 117 -101 -121 -171 180 -32
4120 -32 13 20 -159 -52 88 73 144 84 152 -8 224 -124 53 68 485 80 90 204 -122 -127 -144 -157 -203 -306 89
4145 89 -9 -2 -71 -59 -131 43 -98 -216 -59 -34 -37 -125 -36 -21 193 -352 99 -196 -5 -158 -59 133 101 -176 -18
4170 -18 134 30 353 -111 -105 -68 102 -115 87 -205 -124 -23 -13 -175 -61 -124 325 -99 78 323 10 45 234
4193 234 -53 -135 294 80 118 -124 76 -225 -27 -87 -42 266 -310 -68 226 -135 -54 -187 -92 -26 29 -162 -186
4216 -186 -39 -76 -8 8 -335 -257 43 -35 -86 -11 -109 -13 44 -179 104 94 33 32 -66 90 1 119 103 222 22 19
4242A9K40k64l0n0J53k1N4j27l7J63o8l5L18j05j64j14o4K91k05J17n7k74J67
4265i3J10Ol2L07k56J36j15n9m1l9J15j23J37j44Q2k8r6mJ04J3P4o6K23j56n5
4290@J2r9n0k08K50k25J52K09p7N3o4J28k76N76l23p1l4qn0k6m1J11K40j80Q7
4315H6j51K89k03N8M2j74n0N6N0J21q1M5k4k0j07qj64M29l31R4J62J4O9j62L4
4340G4J1j31n8R4m1l7lK77l18J00N6n0N0P3j22M9j46J70M6l60K83K6r4k41N10
4365B18k39M6n2J24l06K07K67j46lk15L8O8l0j74P6r5J28O2j30L03Q7l34K46j6
4389A30j69L2J39j50K17j84K28m59J28K16N5K3l48M01k14o2l7l1o2k0K44j43K26
4412A60j82k6L7L3J84k48N3O6j70J23l5j94J46K00k54K32k19L54k35K1qK4L6J35
$$ plain form
4242 19 259 -5 -35 -85 68 47 101 -26 -63 100 32 -3 315 210 46 -68 -132 159 -46 71 14 -260 -93
4265 -93 17 23 -9 298 42 178 63 4 -37 -76 39 -84 53 -91 -9 -37 -133 -137 -33 -20 54 -12 211 55 0
4290 0 12 -87 -137 -345 -95 -320 -168 41 -36 17 -47 81 -195 381 58 -13 -47 -55 -105 -131 -172 -61 179 -1 86
4315 86 -65 224 21 79 121 -53 -103 -47 3 124 43 88 64 44 -63 -71 -235 194 -137 -43 119 133 202 40 74
4340 74 85 -46 -104 -10 -51 -88 -91 186 -132 -32 24 -26 24 97 -25 24 -122 48 94 -266 17 43 -51 -292 218
4365 218 -21 25 -27 97 -209 -2 265 119 116 -99 -61 7 -23 -197 -121 -216 -88 -26 -156 147 234 -100 146 130
4389 130 -39 -7 132 -18 199 15 243 -216 -88 128 183 206 -142 259 45 -17 -54 -85 -147 -167 77 -66 160
4412 160 -22 -48 -11 22 206 -42 11 77 -93 30 -5 -199 -53 147 -107 125 -94 260 25 46 38 62 98 233
4436B33k69K1j66J46k43K19kL70k8o33L79J0K3K22n2k12o2K8L20k31R6j90K19
4459A98k35R4m7K14j54J69n4j19r5m8qK82o9k11m3j4K33K8J06m01L72k28P9k5
4483B4L0o1Kk9j3o7K32p6q6N7J45j59L47l83J05M0m48L29K32k00k89J92J35k12
4507a53j67K98O2p9J18J7o8J2j1k86J81J81j45N6l2K30k32M1k39K84m8R0k54J25
4531a9j49K32l9r2p9L13m1j16m9jJ67l7O4l54L01l42K20R7r5l9Q0mk27J96J14
4556A01j8j45L0j11K03j07o7L51k75r4L66l75L11j08j63J71jq6j92J37J81l21
4578b12L11j39L1j22j41J84Q1M0J44n8j27O5j85J9K18k0k68Ll9K01L4K00j44J84
4602B60l04J02j68J28R8j83R9%j73K0Qo1n7J58K78l38J38n5J35J44j74J37k87
$$ plain form
4436 233 -36 -15 -181 -35 -278 -59 -61 309 281 -352 27 37 60 282 230 18 -44 -16 304 73 169 -21 198
4459 198 -37 57 10 224 70 239 185 66 -29 -77 -85 197 128 -83 -126 -140 93 121 227 -174 198 -30 49 24
4483 24 54 -7 -5 -34 -47 -114 118 42 -44 13 158 -1 346 -37 68 108 -340 -11 221 21 -268 -76 59 -153
4507 -153 -320 -22 40 -39 79 96 28 40 29 -257 -76 105 -40 16 -16 214 -18 23 -216 68 20 110 -144 -19
4531 -19 -168 64 25 -67 -146 167 126 10 -39 -40 127 90 154 -200 101 -241 -21 76 -19 -58 22 18 -209 -13 101
4556 101 83 -62 -32 -143 60 -47 -114 237 -38 -132 234 -141 170 62 -101 70 69 -17 -209 -72 109 -212
4578 -212 99 -40 -9 -131 -272 -88 -7 33 177 119 -8 57 -128 -109 109 89 -179 -176 -215 -14 20 220 76 260
4602 260 -44 58 -110 18 116 -67 32 32 -141 -121 -113 -174 -231 -73 205 -133 5 -50 85 229 55 192 -95
4625i5L8K05k90L29j65n2M9r4J02j65L73J19k56j53R1O9J26L1j58J46k95m9K34
4648A40P3j05O0k52J45QL3L0j95L5R4j44q7J87R0j40L4j78K12l8J80l33N8J61
4672F8k07J11mjK47k01j50M67j08j08K9r2J33J7j87o4L56l10J34k95K16j78K55
4695A28O2j94j24J48p1J68j39r5J82J24q2ql31L44Q4k69l4P3m6k6K73n6p0k05
4719a64J80J59j83O3j8K1K19k91N0R3J01k29n0q9J09O3j28J83p7o5k59N91n61
4742b82J88J17J93k18J08j58J40J72r9k94j41K62L26k56k43J21R2j88J1J34q1
4763i6K82k81KJ65n7P1j04J77j76rl3K11j67J67n4j54j08P1R7j40Q1J52k83R2
4787i4K16n0j01J1j09Q6m6j7K37k01K51q2j08N9J06p9j06R1j77Q6j09L40k38j34
$$ plain form
4625 -95 -57 148 -142 187 22 -30 19 -75 27 -138 235 354 98 -55 36 105 231 262 104 250 -45 -94 140
4648 140 213 108 168 -84 61 69 102 132 -63 -28 66 -78 -165 22 112 -28 6 -172 40 2 182 -151 -93 68
4672 68 -139 -28 -32 -33 214 13 -137 330 222 114 143 51 184 201 14 -50 306 -4 130 -165 51 -127 128
4695 128 190 -4 -128 20 -51 117 -22 -117 65 189 107 99 -232 112 196 -73 -107 -34 -80 -106 167 111 41 -164
4719 -164 16 175 -8 55 37 58 277 -14 36 129 230 1 -49 -138 -29 34 -94 89 12 -53 -312 279 -282
4742 -282 -94 23 216 -2 106 -52 88 260 161 -133 -274 -12 314 58 -185 -64 28 -160 -149 -15 -96
4763 -96 186 -95 -93 72 15 86 -18 159 -17 -26 -59 152 -15 152 98 -56 -164 -93 4 -136 -55 97 -186 -94
4787 -94 122 72 -29 -18 -127 -41 -87 -104 133 -68 183 101 -7 52 158 79 -27 64 -113 -27 -136 204 -34 -168
4811a68P2J4J68l02R4n3K76p1q3P8j17l8j21K14j00K71R4m32J17M3K8J7R3o0j88
4836a54J64j94J19Q7J03j83k2J36j40J52R0l56J20k52K17K13k7o3q2J15O4J18
4858B25j12q5j36K4R2j22m9Q5O2q1K25k14N7q4K5J71j83J02J76k78q8J85J41k3
4882A15k20R1j43K87j18k2Mj84J87O3j42K64k80m5J13q6km3R8M18k7l13M0j65
4906a10J09k0K17j05k11J19PMj40O1L4o6n7k5K98j25J1R2%M3k80K57j75R3k06
4931a75J57O9roj60j58J01J07N3n4J06J20k70Q3Q6L9M8r6J69q1k23N3j14J68j19
4956a06k9J11l06K87k5R7j20K08j40K18l55O7P3M6J06k12J66j64rJ41j41J27q1
4979d1k1J40J1j1k15J13M10l62K8j02P2J64j24K5n5q2k04L05N5l13J5K66l16K92
$$ plain form
4811 -168 -96 -82 86 -216 -122 -175 101 30 -53 25 -92 -130 -251 -37 -137 134 228 -204 -87 -44 -16 1 94 34 -154
4836 -154 10 -184 -65 22 125 -58 -80 56 -84 68 158 -198 -78 -330 -113 100 73 10 -72 43 107 225
4858 225 113 28 -108 -84 8 -114 -163 -78 -16 -97 128 -86 -29 -113 -88 83 -100 2 178 -100 -188 -3 138 115
4882 115 -105 -14 -157 130 12 -10 -6 -190 -3 60 -82 182 -98 -143 -30 -116 -118 -161 -63 355 328 15 55 -110
4906 -110 -1 -21 196 91 -120 -1 6 10 -130 -69 -35 -101 -158 -183 115 -10 1 93 93 136 -144 113 -62 31 -175
4931 -175 -18 51 42 36 -124 -282 -181 -74 -21 -75 31 151 -119 -36 50 89 137 41 210 129 -94 -41 -155 13 -106
4956 -106 -135 -24 -330 -43 -68 29 -91 117 -23 195 -160 -93 -20 26 132 -80 86 -78 -87 54 -87 40 -41
4979 -41 -62 78 89 78 -137 -24 386 24 52 -50 22 186 62 87 32 -50 -254 51 106 -207 -192 74 -242 50
5003E0k23K99l5L3k31K11l7j30O1J94k38K69k77%K20j80q4J66q0R4l00J80j7N8
5027Cl7q9Q8q8LK22k1q5k35J83N0P2j26j81L42k15M3j10M09k55N9l8K2J10Rk97
5053a62J75j16K5K30j91Q3M3M7Lk78J50K26j76lP6p5k57J73P2J2p2P8J0m2R0q2
5079C9M5j04k39L06j95Q7J00J6o9qJ63n5j26k08M03k25k4K4m9K62k99K12O5k21
5103a00K95k95J60j64J66j83J76j20J16l7M2j4k13J49lJ06k3k82M00m70K03P1
5125b0J39p8M1k52K09L7j15k8j57K06L8k2K7k23J85Nj94K11k9PO0p1m5k53M74
5150A52k41J01k47j0K40rR0k24M0KJ47Rj67j11Q6L01m18L19j45K16K15k15j80
5173d9NJ70j3r8k38J96K7K22l96R6J35k04J25J22k3Qj4P4l06M22l40j60K54R7
$$ plain form
5003 50 -173 126 91 124 -107 104 67 -63 -2 192 -46 223 -54 -54 166 -14 -98 68 -12 82 -218 -38 -55 3
5027 3 -34 -123 -35 -123 -120 102 81 -4 -239 -56 -6 66 -60 -241 101 -114 -71 -181 228 -27 32 -6 16 126 135 -162
5053 -162 13 -103 -78 152 -39 44 87 134 137 -141 9 235 59 56 132 57 -200 -27 45 57 -15 63 73 31 121 39
5079 39 84 -20 -259 47 -148 -61 39 55 -14 -22 141 86 -40 -248 155 -70 -94 -70 -119 143 -156 56 121 -100
5103 -100 195 -100 60 -104 62 -121 55 -65 51 14 56 42 -171 -22 -25 81 58 -224 176 -294 -91 -20
5125 -20 119 41 82 -170 39 76 -39 -67 -224 -18 20 -2 25 -198 -13 -8 -202 9 -20 -13 47 -24 -69 -322 152
5150 152 -89 12 -235 -245 -5 -14 76 -148 -108 -106 41 50 -117 -228 -142 159 -259 60 -85 131 346 131 -49
5173 -49 -44 126 113 15 -223 -27 0 222 -174 -78 57 -147 -22 100 77 85 71 145 -161 261 -79 -239 15 112
5197A12j11Q9k58P1J67l35K19J66J5k45p8J31J20J0J54j97J05l0j56k4J25j64
5219a14o8J13J01j65J54l2J33r6j51J28m8J2M9M3J17L7l09Q2m1K60j37j14K39
5242A93m44K70j59J25j22k1K83J92k97k13K20j44J8L75k39j1J23k40m6R4j01L51
5264B07l61J10k77K91J00o1N1JK68k71k31Q2K58j92L5J31K74m78O2j42K01j17
5286e9k0K47q6K04k88j67J32R7J3o0Q1k1J20j62K25k56k12L17n2J50k63J1j8J31
5310F4j28j08l1K98j68J56j35M8k9L6n4j66M44j99O7k20K91k77j3K56m6jJ02l10
5334a23M5J83j12j04O8j28N3J34k13K79r4J56j98lkr0Q6j18Q2J05K32n31K49J9
5358b5J19J9k43K32l73K87on3j87K33L2PJ88k52k0J84k51j20J90J21j00m0J20
$$ plain form
5197 112 1 90 -168 -97 70 -265 -46 120 135 -110 -188 -57 63 73 227 30 135 105 -51 -75 50 -114
5219 -114 -182 -69 32 -133 21 -11 122 26 -125 3 -45 -33 16 59 176 213 -96 -14 -55 205 68 -46 193
5242 193 -251 19 -140 -15 -137 -158 125 317 20 -193 27 -117 -99 276 37 26 149 -91 -137 -43 -144 207
5264 207 -154 -44 -321 -30 70 9 60 61 329 58 -173 -91 167 -25 10 141 415 -63 -1 -143 58 -59
5286 -59 -79 168 82 286 -2 -169 -37 60 73 13 94 73 193 31 256 0 -212 105 53 203 -60 -49 -67 64
5310 64 -64 -172 -203 95 -73 83 -52 -4 -33 3 -51 -217 227 28 95 -125 166 -111 -124 132 86 85 187 -123
5334 -123 -78 105 -7 -111 -43 -171 -118 16 -197 82 -12 144 -54 -57 -59 -149 -63 -181 -99 6 238 -293 -44 -25
5358 -25 94 113 -130 102 -271 16 10 -43 -230 3 35 42 230 -22 -42 142 -109 -229 -39 82 -18 -58 62
5381F2k84K3K22J0j47J11p9j90K10J44k04J22k73L94j12k24J76M1J15q9R3J6k90
5404a53L12j49N4j66K65k58L54j72j40O2NJ27j41k32J83J35j4j22j73N4K47j37
5426e9pJ4K26j75J8J07j38o9p5N0K28K32m58J99k92L76j18j19P0n9K06p0j56L9
5450c0J50J44R3m93J53J16k16j19J50J80q1L7m1j84J09q1K1L75n37J90R3J15l59
5473b15O0J25O5R6NL1l17L6L3J57P1j17j31L0k2J8K75k42j82K40Q2j43J33j66
5497g8N4K5n5mJ44J25J99l87J07J05l44J14J41j19k94P8J46J50p7P0k08J60p1
5520a9J16n8N2m5r5nk59K57o1O1j22J06l5J65j16O1J32k47K43o1j21J67j68R0
5544C8J26k2k98N1k43K80j06K40R7m61J99J69j16J14Lq7K5J2l14J80L51j40Pj10
$$ plain form
5381 62 -222 -199 23 33 -114 -3 -82 -272 -62 82 -122 0 -273 121 9 -215 -39 2 117 28 121 137 -153
5404 -153 159 10 64 -102 163 -95 259 87 -53 9 14 141 0 -232 -49 86 72 -50 -223 -169 78 -59
5426 -59 -66 -52 174 -1 17 124 -14 -83 -158 -108 120 352 -106 93 -199 177 59 -60 10 -49 157 87 -69 -30
5450 -30 120 264 357 -136 17 133 -83 -202 -52 128 47 84 43 -141 -32 -113 -92 283 -254 -64 29 144 -215
5473 -215 -155 -30 35 131 136 167 -150 -114 -81 76 147 30 -101 -71 -93 -75 200 -42 -224 16 98 -45 88 -78
5497 -78 -24 1 -54 -58 86 211 410 23 130 235 -109 5 146 27 -267 -189 -43 107 30 100 -108 52 -19
5520 -19 97 39 91 46 -49 -54 -313 -56 -117 -56 -178 -72 -107 58 -58 3 135 -112 131 70 -51 116 -52 38
5544 38 164 142 -156 -105 -348 -68 -174 66 163 -298 -99 70 -46 68 71 -16 9 21 -293 -113 238 98 105 -5
5568eJ84j70j49j98L34j08L9R6o6L05l96k03M54k59L26k6j55l9j1J21M8m7N1Q6
5592B12k25N0q0j57L1K54L7m0k64j36J91k1K91k67j09L98r4O6j33M7K4r9n4K2
5616e6L7J20j69J45j51j34R2O7o0L01M1k0k74J49k40m3J35k0J27j43PK5J83N4
5640A73k01J05j3j69K71k34K65l41K25m8R5r9j65K57k03k64L48J02j92J56Mj38
5662f6jM1j01J4J84Qk43J78o1K12j06j58K90n0j04J48k14j14K89j77J7J45p3q9
5686c1K10j86l4ln6M4K31k56J09m6n8L12l40j4J67M8Q2j74k40K54K50m71J60P2
5710C0J09k08P5J00l26J70pLL05K9l15L9K8n9j74J4O8K62k28J88J49r8k47j57
5734b50L02j0O3k52J80m6J74j25J33j3k38J53n7J42l6k45l3L9K84j69p4m6K12
$$ plain form
5568 -5 179 9 -140 -338 -4 -112 -73 23 -43 262 -134 -337 117 -142 184 158 3 -36 -47 74 122 75 126 212
5592 212 -13 37 -43 -200 -169 85 122 82 -182 -318 -127 -148 143 -124 -233 165 71 137 4 51 75 -24 -78 -56
5616 -56 -19 101 -68 77 -74 -208 -116 -49 -109 192 233 213 -61 88 -152 -195 -60 -80 47 -96 -89 -64 119 173
5640 173 -28 77 64 -105 166 -68 197 -144 81 33 128 29 -136 121 -82 -346 2 104 -88 68 72 -66
5662 -66 -67 -26 -127 -113 71 79 -164 14 -47 165 59 -99 191 141 37 185 -29 -143 146 -31 -14 131 58 -31
5686 -31 179 -7 -41 -44 -100 -56 175 -81 28 -18 -76 236 -104 -118 49 97 179 5 -235 19 269 -202 -42 30
5710 30 139 -69 6 106 -220 -50 -57 -54 251 280 -35 4 32 -27 -201 -187 -119 143 -85 103 252 154 -93 -250
5734 -250 52 42 105 -147 33 -13 161 36 169 156 -82 71 14 156 120 -125 -158 -119 165 -4 -78 -124 88
5757H8k64J09K5N5l7J7j23q3K65r9k07L34j16m9Q7n6J65j73m8J78j82O5J26j62
5781h5J69pl04K76J14k31j01J62K19j27k0RJ59k75J21J77l6o4l46L12l60L0j08
5804c16J87K56k84K92q5j31J25M4o0n1M2n9l0%J07RR5k4l2l3kn3J17j28l34M82
5830A34j33p6p5M5M02J5m25K04m12K15L54m62J85N5P3j4o2j11R4J64l08Q1R4k5
5854A2k53L80k09p8l8K23j98M6K05j33LJ87l01k7L05l5k85L31k94N1K92m5k74
5877a35J84j34J42Ol46K44J3J05rj9o5r1J52R2o7j11K16l62Q1K69k21N8P6j56
5901g8n9N4R0K5j49K6j47L92j42j1M2k5n0RJ73J01k39K45l38O9kL9m0K48k33j03
$$ plain form
5757 88 -176 -67 -42 13 -24 -7 -130 -213 52 -47 -254 80 -36 -85 2 -54 111 -62 -110 68 -114 -49 77 -85
5781 -85 84 77 -227 49 163 -68 -169 -7 212 85 65 74 233 -42 79 256 220 156 -190 122 -238 -208 -316
5804 -316 -129 127 -157 135 50 -81 44 88 28 -23 19 -40 -70 -70 37 46 141 117 85 52 50 -3 114 -14 -348 134
5830 134 1 -75 -150 -105 297 312 -113 91 -321 -106 248 -214 -29 26 99 85 23 -88 6 170 -138 -57 37 12
5854 12 -241 139 -70 -148 -186 37 -161 -115 90 -43 -40 147 -154 -181 124 89 -196 135 -159 -108 184 139 -135
5877 -135 49 -85 57 63 -283 -39 -26 79 70 51 -14 -105 47 139 72 -39 177 -185 -104 165 -56 2 78 -78
5901 -78 -137 -83 7 32 -117 -91 -238 154 12 1 43 18 -32 -23 150 251 12 257 -81 -12 -14 25 -15 233 0 -103
$$ [...]
8191g7
##END NTUPLES=NMR FID
##END=
