##TITLE=1H_Pr 4989-Am-Bn
 CDCl3, 8 sc, 
 4.9.2020
##JCAMPDX= 6.0         $$ Bruker NMR JCAMP-DX V2.0
##DATA TYPE= NMR FID
##DATA CLASS= NTUPLES
##ORIGIN= UXNMR, Bruker Analytische Messtechnik GmbH
##OWNER= root
$$ XWIN-NMR		Version 3.5
$$ Fri Sep  4 13:05:21 2020 Russian Standard Time (UT+4h)  she@DPX200
##.OBSERVE FREQUENCY= 200.1315066352
##.OBSERVE NUCLEUS= ^1H
##.DELAY= (6, 6)
##.ACQUISITION MODE= SIMULTANEOUS
##.ACQUISITION SCHEME= undefined
##.AVERAGES= 8
##.DIGITISER RES= 18
##SPECTROMETER/DATA SYSTEM= spect
##.PULSE SEQUENCE= zg30
##.SOLVENT NAME= CDCl3
##.SHIFT REFERENCE= (INTERNAL, CDCl3, 0, 15.7039)
##AUDIT TRAIL= $$ (NUMBER, WHEN, WHO, WHERE, WHAT)
$$ ##TITLE= Audit trail, XWIN-NMR		Version 3.5
$$ ##JCAMPDX= 5.01
$$ ##ORIGIN= Bruker BioSpin GmbH
$$ ##OWNER= she
$$ F:/spectra/data/she/nmr/H-F/1/audita.txt
$$ ##AUDIT TRAIL=  $$ (NUMBER, WHEN, WHO, WHERE, WHAT)
(   1,<2020-09-04 13:04:08.78 +0400>,<she>,<DPX200>,
      <created by zg, POWCHK disabled, PULCHK disabled
       configuration hash MD5:
       00 E9 B6 7A A2 85 ED C7 34 08 36 98 17 FE 4E 26
       data hash MD5: 16K
       8E AC 58 93 5E C4 2B 2D B1 5B A7 D0 56 F3 64 B8>)
$$ ##END=
$$ 
$$ hash MD5
$$ 7A 7E 6F 59 4F DD F0 0A BE A6 D8 7E BB 4D FE 0F
##$RELAX= 
##$RELAX= 
##$RELAX= 
##$RELAX= 
##$RELAX= 
##$RELAX= 
$$ Bruker specific parameters
$$ --------------------------
##$DU= <F:/spectra>
##$EXPNO= 1
##$NAME= <H-F>
##$PROCNO= 1
##$TYPE= <nmr>
##$USER= <she>
##$AMP= (0..31)
100 100 100 100 100 100 100 100 100 100 100 100 100 100 100 100 100 100 
100 100 100 100 100 100 100 100 100 100 100 100 100 100 
##$AQSEQ= 0
##$AQ_mod= 1
##$AUNM= <au_zg>
##$AUTOPOS= <>
##$BF1= 200.13
##$BF2= 200.13
##$BF3= 200.13
##$BF4= 200.13
##$BF5= 200.13
##$BF6= 200.13
##$BF7= 200.13
##$BF8= 200.13
##$BYTORDA= 1
##$CFDGTYP= 0
##$CFRGTYP= 5
##$CHEMSTR= <none>
##$CNST= (0..31)
1 1 145 1 1 1 1 1 1 1 1 1 1 1 1 1 1 1 1 1 1 1 1 1 1 1 1 1 1 1 1 1 
##$CPDPRG= <>
##$CPDPRG1= <>
##$CPDPRG2= <>
##$CPDPRG3= <>
##$CPDPRG4= <mlev>
##$CPDPRG5= <mlev>
##$CPDPRG6= <mlev>
##$CPDPRG7= <mlev>
##$CPDPRG8= <mlev>
##$CPDPRGB= <>
##$CPDPRGT= <>
##$D= (0..31)
0 1.2 0 0 0 0 0 0 0 0.06 0 0.03 0 0 0 0 0.0002 0 0 0 0 0 0 0 0 0 0 0 0 
0 0 0 
##$DATE= 1599210248
##$DBL= (0..7)
120 120 120 120 120 120 120 120 
##$DBP= (0..7)
150 150 150 150 150 150 150 150 
##$DBP07= 0
##$DBPNAM0= <>
##$DBPNAM1= <>
##$DBPNAM2= <>
##$DBPNAM3= <>
##$DBPNAM4= <>
##$DBPNAM5= <>
##$DBPNAM6= <>
##$DBPNAM7= <>
##$DBPOAL= (0..7)
0.5 0.5 0.5 0.5 0.5 0.5 0.5 0.5 
##$DBPOFFS= (0..7)
0 0 0 0 0 0 0 0 
##$DE= 6
##$DECBNUC= <off>
##$DECIM= 32
##$DECNUC= <off>
##$DECSTAT= 4
##$DIGMOD= 1
##$DIGTYP= 9
##$DL= (0..7)
0 120 120 120 120 120 120 120 
##$DP= (0..7)
150 150 150 150 150 150 150 150 
##$DP07= 0
##$DPNAME0= <>
##$DPNAME1= <>
##$DPNAME2= <>
##$DPNAME3= <>
##$DPNAME4= <>
##$DPNAME5= <>
##$DPNAME6= <>
##$DPNAME7= <>
##$DPOAL= (0..7)
0.5 0.5 0.5 0.5 0.5 0.5 0.5 0.5 
##$DPOFFS= (0..7)
0 0 0 0 0 0 0 0 
##$DQDMODE= 0
##$DR= 18
##$DS= 0
##$DSLIST= <SSSSSSSSSSSSSSS>
$$ [...]
##$SUBNAM2= <"">
##$SUBNAM3= <"">
##$SUBNAM4= <"">
##$SUBNAM5= <"">
##$SUBNAM6= <"">
##$SUBNAM7= <"">
##$SUBNAM8= <"">
##$SUBNAM9= <"">
##$SW= 16.880792210976
##$SWIBOX= (0..15)
0 0 2 0 0 0 0 0 0 0 0 0 0 0 0 0 
##$SW_h= 3378.37837837838
##$TD= 16384
##$TD0= 1
##$TE= 0
##$TE2= 300
##$TE3= 300
##$TEG= 300
##$TL= (0..7)
0 120 120 120 120 120 120 120 
##$TP= (0..7)
150 150 150 150 150 150 150 150 
##$TP07= 0
##$TPNAME0= <>
##$TPNAME1= <>
##$TPNAME2= <>
##$TPNAME3= <>
##$TPNAME4= <>
##$TPNAME5= <>
##$TPNAME6= <>
##$TPNAME7= <>
##$TPOAL= (0..7)
0.5 0.5 0.5 0.5 0.5 0.5 0.5 0.5 
##$TPOFFS= (0..7)
0 0 0 0 0 0 0 0 
##$TUNHIN= 0
##$TUNHOUT= 0
##$TUNXOUT= 0
##$USERA1= <user>
##$USERA2= <user>
##$USERA3= <user>
##$USERA4= <user>
##$USERA5= <user>
##$V9= 5
##$VALIST= <valist>
##$VCLIST= <CCCCCCCCCCCCCCC>
##$VD= 0
##$VDLIST= <DDDDDDDDDDDDDDD>
##$VPLIST= <PPPPPPPPPPPPPPP>
##$VTLIST= <TTTTTTTTTTTTTTT>
##$WBST= 1024
##$WBSW= 4
##$XGAIN= (0..3)
0 0 0 0 
##$XL= 0
##$YL= 0
##$YMAX_a= 301104
##$YMIN_a= -298150
##$ZGOPTNS= <>
##$ZL1= 120
##$ZL2= 120
##$ZL3= 120
##$ZL4= 120
##$ABSF1= 10
##$ABSF2= 0
##$ABSG= 5
##$ABSL= 3
##$ALPHA= 0
##$AQORDER= 0
##$ASSFAC= 0
##$ASSFACI= 0
##$ASSFACX= 0
##$ASSWID= 0
##$AUNMP= <proc_1d>
##$AZFE= 0.1
##$AZFW= 0.1
##$BCFW= 1
##$BC_mod= 2
##$BYTORDP= 1
##$COROFFS= 0
##$CY= 11.3945322036743
##$DATMOD= 1
##$DC= 2
##$DFILT= <>
##$DTYPP= 0
##$F1P= 16.9975609425685
##$F2P= -3.02152046262296
##$FCOR= 0.5
##$FTSIZE= 0
##$FT_mod= 4
##$GAMMA= 1
##$GB= 0.15
##$INTBC= 1
##$INTSCL= 1
##$ISEN= 128
##$LB= 0.24
##$LEV0= 0
##$LPBIN= 0
##$MAXI= 10000
##$MC2= 0
##$MEAN= 0
##$ME_mod= 0
##$MI= 1.114404
##$NCOEF= 0
##$NC_proc= 0
##$NLEV= 6
##$NOISF1= 3.799351
##$NOISF2= 2.8
##$NSP= 1
##$NTH_PI= 0
##$NZP= 0
##$OFFSET= 15.70392
##$PC= 1
##$PHC0= -9969.137
##$PHC1= 6.6009
##$PH_mod= 1
##$PKNL= yes
##$PPARMOD= 0
##$PSCAL= 0
##$PSIGN= 0
##$REVERSE= no
##$SF= 200.130013532006
##$SI= 16384
##$SIGF1= 3
##$SIGF2= 2
##$SINO= 400
##$SIOLD= 16384
##$SREGLST= <1H.CDCl3>
##$SSB= 0
##$STSI= 0
##$STSR= 0
##$SW_p= 3612.71676300578
##$SYMM= 0
##$S_DEV= 0
##$TDeff= 0
##$TDoff= 0
##$TI= <>
##$TILT= no
##$TM1= 0
##$TM2= 0
##$TOPLEV= 0
##$USERP1= <user>
##$USERP2= <user>
##$USERP3= <user>
##$USERP4= <user>
##$USERP5= <user>
##$WDW= 1
##$XDIM= 8192
##$YMAX_p= 0
##$YMIN_p= 0
$$ End of Bruker specific parameters
$$ ---------------------------------
##NTUPLES= NMR FID
##VAR_NAME=  TIME,          FID/REAL,        FID/IMAG
##SYMBOL=    X,             R,               I
##VAR_TYPE=  INDEPENDENT,   DEPENDENT,       DEPENDENT
##VAR_FORM=  AFFN,          ASDF,            ASDF
##VAR_DIM=   8192,          8192,            8192
##UNITS=     SECONDS,       ARBITRARY UNITS, ARBITRARY UNITS
##FACTOR=    0.000296,      1,               1
##FIRST=     0,             0,               0
##LAST=      2.424536,      0,               0
##MIN=       0,             -298150,         0
##MAX=       2.424536,      301104,          0
$$ Real data points
##PAGE= N=1
##DATA TABLE= (X++(R..R)), XYDATA
0 0 0 0 0 0 0 0 0 0 0 0 0 0 8 -8 8 -8 11 -16 16 -24 25 -32 40 -48 55 -65 74 -89 100 -116 133 -151 174 -198
34 -198 223 -253 283 -320 356 -399 445 -496 550 -611 676 -748 826 -911 1005 -1107 1221 -1343
52 -1343 1478 -1630 1800 -1987 2199 -2441 2717 -3039 3419 -3874 4429 -5127 6034 -7262 9034
67 9034 -11824 17034 -53242 242125 -14463 -298150 80991 26500 -83270 77701 -12282
78 -12282 -72244 105952 30594 57592 101697 -61363 89940 301104 -27548 -62713 281979
89 281979 165093 6436 143762 117912 102484 190673 76051 49285 163967 89136 106194
100 106194 154356 12318 49621 221397 80258 -40760 91365 119397 57918 29241 15318
111 15318 51437 73630 14386 11647 29400 -17712 28058 58294 -40996 -67080 37698 37839
123 37839 -61735 -76319 -21837 513 -51962 -72875 -57557 -54771 -41022 -34324 -83115 -108945
135 -108945 -36515 -18530 -84577 -113741 -60751 -27797 -52516 -74137 -95726 -66823 -404 -28481
147 -28481 -127961 -67937 28828 -39824 -76658 -35954 -46660 -31565 19639 -54784 -92714 6352
159 6352 33029 -24997 -62629 -34748 41023 41045 -65490 -37059 57361 14256 2727 21609 -26632
172 -26632 19245 102792 2568 -40662 59172 65202 43769 34119 -7751 44982 117760 18568
184 18568 -17120 69751 54856 43725 59240 -1683 16328 109747 41309 -19036 45943 43604
196 43604 38734 55975 -6347 -10098 82048 43701 -24732 12274 23763 27629 33063 -15175 -21965
209 -21965 39806 23242 -13381 -9135 -24272 8119 31330 -37874 -56951 14999 2376 -32746
221 -32746 -19798 -47414 -28846 22879 -29240 -82087 -14988 5337 -36411 -34995 -43208 -39223 -2369
234 -2369 -11241 -61074 -46251 -6676 -1272 -26127 -58850 -27963 16298 -8254 -50587 -28739 -6523
247 -6523 -3260 -1729 -36298 -37628 13530 21939 -26865 -29931 -250 19767 20056 -20158 -26914 24578
261 24578 41645 -7813 -15450 11770 22728 32965 11300 -16229 15730 60011 23612 -8489
273 -8489 13692 34446 42731 22734 -7092 8588 54663 34903 -1970 4457 27451 43652 26335
286 26335 -2710 2871 39599 34555 9862 -3622 2653 38277 32690 -16875 -15751 32415 22441
299 22441 -99 -2338 -13134 11685 32622 -11048 -38366 7438 17299 -7742 -18507 -27377 -8076
312 -8076 16719 -10255 -47102 -18541 6094 -5717 -25572 -39582 -17821 7120 -11576 -42577
324 -42577 -29867 -10984 -831 -14602 -47687 -27766 11156 -4743 -37862 -26429 -13494 -596
336 -596 -171 -35538 -32766 9500 11236 -24706 -21480 -8498 4421 13956 -14515 -28450 7748 29757
350 29757 -2520 -16331 -1707 18310 24280 674 -11537 8860 32260 20327 1197 -3176
362 -3176 20068 39878 15291 -7306 7790 35359 30444 10108 -4070 16235 42641 20879
374 20879 -5245 6172 27588 24000 18448 4 -3918 30226 34251 -5923 -17443 19671 27563
387 27563 5087 -10505 -4551 14015 16324 -1405 -19623 -6568 11930 9839 -16126 -25456 -420
400 -420 12811 -5658 -29752 -20342 1303 6226 -20882 -34627 -8438 3945 -10771 -24639 -23688
413 -23688 -16376 3388 -6720 -38252 -24552 6506 -957 -26393 -24553 -15146 800 107 -26919
426 -26919 -27185 2430 8788 -14617 -20128 -12107 3875 7740 -11616 -19799 -2744 15130 6911 -9772
440 -9772 -15208 10940 26341 -472 -15331 6328 23329 13705 4307 -4484 9399 30211 16864
453 16864 -3477 4823 23582 26240 21715 -364 1469 38823 35914 -6663 -4048 35315 28544
466 28544 9040 8396 10255 18105 30827 16074 -8765 7481 29949 23061 -4929 -11566 14724
479 14724 29199 565 -22960 2600 18176 2791 -10694 -9851 -5544 3881 4383 -19594 -26427
492 -26427 -6077 8592 -14970 -37620 -18893 5773 -8236 -35156 -24960 -9060 -9429 -18433 -25141
505 -25141 -27115 -14812 -3370 -20252 -34983 -22052 -1254 -9784 -25735 -24846 -10625 3364 -8761
518 -8761 -26423 -16168 7462 -2545 -15377 -7081 -6562 -502 11771 -1345 -19414 7696 22617
531 22617 1874 -5467 3140 13588 20489 9512 -7803 11911 27292 13092 6106 8680 13392
544 13392 24214 25105 2364 4738 26598 29663 12533 -732 12213 32892 24278 -3338 5245
557 5245 25963 21961 11628 4074 4680 17722 26280 4296 -8954 7811 23780 13264 -10561
570 -10561 -8645 13654 20602 -6750 -18127 2409 13235 -1091 -12261 -9816 -8184 3788 1865
583 1865 -22840 -25726 5323 6402 -26329 -26693 -6318 -1628 -12674 -22945 -23628 -9042 -3008 -18878
597 -18878 -25792 -19070 -7106 -6097 -19342 -27831 -12598 1121 -11686 -22645 -18106 -2674 -366
610 -366 -13376 -18620 -6502 1769 -2487 -5264 -11657 -3676 11017 5383 -9944 -3173 12079 10420
624 10420 4521 -1406 4291 15450 16162 4884 1555 12710 20002 16212 4277 6943 17822 22005
638 22005 13957 4068 9176 22354 22165 4439 4316 14881 19564 15151 3697 268 14783 23013
652 23013 2398 -4821 7723 14944 8998 -838 -5807 2398 14346 2698 -12773 -8487 8384
665 8384 7943 -10083 -15611 -2581 6153 -4044 -14063 -15137 -4046 4133 -9429 -22591 -12439
678 -12439 2581 -4769 -16166 -18930 -8778 1992 -6885 -21086 -16086 683 -2554 -13504 -17781
691 -17781 -9268 253 -3193 -13105 -15622 -2366 4288 -4342 -15246 -7508 5245 1847 -6596 -9729
705 -9729 -1156 6336 4571 -7257 -5831 7402 8871 1688 -3416 1358 8945 12127 2049 -3945
719 -3945 6950 14768 8362 -1446 3496 10982 13790 7522 1843 4098 13281 15905 3211 -735 9322
734 9322 16034 8395 1365 2368 9156 14879 6022 -2687 2561 13506 9364 -1127 -1704 3941 10138
749 10138 4641 -4217 -5491 5928 9066 -2778 -9759 -1986 6945 307 -7497 -9552 -2245 3493
763 3493 -2917 -13633 -10617 2379 -554 -10224 -13750 -6515 37 -2608 -12847 -14960 -2151 1112
777 1112 -8737 -15361 -7773 -773 -2386 -9427 -13157 -5099 1796 -1487 -12241 -9257 1671 2847 -5383
792 -5383 -9587 -2944 3345 3897 -5162 -7456 2605 8543 1582 -5297 305 6041 7828 2143 -3065
807 -3065 1413 10946 9294 -1984 -165 8693 11983 4755 513 3081 9880 11794 3182 -1251 4710
822 4710 12821 7040 -225 809 6867 10538 4669 -1779 -94 9670 8326 -1473 -3621 3660 7738
837 7738 1885 -2963 -3803 3242 6063 -469 -7266 -2927 5568 1701 -5704 -7331 -1072 2477 -828
852 -828 -8545 -8146 1611 1979 -6143 -9999 -2775 836 -1641 -6399 -9677 -3314 2423 -2320 -11297 -6441
868 -6441 1747 297 -6111 -8220 -3235 1832 715 -7713 -6985 790 3292 -2453 -6411 -3237 2005
883 2005 4418 -2661 -6059 115 6874 2483 -4650 -2115 4608 6438 29 -2360 966 5706 6450
898 6450 698 -2550 2805 10069 4070 -2212 679 6808 7355 2212 -1644 1232 8774 5916 -1009
913 -1009 -1307 5311 6538 3221 -147 -1786 4906 7750 -148 -5577 2053 6789 1113 -2563 -2839 1334
929 1334 4122 1121 -6079 -2927 4095 1612 -3032 -5304 -1740 2175 1326 -6189 -6600 788 2078 -2882
945 -2882 -7241 -3473 1023 1152 -5165 -6479 -1408 1009 -304 -5762 -6024 -247 3543 -3558 -7346 -1891
961 -1891 1932 979 -3742 -5377 -1295 4665 173 -6712 -2645 2619 2295 -1504 -3636 -2256 4026 4193
977 4193 -3642 -4524 3358 5987 -706 -2565 -624 3703 4923 42 -3409 1426 6587 2433 -1491
992 -1491 -940 3517 6190 2541 -2105 68 7081 5031 -419 -1389 3421 6263 3050 -897 -296 4783
1008 4783 4809 1766 -1771 544 5330 4238 -1438 -2773 3058 3891 925 -2121 -2026 1942 3499 -1094
1024 -1094 -4866 -447 2271 430 -3010 -3666 -1741 1482 -625 -6401 -4117 503 580 -4213 -5025 -2863
1040 -2863 -527 102 -4565 -5749 -1945 1470 -2279 -6290 -4006 -291 545 -3208 -5526 -2746 2250
1055 2250 629 -4254 -3957 582 2821 -693 -3623 -2253 2815 3130 -1085 -3081 726 5709 2299
1070 2299 -2069 -1117 4400 4730 1375 -1189 285 5521 4737 -377 -1503 4056 5775 2452 -484 397
1086 397 4953 5629 1194 -2380 2189 5326 3105 -1099 -1020 2968 4108 1247 -2167 -539 3283 3320
1102 3320 -1566 -3315 1398 2847 513 -2731 -2392 570 2088 -584 -4424 -1223 1273 434 -3138
1117 -3138 -3104 -1133 716 -424 -4204 -3187 -254 1236 -2322 -4248 -1955 705 7 -2746 -3508 -1975
1133 -1975 1413 -134 -3686 -2816 717 991 -1939 -2636 -2061 1092 1474 -1810 -3545 86 2627 -289
1149 -289 -2304 -2094 1308 1918 -109 -2902 -654 3159 1862 -1711 -2438 1947 2858 693 -1695 -625
1165 -625 2653 3372 -21 -3018 1053 3983 1708 -1363 -699 2452 3486 1296 -2081 82 4041 3277
1181 3277 -907 -1254 2398 3519 1742 -1395 -349 2352 3533 605 -2027 986 3687 2365 -1419
1196 -1419 -908 1443 2769 785 -1836 -677 2279 2187 -1504 -2046 120 2027 546 -1913 -2120 378
1212 378 2260 -709 -2975 -1517 1012 384 -2412 -2680 -1229 793 -529 -2645 -3127 -228 653 -1960
1228 -1960 -3256 -2032 62 -65 -1767 -3521 -1281 713 -911 -3091 -2631 252 211 -845 -2644 -1476
1244 -1476 999 857 -1713 -3099 -76 1826 225 -2332 -1170 1426 2084 572 -1916 -176 2404
1259 2404 2070 -938 -829 1727 2636 1635 -959 45 2403 3452 586 -941 1535 3819 2386 -531
1275 -531 128 2181 3409 1573 -729 344 3144 2895 -492 -411 1328 3006 1574 -680 -810 1481
1291 1481 2670 -4 -1812 -261 1973 820 -1224 -1842 -318 1834 168 -1990 -2042 862 981 -1524
1307 -1524 -2598 -1236 545 -243 -1917 -2716 -474 872 -914 -3026 -1640 149 -290 -1748 -3106 -1508
1323 -1508 304 96 -2513 -2610 182 697 -639 -2414 -1483 329 724 -1293 -2476 -281 1052 584 -2013
1340 -2013 -1403 659 1389 285 -1425 -280 1300 1937 -700 -1266 721 2089 888 -931 -1 947
1356 947 2417 764 -1040 333 2633 1958 -635 -145 1372 2472 1312 -346 -473 2106 2716 108
1372 108 -682 758 2399 1168 -254 -547 732 2320 722 -958 -357 1755 1168 -358 -946 228
1388 228 1633 899 -1116 -1250 675 1219 -398 -1672 -884 929 390 -870 -1973 -624 718 -51 -1793
1405 -1793 -1843 283 573 -994 -2421 -1018 239 111 -1822 -2418 -770 534 -526 -2418 -1229 9
1421 9 372 -911 -2000 -1161 551 491 -1810 -1532 190 886 -275 -1132 -615 626 1475 -578 -1115 26
1439 26 1679 879 -657 -408 840 1960 546 -554 -233 1817 1585 100 -253 797 2323 1266 -153
1456 -153 -158 1188 1854 436 -504 66 1945 1433 -9 -245 740 1631 795 -376 -598 1210 1745 -179
1474 -179 -1299 -120 929 471 -523 -1243 12 961 447 -1662 -955 460 435 -738 -1793 -749 136
1491 136 402 -1564 -1640 34 453 -818 -1853 -937 168 507 -1143 -1692 -456 224 20 -1554 -1251 -68
1509 -68 660 -620 -1529 -619 303 486 -768 -1098 -302 1090 91 -989 -731 378 601 -86 -754 -374 1101
1528 1101 834 -513 -499 481 1327 379 -363 -496 699 1261 272 -555 218 1281 846 -125 -383 347 1176
1547 1176 609 -398 -152 1203 1264 18 -630 407 1131 891 -18 -708 769 1158 693 -553 -323 631
1565 631 870 -154 -981 -149 687 610 -707 -923 471 1013 -129 -1129 -206 510 538 -585 -1037 -226 912
1584 912 32 -1171 -830 386 842 -568 -1012 -390 223 470 -954 -1058 -12 649 -179 -1084 -569 141
1602 141 682 -467 -946 -347 387 15 -817 -922 121 672 -156 -676 -502 612 457 -294 -661 179 671
1621 671 10 -395 -307 159 572 -12 -652 -175 423 430 -463 -793 53 516 443 -98 -451 682 731 405 -738
1642 -738 -225 657 518 -101 -469 115 785 556 -273 -310 410 1031 -5 -334 173 714 730 -62 -634 293
1662 293 1100 377 -528 -285 425 977 23 -510 -51 789 370 -665 -688 257 797 -107 -662 -187 407 457
1682 457 -168 -910 -383 618 150 -832 -835 195 423 -303 -835 -692 154 -14 -500 -905 -73 289 -171 -687
1702 -687 -766 18 187 -400 -770 -450 218 -64 -511 -920 58 310 136 -707 -574 414 387 -23 -478 125 442
1723 442 364 -343 -218 288 764 520 -175 -276 436 598 19 -360 169 406 481 181 -58 553 1035 372 25
1744 25 318 552 787 -22 -199 -3 879 543 151 -78 379 803 248 -146 -117 553 734 -34 -570 46 561
1765 561 -113 -454 -419 153 164 -304 -538 -430 132 107 -304 -722 -288 46 -294 -772 -800 160 158 -503 -882 -418
1787 -418 133 42 -559 -798 -227 163 -214 -813 -747 209 165 -599 -587 -159 116 132 -443 -430 -78 422 96 -377
1809 -377 21 409 561 -326 -244 156 145 403 -177 -193 552 665 164 -32 317 559 701 17 -90 414 771
1830 771 493 -120 177 568 691 160 54 134 568 689 61 33 263 462 306 -98 -174 512 509 200 -46 -6
1852 -6 461 242 -192 -265 325 361 -211 -295 -274 117 219 -137 -727 116 126 -35 -200 -699 -105 7 -36 -775 -671
1875 -671 -84 75 -406 -744 -34 42 -93 -716 -621 -149 28 -411 -876 -261 45 -108 -335 -476 -172 358 78
1896 78 -487 -417 171 106 -114 -493 -301 351 205 -102 -254 154 363 96 -140 -133 144 206 -17 -33 -45 612 417
1919 417 207 -25 477 576 217 -4 65 544 484 168 -166 121 691 200 59 -110 339 715 107 -13 -140
1940 -140 308 283 -101 -180 94 500 146 -303 -216 95 33 -292 -334 -238 131 60 -432 -263 -74 -62 -29 -412 -261
1963 -261 -362 13 -172 -531 -112 103 136 -507 -309 -15 129 49 -305 -551 -156 -181 -86 -245 -72 11 92 -479
1985 -479 -314 135 211 149 -135 -152 269 46 -88 -72 335 350 8 -80 -105 414 621 2 -128 207 377 131
2007 131 251 -92 31 513 138 131 -63 311 364 249 -149 274 343 223 238 107 152 385 285 65 62 131 157
2030 157 -180 -259 -201 -90 211 -133 -44 265 -11 81 -218 -254 -61 139 -37 -664 -231 154 -101 -381 -392 -212
2052 -212 -27 -104 -366 -229 -223 -42 -255 -361 46 208 6 -472 -388 121 165 -150 -148 -189 199 -37 -283 -384 -273
2075 -273 43 216 -155 -256 154 42 -81 -190 -63 433 214 44 61 16 528 26 -39 105 438 318 -21
2096 -21 -51 -83 279 307 -34 -180 308 269 99 -209 150 419 407 85 -63 247 437 280 112 101 384 117
2118 117 150 -131 276 115 228 223 -10 174 57 231 -484 -162 109 71 -140 -234 -69 234 145 5 -159 -346
2140 -346 0 -142 -15 -228 -21 -41 -314 -205 -271 -370 -22 -193 -259 -171 -121 -221 -257 -378 238 57 6 -257 -161
2163 -161 -266 -113 -17 -72 -33 55 279 -225 -433 146 244 16 -270 100 156 -79 -105 -245 35 95 471 -257 146
2186 146 342 193 100 -61 145 243 195 85 222 196 508 188 -193 287 180 466 190 59 86 477 120 -152
2208 -152 13 -17 449 -55 89 114 324 244 273 35 -9 10 -33 77 97 -48 286 116 -133 34 82 150 -177
2231 -177 -134 -470 -77 -97 -18 -227 90 -179 -289 -386 -361 -71 -113 -235 -402 -187 27 -248 -408 -160 14 26
2253 26 -29 -257 -411 -93 -9 -107 -215 53 -245 -107 -326 -223 139 210 -7 -163 -126 139 110 96 50 213 187
2276 187 267 99 -190 182 328 66 6 46 457 276 139 171 222 544 225 -95 62 349 229 -29 49 318
2298 318 196 226 -2 50 319 254 234 -134 17 373 185 168 -246 79 -121 136 -95 -178 129 57 -219 -52
2320 -52 -225 66 106 -12 -104 123 2 31 -211 -185 34 -16 -107 -304 -102 -96 -151 -371 -262 -214 -130 -378 -309 -253 -176
2345 -176 -14 -126 -246 -318 6 -69 -193 -26 -486 -113 -144 -65 -206 121 -44 -341 -123 -84 110 -74 -369 222
2367 222 83 108 51 167 -50 48 119 48 41 143 190 -10 185 135 346 134 219 -48 134 335 243 44 -60 249
2391 249 290 133 204 1 72 315 104 209 138 303 -183 119 51 357 230 251 33 13 -18 -126 -91 -228 69
2414 69 337 110 -125 88 117 124 -238 -37 89 -86 -90 68 -221 -33 -163 204 -118 -95 -65 46 -81 -283 -105
2437 -105 -296 -62 56 -129 -20 22 -40 -133 -74 130 -398 -63 -64 -28 185 58 -92 -137 6 10 107 -176 -188 384
2461 384 160 57 -72 -182 -90 113 -127 286 -11 233 307 70 19 215 -16 319 -117 275 205 267 -205 195
2483 195 245 241 254 -28 187 93 -17 82 121 -77 268 88 41 -194 222 250 -135 -358 -51 42 32 81 -161 -20
2507 -20 -73 -241 -155 -457 -118 55 -119 -52 -232 -59 -29 -120 -393 -208 103 -13 -225 -83 109 -221 -228 -375 -157
2530 -157 38 -22 16 -19 -182 76 -193 -106 -86 32 189 -27 -88 126 340 -16 -31 34 284 115 44 -20 225
2553 225 -121 91 127 25 15 292 15 224 -73 399 261 181 -121 85 252 -53 69 -50 231 -13 -6 -68
2575 -68 -17 22 407 -103 -195 267 236 -135 -59 150 15 124 -192 -256 27 -64 114 29 -242 -55 114 -159 87
2598 87 -158 -214 148 -74 -264 -127 45 -213 -94 -32 -140 -341 -33 -77 -100 -93 258 -226 -104 36 70 189 51
2621 51 -17 -81 -6 -45 -68 -140 14 141 168 180 -12 220 206 -18 -51 272 192 105 69 -26 138 189 -23 -61 114 82
2647 82 335 -125 150 -104 26 -49 113 134 -107 382 44 -15 -73 150 130 -103 52 152 -125 110 -51 47
2669 47 -117 193 0 -10 88 44 47 -33 -165 -166 19 -32 -326 -413 142 -230 -430 -231 -61 -50 -180 -273 -58 -14 -254
2694 -254 -138 -167 -199 -248 -5 -237 -219 -46 -2 21 -52 -245 70 194 -82 -59 -46 97 11 -140 -27 44 136 110
2718 110 -62 -219 187 -66 -148 -229 89 25 87 62 -38 -1 324 -68 108 -129 146 161 -38 -53 -94 99 227
2741 227 5 -15 261 122 136 56 68 64 -30 66 98 136 209 215 -8 -58 191 118 -105 -223 45 39 70 10 -150 -12
2767 -12 203 344 -7 -7 153 159 -159 -143 -353 65 -15 107 -9 8 115 132 -176 -11 44 -78 189 -11 81 -55
2791 -55 69 -190 -168 -121 -60 50 -325 -5 45 49 12 -419 466 83 24 -232 40 -84 166 169 -176 95 162 -36
2815 -36 -12 61 223 85 -42 173 -3 -94 12 19 101 73 157 47 -57 -226 202 175 -41 129 -206 40 275
2838 275 362 97 96 146 16 299 -176 46 217 150 161 142 259 153 9 45 95 41 -159 28 186 -65 1 100
2862 100 -177 -23 -9 32 -60 -177 22 43 -42 -144 -110 -23 -58 -1 -313 1 -31 -77 -219 -267 60 -160 -211 -376
2886 -376 -384 -138 128 192 -347 -81 -311 -220 -153 -154 -158 -95 144 310 11 240 -166 -45 128 -62 -98 10 -12 1
2910 1 -56 123 298 -73 -51 82 80 -23 -10 210 92 -7 303 125 120 224 67 85 -133 216 101 158 150 242 139
2935 139 439 -20 -20 34 153 79 -197 279 71 217 78 -180 325 156 19 -198 -67 20 -106 -289 -118 78
2957 78 4 199 -229 5 -113 -271 62 -107 -167 -54 223 -84 -316 -47 196 62 -216 -273 82 -51 -335
2978 -335 18 -84 201 25 -180 -203 -251 -128 -126 -57 -230 60 122 89 -254 -227 -49 -88 -150 -48 53 70 -15 2
3002 2 -71 -8 144 13 -27 -33 69 -49 101 -125 55 88 50 -107 137 394 -47 -166 -299 38 89 340 45
3025 45 81 87 221 287 -125 -114 61 -169 8 90 119 -59 -29 -6 -61 -9 -30 -28 58 -187 16 233 -85 120 96 -14
3051 -14 71 -172 -46 -260 13 -16 -237 -119 19 -56 -105 -291 -237 -85 -171 -178 -2 -104 229 -84 -82 -34 96 70
3075 70 -57 150 -16 11 -110 -86 95 -191 24 45 -200 -163 90 115 -13 215 29 -148 173 64 -17 320
3097 320 200 69 -190 -71 -14 144 -108 -61 -46 142 -38 28 26 124 -54 -9 0 56 71 61 -260 -171 209 170 -25
3122 -25 -127 -104 6 -37 96 16 -95 143 -13 -151 13 1 -168 -30 16 -213 -13 47 -168 -48 -20 -141 54
3145 54 -104 -241 -155 168 -47 64 -4 135 98 236 54 17 213 -128 -87 -102 -125 -186 -66 -147 11 46 -222 -23
3169 -23 88 50 112 -22 81 13 69 122 30 -128 -63 62 176 -83 -363 321 241 132 -122 -202 57 -61 -107 152
3193 152 -73 -233 -62 -91 -75 80 41 -103 -78 -170 -64 190 -225 32 -171 50 146 15 -177 231 -55 -169
3215 -169 23 -107 170 32 107 -100 39 -12 -143 -112 -33 -21 74 -299 -24 -61 -145 52 -257 -162 -136 -172 -301 -42
3239 -42 42 174 121 130 -342 103 74 164 -47 125 92 272 -105 -287 -6 48 26 119 -88 110 -91 -183 -22 120
3263 120 121 43 79 -2 182 45 88 -51 65 -214 159 168 -195 -170 29 83 -95 -127 -106 271 -78 -18 -270 82
3287 82 70 -65 -49 90 6 -364 -41 -1 121 95 49 92 -169 162 45 -43 -13 94 73 305 -140 53 30 13
3311 13 70 -111 53 -126 97 -170 -344 -155 -5 24 -244 -234 37 -60 -5 -75 -170 -121 271 98 -121 -7 28
3334 28 -132 -330 -39 100 -14 20 -128 -339 74 49 8 4 -34 79 -86 -51 -143 22 -45 -44 -44 -93 271 -115 -176
3359 -176 -249 -20 210 -8 67 53 221 197 -101 32 -16 -248 -81 180 -3 -138 155 147 96 -73 88 296 117
3382 117 -292 -277 37 -9 -299 281 130 -7 -150 -4 -50 57 151 81 40 312 -80 156 -9 27 -117 -94 -136
3405 -136 116 237 20 51 -180 -121 91 -221 -14 -37 -123 -272 -135 -18 12 -60 -106 -67 -178 -230 60 -35 -138
3428 -138 -309 52 -306 -27 -77 112 -97 -31 35 -292 266 -191 -128 -44 -53 12 -24 1 109 -92 86 -77 95
3451 95 68 89 98 4 -88 170 -65 45 213 212 204 188 62 -306 175 202 194 206 118 -21 -9 -38 273 145 154 238 1
3478 1 18 45 -121 236 69 2 28 136 212 153 -140 -270 -23 -102 22 159 -93 1 -67 53 -81 -155 108 -66
3502 -66 31 49 -253 -352 72 -93 -65 24 -31 -231 -61 -218 65 -123 2 -8 -122 -195 -176 -7 -38 162 74 -149
3526 -149 -33 -48 129 123 -97 -62 29 50 190 120 -185 182 87 30 -16 75 -65 331 159 -12 204 -27 -126 268
3550 268 7 -137 -52 197 -79 338 219 -91 -64 44 -44 277 -114 18 93 -8 3 71 -164 84 11 227
3572 227 -3 19 225 54 8 203 -147 -27 245 -28 152 205 -163 -72 203 126 19 -165 122 -88 185 -77
3594 -77 74 89 66 -34 -3 -31 -190 32 272 -39 23 -243 -67 156 -40 -214 -126 -104 -10 0 69 33 58 -32 51
3619 51 -54 -154 -253 -72 -124 -142 -203 127 -139 1 0 -155 -110 100 -208 162 -187 -4 100 -5 81 -190 -92
3642 -92 -111 -213 -288 -93 -14 0 57 54 -108 240 6 99 19 11 -26 -211 22 97 76 -171 67 -140 -139 -46 -216 -92
3668 -92 -36 -159 92 14 -203 31 -95 -187 -149 -89 -72 -27 -129 258 125 17 34 -85 43 37 -22 -48 -56 57 111
3693 111 25 -50 -105 -149 -55 177 -79 111 37 20 -198 -6 -60 103 26 18 41 -230 142 -129 -39 80 -35 -141
3717 -141 -93 -8 -82 -72 -9 148 270 -58 -167 -123 -20 -106 16 71 254 -68 18 6 162 36 120 -65 137 -388
3741 -388 -2 29 64 25 86 23 17 -177 -106 -38 -24 147 -57 173 323 -163 -323 89 65 61 20 170 -151 101 32
3766 32 -165 84 -28 250 -143 -22 -23 29 103 -80 -86 -37 113 -71 216 -87 -99 -24 -86 -34 98 58 -184 -118 107
3791 107 -97 -68 28 -30 -125 186 24 -64 201 36 158 12 226 -109 125 10 -172 52 12 129 99 214
3813 214 65 164 40 14 -190 192 -117 58 156 239 154 -82 285 31 36 440 257 188 -41 169 251 1 17
3836 17 -89 96 5 -156 -43 -38 -38 -17 100 40 66 -99 2 159 152 208 129 -102 -195 -77 46 103 -18 -162 -102
3861 -102 95 61 -183 -52 79 212 -126 -12 -1 -184 104 -198 88 -80 0 83 157 -65 66 33 10 -54 205
3884 205 228 -3 -36 -19 231 214 24 5 -47 308 139 130 109 -19 52 -124 -12 80 -65 -25 354 11 168 330
3908 330 180 -30 -18 -165 -23 88 181 11 -94 100 139 -106 -6 -186 137 117 248 -98 -100 21 -82 95
3930 95 -22 -239 -50 -29 -73 -29 -55 -52 38 -47 -67 -58 72 97 -180 76 18 -11 238 -45 -21 -164 -79 -62 82 -69
3956 -69 25 -54 -47 -190 -45 11 57 -183 103 -42 14 -26 -133 290 -8 13 195 -10 6 -87 54 79 99 -138 185
3981 185 300 24 66 63 31 290 88 69 68 11 83 -15 60 -162 -187 -86 -47 -39 79 126 -84 48 172 204 -53 163
4007 163 134 212 -32 -44 46 182 93 -108 94 -83 -145 -6 322 -2 -136 7 -115 -203 -56 -13 -55 181 79
4030 79 -116 86 13 177 -157 -239 -55 -128 -70 207 244 -152 -290 -275 -72 -127 230 44 3 -26 30 -27 -49 -50 39
4055 39 135 34 111 -1 16 110 -4 211 -55 -81 24 155 39 114 -123 -45 35 -225 120 -92 153 196 185 232
4079 232 -24 78 -16 64 68 57 -16 -153 25 -180 -49 -199 82 225 -135 -5 -73 -28 104 -89 -42 113 24
4102 24 -34 113 64 7 57 201 -143 -137 157 58 -33 136 102 -104 -97 45 16 31 141 85 -231 162 -19 -188 54
4127 54 17 46 92 111 4 -67 -24 -14 -105 -46 127 -92 173 41 23 -157 -62 47 -5 2 112 -260 19 -89 -65
4152 -65 41 -100 209 -167 -98 -115 -176 -57 -28 -23 36 104 -36 169 133 173 7 -4 213 98 120 113 -57 -13 -128
4177 -128 151 207 -6 218 178 -133 308 52 -76 37 -84 91 -61 -63 -44 161 -4 178 206 108 78 -37 67
4200 67 175 -140 107 94 152 -239 255 189 -143 56 -138 59 102 101 -24 54 -40 -112 -33 101 -71 161 117 -120
4224 -120 291 -179 119 -220 -60 -30 -229 -34 -41 -32 -269 167 45 -173 -67 -96 180 44 -129 -19 -213 68
4246 68 164 -227 -36 164 166 46 23 50 -54 -121 -13 40 10 190 -137 -79 33 49 170 1 159 -93 -159 190
4270 190 -17 226 96 101 224 194 202 0 11 193 49 -203 -1 -105 52 32 258 48 -153 21 32 -69 88
4293 88 -33 5 421 145 20 38 -142 -90 1 -87 252 -186 20 94 -141 -238 -74 -334 281 -210 -16 46 -167
4316 -167 74 92 -47 -86 75 -105 -114 28 -197 -104 98 -139 34 -200 -143 372 -21 -124 98 -92 -140 -151 129
4339 129 174 198 146 282 -148 20 -31 36 -95 127 -52 -110 -141 50 26 -176 83 222 -3 -76 -67 82 332 -164
4363 -164 -135 -70 -42 41 20 -19 168 101 59 -84 28 -7 97 -67 41 43 -79 -105 111 -141 -136 8 -193 -198 12
4388 12 11 65 -205 -14 -82 -149 -19 44 4 -186 -8 61 119 -198 25 -93 63 -138 -83 -32 -135 -86 101 25 -49
4413 -49 61 -65 -174 52 36 -96 44 -44 -139 192 87 -3 67 -116 72 -96 -249 -144 35 -90 -112 -23 244
4436 244 -47 210 200 -41 187 75 35 133 34 -134 284 39 -146 2 2 -80 207 81 -227 20 -215 -52
4458 -52 -53 279 -9 41 9 175 -31 -143 -77 -81 -6 -170 -85 47 215 134 -128 -16 -3 -160 -79 -2 245 -184 -110
4483 -110 99 -79 -128 110 -176 115 -176 -14 150 -334 -10 -28 -215 61 179 287 -135 -37 25 -147 110
4504 110 -4 -64 -26 -90 -201 105 -109 6 200 1 140 246 -63 90 86 97 37 -20 76 221 64 -45 -121
4527 -121 -54 -72 93 118 -132 253 102 51 -111 160 68 -65 21 -247 42 209 -65 137 62 170 181 47 174
4550 174 90 86 129 13 67 353 -104 -58 8 -65 -91 -31 165 204 -207 97 5 6 -278 -66 -80 1 92 -57 4 -315
4576 -315 -125 -183 192 -153 -24 -68 98 5 -41 -178 92 93 -21 -23 237 150 149 19 -46 3 -50 -4 113 203 164 -74
4602 -74 -202 76 81 121 -120 121 93 215 146 68 126 47 -130 -216 3 -56 3 267 104 -13 -54 -30 23 200 199 194
4628 194 -57 100 -14 79 -123 135 130 -12 59 122 94 -251 -101 -46 70 -238 177 -48 -59 72 106 -88 -173
4651 -173 -155 25 -29 -66 124 -48 0 44 -38 -73 18 -120 16 -63 84 76 -224 -68 -105 -111 -107 114 -19 175 -101
4676 -101 -143 88 77 -8 346 -60 65 -103 -149 -340 -52 -109 -93 -13 135 -73 181 -128 -83 -53 41 -11 -120 -2
4700 -2 105 -87 -80 -41 -317 164 -10 258 -228 -146 98 35 -26 -93 -18 -67 -304 31 292 99 185 -34 5 -70 93
4725 93 66 -33 41 70 -137 37 205 83 -169 156 164 12 -97 -57 89 -89 -3 -281 54 13 159 88 27 7
4749 7 145 113 -78 171 -46 175 -3 -45 -163 50 -84 -198 -7 -39 -132 283 81 38 -198 -208 -102 8 142
4772 142 -187 -2 144 -154 42 -129 -210 97 -17 -94 117 150 -181 57 -179 67 146 85 15 -74 -168 -45 -134
4795 -134 53 -94 56 112 333 -18 5 -217 51 -200 -12 -127 72 95 -84 57 74 -92 218 -17 -34 -23
4817 -23 31 9 82 -29 124 103 105 217 -116 -58 7 -14 -49 189 167 44 48 -72 -55 37 82 -261 300 80 85 -121
4843 -121 -116 111 -223 174 -179 -220 -92 -185 3 -42 -18 35 45 -45 -29 -28 93 124 -82 111 47 -143 -48 18 -74 -106
4869 -106 125 2 96 -49 80 -345 1 -82 -16 99 -219 -163 127 -77 -184 33 -80 82 142 -132 145 172
4891 172 -4 69 39 194 165 135 111 64 108 37 62 131 -73 53 26 43 -1 188 -37 35 162 -7 -95 200 -151
4916 -151 -31 135 34 -133 -66 40 -86 155 84 -4 107 288 -166 1 -6 -217 -47 -50 -47 -112 89 -78 253
4939 253 97 40 -88 -2 -41 -66 -25 -226 26 -138 230 -63 -87 3 60 167 2 -183 -135 -24 68 -44 155
4962 155 -47 -232 -53 61 12 4 66 70 8 177 89 -216 17 -86 -117 72 117 112 -29 -277 13 210 58 -52
4986 -52 -23 18 170 -93 -20 -23 183 -149 -25 15 -154 -6 104 66 -17 -18 148 -9 82 -29 -85 205 96 -56
5010 -56 112 -208 -229 15 -42 -234 -73 -113 90 144 -186 -185 -121 -14 -122 77 16 -142 156 9 80 -26 180
5033 180 155 195 46 124 37 -33 -152 -131 -118 -6 -71 30 -253 -105 46 -152 -276 -115 -183 29 -239 193 17
5056 17 -63 -72 242 -21 140 -247 -100 134 186 135 87 160 70 26 72 74 -42 36 -65 -155 326 220 -23 -93 19
5081 19 -190 78 174 80 195 -5 419 -279 -322 -36 -21 18 123 -14 45 145 -59 -222 89 -56 -40 217 -41
5104 -41 -180 98 113 -80 -37 25 -2 119 295 54 -2 -93 55 -9 26 6 -260 18 -40 -145 -18 -182 -63 50
5128 50 98 5 -93 15 74 -197 -162 -9 -147 129 -124 -94 -66 -84 99 -141 -95 18 165 -250 270 -132 69
5151 69 -237 47 100 53 -113 151 170 -286 168 -23 167 94 146 154 -17 79 -147 -239 -311 14 87 -240 253 145
5175 145 -15 27 -76 -124 -118 -243 -4 -134 219 381 42 98 123 147 -24 -28 52 16 -13 216 117 120 7 171 -101
5200 -101 -67 -150 40 -27 -100 68 110 -117 231 41 -9 -214 72 9 -2 115 -8 139 -181 104 75 152 -137
5223 -137 226 12 -19 51 -40 -62 -77 76 10 45 -37 23 14 94 -275 -70 122 61 96 1 208 -149 297 -75 -239
5248 -239 -19 111 99 78 174 -82 -49 157 51 16 -39 -187 -19 201 128 62 125 82 -21 -254 4 -108 95
5271 95 -73 11 -139 -28 154 36 174 30 74 205 -50 109 100 -8 63 187 -233 -23 47 -57 -168 91
5293 91 102 -14 -19 26 12 -22 86 88 62 163 -47 -143 169 -71 -140 -192 -45 -18 69 145 -181 -132 -19 77 175 36
5319 36 39 166 132 4 -53 170 -82 42 133 122 95 -70 -71 11 -67 255 113 -310 140 -70 135 12 -131 40
5343 40 252 29 86 -93 29 -176 16 -121 -32 -133 145 9 138 17 187 166 -67 74 -56 -16 -123 -256
5365 -256 135 -87 49 193 -92 93 -205 -79 -58 27 300 -66 -95 -93 231 140 107 80 -191 -73 -91 123 -92
5388 -92 178 -151 23 -175 142 300 63 113 299 208 -173 198 214 -108 -142 -47 148 180 -19 -41 -70 78 -129
5411 -129 129 -27 21 -54 -205 -48 -3 112 -51 132 -74 -106 -144 1 33 -172 175 10 -52 -8 -191 -116 32
5434 32 112 24 186 -14 93 -101 -6 146 -13 -28 -113 178 20 26 139 67 -74 31 -98 202 64 -196 -147
5457 -147 -89 -35 179 82 -226 110 121 -135 37 50 -253 -6 49 -82 -135 46 57 91 273 102 164 -84 125
5480 125 -29 -165 115 -86 211 19 -150 42 -37 44 54 5 -101 145 247 3 336 122 192 53 -9 35
5502 35 -79 -251 -84 130 -67 10 -86 -156 -97 22 49 150 201 -55 -59 80 239 270 155 -28 -109 -13 273 54
5526 54 -137 58 33 -271 -77 190 -26 -38 -23 -4 -130 18 36 147 -76 95 175 99 -42 -122 -54 163 -75
5549 -75 -58 154 106 190 41 105 -5 147 58 70 145 34 -56 47 1 42 54 -14 197 -57 173 -31 -49 -111 160
5574 160 -50 -133 88 6 137 -135 -254 164 -75 -113 -71 32 -45 -12 47 -103 15 146 -222 69 -98 -128 -110
5597 -110 -60 8 7 13 -11 -70 51 29 -345 60 -205 -38 -83 -25 -101 -96 37 -87 -12 -23 -53 -93 -84 163 -30 126 -189
5624 -189 -63 179 41 -128 66 18 -128 108 31 -3 90 -132 -34 163 134 165 -9 -174 -97 12 71 -9 -160
5647 -160 -93 115 151 187 -97 -45 146 239 -280 201 28 -130 -36 -282 60 140 -67 47 -283 -70 -159 33 -183
5670 -183 27 -78 -66 91 151 -44 -167 114 39 59 -124 78 -176 87 91 182 189 -136 197 -53 -80 26 -103
5693 -103 59 98 56 32 63 -17 -381 159 155 162 99 192 -81 -217 259 105 80 101 -31 108 -157 300 30 4 42
5718 42 -87 55 -119 -11 117 167 -107 108 123 174 117 77 12 43 101 -94 31 43 52 151 -103 -103 -29 -51 -184 -48
5744 -48 -87 -153 -67 8 -137 -37 -30 151 80 -3 102 71 -130 54 -59 -1 163 116 54 40 36 -90 27 -231 -235 42
5770 42 23 -147 7 -112 -149 -328 -46 27 -119 4 19 101 -104 87 -18 18 33 -98 208 -120 2 90 51
5793 51 -115 -30 153 6 202 226 68 1 -4 42 78 147 -69 34 -141 31 -128 178 22 -136 133 50 116 -266
5817 -266 46 -253 -50 -151 -59 -17 -187 6 -32 -18 -32 -23 -74 97 -80 46 121 161 -141 -298 -100 -156 16 -45
5841 -45 -2 -132 184 -118 218 322 -63 44 -5 169 44 59 -151 73 -98 -21 -14 -119 1 -121 -120 -138 73
5864 73 -50 107 191 20 -177 -58 104 -156 -283 -123 66 -7 -13 -69 23 72 -8 -143 -74 -102 21 -101 -32 26
5888 26 -22 23 151 -2 42 7 33 -102 -281 38 127 60 -55 218 215 -218 -26 -57 102 238 164 -117 -20 127
5912 127 54 26 -73 -291 112 57 -41 -233 176 30 -94 169 -76 -29 39 -75 216 90 70 71 -30 -21 92 -25
5936 -25 -299 10 44 -96 -74 134 90 -272 -83 207 -85 -241 -82 -55 142 -120 191 -119 -88 -49 -34 237 5
5959 5 251 124 -116 85 62 -80 67 -56 1 -149 100 29 -47 69 21 57 30 -102 -52 126 79 334 232 5
5983 5 167 -96 133 -14 -128 -63 143 -112 92 143 20 -105 55 71 82 -92 -100 38 91 50 -41 208 -26 64
6007 64 -66 48 -278 -252 -158 -73 128 78 -23 -371 -50 140 -90 -198 121 15 233 -63 -79 8 14 -117 -108 -69
6031 -69 -44 -154 -50 1 267 -6 55 -162 77 -87 121 -32 235 -63 261 50 -4 28 307 268 -62 120
6053 120 22 -60 -131 -6 47 221 33 218 159 77 -63 7 -56 58 -109 -17 -36 -123 -108 9 -161 71 -86 -242
6077 -242 -117 136 186 -92 -217 47 -85 -157 -49 -172 173 51 -70 200 126 -228 -170 -72 141 29 -81 35
6099 35 168 -201 138 84 -89 -55 -74 -130 304 -22 222 201 16 -187 -20 18 -96 184 176 66 41 -136 106
6122 106 93 -165 -56 -136 -98 152 131 102 88 7 20 124 -28 -75 -217 18 63 205 137 -98 -62 -49 -48 -101 -344
6147 -344 -192 -152 -164 130 45 88 -26 214 40 327 231 206 149 -37 -48 -3 90 -57 119 -134 -129 -98 35 -56 -36
6172 -36 -43 4 65 -49 42 -109 72 -87 -157 84 -51 131 -131 50 1 -122 -85 67 141 76 231 196 -151 -27
6196 -27 -134 37 12 -219 -2 -167 47 256 -124 92 -36 67 -148 49 40 217 31 80 -125 -291 -151 -21
6218 -21 -98 -32 -51 16 -72 69 59 -58 105 -159 148 -40 70 -31 -79 -62 20 294 15 27 -49 293 -178 -113
6242 -113 -25 -150 -115 -270 23 49 -156 95 -15 -76 -75 -110 101 29 -78 -179 -5 71 102 -155 -64 -48 151 24
6266 24 -131 -30 -41 -72 14 -35 20 8 -58 -215 -87 204 70 74 69 -64 -68 -47 -238 85 212 -95 127 -181 2
6291 2 -142 124 -148 118 -41 -54 -340 40 -117 -262 199 -45 244 -21 -56 -41 60 179 103 -43 194 -118
6313 -118 36 84 -62 -129 22 -99 18 187 -301 270 -74 15 -6 261 13 -196 -304 36 6 221 227 -223
6335 -223 59 -373 -6 -163 -61 188 128 -2 -269 -45 4 -144 -113 -21 227 227 -9 127 -22 42 47 -127 -31
6358 -31 97 -168 31 -48 76 4 -175 74 -83 83 22 123 -211 6 94 115 86 197 94 -60 -40 76 24
6381 24 -23 -228 -307 -120 -27 41 6 -210 78 -30 94 -275 48 42 -125 -69 -169 -177 -62 -124 52 100 -200 16
6405 16 138 121 -169 225 -272 -7 24 -84 -26 -142 59 -26 -98 64 -108 -93 -220 87 -28 -111 -65 -133 191
6428 191 94 -210 -3 142 176 102 56 -44 -41 128 -155 81 27 5 118 -152 142 -31 158 60 -51 -95 -279
6451 -279 -20 98 48 -60 -52 109 -32 366 -111 171 -95 114 83 74 7 -377 47 -109 -390 29 -81 -168 28
6474 28 -205 205 -124 172 200 44 -171 21 90 74 47 -98 116 74 -39 -202 33 119 -91 120 4 -154
6496 -154 28 9 -39 8 -99 7 -79 13 -286 -138 -167 -68 -70 -39 98 102 -133 105 217 -220 -128 -75 76 31 -147
6521 -147 -50 -152 -218 -276 -58 37 -63 116 97 49 126 165 -8 -218 123 40 68 42 170 2 -12 -85 -41 31 111
6546 111 54 23 267 -151 -47 -187 75 -177 179 -75 115 -345 -2 -136 -13 271 36 80 -212 236 -65
6567 -65 -4 -27 158 196 55 -65 -82 -103 -221 140 242 -2 137 -80 -138 -17 -93 57 1 -91 -119 -212 60 58 -45
6592 -45 56 -121 193 -21 32 -149 -17 262 100 -46 -150 -124 -141 -221 21 168 -96 138 -215 75 -92 25
6614 25 -183 -116 91 0 -183 16 19 -68 287 -42 54 -90 -394 202 -34 230 11 -70 93 -131 -70 -129 -111 97
6638 97 260 22 -91 -91 64 -100 96 25 24 -129 48 109 17 1 43 228 -67 56 -157 -19 -62 91 -73 -60
6662 -60 237 35 62 -7 -5 93 52 27 -129 121 -69 94 169 -16 234 43 60 162 92 16 60 -81 -240 211
6686 211 24 88 -25 -95 -72 133 -21 -133 -125 77 48 -124 -166 -243 -14 -97 35 -36 -32 165 -239 44 29 153
6710 153 69 21 13 -131 -123 123 238 79 -65 89 37 -82 42 58 38 22 38 -66 45 -77 148 118 -102 -230
6734 -230 -256 26 294 -32 -60 89 64 -47 -49 -233 -23 189 -16 129 -174 9 -147 -157 -23 52 112 20 155
6757 155 -103 -40 -32 -66 -42 -53 137 -42 191 36 -180 -208 -46 239 -132 118 -241 6 79 109 -93 -132 3
6780 3 13 -105 60 -178 -65 -117 53 -63 112 -7 -200 -174 37 147 -30 34 100 -70 -171 -63 -76 -204 -84
6803 -84 200 95 -13 -77 12 -119 66 -155 188 99 174 -263 176 -8 -140 322 96 131 -9 134 68 -184
6825 -184 -252 -126 125 -293 161 71 18 66 152 61 78 86 -272 -96 -60 54 -45 -173 -2 -63 79 147 -249 -63
6849 -63 -261 -138 3 98 -77 27 98 -80 -96 -57 -13 19 8 36 33 -341 102 -208 -134 -193 -284 -111 -205 187 -8
6874 -8 114 65 -8 -76 51 -64 -47 88 -71 94 231 -119 -18 35 109 36 22 -22 -13 52 151 134 94 28 -15 -64 40
6901 40 76 -144 217 -255 -250 17 -22 208 194 75 170 -261 -112 144 144 47 -127 2 -62 165 -1 118 -11 11
6925 11 269 -77 -116 285 142 -82 112 -42 36 -148 14 -280 -105 -11 61 79 204 35 37 18 -100 -24 244
6948 244 19 55 -67 29 89 158 -121 107 87 92 -16 -48 -25 -170 -125 -75 173 -163 15 13 -29 -34 -62 18 85 16 -29
6975 -29 -101 70 -429 81 31 -26 172 155 -231 9 -15 -15 -250 56 33 -177 -51 184 -283 5 -45 5 117 -169
6999 -169 174 -122 -104 26 -9 -5 279 14 228 -220 -36 -15 -121 40 57 -147 107 -140 28 -431 210 19
7021 19 -83 -142 -145 309 -39 -113 -263 -27 9 34 -37 197 -63 19 -120 -106 0 -16 -82 85 308 -46 -38 -40 62
7046 62 70 -105 -15 116 -37 -24 -239 -11 -113 -167 127 91 232 46 177 17 268 64 155 -26 -55 19 118 -1
7070 -1 146 -159 -170 28 8 83 234 -148 52 -107 -88 169 -121 217 88 -89 -26 -15 308 -77 -48 70 -92
7093 -92 110 13 -151 -191 99 -70 150 112 -103 -198 -141 -114 -16 -139 17 109 45 16 -150 -20 112 18 20 -5 -231
7118 -231 -34 -44 -55 63 -191 -172 -288 37 32 -96 -161 -283 89 -300 -181 45 291 129 -114 -19 42 86 -162
7141 -162 -104 28 -87 -108 -13 -24 17 65 -100 -21 11 -243 -131 117 126 -98 -69 148 46 27 -173 -80 -73 116 -44
7166 -44 123 -43 1 -93 213 -26 47 -107 52 -237 -37 -24 -83 -40 -16 111 -5 -32 22 90 -102 69 61 -79
7190 -79 -129 33 17 10 -149 -11 -131 79 -164 -257 120 101 110 -128 -141 170 138 119 -112 -46 -5 113 17 -203 116
7215 116 132 111 136 -60 -102 265 49 -23 -61 120 -158 -183 45 144 38 192 -140 -89 -119 -117 67 -135 -239 -20
7239 -20 63 -151 128 21 -82 -253 -74 -98 -25 184 -227 204 125 84 102 45 180 -7 -52 52 -111 -25 177
7262 177 140 140 90 -258 -153 121 -1 68 178 9 36 -143 58 43 -161 -107 -111 -129 102 147 163 5 258 105
7286 105 20 192 238 -21 -46 -69 -110 -208 -56 268 -182 -8 23 176 167 -76 -26 54 155 -88 -130 -29 -60 -143 48
7311 48 -122 -65 51 -118 -50 2 202 -24 -189 233 126 -56 141 -209 -216 203 73 59 36 106 267 44 -28
7334 -28 -209 17 32 -20 -63 38 50 -260 16 137 -246 50 -117 -240 26 111 147 -509 122 225 -120 226
7356 226 133 47 463 -115 418 -148 -129 -17 -23 -73 80 -120 132 203 48 194 220 -4 -72 18 -137 147 -173
7379 -173 164 92 61 -105 65 183 49 117 -126 -126 248 115 -103 163 -51 -80 -207 -60 68 105 -49 153
7401 153 -23 -140 -4 -18 296 -160 86 -267 277 -70 156 45 97 -6 -160 169 53 -83 2 203 109
7422 109 90 -76 -8 -51 151 -85 -9 -4 20 48 -11 -84 64 9 225 7 -24 4 -215 -124 138 99 -49 -136 -64 99
7448 99 23 84 -5 138 57 6 -24 45 82 124 -223 -108 -14 288 106 18 13 87 -100 -120 101 -251 27 -25 -32 -41 -11
7475 -11 -69 -21 -56 111 78 -40 248 -188 156 -111 -17 -56 -81 -82 -31 129 179 8 228 -173 -108 -71 -278 135 8
7500 8 10 -109 -10 116 -121 105 -248 -6 194 79 89 -46 -45 -36 -244 -87 14 -68 130 -6 54 -361 78 -7
7524 -7 33 -62 73 47 -98 168 -41 -34 -98 85 41 -33 52 64 -93 81 -135 95 -9 -10 136 89 155 70 67 -90
7550 -90 -50 -107 132 5 -147 -60 -96 68 -24 117 24 1 41 -52 12 212 -7 -351 -93 -66 -69 100 -40 -93 294
7575 294 55 -91 -13 145 22 -170 -226 -87 -49 -56 -95 48 -274 130 -156 13 -114 168 46 -172 -24 207
7597 207 -13 136 -20 -96 -15 -143 29 178 -224 116 -9 116 113 -372 -38 70 298 -83 -23 98 38 52
7619 52 199 -110 -20 66 159 -3 4 -62 -20 -207 -122 -6 110 -230 11 -178 308 -144 0 95 -163 55 -39 -44
7643 -44 -48 -16 -18 248 110 -234 -149 -6 -13 154 -91 184 -70 96 80 62 -116 52 99 -213 48 100 158 -82 -149
7668 -149 201 50 -76 58 59 -56 -129 -14 8 29 23 -129 -1 206 3 -65 -127 124 183 83 204 -178 -85 58
7692 58 14 51 -82 -232 -182 56 125 -139 13 93 -197 89 -175 -112 -36 85 -19 55 -167 56 162 -173 -17
7715 -17 -98 -82 -293 33 18 249 -2 -98 -27 -86 -191 61 -125 32 65 158 -30 138 -49 -215 -238 59 8 -42
7739 -42 -221 -44 -143 -107 -23 -89 -39 40 -83 -170 -186 -45 64 -181 -32 -154 -12 8 27 -271 23 126 53 91
7763 91 -12 136 -4 192 -107 -225 -26 203 -120 54 17 -41 25 38 -103 -73 6 -312 -137 132 239 -70
7785 -70 -228 -36 41 -62 70 67 -184 62 4 113 80 113 -66 -14 89 36 105 -2 -187 54 -138 -26 -151
7808 -151 2 14 -51 228 -138 91 40 -173 -21 168 -71 108 54 -113 14 51 -37 -39 -10 -48 95 108 102 79 58
7833 58 -39 192 -50 -38 -135 13 -24 -176 -99 121 66 60 121 -140 -111 -90 96 -147 126 46 384 -252 -151 -57 117
7858 117 -113 114 66 -100 -108 -49 -11 -18 -70 92 -27 -3 -189 -101 111 236 68 9 22 217 -115 -73 226 -29
7882 -29 -17 65 -104 -20 -8 228 66 18 -169 66 33 -41 -86 92 -61 -99 65 155 -174 -102 135 -181 -129 94
7906 94 154 -109 110 -136 -74 -42 64 10 -77 25 -11 39 -103 -175 67 -128 -44 169 298 320 70 -54 -100 6
7930 6 39 94 2 4 -8 14 -187 31 95 -116 -3 -146 118 -77 -143 40 -131 4 39 -21 16 -167 -312 -158 -42
7955 -42 53 290 -289 -22 -7 275 -38 183 16 203 81 -102 85 -87 139 -72 -74 -133 -59 34 12 -80 -77 179
7979 179 -206 66 -140 166 -61 -172 -28 143 180 42 93 -141 -47 -214 -78 101 98 -157 -66 188 88 399
8001 399 -110 -105 -90 -7 -159 76 -124 158 -63 -84 94 109 -98 160 222 -10 -91 -71 5 29 69 -83 -28 -94 -40
8026 -40 23 -243 -101 -21 152 -176 22 62 56 -12 82 179 -286 -60 -37 80 -278 116 -25 -19 -74 20 -97 -205 74
8051 74 -20 -17 111 -62 -35 48 158 -5 144 -49 -91 -45 -97 -18 -67 51 17 136 -92 -73 -62 -73 212 127 -173
8076 -173 -9 59 0 110 -100 -55 -155 64 -37 153 193 -78 -124 -95 -229 -109 -90 -112 -222 -28 14 -47 -98 -182
8100 -182 -109 50 37 -177 1 156 32 -116 50 -219 99 -116 -125 64 69 -67 8 -55 190 -200 70 -73 81
8123 81 57 -36 58 -166 131 199 59 -123 -73 -155 -154 -117 -140 -153 -74 103 -219 32 -59 133 -40 65 167 267 -73
8148 -73 -44 13 142 83 -107 108 -117 -66 97 -93 -21 -79 -17 -120 -39 98 99 81 101 -88 -215 -4 50 127 151
8173 151 -216 -111 -307 -33 197 35 258 -223 34 164 141 64 -18 297 -150 -97 196 -39
8191c9
$$ Imaginary data points
##PAGE= N=2
##DATA TABLE= (X++(I..I)), XYDATA
0 0 0 0 0 0 0 0 0 0 0 0 -8 8 -8 16 -16 24 -26 32 -40 48 -58 72 -82 97 -114 131 -155 179 -205 236 -269 309
32 309 -349 394 -444 500 -562 629 -703 784 -872 967 -1073 1189 -1314 1450 -1601 1766 -1944
49 -1944 2142 -2359 2598 -2864 3162 -3494 3870 -4299 4792 -5366 6048 -6865 7873 -9148
63 -9148 10820 -13117 16483 -21890 31982 -57138 251098 294041 -197043 219027 275355 41009
75 41009 150238 165550 11981 191428 152661 69563 140033 36925 67119 279579 16814
86 16814 -122121 234081 178492 -97160 49936 95286 6750 71510 11311 -69273 63886
97 63886 21942 -40083 27652 -66619 -85894 76403 -27077 -191231 -46598 16330 -90243
108 -90243 -114885 -101513 -71766 -51390 -102005 -121901 -75046 -101178 -85731 -41218 -116860 -141706
120 -141706 -34919 -18580 -122611 -121957 -43494 -19282 -68189 -88858 -47480 -34051 -29869 -26898
132 -26898 -54430 -70630 -3751 21043 -48293 -66515 -4840 32989 -6483 -28874 -23435 5411
144 5411 53912 30515 -50239 -5035 105311 38224 -26912 35068 50168 37554 75115 31919
156 31919 -15970 81612 111330 31022 2190 44123 99036 88211 -5984 1524 111591 68805
168 68805 11996 47127 23551 33374 104464 26621 -45388 65228 83027 17223 13729 -2164
180 -2164 24243 86387 5666 -58511 43382 47023 -7398 11395 -19537 -24326 56648 9159
192 9159 -78774 -5014 17823 -23196 -10542 -44306 -60788 20468 1635 -88611 -43916 -7104
204 -7104 -26892 -26237 -54458 -63395 -4032 -8202 -63835 -46462 -37483 -23599 185 -52227 -74569
217 -74569 1543 7173 -51612 -31290 -28558 -26328 18771 -16919 -71292 -6874 33693 -25356 -29106
230 -29106 -11856 -9765 17123 12488 -31106 -16654 33625 26475 -1051 -20047 9603 51511 24561
243 24561 -19077 5880 42137 30143 23739 4223 2978 49019 54036 2672 -3329 39469 47201
256 47201 34232 2391 -2227 44027 56176 3523 -10896 30574 36743 29014 11636 -8569 17532
269 17532 54258 18056 -24130 7851 30809 23232 1056 -19580 -3468 35120 16404 -29539
281 -29539 -15026 12199 16727 -5470 -30303 -21080 12351 6087 -29063 -31694 -19307 5839 -312
294 -312 -44734 -42945 8002 2547 -36235 -29269 -25940 -12245 4658 -30589 -56468 -9188 11042
307 11042 -27641 -34270 -26891 -11011 7106 -15450 -47395 -17619 15889 -6683 -25392 -27745 -5252
320 -5252 16077 -2808 -31372 -13829 13858 11917 -468 -23234 -4176 34491 17113 -19503
332 -19503 -3855 21632 20989 18328 -6575 -4581 37015 37236 -3315 -1591 25017 27891 28857 6684
346 6684 -5066 28434 47593 11140 -7424 17582 31851 29336 5713 -3511 18461 36341 18498
359 18498 -4241 -214 18636 32123 5180 -16767 2649 27539 15941 -9878 -14763 2810
371 2810 24166 676 -27308 -11654 12370 3218 -12068 -19162 -21451 6120 8611 -29870 -38974
384 -38974 940 10074 -21454 -32282 -20014 -1543 -4226 -22427 -33824 -17243 2077 -6603 -27365
397 -27365 -32147 -4433 6731 -14696 -33565 -18862 5618 3674 -19254 -29993 -188 12926
409 12926 -6667 -19746 -10681 1212 10955 5008 -22540 -8024 24704 15010 -13840 -7306 11418
422 11418 18277 16018 -6660 -4805 24399 28791 1269 -3493 13216 23176 23575 4426 -749 18068
436 18068 32341 18776 1585 3141 23731 35651 7136 -7644 16124 32778 15626 1754
448 1754 2350 12305 28436 13322 -7958 2066 22208 17286 4276 -8109 -7480 22786 18524 -22991
462 -22991 -22155 19853 13898 -17815 -14369 -6288 -1959 2170 -9658 -31609 -15463 7721 -6322
475 -6322 -31327 -32649 -5032 4389 -22780 -43811 -15224 5058 -16897 -30955 -23398 -13634 -10045
488 -10045 -10900 -28808 -31627 -7157 3334 -17585 -36167 -12829 11441 -2999 -29425 -15699 7404
501 7404 2743 -7950 -11157 -5440 4848 13714 -551 -12308 4711 23314 14376 -3992 2947
514 2947 17972 26111 13453 -2036 9295 31435 22122 2448 13914 20253 19828 25894 16378 170
528 170 20636 38342 11778 1262 15563 23883 22280 11619 -1869 12175 30295 10363 -1035
541 -1035 6694 11918 15197 12546 -6055 -6482 16373 14151 -5763 -15112 -594 15162 3967 -21798
555 -21798 -14458 10069 1705 -13811 -16900 -11819 -2525 1030 -17589 -29652 -9425 3496 -10002
568 -10002 -31019 -24401 -1717 1072 -23870 -34343 -9079 1524 -15617 -27737 -18141 -11563 -6531
581 -6531 -7344 -26297 -25781 2694 6204 -26400 -25865 1894 4854 -9639 -16664 -10523 2513 8116
595 8116 -7461 -12660 -385 10222 9275 -3106 -6727 8301 21578 6914 -4074 5626 19326
608 19326 19558 5228 2446 14984 23146 14350 9681 8573 14508 25712 18166 3104 9044 25437
622 25437 19558 9021 6374 11857 20395 16738 4983 1557 13384 17415 9549 -1486 733 12233
636 12233 11135 1002 -7722 -1095 9055 5995 -11205 -11924 2354 3038 -4658 -14321 -13821 -1714
650 -1714 4140 -14744 -23697 -6144 39 -9168 -18505 -18119 -9591 -166 -10742 -24923 -15972 -457
664 -457 -1439 -19952 -21757 -5853 2067 -9931 -19199 -13497 -3133 3170 -9374 -19307 -7114 8497
678 8497 -132 -13066 -9444 1035 9346 69 -11622 -4802 12324 8465 -5297 -4936 5361 13626
692 13626 7138 -1359 -750 11601 16608 5525 -2932 5049 17963 11996 2023 2022 10616 16260 10682
707 10682 1432 2113 15895 15078 5054 1205 7297 13438 11984 3259 -2696 8432 14789 6222 -3618
722 -3618 1531 10217 8424 1468 -3829 143 6708 6934 -4990 -8718 2770 6898 -2063 -9704 -5248
737 -5248 428 3400 -5473 -13324 -6360 2856 -1956 -13724 -11378 -4078 -271 -6373 -14242 -12142 -1970
752 -1970 657 -11897 -16242 -6757 1789 -5918 -14212 -11352 -3713 1109 -6379 -13690 -9380 3522 816
767 816 -10367 -10037 -1333 4621 -525 -7834 -7998 4881 7867 -3467 -7804 991 9351 4556 -1596
782 -1596 -2765 5470 11210 5707 -2694 313 12470 11051 2091 -551 6910 12346 9603 1863 64
797 64 10463 13937 5779 -1554 5193 11366 9175 3460 -1032 4607 11327 8294 -2868 -1200 8740
812 8740 8880 272 -4258 1191 5670 5413 -3299 -6401 663 6499 315 -8274 -4400 1680 2947 -3824
828 -3824 -8857 -5449 2432 801 -9703 -9802 -1813 2105 -5259 -9542 -7150 -1516 913 -6319 -11078
843 -11078 -5705 2473 -1966 -9375 -8886 -1617 1487 -3462 -8712 -7254 2885 2680 -5966 -7965 -379
858 -379 4130 -802 -4429 -5600 1149 5792 798 -6882 -1516 7926 4506 -2366 -3008 3415 6999 4583
874 4583 -2569 -1996 7026 7774 1358 -2136 2825 7425 7198 1070 -2157 5311 9729 4951 -2914 1100
890 1100 7732 7356 691 -1744 3373 6369 5277 -499 -2516 2739 8237 2065 -5234 -299 5124
905 5124 4015 -2188 -4225 -965 5103 2004 -6475 -4394 2283 2814 -3037 -4988 -4478 396 2512 -4938
921 -4938 -9137 -1809 3959 -3105 -7214 -4797 -688 803 -3013 -7537 -4816 2973 -249 -5823 -5976
936 -5976 -1345 1770 -588 -5709 -5703 2271 2753 -2775 -5697 -1349 3700 1775 -3704 -4285 2107 3555
952 3555 987 -3146 -2554 3535 5697 -542 -4911 2175 5845 2752 -1590 -1575 2823 6659 2577 -4184
968 -4184 801 6441 4518 -418 -952 1852 5689 5736 -2345 -1937 5584 7389 -234 -2446 1857 4752
984 4752 4853 -376 -2433 1885 6660 1811 -3140 -354 3514 4606 67 -3576 -1163 4990 2424
999 2424 -3765 -3312 1361 3665 -755 -4218 -2653 2093 1535 -2789 -4539 -2961 2195 247 -5362 -5827
1015 -5827 488 787 -3570 -5017 -4139 -168 320 -3782 -7095 -1472 1306 -2040 -4585 -4540 -1098 977
1031 977 -1042 -5867 -3431 2203 1165 -3431 -3856 213 1623 1219 -2480 -3103 1342 4157 490 -3340
1047 -3340 430 3806 3660 -270 -1432 1978 5659 3730 -1547 -179 4604 5809 1433 -1055 1566
1062 1566 5572 5282 455 -581 3053 6680 2959 -1825 292 5200 4741 -34 -1330 614 5178
1077 5178 3352 -2142 -2635 2872 4320 -726 -2744 -1464 2773 2216 -2312 -4767 -426 2912 -989
1092 -989 -4535 -3293 1157 797 -2300 -4761 -2810 932 -76 -4016 -5112 -219 1220 -2482 -4559
1107 -4559 -3111 -121 132 -2168 -4984 -1533 1672 -617 -3897 -3150 -238 558 -258 -3393 -2015 1368
1123 1368 1997 -1444 -2902 62 1917 748 -2035 -1153 658 2577 1263 -1853 -942 2728 2897 -641
1139 -641 -794 863 2753 3094 -479 -1353 2070 4198 608 -1156 336 3051 3366 301 -1309 830
1155 830 4150 2410 -1316 -1398 2471 4082 322 -1468 210 3441 2853 -511 -2466 1491 4407 720
1171 720 -2106 -926 2570 2429 85 -2840 -758 3334 1775 -2456 -2626 1558 2431 -431 -3038 -1491
1187 -1491 1395 1340 -1537 -3705 -314 2237 137 -3411 -2447 252 819 -1095 -3330 -1845 987 493
1203 493 -3022 -3067 -280 465 -798 -3275 -2335 -268 773 -1652 -3506 -1401 912 -14 -2846 -2040 -372
1220 -372 1088 -333 -2269 -2063 445 1726 -1477 -2060 -96 1765 1090 -874 -1301 575 2746 836
1236 836 -1159 -223 2396 2334 406 -595 682 2856 2436 68 -1048 1983 3847 1382 -239 570
1252 570 3324 2999 1207 -843 1063 3617 2192 -674 -612 2550 2748 1015 -1057 129 2459 2500 -191
1269 -191 -1830 1051 2511 872 -1971 -1200 1148 1808 -529 -2557 -1002 1436 850 -2722 -2568 -236
1285 -236 744 -1012 -2862 -2198 -94 792 -1997 -3631 -1320 691 -348 -2800 -2341 -977 771 -1340
1301 -1340 -2949 -1890 64 273 -2305 -2704 -830 1035 -569 -1864 -2061 193 1515 -746 -2192 -787
1317 -787 1716 842 -1082 -1276 28 1934 876 -1111 -874 1945 2170 195 -1077 351 2485 1622
1333 1622 152 -953 1322 2492 1187 -721 162 2442 2188 904 -619 893 2443 2105 -232 -941
1349 -941 1815 2470 769 -918 245 1833 2075 324 -1036 133 2064 1326 -1297 -1015 1327 1358 -4
1366 -4 -1368 -822 989 1427 -1179 -1892 244 1258 -481 -1795 -1397 -63 944 -1054 -2433 -1146 636
1383 636 47 -1902 -1896 -835 596 -413 -2169 -1830 277 406 -1407 -2251 -1416 802 -419 -1495 -1992
1400 -1992 -488 653 -605 -1856 -1216 925 528 -1082 -1747 -192 1116 323 -987 -1279 471 1303
1416 1303 279 -1259 -186 1533 1257 -6 -691 732 1908 1463 -716 -426 1743 1806 717 -387
1432 -387 673 1833 1887 414 -583 1182 2175 1188 -471 116 1323 1754 332 -656 387 1781 1693 -200
1450 -200 -558 747 1420 390 -1027 -863 607 1215 -530 -1230 -398 722 297 -1622 -1349 26 575
1467 575 -220 -1380 -1539 124 645 -1494 -2052 -660 637 -419 -1192 -1446 -357 579 -458 -2166 -1282
1484 -1282 454 -132 -1186 -1543 -294 619 267 -1110 -1364 692 765 -453 -1560 -304 759 584 -527
1501 -527 -1118 382 1031 453 -986 -472 1053 1368 192 -289 299 1272 1212 -181 -628 627 1710 642
1519 642 -624 192 1016 1540 414 -483 417 1309 971 -325 -216 724 1489 311 -462 59 818 1071 -60
1538 -60 -636 120 1261 447 -465 -656 343 873 -196 -1025 -554 827 599 -685 -758 -164 469 34 -891
1557 -891 -1090 177 401 -368 -1338 -856 454 -51 -648 -1078 -253 393 -24 -1128 -1230 261 297 -679 -1358
1576 -1358 -642 445 241 -695 -1237 118 907 -74 -1134 -710 730 775 -412 -1067 -110 725 491 -666
1594 -666 -706 426 741 -61 -703 -127 716 974 -207 -637 76 917 529 -485 -306 614 953 -101 -756
1613 -756 0 867 803 -339 -385 512 950 189 -707 -306 574 947 88 -361 -79 1088 563 -355 -305 415
1633 415 955 454 -136 -165 850 621 214 -721 -64 591 557 -335 -533 121 584 132 -645 -484 598 637
1653 637 -165 -649 -288 427 305 -424 -882 304 576 -28 -981 -466 322 186 -385 -954 -211 370 122 -890
1673 -890 -828 260 415 -392 -844 -497 268 425 -593 -869 -221 356 127 -1170 -750 328 420 -367 -825
1692 -825 -252 346 134 -654 -232 304 523 104 -491 -207 371 552 -148 -65 377 702 451 -136 -51 662 583
1713 583 47 -283 -59 1025 663 -12 -268 303 889 451 -89 -83 507 628 514 -183 6 644 832 13
1733 13 -239 152 392 599 -335 -496 176 647 -174 -522 -192 225 94 -281 -581 -194 336 64 -707 -448
1753 -448 -105 255 -533 -794 -298 -178 142 -610 -1001 -296 146 -375 -1000 -513 43 237 -655 -797 -248 242
1773 242 25 -864 -444 23 239 -175 -678 -481 65 332 -271 -286 24 276 193 -211 -419 88 367 195 -127
1794 -127 -190 498 486 -53 -107 646 777 392 -230 -28 831 759 326 -129 284 778 655 248 -70 759 849 225
1816 225 219 291 685 551 44 -166 265 519 387 164 -56 186 417 182 -484 -105 274 509 -158 -32 68
1837 68 281 167 -525 -314 -225 85 -38 -441 -318 233 31 -560 -586 -366 -63 -130 -626 -797 -187 171 -495
1858 -495 -747 -505 -97 163 -360 -755 -75 116 -180 -725 -491 28 -64 -155 -470 -317 350 53 -322 -384 20
1879 20 450 132 -350 -162 477 307 321 -550 405 306 316 -49 -9 597 711 397 -209 256 429 413 21 -59
1901 -59 351 587 419 -131 24 381 719 448 -106 214 357 425 -27 16 302 438 451 -37 -184 54 345
1922 345 73 -323 125 193 54 -300 -510 -89 247 41 -319 -486 -75 78 -200 -448 -395 -182 -67 -380 -542
1943 -542 -209 73 -320 -495 -598 -77 36 -318 -564 -198 194 -63 -201 -658 173 306 -202 -239 -61 1 278
1964 278 -65 -426 15 137 226 -44 -274 245 312 104 -444 -124 467 527 64 97 207 445 335 180 55
1985 55 100 846 -75 -95 74 317 423 0 144 70 716 44 109 -139 448 471 13 -291 150 196 361 125
2007 125 -111 -41 95 -56 -67 -474 408 63 80 -111 -75 109 185 -159 -250 7 162 -450 -283 -434 -4 245
2029 245 -222 -295 -166 283 -112 -286 -333 46 -13 -9 -354 -328 36 231 -221 -738 -182 -78 -54 -374 -278 -19 21
2052 21 104 -318 20 7 13 -129 -363 8 302 147 -85 -8 120 452 87 -198 66 319 233 -87 -22 27 417
2075 417 125 -103 139 425 273 33 153 92 514 228 -94 -121 201 344 34 -196 -40 339 246 129 -68
2096 -68 181 219 -7 -90 -91 4 331 -95 -197 64 7 -145 -282 -369 -234 -8 -54 -145 -214 -77 -259 -266 -304 -133 108
2121 108 56 -279 -232 -275 15 -222 -466 -275 -166 -40 -370 -453 -244 -134 -114 -261 -600 -156 69 -40 -211 21
2143 21 -66 134 -94 -180 -3 -11 123 -221 -203 -89 416 77 -145 12 -21 370 97 -59 188 235 97 29 64
2166 64 342 256 142 142 132 317 156 410 62 -124 385 293 22 207 277 311 246 -166 322 222 248 41 178
2189 178 98 194 352 -209 -46 487 355 -28 -256 133 51 125 -185 -130 83 167 -47 -242 -179 -215 -121 -389 -81
2212 -81 71 82 153 -577 -178 -236 -340 -351 -161 76 -130 105 -455 -143 -229 91 -279 -408 -176 -68 -127 -145 -107
2235 -107 -332 -29 185 -194 -109 -61 49 -84 233 -210 124 330 49 31 -3 218 292 -62 -164 288 356 207
2257 207 -135 41 342 193 204 -119 228 358 -1 105 -96 354 326 120 -133 34 181 640 329 -144 137
2278 137 288 194 78 -101 -21 198 119 37 48 306 103 -245 -169 126 173 111 -190 -273 -88 146 -159 -7 -128
2301 -128 -59 44 -150 -227 -170 -139 -67 -281 -224 -127 -37 -262 -138 -38 -189 -214 -525 -313 -378 -260 -292 -206 -481 33
2325 33 39 -118 -139 -473 -85 -274 -241 -382 -261 82 -33 -205 -22 308 61 -207 -81 82 -10 8 126 -54
2347 -54 94 141 79 -112 312 308 240 216 -85 260 405 261 91 -282 346 114 169 184 233 152 297 63 164 10
2371 10 261 132 -160 299 255 175 -60 -44 -157 170 44 -135 -194 -115 165 -148 -77 127 72 114 147 -26 -194
2394 -194 99 118 -196 -261 -16 76 34 -163 -340 83 -305 38 -231 -224 65 -4 125 -307 -301 -91 -123 -77 9 88
2418 88 -325 -539 -289 -312 -75 -11 -85 -58 1 72 -39 -378 -119 148 104 -355 -193 9 158 -32 107 261 -5
2441 -5 341 157 -234 -95 222 156 -167 -31 118 217 -74 -169 -59 190 286 228 -2 34 195 56 205 -79 -26
2464 -26 371 85 -132 164 78 401 -89 62 92 -43 169 -94 6 -2 79 13 171 59 -66 85 -135 -55 -33
2487 -33 -10 136 58 -117 91 131 97 -235 -257 100 -144 -39 -303 -106 148 57 83 -66 4 -93 -180 -235 -96 -137
2511 -137 -92 89 -178 143 48 137 -278 147 22 34 -22 51 -54 210 78 -87 40 13 76 -13 69 25 207 287
2535 287 201 -200 -149 164 218 -62 80 -28 211 -63 81 -74 65 240 15 -30 -113 188 102 -38 -131 21
2557 21 31 -88 -1 -130 175 43 56 -89 -86 -134 68 -29 170 140 51 -256 -283 -159 -211 80 -156 -77 -52 -13 119
2582 119 -165 -126 -127 -105 -115 -223 -175 63 -273 -239 -76 -219 61 10 -276 -182 -170 14 -119 138 49 -51 -85 -92 11
2607 11 -43 191 219 101 -117 253 209 64 61 71 238 134 23 -155 60 197 240 291 126 273 90 83 -104 -115
2631 -115 410 158 91 -218 30 174 112 -85 -26 46 -67 75 -89 213 196 316 212 -111 -79 174 -84 -65
2653 -65 -292 -180 -92 -5 -97 81 -180 -173 -163 -183 76 -19 -193 -108 -234 -125 40 -275 -176 -20 -267 -161 -158 119
2677 119 213 -35 44 -99 -294 83 197 -71 -147 -181 54 -217 3 46 238 160 -96 62 -48 307 13 -88
2699 -88 61 89 249 252 -54 -87 214 169 125 14 10 86 59 -9 46 31 236 94 -109 183 148 318 35 -142 233
2724 233 15 -150 296 204 50 70 66 38 -91 410 159 -4 156 -134 -153 53 -143 -115 94 4 -331 -31 117
2747 117 -137 294 -75 -113 -86 -74 10 -254 -14 -86 64 -54 -196 -161 186 -206 -47 -72 237 -230 -168 -32 -149
2770 -149 -128 163 -76 107 71 39 140 -27 17 -73 9 -80 -167 -140 203 73 54 -1 41 39 -33 -229 -68 89 -68
2795 -68 243 134 107 22 -176 88 -139 28 219 168 -248 -31 83 17 -101 -192 126 117 80 9 -97 251 -154
2818 -154 31 30 33 218 -7 -37 -128 206 46 -19 -22 148 303 169 55 -263 -14 79 135 150 18 131 240 32
2842 32 -90 -56 -211 -13 151 33 4 -80 -166 -88 155 141 -157 -81 -304 -85 -186 56 -87 -57 -31 222 -143
2865 -143 -285 -119 -253 -138 -254 -237 -40 -92 -184 -151 68 -39 -36 87 16 52 -266 58 -53 -164 209 23 72
2888 72 58 110 93 -85 138 147 -89 -70 -55 254 -132 154 133 88 -85 297 190 163 25 -63 -172 112 337 32
2912 32 5 -9 144 97 203 -110 -74 171 32 45 -29 119 197 118 -95 -29 339 55 -191 -8 117 -21 66 -221
2936 -221 -271 33 15 -200 91 -264 -179 -165 -219 -37 -38 18 -251 -138 -8 -10 -11 -141 -365 -10 -298 -107 -321 -147
2960 -147 -118 -6 -182 -376 14 -73 98 -66 58 96 107 -49 -102 -60 144 162 -14 62 61 162 245 98 89 -25
2984 -25 165 -54 -52 49 -2 7 132 222 70 185 -84 -4 15 101 229 125 20 108 107 153 227 -10 -85 328 170
3009 170 158 -158 -51 25 33 100 -113 177 88 166 -132 73 269 162 -31 15 -235 -80 62 -84 -349 64 34
3032 34 -75 19 -93 -11 -1 -163 -312 -251 -196 -133 -62 -134 -64 24 -88 -246 -7 -76 -17 -91 9 136 107 -154 -98
3057 -98 -2 36 157 -29 -53 -189 87 -28 63 -10 86 -97 126 -140 -59 190 30 34 199 23 117 177 75 58
3081 58 151 99 146 -42 59 314 -108 319 51 58 3 104 168 121 -37 67 106 52 61 -11 137 40 -80 158 -29
3106 -29 -54 -206 -9 75 -64 -84 44 84 -33 -237 15 19 43 -87 -216 -181 -98 -61 85 -6 13 35 60 -9 -161
3131 -161 -142 161 136 5 226 -98 -22 44 -41 149 -91 27 -19 114 -173 81 229 -52 -21 177 -13 -178
3153 -178 -84 -14 140 217 -148 88 -19 -25 -205 -50 -492 165 -164 -38 -45 174 77 -194 59 -45 -118 194 102
3176 102 -85 -124 -15 -29 168 -385 -13 -196 -73 19 -30 -114 -79 12 -103 -154 -150 -119 95 83 -146 62 -5 -18 75
3201 75 85 95 61 -158 -120 96 59 87 -16 -145 143 142 41 7 -304 -21 -153 -75 -90 -211 -44 -188 -131 -115 247
3226 247 76 -166 -137 220 -118 6 -138 0 120 103 -250 17 -113 188 -6 296 102 -108 -17 28 59 -329
3248 -329 -51 -9 15 305 143 -2 22 44 -14 143 171 90 -97 -103 68 -139 60 124 82 116 85 -273 18 343
3272 343 236 -5 -217 -88 95 48 -142 4 -126 -94 -66 -67 -298 -13 176 9 59 -26 -3 14 313 168 -87
3295 -87 40 -44 23 -133 -150 -53 -203 -184 -161 -72 -266 -55 -154 25 180 -510 -22 -124 118 176 -60 12 -14 -80
3319 -80 -168 100 -207 -197 -114 -165 -165 -98 -46 301 -129 -27 8 100 -12 -35 110 220 -223 106 96 193 113 135 -207
3344 -207 175 32 52 -81 -118 108 -120 149 15 -107 -266 -109 191 1 -139 66 -226 57 -47 115 38
3365 38 214 -95 341 4 19 228 21 -55 87 76 9 -258 -150 33 46 201 -49 154 52 17 -208 94
3387 94 105 -200 -292 -100 -95 -246 -35 36 -91 -24 58 -28 10 -90 -13 -39 -197 -148 -202 158 46 -164 -126 -97 120
3412 120 69 -172 -1 -13 -22 9 19 22 -102 21 171 -65 -20 84 -62 55 -48 120 -41 -83 -165 153 184 -36
3436 -36 -104 66 99 -29 228 -59 115 -7 27 167 207 67 254 212 -99 85 -37 138 -69 51 -26 190
3458 190 282 140 77 26 46 8 23 139 -68 -25 -190 -153 22 -142 137 -22 0 -45 121 60 -55 -41 183 61
3482 61 7 -112 -370 95 -2 55 -246 -211 -112 -340 172 128 -67 85 72 46 2 -109 3 -105 -118 -8 -92 148
3506 148 -103 -110 -91 -59 -50 -81 -36 270 0 -23 -81 0 -122 22 233 -265 150 5 -145 33 -49 188 114 -16
3530 -16 -148 42 38 178 99 -36 176 -71 114 129 -4 -173 14 160 179 -19 -140 -103 -157 -85 305 -10 -64
3553 -64 -139 6 -68 -9 -32 -81 85 -129 53 51 -163 363 198 71 18 -5 -23 72 196 -44 -29 46 -117 91 107
3578 107 -77 150 -305 4 164 19 -199 300 74 34 118 17 -55 355 -125 54 104 -173 46 169 -31
3599 -31 -133 -349 -75 220 12 149 -53 259 195 54 120 -93 -199 -189 136 -262 -40 -133 -197 -190 190 -208 -153
3622 -153 -184 40 58 91 -111 -99 5 55 74 120 35 -39 86 29 53 3 -11 -146 -3 -121 -17 -82 15 -14 -12 12
3648 12 211 11 77 143 24 30 152 34 -151 97 -106 16 83 156 318 85 -18 183 252 45 -39 100 -43
3671 -43 77 83 -149 -45 25 -250 -258 -93 161 -153 174 2 -178 -144 73 -192 -113 0 -232 -11 -135 -53 -172
3694 -172 183 49 -206 -98 65 126 -41 -57 174 -179 154 300 -28 1 265 -52 70 -36 12 -18 186 23
3716 23 -91 -21 15 148 20 19 -63 206 -75 -269 3 6 28 -2 6 86 53 -299 15 178 14 29 37 175 99 128
3742 128 -9 -150 -273 4 -129 -97 110 55 13 21 -223 -267 -26 -113 -241 48 -71 -17 -55 -169 68 -28 -162
3765 -162 -109 53 -128 14 97 -287 181 -105 -254 241 -204 128 -87 -129 118 25 84 70 -90 225 5 65
3787 65 -101 279 -146 65 -82 134 140 -33 107 -142 61 -168 -5 32 -206 -74 36 6 2 -109 -152 -2 13
3810 13 196 28 -52 17 150 147 165 -193 97 53 -58 73 -17 -89 31 53 -108 59 71 -12 11 32 95 201 68
3835 68 -13 -12 271 -74 -114 42 115 21 70 -31 -86 -266 -58 -107 109 144 -67 -95 -61 -108 58 -20 -177 68 110
3860 110 169 -56 96 152 -186 -17 -15 -41 93 235 -163 9 -150 -296 46 -22 181 -114 281 75 -62 167
3882 167 2 69 247 -39 110 -270 -3 89 54 -22 -66 149 -81 123 -94 -111 -29 88 112 34 138 -72 -32
3905 -32 -75 4 -106 -91 -70 23 -8 -59 -48 -41 22 91 -432 20 95 1 -102 -209 74 15 -289 241 31 -18 -333 -59
3931 -59 25 -17 -215 -15 99 341 -141 102 -115 -3 179 -267 -164 54 97 -128 18 -20 -75 -181 57 110
3953 110 141 175 19 -100 153 -135 -80 6 -103 5 74 -289 -197 106 -4 -12 -12 156 93 -73 59 144 -21 8
3977 8 130 -94 -30 198 10 -151 -94 160 142 81 259 25 8 26 -272 -136 147 -19 324 232 94 -81 187
4000 187 -8 -103 -79 -219 205 98 -220 65 -55 65 64 -123 -68 -15 51 -186 115 -44 130 -13 38 -220 165
4023 165 -113 128 -233 25 -191 143 132 128 -297 223 -175 87 -23 94 -196 59 -121 -92 -20 53 -159 -311
4045 -311 -33 -343 -25 175 138 58 33 -165 -130 -151 1 -64 -52 58 110 -61 175 41 -64 -121 -104 35 -174
4068 -174 8 -44 138 -106 -72 16 -111 110 -19 4 57 40 -81 -3 -137 -124 3 -59 176 -16 -87 -288 -31
4091 -31 166 -6 -149 -1 25 75 201 103 -98 182 -260 -153 -56 232 -153 -3 119 -78 41 85 197 27
4113 27 85 -143 -226 -23 23 76 -78 161 45 -86 11 10 -167 -32 -121 155 99 -67 225 244 120 -202 -11 185
4137 185 -235 -32 -124 -159 -212 -178 -44 75 -134 -4 168 225 256 -30 -149 123 38 -207 64 202 -93 -104 -60
4160 -60 104 -48 299 286 -69 20 115 1 121 -139 -21 -18 -11 88 27 63 -26 -131 29 9 -66 134 73 172 41
4185 41 114 129 45 -394 -49 -334 -153 -104 119 -164 32 -28 272 79 -52 -37 264 60 -8 -76 150 72 -52
4208 -52 -75 119 -104 63 -25 -151 -8 19 -116 -112 -24 55 -49 -67 -35 159 59 -85 -78 22 37 -283 64 218
4232 218 -135 -42 65 203 125 -5 -17 -137 23 -128 71 -102 97 -77 -1 -226 168 70 -105 155 -105 387
4254 387 -49 17 131 200 31 -155 179 -52 185 -76 -69 185 -138 190 39 61 -36 209 -150 -30 -212 -3
4276 -3 -47 -293 9 -154 176 233 55 -52 53 102 118 -140 21 -102 -333 -93 154 239 -37 158 -77 -71 -8
4299 -8 -72 -24 -160 -99 -118 -43 7 152 -146 -314 -89 127 63 -191 -51 -237 -55 27 242 23 50 5 104 196 -108
4324 -108 -65 121 -3 109 70 -74 -108 -108 236 12 55 206 40 123 153 -197 -36 -49 29 5 34 131 120 195 -30
4349 -30 134 74 -45 -26 80 -240 -131 117 -29 49 -106 -40 331 47 -83 -182 -136 202 7 -62 -23 59 -10 -311
4373 -311 106 220 -108 100 65 -164 107 16 171 -10 147 -153 -133 33 -269 72 -7 177 -147 247 -4
4394 -4 -118 32 23 -122 -102 -23 -90 -56 69 240 108 -86 24 -16 -39 -23 40 -94 2 194 -202 68 61 -105 153
4419 153 -12 -5 13 -68 -75 247 -38 21 168 254 42 -7 76 -70 185 -49 85 -74 -266 -9 -110 219 295 43
4443 43 27 128 101 15 -68 110 49 -57 -251 -60 -32 -111 154 -213 -93 -78 -107 -6 52 -18 121 -178 203 -14
4467 -14 -9 -96 -106 -122 39 23 49 -106 -56 -106 -90 44 -132 -181 -123 -57 -127 161 117 -55 -54 273 -16 112 -29 -89
4493 -89 -21 13 -127 -125 4 -12 81 -35 110 -125 215 124 200 30 -218 -83 -112 15 40 113 -30 -66 118 -41
4517 -41 57 123 24 -8 79 -93 -186 29 48 -102 83 19 172 24 -79 266 44 34 -79 -42 90 157 82 27 232
4542 232 54 -48 8 70 130 62 -110 101 -230 5 -163 -59 71 -153 -118 -4 -116 73 -148 -36 -46 28
4564 28 39 29 50 -137 -38 121 215 -59 -115 -200 -88 123 -36 -225 54 -33 -35 135 -115 -65 -31 49 12 72 61 -208
4590 -208 -16 64 -148 -17 142 -134 167 112 -15 47 -52 -24 -92 -148 -301 -306 -185 -233 -5 -160 -38 148 193 -64
4614 -64 -21 -23 79 -181 75 -43 27 -139 -151 82 92 63 -259 194 156 7 -93 72 75 -166 -153 3 6 -60 50
4639 50 -144 75 -10 -97 -64 288 104 4 112 -109 37 -45 173 -121 -105 -270 64 75 59 -100 41 130 -209
4662 -209 -79 107 13 66 -13 -9 -94 -192 76 -215 -122 -5 -82 -223 98 125 -102 -168 38 59 -46 165 73 -176
4686 -176 -194 -44 -90 -32 -2 -46 332 7 -15 -176 228 -103 -34 -33 72 -53 -105 59 -88 339 3 -26 7 -113
4710 -113 24 13 11 -148 -59 -59 87 -26 327 205 -159 -139 122 -175 173 8 -49 -110 129 -205 -142 183 39
4733 39 -31 -78 94 140 112 -99 -74 217 64 287 -328 -136 -26 -99 -81 125 0 -106 21 49 26 -70 39 -48
4757 -48 -88 -82 -266 -265 -157 71 -88 385 -114 -101 52 -271 -90 -125 50 -52 -133 -105 -138 5 -158 86 98 -65
4781 -65 -63 -111 -157 -67 31 -76 -129 -98 43 10 -1 190 -234 26 -83 -36 -205 -39 128 20 -46 4 0 -7 57 5 -71
4808 -71 243 69 113 -36 -147 71 -37 -115 -48 71 177 53 -154 86 -189 180 46 171 295 -17 -105 142
4830 142 1 -168 19 -65 52 -36 157 58 12 -192 -258 -6 -48 76 -122 115 30 29 -98 -103 -73 -106 82 63 205
4855 205 -200 -116 -14 -123 -7 -55 -333 -178 -41 -108 141 244 -69 176 2 -64 -209 2 -292 59 -64
4876 -64 47 78 181 -34 145 -54 -74 -36 10 -170 66 89 27 -124 -1 -162 507 184 -55 105 -206 110
4898 110 -48 -172 -133 -77 -98 -58 172 -83 68 178 -28 -170 62 239 -98 -2 -67 -26 -128 36 10 18 -35 -33
4922 -33 -50 104 -224 16 142 202 59 -200 -150 136 -55 -13 -204 134 -304 -242 -74 1 80 -115 272 -96 -56
4945 -56 36 -126 30 9 155 -81 -171 140 -112 -43 36 17 -126 -70 192 -179 -62 52 176 79 -213 38 -157
4968 -157 -110 -119 -189 229 -54 29 79 41 36 -181 34 108 43 180 -156 -264 73 43 253 106 -101 26 -295 56
4992 56 -16 -57 -30 -108 -178 78 99 -149 87 -90 -285 -302 72 -27 1 182 57 -85 -80 -139 1 53 138 65 -42
5017 -42 -201 51 17 47 -75 -39 10 42 318 -98 39 -142 -43 -20 53 98 -111 -167 78 -163 -159 55 -259 -47
5041 -47 -84 -275 67 16 -66 -89 50 -33 -206 42 151 98 139 277 208 12 115 -11 -204 16 96 75 69 130 -175
5066 -175 -238 32 212 -29 -132 20 34 -24 94 -75 -49 204 30 3 78 188 31 88 124 112 -226 -17 26
5089 26 16 -38 -175 9 -1 46 -16 5 83 -144 82 166 90 -102 104 294 54 -46 120 166 145 -317 135 39
5113 39 -207 -27 72 3 -138 -140 -37 15 19 -61 -382 108 -88 -18 -108 19 -221 -197 151 -46 -105 -113 -191 -147 -14 96
5139 96 74 -19 -48 104 -12 4 -10 7 43 -33 -26 -84 -153 -2 110 55 -25 224 -108 -130 241 -6 -132 19 -10 118
5165 118 161 -41 132 -3 99 -282 -138 -89 85 -163 -147 44 130 -125 -55 -105 238 129 -143 35 29 182 -170
5188 -170 168 136 33 -76 1 -171 -137 -69 -101 -114 105 86 -183 28 -106 113 81 -68 -9 -51 -92 -37 -80 8 138
5213 138 103 -135 -90 -20 -77 107 -31 -146 -116 -218 153 52 61 -105 -144 59 102 -101 48 -97 105 41 56 124
5237 124 13 -191 1 175 -46 112 -187 76 -108 -106 7 95 20 -239 -155 -95 124 -22 102 121 112 208 170 -122
5261 -122 56 95 135 -152 -132 -112 117 61 -71 53 110 -155 57 -58 -55 -10 115 -13 18 -40 -134 -322 142 -2
5285 -2 -62 52 -22 -26 16 119 41 147 -205 -94 148 -69 -88 -68 278 100 123 -59 123 -57 36 -19 24 76 227
5310 227 -53 33 135 -67 109 -129 -114 -50 149 26 335 153 160 -54 64 -60 -29 -133 -18 63 120 174 -151
5333 -151 -61 -180 -105 10 -138 28 -134 -188 -174 -73 -66 -149 14 -102 16 189 13 9 -10 15 -235 -192 80 -142
5357 -142 171 36 176 100 153 50 32 31 -134 -281 -114 10 56 -259 85 45 -92 361 23 246 -27 -188
5379 -188 -131 -196 158 34 -42 288 98 -108 -230 -11 88 164 -13 -172 -41 98 142 -118 -48 35 220 65 171
5402 171 -130 64 260 -74 -103 85 -140 214 142 -121 -162 -56 85 -131 -43 -65 28 -43 258 134 1 -2 -253
5425 -253 -7 -94 56 -129 21 -31 261 -19 155 -94 -134 98 183 118 -6 9 -311 -129 54 14 -47 -3 94
5448 94 -119 -29 88 -115 72 39 99 -126 173 150 23 -210 -156 -107 -10 11 -176 9 16 -204 -129 59 77 -67
5472 -67 -194 -112 126 0 -221 34 -162 231 304 56 -184 -140 36 -60 55 56 -12 -9 -15 -10 48 -155 -181 79 -157
5497 -157 105 -42 -105 172 69 8 -78 59 82 155 190 301 225 209 -23 74 -38 193 152 90 -116 10 14 -46 105
5522 105 -93 167 313 -34 47 -6 -103 119 69 158 -65 245 119 -16 -172 98 31 30 -193 86 -47 -174 -86
5545 -86 -3 -155 158 -140 122 87 36 -40 -90 39 39 -77 132 115 225 76 74 -14 -134 -118 46 56 -244 105 -22
5570 -22 -93 -106 97 107 223 -205 102 -14 51 26 -246 175 -350 -9 -103 216 -166 -3 -104 -19 -82 28 -48
5593 -48 -80 128 36 118 86 -91 -32 -23 39 -73 -52 93 179 324 -347 78 -41 183 -21 -184 -1 -100 -12 76 -60
5618 -60 -72 15 125 143 127 43 -72 -120 -301 66 -54 -108 14 -35 -32 -14 -2 -14 34 22 -6 -58 -95 121 -36 -23 -360
5645 -360 17 -114 121 -81 -115 -119 -67 82 73 206 -96 -195 -212 -22 -197 88 55 78 -93 -17 -15 29 -86 -38 235
5670 235 241 -60 -35 42 157 110 128 -62 -164 -95 182 177 52 77 -169 -92 -215 -224 -30 143 102 54 -48 35 -55 128
5696 128 10 -33 30 281 35 51 0 38 170 151 325 -49 -181 -104 180 -126 114 -73 22 -46 -194 -31 263
5719 263 -159 -35 -15 -93 131 -228 -163 -207 185 -63 -61 71 203 -2 -113 -51 -58 88 120 -191 -35 -26 24 -12 -104
5744 -104 310 54 101 41 -143 265 5 9 160 -101 -142 73 -47 -133 -126 -49 100 -123 -143 -153 116 156 -112 131
5768 131 -91 -33 -191 -364 61 -110 113 -48 51 -128 156 -166 18 163 -98 -250 194 31 63 102 -16
5789 -16 32 -8 116 -19 160 56 39 117 152 86 83 -201 105 -104 125 -41 -253 52 -294 46 111 -107 -33 4
5813 4 -18 -22 103 -96 -183 210 -154 -95 187 204 10 49 -16 -141 -80 -124 147 -150 40 -19 28 -139 70 125 54
5838 54 -88 12 -22 -69 -8 100 -189 -120 57 -100 -14 -132 -62 50 -221 145 -232 -169 226 -169 19 89 -274
5861 -274 -201 -63 -8 54 22 231 129 93 31 -17 221 -140 202 -136 233 118 -140 39 -131 227 -3 119
5883 119 -182 64 -124 -232 30 199 -52 76 -38 -267 61 -103 -80 -121 202 -30 -167 76 53 50 8 -265
5905 -265 91 19 282 58 85 -250 67 56 -89 -14 -26 -109 -186 -17 20 173 81 50 229 -80 -191 -93 2 -219
5929 -219 -371 -160 -26 -53 -321 61 84 139 0 -91 53 130 -241 -195 78 -55 -6 91 63 51 -301 -15 453
5952 453 -41 -14 -95 -140 -103 281 -317 -163 -38 25 90 50 128 -24 60 -42 -10 -68 -65 -54 158 87 181 126 -89 -98
5978 -98 246 148 -20 -244 56 -7 -15 145 -8 -51 12 -173 72 108 -103 -87 144 -142 -127 -46 37 73 -40 81
6002 81 176 18 -180 -49 -348 -249 269 -234 -228 172 -226 88 -8 -18 -48 65 -144 -102 -163 -115 -301 49 171 -44
6026 -44 104 167 14 48 -229 -51 -9 -108 1 -1 58 -85 160 73 37 -44 -56 198 148 46 -16 52 125 -4 -38 132
6052 132 76 109 118 29 -108 10 70 -113 47 105 0 -143 110 15 17 29 61 -28 -10 -162 39 38 -309 -41 -68 83
6078 83 -35 -67 23 -107 24 -36 -149 -196 -78 -97 -380 188 -264 132 3 -60 -54 323 181 -121 -105 4 -138
6101 -138 42 108 141 -130 -45 150 -146 281 -91 6 106 114 -26 -107 -95 45 -117 205 162 140 172 87 -124 -77
6125 -77 34 -185 181 74 -27 -30 -74 130 16 130 145 -88 30 -17 186 123 -19 129 217 210 -40 16 164 -153
6149 -153 -100 -82 -29 181 149 -54 95 106 -117 11 -193 124 233 -166 235 117 17 -17 108 -35 -248 57
6171 57 -173 -76 -274 -5 196 18 204 -23 -113 8 161 -48 -189 -100 -70 -51 241 -69 71 18 -129 125
6193 125 151 28 159 132 89 87 -36 -360 39 79 -115 163 225 151 -10 180 -8 203 422 37 -190 -5 -33
6216 -33 -44 -48 -16 -157 -147 -141 34 -1 389 -36 -83 87 -265 -55 13 -29 -33 71 19 -75 120 236 191 128 -2 33
6242 33 58 133 268 55 69 0 -179 186 -1 78 -47 76 -20 8 117 182 -55 -132 180 -133 -72 -57 -83 112
6266 112 -243 61 151 116 -86 -214 90 -65 187 16 -15 6 149 -99 9 7 -37 -73 -30 -120 -110 252 -59 -61
6290 -61 -43 -200 -30 -42 -111 48 138 -133 -43 -177 -56 -54 50 1 -43 53 155 34 -25 -202 -12 40 77 -134 14
6315 14 -24 -37 -51 -159 88 92 -75 75 -202 234 -41 180 254 217 12 273 97 -127 102 -77 -280 -62 -28
6338 -28 138 -85 7 321 -88 -107 -173 -192 43 -116 -7 -237 22 -78 -126 -270 -48 89 97 -36 -186 -86 57
6361 57 123 67 -383 43 112 -73 -37 72 5 -71 28 65 -73 -179 -160 -57 -74 199 164 266 -35 63 156 -179 -125
6386 -125 -74 -21 -115 116 31 -29 67 -84 -31 61 -37 60 -90 -79 -147 -157 223 -87 239 121 72 -99 58 50 173
6411 173 152 -56 -88 183 -60 64 56 105 -167 -128 -122 223 238 -82 -156 13 -75 -165 -114 162 -122 44 143 -107 77
6436 77 16 37 21 241 75 148 -123 -98 100 -22 -189 75 66 116 -86 -7 -121 -20 -83 -121 -128 -88 39 -105 -50
6461 -50 112 4 23 -239 -91 36 -38 83 -108 -24 -15 52 -160 -34 -55 -115 -132 -122 176 -119 -108 -62 -27 221 -211
6486 -211 76 29 33 -75 -25 -77 -150 -42 191 -151 -257 366 -12 -52 -203 -46 27 110 27 -151 -53 71 -74 -104
6510 -104 -47 -33 85 47 -227 24 156 -34 -40 -344 96 181 128 -48 22 10 -6 -225 152 63 -25 -57 141 -206
6534 -206 29 37 41 -301 -227 -132 160 -166 73 55 -123 -63 145 -107 -91 127 -8 -224 -45 131 167 105 3 2
6558 2 145 175 -38 -88 -29 -43 75 57 -125 128 -54 -198 -23 -38 -9 -114 -19 185 94 -43 -60 33 -12 133 -184
6583 -184 -24 50 -20 184 -4 -160 -173 -83 -100 -18 -93 83 129 132 -34 115 -115 198 -95 160 -119 68 97 -145
6607 -145 82 -228 133 166 211 152 161 -45 -121 -113 159 10 -44 -135 134 136 -36 -22 -103 157 46 -31 -139 121 -16
6632 -16 14 29 -95 -90 71 -31 146 32 -160 87 -16 -19 -21 157 -24 -95 245 278 22 -126 97 -168 -61 -172
6656 -172 17 208 -4 -74 47 -91 9 -207 -46 -61 -239 -86 -54 -270 56 17 -124 -48 7 38 60 14 -17
6679 -17 -112 116 -52 -65 15 -6 137 -20 126 77 84 40 112 43 23 -47 113 30 216 141 33 79 166 110 72 -193
6705 -193 40 59 138 75 96 110 42 15 59 -19 48 257 16 306 201 63 34 286 -64 223 91 102 -137 102
6729 102 72 -17 -31 38 188 -184 -101 -30 0 -151 -90 -160 145 -34 -108 -130 101 132 38 85 -250 127 -41 31 91
6754 91 -75 -152 -298 165 -166 328 -89 -77 93 -114 -125 13 -206 127 -210 63 70 -157 -58 -256 87 101 -40
6777 -40 -9 -142 51 169 -142 131 34 -44 60 -36 -53 -73 201 -42 44 130 -163 170 -31 35 -70 -93 3 -78
6801 -78 -123 75 131 -93 155 -43 60 2 -60 -169 -108 -17 138 -283 -68 246 16 121 105 -146 -59 -78 -349
6824 -349 40 132 -71 234 61 -20 132 74 167 -111 -317 0 -44 16 102 -83 -151 24 -142 -21 205 -197 -55
6847 -55 136 -117 31 -59 57 -84 -38 55 216 -123 -317 116 -144 -56 2 82 -166 -69 -20 2 -112 19 70 70
6871 70 9 29 37 76 -20 116 138 199 -212 -55 209 95 64 90 -290 29 -179 -94 -65 99 2 -43 -42 -332 -179 151
6897 151 -99 41 8 40 99 -86 -77 -62 90 246 -114 217 14 -66 -73 -45 70 171 -62 130 182 227 -109 -199
6921 -199 -160 -120 -35 -80 117 -72 30 -224 187 75 -101 -394 18 25 187 221 83 364 -47 -197 26 64 -7
6944 -7 -99 -132 -23 -16 80 52 109 -16 -63 16 259 58 -39 19 51 -57 4 19 85 22 212 -16 -279 129 -7 -177
6970 -177 24 -2 2 268 36 18 -89 24 222 -58 133 34 31 -231 -36 -93 -167 -154 -16 -71 -109 95 -4 94 109
6995 109 -107 10 -102 -101 201 -179 105 145 183 106 -159 -88 10 -47 -5 40 137 36 -257 -94 96 -89 214 -172
7019 -172 -55 84 19 -205 34 -320 -46 157 -19 -81 -32 173 -117 -64 -84 -221 185 -38 83 49 -285 116
7041 116 194 59 -115 128 -158 242 31 31 24 -162 -57 -39 138 -135 -225 -118 -202 -38 11 92 7 -220 26 120
7065 120 55 -266 -147 114 -172 -51 129 19 55 41 -49 286 -46 237 105 105 103 183 102 116 143 -61 132 231
7089 231 -8 -20 147 -138 -33 54 -120 42 10 16 -50 -99 11 -133 -96 -197 -178 111 -13 58 83 269 34 -34
7113 -34 -136 26 -127 -123 102 -44 53 17 83 -79 49 124 -63 224 94 90 -25 -22 3 -57 45 -101 -68 66 52
7138 52 -90 -17 26 157 -292 -106 -134 -7 91 6 -36 -245 -34 -66 -339 -79 -45 -155 40 72 154 46 -154 -119
7162 -119 238 231 -106 -13 161 -53 4 -18 -32 177 19 105 36 130 -202 -92 67 -56 105 -130 -139 149 -200 -149
7186 -149 181 49 -14 -146 -10 14 103 -13 -169 7 40 -205 141 -238 119 44 -221 -90 -15 -121 59 36
7208 36 209 104 -91 -81 -83 -35 -10 -41 -242 88 -44 65 -108 224 -140 34 91 141 210 -51 -74 50 58 94 36
7233 36 68 -245 92 25 164 90 141 -76 181 -70 -1 85 173 -424 104 52 82 -39 64 176 -165 49 200
7256 200 15 19 -260 -66 1 56 259 -38 80 140 -95 -149 -42 110 155 -22 -145 -93 -5 196 10 -123 171
7279 171 76 203 -135 -97 -80 267 63 14 -60 47 -244 163 23 111 -35 -77 100 -160 -95 -121 81 55 111 112
7303 112 28 12 -51 84 -135 11 -106 -16 -21 134 -73 -21 268 100 -118 55 -38 122 131 -206 -298 294 58 -61
7327 -61 -9 201 -71 -83 -139 -121 -101 -184 201 213 -92 59 -61 -81 88 27 32 43 -85 152 -62 -9 9 -226 190
7352 190 124 -85 -90 127 29 1 108 135 -44 53 69 78 -327 -56 54 11 -41 -115 -37 141 62 127 110 57 -258 83
7378 83 193 78 3 -108 72 -29 2 -123 116 159 -134 -20 -77 249 -88 -127 -53 241 174 -71 155 -30 228
7401 228 -13 -125 -252 -122 -118 228 -28 150 260 -103 73 -146 95 1 -182 24 -5 -187 106 -238 -9
7422 -9 -3 -63 96 -37 -104 -8 -9 18 -73 157 -152 47 152 -51 20 -56 -185 109 15 -163 -110 62 -199 -49 16
7447 16 -66 -162 165 -71 119 87 177 5 43 19 -142 28 -47 33 32 117 -144 114 74 1 54 185 -8 -70 -186
7472 -186 136 217 -295 161 -159 -289 1 26 -65 -82 -37 69 64 61 -94 -190 187 7 145 -22 -86 -143 96 -77
7496 -77 -88 -69 119 255 249 -43 -71 4 81 217 42 -173 90 -97 -122 37 191 67 -77 -73 -154 94 66 53 253
7521 253 -243 -120 -54 180 74 225 -44 -285 39 -100 -91 10 -28 151 110 -225 -269 -50 97 14 -130 -92 -144
7544 -144 -113 129 -24 -14 98 -87 248 126 -210 -57 -97 -24 -158 34 -221 -154 81 53 -292 135 119 -91
7566 -91 275 99 34 113 32 -80 -54 -181 55 3 210 34 -25 132 -111 -81 -48 -342 68 -49 21 -52 141 -91
7590 -91 -122 3 211 123 156 -34 199 77 142 -33 91 -3 55 -18 90 90 107 109 190 87 25 -43 -122 213 -77 32
7616 32 90 118 43 124 47 -169 -265 -2 187 -55 -298 45 -210 212 -85 241 -230 27 -28 -79 90 -115 -201
7639 -201 15 278 86 -239 122 -11 -23 -10 -199 221 -241 170 5 177 72 59 127 -235 309 -36 102
7660 102 -279 -217 16 -99 -101 191 -40 255 60 49 -8 -115 25 -215 24 64 -245 -111 55 1 -181 5
7682 5 -138 -92 273 -14 -34 75 -92 -77 122 -108 50 97 32 -59 -29 -42 -181 -35 -29 117 -117 30 -135 -36
7706 -36 311 -235 -49 12 -45 89 -278 -155 -142 36 -200 159 -184 63 42 -118 249 249 -116 -67 -132 -134 0 -226
7730 -226 -114 46 291 2 62 42 -23 259 52 114 99 134 -72 85 112 -39 -152 11 -10 176 72 61 77
7753 77 80 23 -159 -112 118 124 334 -58 -113 -1 54 -223 20 -10 -113 -51 -113 -17 164 -125 11 64 115 -103 -230
7778 -230 -157 -295 -52 -9 -256 32 -24 111 -82 -29 -129 -113 -98 -107 104 29 14 123 -62 74 -76 -46 246 34
7802 34 8 -116 -28 0 -245 -85 -74 169 -201 43 22 101 16 -72 -130 -78 -78 -184 -237 62 -49 158 242 -359 49
7827 49 -122 -162 -129 121 -36 21 -20 -73 -127 -56 -84 45 65 41 -50 -201 160 107 172 -56 -66 -141 -190 195 -88 166
7853 166 30 96 -190 43 -101 -20 -32 -73 404 -27 75 -35 -255 -2 -28 94 -135 -113 -33 -176 -77 185 60
7876 60 -14 55 -201 -126 -61 55 67 9 67 29 46 -34 75 27 -170 -117 -12 -152 215 123 -380 -49 -94 238 -145
7901 -145 344 50 -115 -25 111 64 -192 -60 -191 70 -120 66 27 59 -181 134 103 196 177 -115 -143 -165 -29
7924 -29 -59 135 -91 142 61 -83 -248 -133 -185 164 29 -131 16 72 -141 -82 -237 -104 128 -76 267 -54
7946 -54 26 161 191 74 39 -151 -124 -17 135 -122 101 -100 -194 206 -94 -120 28 102 160 86 115 6 -30 65
7970 65 10 -36 272 -16 63 173 -185 36 -26 63 -29 71 -207 -40 -60 76 65 123 -44 -114 -28 44 -187 146
7994 146 5 32 -34 -75 29 -178 -67 -183 -158 86 -189 81 -154 32 114 -11 131 -157 -95 -180 -151 -101 -44
8017 -44 200 126 70 336 -72 -28 -116 -269 -22 17 268 -74 85 -25 147 293 -21 -64 52 54 202 116 -55
8040 -55 -36 -69 -52 -20 32 -138 -109 -119 -34 122 -57 -72 124 40 165 208 116 233 150 -36 70 89 -366 -75 -71 -134
8066 -134 5 63 -115 29 -68 -76 -13 112 -12 47 45 -3 150 -69 -151 123 104 71 -104 68 -100 -136 -47 82 85
8091 85 5 -7 -36 123 -118 98 78 27 -84 219 -60 21 -57 136 -314 -170 -290 -79 90 98 -97 -137 125 -22
8115 -22 157 23 22 -97 144 68 -11 324 20 49 247 -133 141 -56 105 103 -283 37 -13 -143 -16 120 20
8138 20 -44 -260 57 156 117 282 -162 -51 25 3 36 -67 -24 67 138 -45 -36 -64 -291 -161 38 192 -206 25
8162 25 -113 -57 95 67 262 -27 -211 68 -69 -76 -25 -143 5 12 -10 -79 27 -74 227 15 111 -43 -80 -162
8186 -162 47 -55 4 -158 206
8191B06
##END NTUPLES=NMR FID
##END=
