##TITLE=1H_Pr 4989-28
 CCl4, 8 sc, 
 28.9.2020
##JCAMPDX= 6.0         $$ Bruker NMR JCAMP-DX V2.0
##DATA TYPE= NMR FID
##DATA CLASS= NTUPLES
##ORIGIN= UXNMR, Bruker Analytische Messtechnik GmbH
##OWNER= root
$$ XWIN-NMR		Version 3.5
$$ Mon Sep 28 11:05:26 2020 Russian Standard Time (UT+4h)  she@DPX200
##.OBSERVE FREQUENCY= 200.1315066352
##.OBSERVE NUCLEUS= ^1H
##.DELAY= (6, 6)
##.ACQUISITION MODE= SIMULTANEOUS
##.ACQUISITION SCHEME= undefined
##.AVERAGES= 8
##.DIGITISER RES= 18
##SPECTROMETER/DATA SYSTEM= spect
##.PULSE SEQUENCE= zg30
##.SOLVENT NAME= CDCl3
##.SHIFT REFERENCE= (INTERNAL, CDCl3, 0, 15.7039)
##AUDIT TRAIL= $$ (NUMBER, WHEN, WHO, WHERE, WHAT)
$$ ##TITLE= Audit trail, XWIN-NMR		Version 3.5
$$ ##JCAMPDX= 5.01
$$ ##ORIGIN= Bruker BioSpin GmbH
$$ ##OWNER= she
$$ F:/spectra/data/she/nmr/H-F/1/audita.txt
$$ ##AUDIT TRAIL=  $$ (NUMBER, WHEN, WHO, WHERE, WHAT)
(   1,<2020-09-28 11:03:55.50 +0400>,<she>,<DPX200>,
      <created by zg, POWCHK disabled, PULCHK disabled
       configuration hash MD5:
       00 E9 B6 7A A2 85 ED C7 34 08 36 98 17 FE 4E 26
       data hash MD5: 16K
       42 4E 87 77 F5 22 42 8D AB F8 89 DA 8E 55 44 AD>)
$$ ##END=
$$ 
$$ hash MD5
$$ 81 1C 68 2D 3B 4D F0 4B DF 96 44 28 D3 55 FE 50
##$RELAX= 
##$RELAX= 
##$RELAX= 
##$RELAX= 
##$RELAX= 
##$RELAX= 
$$ Bruker specific parameters
$$ --------------------------
##$DU= <F:/spectra>
##$EXPNO= 1
##$NAME= <H-F>
##$PROCNO= 1
##$TYPE= <nmr>
##$USER= <she>
##$AMP= (0..31)
100 100 100 100 100 100 100 100 100 100 100 100 100 100 100 100 100 100 
100 100 100 100 100 100 100 100 100 100 100 100 100 100 
##$AQSEQ= 0
##$AQ_mod= 1
##$AUNM= <au_zg>
##$AUTOPOS= <>
##$BF1= 200.13
##$BF2= 200.13
##$BF3= 200.13
##$BF4= 200.13
##$BF5= 200.13
##$BF6= 200.13
##$BF7= 200.13
##$BF8= 200.13
##$BYTORDA= 1
##$CFDGTYP= 0
##$CFRGTYP= 5
##$CHEMSTR= <none>
##$CNST= (0..31)
1 1 145 1 1 1 1 1 1 1 1 1 1 1 1 1 1 1 1 1 1 1 1 1 1 1 1 1 1 1 1 1 
##$CPDPRG= <>
##$CPDPRG1= <>
##$CPDPRG2= <>
##$CPDPRG3= <>
##$CPDPRG4= <mlev>
##$CPDPRG5= <mlev>
##$CPDPRG6= <mlev>
##$CPDPRG7= <mlev>
##$CPDPRG8= <mlev>
##$CPDPRGB= <>
##$CPDPRGT= <>
##$D= (0..31)
0 1.2 0 0 0 0 0 0 0 0.06 0 0.03 0 0 0 0 0.0002 0 0 0 0 0 0 0 0 0 0 0 0 
0 0 0 
##$DATE= 1601276635
##$DBL= (0..7)
120 120 120 120 120 120 120 120 
##$DBP= (0..7)
150 150 150 150 150 150 150 150 
##$DBP07= 0
##$DBPNAM0= <>
##$DBPNAM1= <>
##$DBPNAM2= <>
##$DBPNAM3= <>
##$DBPNAM4= <>
##$DBPNAM5= <>
##$DBPNAM6= <>
##$DBPNAM7= <>
##$DBPOAL= (0..7)
0.5 0.5 0.5 0.5 0.5 0.5 0.5 0.5 
##$DBPOFFS= (0..7)
0 0 0 0 0 0 0 0 
##$DE= 6
##$DECBNUC= <off>
##$DECIM= 32
##$DECNUC= <off>
##$DECSTAT= 4
##$DIGMOD= 1
##$DIGTYP= 9
##$DL= (0..7)
0 120 120 120 120 120 120 120 
##$DP= (0..7)
150 150 150 150 150 150 150 150 
##$DP07= 0
##$DPNAME0= <>
##$DPNAME1= <>
##$DPNAME2= <>
##$DPNAME3= <>
##$DPNAME4= <>
##$DPNAME5= <>
##$DPNAME6= <>
##$DPNAME7= <>
##$DPOAL= (0..7)
0.5 0.5 0.5 0.5 0.5 0.5 0.5 0.5 
##$DPOFFS= (0..7)
0 0 0 0 0 0 0 0 
##$DQDMODE= 0
##$DR= 18
##$DS= 0
##$DSLIST= <SSSSSSSSSSSSSSS>
$$ [...]
##$SUBNAM2= <"">
##$SUBNAM3= <"">
##$SUBNAM4= <"">
##$SUBNAM5= <"">
##$SUBNAM6= <"">
##$SUBNAM7= <"">
##$SUBNAM8= <"">
##$SUBNAM9= <"">
##$SW= 16.880792210976
##$SWIBOX= (0..15)
0 0 2 0 0 0 0 0 0 0 0 0 0 0 0 0 
##$SW_h= 3378.37837837838
##$TD= 16384
##$TD0= 1
##$TE= 0
##$TE2= 300
##$TE3= 300
##$TEG= 300
##$TL= (0..7)
0 120 120 120 120 120 120 120 
##$TP= (0..7)
150 150 150 150 150 150 150 150 
##$TP07= 0
##$TPNAME0= <>
##$TPNAME1= <>
##$TPNAME2= <>
##$TPNAME3= <>
##$TPNAME4= <>
##$TPNAME5= <>
##$TPNAME6= <>
##$TPNAME7= <>
##$TPOAL= (0..7)
0.5 0.5 0.5 0.5 0.5 0.5 0.5 0.5 
##$TPOFFS= (0..7)
0 0 0 0 0 0 0 0 
##$TUNHIN= 0
##$TUNHOUT= 0
##$TUNXOUT= 0
##$USERA1= <user>
##$USERA2= <user>
##$USERA3= <user>
##$USERA4= <user>
##$USERA5= <user>
##$V9= 5
##$VALIST= <valist>
##$VCLIST= <CCCCCCCCCCCCCCC>
##$VD= 0
##$VDLIST= <DDDDDDDDDDDDDDD>
##$VPLIST= <PPPPPPPPPPPPPPP>
##$VTLIST= <TTTTTTTTTTTTTTT>
##$WBST= 1024
##$WBSW= 4
##$XGAIN= (0..3)
0 0 0 0 
##$XL= 0
##$YL= 0
##$YMAX_a= 471509
##$YMIN_a= -434836
##$ZGOPTNS= <>
##$ZL1= 120
##$ZL2= 120
##$ZL3= 120
##$ZL4= 120
##$ABSF1= 10
##$ABSF2= 0
##$ABSG= 5
##$ABSL= 3
##$ALPHA= 0
##$AQORDER= 0
##$ASSFAC= 0
##$ASSFACI= 0
##$ASSFACX= 0
##$ASSWID= 0
##$AUNMP= <proc_1d>
##$AZFE= 0.1
##$AZFW= 0.1
##$BCFW= 1
##$BC_mod= 2
##$BYTORDP= 1
##$COROFFS= 0
##$CY= 11.3945322036743
##$DATMOD= 1
##$DC= 2
##$DFILT= <>
##$DTYPP= 0
##$F1P= 16.9975609425685
##$F2P= -3.02152046262296
##$FCOR= 0.5
##$FTSIZE= 0
##$FT_mod= 4
##$GAMMA= 1
##$GB= 0.15
##$INTBC= 1
##$INTSCL= 1
##$ISEN= 128
##$LB= 0.24
##$LEV0= 0
##$LPBIN= 0
##$MAXI= 10000
##$MC2= 0
##$MEAN= 0
##$ME_mod= 0
##$MI= 1.114404
##$NCOEF= 0
##$NC_proc= 0
##$NLEV= 6
##$NOISF1= 3.799351
##$NOISF2= 2.8
##$NSP= 1
##$NTH_PI= 0
##$NZP= 0
##$OFFSET= 15.70392
##$PC= 1
##$PHC0= -9965.976
##$PHC1= 8.6009
##$PH_mod= 1
##$PKNL= yes
##$PPARMOD= 0
##$PSCAL= 0
##$PSIGN= 0
##$REVERSE= no
##$SF= 200.130013532006
##$SI= 16384
##$SIGF1= 3
##$SIGF2= 2
##$SINO= 400
##$SIOLD= 16384
##$SREGLST= <1H.CDCl3>
##$SSB= 0
##$STSI= 0
##$STSR= 0
##$SW_p= 3612.71676300578
##$SYMM= 0
##$S_DEV= 0
##$TDeff= 0
##$TDoff= 0
##$TI= <>
##$TILT= no
##$TM1= 0
##$TM2= 0
##$TOPLEV= 0
##$USERP1= <user>
##$USERP2= <user>
##$USERP3= <user>
##$USERP4= <user>
##$USERP5= <user>
##$WDW= 1
##$XDIM= 8192
##$YMAX_p= 0
##$YMIN_p= 0
$$ End of Bruker specific parameters
$$ ---------------------------------
##NTUPLES= NMR FID
##VAR_NAME=  TIME,          FID/REAL,        FID/IMAG
##SYMBOL=    X,             R,               I
##VAR_TYPE=  INDEPENDENT,   DEPENDENT,       DEPENDENT
##VAR_FORM=  AFFN,          ASDF,            ASDF
##VAR_DIM=   8192,          8192,            8192
##UNITS=     SECONDS,       ARBITRARY UNITS, ARBITRARY UNITS
##FACTOR=    0.000296,      1,               1
##FIRST=     0,             0,               0
##LAST=      2.424536,      0,               0
##MIN=       0,             -434836,         0
##MAX=       2.424536,      471509,          0
$$ Real data points
##PAGE= N=1
##DATA TABLE= (X++(R..R)), XYDATA
0@%%%%%%%%%%%%%%%%%%JrJ6j6J8k3K9l3M1n3O2p0Q0r4J12j31J50j71J93k20K53
39A35k89L29l69M12m64N23n86O54p27Q07q96R95j104J221j351J494j650J825k021
58a062K236k477K751l062L423l838M316m859N408n685M120Q57M15140n91874r5559
73b70165P41674p03157J6514O53314o72085M0538O28539o95820J00756N76809
83D16917o80240J21229N46798o80417J63700M91399o57874J94116M46212o52893
93b91053K37872L93282o37500K65479L54974o21333K89353L08903n96054L06841
103A0764K65043n71248L29281K21599n50783L45957J86870n28183L54415J53397
113B17112m97399L54383J18181m58935L54779P8465m20746L54275M4304l89018
$$ plain form
0 0 0 0 0 0 0 0 0 0 0 0 0 0 0 0 0 0 0 0 1 -8 8 -8 10 -13 16 -17 24 -29 33 -37 43 -51 61 -70 80 -91 102 -118 135
39 135 -154 175 -194 218 -246 277 -309 345 -382 425 -471 524 -580 641 -710 784 -866 959 -1062
58 -1062 1174 -1303 1448 -1614 1809 -2029 2287 -2572 2836 -2849 1271 2128 417268 -174606 -270165
73 -270165 471509 -231648 -215134 438180 -233905 -193367 435172 -260648 -159892 416917
83 416917 -263323 -142094 404704 -275713 -112013 379386 -278488 -84372 361840 -291053
93 -291053 -53181 340101 -297399 -31920 323054 -298279 -8926 299977 -296077 10764
103 10764 275807 -295441 33840 255439 -295344 50613 237483 -290700 63715 217112
113 217112 -280287 74096 192277 -266658 88121 166586 -254160 100115 144419 -244599
123b44599L52510J7990l56113L41359k865l21546L25587k5113k82032L10722m7835
134F8065k48458K98363o4370k20261K83648p4877j94674K64030p9799j68032K43626
145A07261q6267j42973K25039r0642j22606K08521r1740j06202J90815q8246q8428
156h5468J67192q4407o9128J45347q1892n0060J24780p8813l6482J07194p0821
167a2558k7060Q8236o0149j9055O8685m9130j0483N1957m1840l354L8613l4247
179a0385k46K8660k5432J95J8801j5747N12Q029m960o6k40K820j727n764J2313
194F763n913j0050J9575j0391j3895K8020j3629j6986L4131j7566j8713L8742
206B0088k1323j9158M3833k6988j8271M8615l2178j7417N2948l7263j6211N4805
$$ plain form
123 -244599 107911 125901 -230212 111147 108282 -213264 112323 87210 -194822 115900 68065
134 68065 -180393 117970 53600 -166661 116987 42110 -152564 111466 31667 -136365 107261
145 107261 20994 -121979 103060 12418 -110188 98333 6593 -99609 91206 2960 -85468
156 -85468 81724 -2683 -71811 73536 -8356 -58416 66364 -12449 -48931 58263 -12558
167 -12558 -39618 48618 -11531 -30586 38099 -11031 -21514 30443 -11397 -14751 23862 -10385
179 -10385 -10631 18029 -7403 -7208 11593 -4154 -3642 4387 -573 -639 -879 1941 214 -5550 6763
194 6763 850 -9200 10375 -16 -13911 14109 480 -16506 17625 59 -18654 20088
206 20088 -1235 -20393 23440 -3548 -21819 26796 -5382 -22799 30149 -7114 -23325 31480
218C1480m1228j2690N5757m4602r924N5786m9591n204N5481n2527j035N5455n6840
231a9682K808N4861o0133O823N3100o1763J0762N1063o3329J4887M7641o4748
243b7710J8868M5268o6060K3251M2686o6833K5770M0563o7394K8199L7307o6561
255c2646L2049L3208o5674L5566K8640o5430L8295K5704o4187L9820K2908o1905
267c3652M0850J8710n9436M2727J3980n7180M5813J0136n6087M7250P604n4357
279c3642M8078L674n0980M8782p45m6999N0807n741m5968N2791q503m4114N4475
292B1915j1274m2443N3846j3881l8560N4590j8494l5963N5563k1786l3315N6865
304B7063k3598l2982N6194k5110k9684N4717k6879k5644N3930l0923k2128N3987
$$ plain form
218 31480 -9748 -22438 33319 -11283 -21207 34579 -15012 -20216 35265 -17262 -18297 37158 -19682
231 -19682 -16874 37987 -22146 -15323 37777 -23986 -13224 37839 -25490 -10603 37038 -27710
243 -27710 -8842 36426 -29634 -6383 36303 -30530 -4760 35803 -31591 -3392 33915 -32646
255 -32646 -597 32611 -33063 2503 31143 -34287 4008 29712 -34475 5345 28253 -33652
267 -33652 7198 25908 -33528 9199 23179 -34001 11812 21948 -34139 13111 20715 -33642
279 -33642 14436 18110 -32870 15912 15167 -31832 18975 13234 -32734 20057 11554 -32560 21915
292 21915 10641 -31802 22044 8163 -30397 24193 5699 -30264 25299 3513 -29802 27063
304 27063 3465 -29517 26677 1567 -28117 26600 -279 -25923 28007 -2916 -25044 28943
316B8943l4131j8820N3492l5235j7007N1753l6945j2591M9563l9142q302M8303
328B9881m3282l802M8662m6125j455M7447m6821J92M5845m7382M057M2979m8646
341a8450P049M1282m9671R572M0409n0187J0282L8545m8590J2103L4629m6896
353a9923J4656K9900m5608J7661K7374m4896J9432K3537m3038K0450K0354m0315
365b0416K2435J5619l8327K5359J1134l6937K7310Q634l6673K9305O585l4801
377b0773K8938M105l2669K9633J837l1422K9952K68k9852L0363l44k9237K8991
390I790j177k6218K7072k223k3191K5143l493k0272K3826m559j8257K2112m665
403C888j5636K0077n585j2486J7733o776r770J6294p939p452J5529q333o022J4336
$$ plain form
316 28943 -5188 -24008 29484 -5751 -22758 28995 -7950 -20541 29022 -10120 -18422 29881
328 29881 -13401 -17203 31459 -14666 -16121 31326 -15495 -15303 30542 -16840 -12783 30196 -18450
341 -18450 -11401 29881 -19790 -10218 30191 -19996 -9714 28831 -19759 -7656 26973 -19923
353 -19923 -5267 24633 -20975 -3314 24060 -20836 -1404 22133 -20905 -455 19899 -20416
365 -20416 2019 17638 -20689 4670 15804 -21133 6177 14811 -21862 7443 14028 -20773
377 -20773 8165 12270 -20399 9234 11071 -20351 9601 9869 -19983 10380 10036 -19201 9790
390 9790 8613 -17605 9467 7244 -15947 9196 5703 -14569 9257 4698 -13559 8553 3888
403 3888 -11748 8329 2744 -9742 7991 1215 -8555 7739 -200 -7652 7877 -456 -6478 7858
417G858r150n178J3596q216m690J2955r210l472J3034r704l180J2526r434k853
431e118J1783q781k207J0962q522k007R794q464j281R947q308r69Q890q456o15
446c352R190q687P47P492r324K344P080r421L327O036j0942M735O947j1871O016
461C17O186j3751P539O749j4794Q279P386j6544R653P330j8620J2008P551k1008
475a1719J4471P098k3634J7375O909k5769K0832M838k7298K3754L250k8505K7773
488I375M14k9908L1167k005l0522L4865n427l0736L8290q269l1064M2098j1917
501F361l1935M5674j5107l1662M9187j8538l1831N3366k3003l1418N6406k6682
513H18l0765O0473l1360l0191O4789l6679k8888O8217m1263k7693P1246m6460
$$ plain form
417 7858 -1292 -6470 7126 -1090 -5780 7175 -2035 -5507 7527 -2177 -5357 7169 -2265 -5118
431 -5118 6665 -2116 -4323 6639 -1883 -3890 5904 -2560 -3841 6106 -2202 -3171 5719 -2737 -3352
446 -3352 5838 -2849 -2102 5390 -3934 -1590 5490 -3931 -604 5432 -5510 -775 6172 -5699 317
461 317 6503 -7248 291 7040 -7754 525 7911 -8633 1020 8350 -10270 1738 9289 -11719
475 -11719 2752 9850 -13784 3591 10500 -15269 5563 10401 -16897 6857 10107 -18398 9375
488 9375 9789 -20119 11048 9043 -21479 13386 7959 -22777 15513 7244 -23820 18278 6361
501 6361 -25574 20100 4993 -26669 22518 3980 -27851 25515 2512 -28906 27500 818
513 818 -29947 30526 -834 -31025 33764 -2915 -31803 36414 -4849 -32542 38704 -7756
525g756k3980P3583n2777k0450P5516n8210j6330P6622o3897j1406P7343o9499
537b1241n970P7376p5287n9P6734p9895N656P5391q4703J1862P3726q9160J7861
550a7709P2243r3428K4007P0047r7044K9691O7783j00906L5951O5138j04417M2534
562f110O1594j06957M9169N7312j09833N6047N2419j10708O2526M6604j11422
573e9359O9073M0080j11842P6395L3487j11716Q2325K6566j10633Q8451J9521
584D2348j09001R3517J1621j05821R8737L461j02808J03772m302j00126J07520
595C8918j0473r6746J09826j6458r1951J11336k3358q7374J13491k9628q3168
606f5585J15568l5954p8162J16433m1716p3237J16709m8259o6097J17053n5376
$$ plain form
525 -7756 -31736 41847 -10930 -31380 44136 -14074 -30404 46218 -17679 -29085 48258 -21241
537 -21241 -27211 50165 -25122 -25181 51553 -28342 -22686 52705 -31998 -20136 53590 -35570 -17709
550 -17709 54534 -38894 -14887 55160 -41884 -12193 55590 -45316 -9365 55773 -48644 -6110
562 -6110 55484 -51473 -2304 55008 -54825 1222 53641 -57067 5459 52063 -59359
573 -59359 9714 49794 -62048 14347 47834 -63882 18443 45009 -65624 22827 42348
584 42348 -66653 26864 38485 -67336 31401 34862 -67946 35826 31524 -68602 38918
595 38918 28445 -68301 41525 25067 -66884 44452 21094 -66280 47211 17583 -65585
606 -65585 49983 14029 -64133 52300 10584 -62653 54056 5797 -60300 56753 1377
617A377n9394J17256o2475n2703J16650o8107m5179J14091p2914l7697J11451
628F2356p8659k8678J07984q3262k1986J05686q6903j5558J02192q8839j0329
639c5996R7763q9692l832R2411r1701L380Q6962r3140R641Q2834r4038J4379P7358
652E6329r3295J9587P1007r1529K4914O3923r1227L1564N7804r0756L6141N2603
664D7065r0102M0307M7366q7681M3960M0245q4908M7913L4466q2782N1247K9086
676C6182q0123N2522K5580p6767N2836J9992p0813N2503J4595o5195N2692R466
688B3470o0749N2276O139n6403N0006L714n0363M6612J88m3836M4651m645l7637
701b6577M3151p855l3412M1304j0060k8549L7726j0914k4020L4030j2566j8642
$$ plain form
617 1377 -58017 59239 -3236 -55939 60711 -7396 -52575 61516 -11398 -49095 62356
628 62356 -16303 -44981 63003 -20259 -42245 63441 -23462 -39020 63172 -25667 -35996
639 -35996 61767 -27925 -31757 60654 -31047 -27667 59295 -33845 -24204 58630 -35408 -21029 56329
652 56329 -36966 -17379 53628 -37901 -12987 50936 -40291 -8727 49077 -41679 -5538 47065
664 47065 -43037 -2730 44636 -43045 915 41160 -43748 4165 38631 -44151 7096 36182
676 36182 -43941 8581 34161 -42606 10230 30222 -40591 11912 26507 -38688 14004 23470
688 23470 -37279 14997 21136 -35267 14739 18453 -31910 14702 14890 -28946 15705 11060 -26577
701 -26577 16574 8719 -24693 16611 6551 -21998 15728 4814 -19206 14824 2258 -16384
713a6384L1370j4344j4916K8191j4605j2055K5089j2711r780K0200j1136o501
725g582J5719j0090l213J1676q434j893Q469n606j601M591j881n42n87J592J525
740B143n516M448K273q466O952K288j1047J0858K01j3848J5606j051j6965J9391
754G267j855j9159K2608m221j9563K5982p430j9752L0007j1285k0409L4537j5111
767A616k0914L8054j8415k0904M1550k2221j9328M4366k7471j7315M7324l2081
779e739j5987N0645l6244j4866N2651l9670j2062N3253m3563r027N4397m7869
791a4081n773N5192n1634k810N5481n4608N72N4750n7548M714N2921n9972Q985
804a3811N1793o3326J3404N0078o5702J7505M8015o7257K1564M5028o8461K6075
$$ plain form
713 -16384 14986 642 -14274 13917 -688 -12743 12346 -365 -10145 10055 -1081 -7582
725 -7582 8137 -1953 -5166 6510 -1924 -3817 4652 -954 -2555 2036 155 -387 -974 618 2143
740 2143 -3373 1075 3348 -5118 1834 4122 -6925 3933 4134 -9714 5892 4841 -12124 7267
754 7267 5412 -13747 8861 4640 -14923 11059 3629 -16123 13884 2599 -17810 16727 1616
767 1616 -19298 18756 341 -20563 20987 -1234 -20562 23804 -3667 -20982 26342 -5739
779 -5739 -21726 28919 -7325 -22191 30460 -9210 -21272 31981 -11582 -20609 33788 -14081
791 -14081 -19854 35338 -16296 -19106 36375 -18233 -17661 37089 -20459 -15745 37176 -22796 -13811
804 -13811 37982 -25344 -11940 38138 -27564 -10059 37956 -29301 -7737 37291 -31170 -5095
816e095M1908o9485L0049L8453p0265L4100L5085p0116L7592L0995o9863M1126
828D484K6975o9008M4812K2244o7690M7687J8267o5837M9757J4370o4458N2297
840A3900R689o2313N4755N480n9258N5782J276n6515N6861k983n3619N8029o591
853A4493n0476N8958j0663m7252N8637j3673m3805N8287j6639l9999N7570k0010
865E428l6119N6522k2616l2368N5475k4782k8885N3569k6631k5210N1399k7832
877b050k1258M9129k9865j7409M7507l1666j4012M4662l1915j1030M2338l2162
889g731p952L9297l2565m690L6237l2673j836L4093l3086M19L1651l2124K183
902h777K8408l0997M489K5119l0458P077K2741l0237Q582K0221k8803R780J7882
$$ plain form
816 -5095 36813 -32672 -2623 35830 -34435 -335 34750 -35366 2226 33221 -36642 4484
828 4484 31459 -37549 7263 29507 -38183 9504 27771 -38066 11691 26061 -38397 13900
840 13900 23589 -38724 16031 21511 -37747 18035 19311 -37204 19657 16674 -36945 21084 14493
853 14493 -35983 22975 12312 -34940 23697 10024 -33781 24506 7867 -32132 25438 5428
865 5428 -30691 25831 3215 -29153 26322 1540 -27345 26224 -407 -25617 25782 -2050
877 -2050 -23308 25821 -4044 -21453 26054 -5612 -19624 25038 -6877 -17907 24431 -7731
889 -7731 -15683 23614 -8951 -13641 22596 -10077 -11913 22180 -10906 -10487 21164 -10960 -8777
902 -8777 19631 -11366 -6877 18242 -12216 -5139 17602 -12635 -4053 16168 -12635 -2855 15027
915A5027k6996J0082J5500k5389J0940J2786k3696J2395J0492k2977J2527R499
927A0190k0948J2103P647j8949J1819N716j7085J2348L822j6021J2431K991j5195
940i131J1866K854j3502J0574J891j1715J0372M84j0340J0507r59r219R913j091
954B504q098Q460q13o275O707j233m414N333j798k912M779j909k332L285o55k030
970a401K121k54q02K28p0N93l14p47J009k80o02J167j095J42J150k061J171J415
988A370k716Q95K048k701Q04J775k451J018J040k617K323L22l283K987P76m236
1004b646L549J116m976M255R3m812N895j220n304P594k527o062Q771k577n955
1019d806Q843l168n252Q663m187m205Q781n212l848R359n344l896Q976m918l743
$$ plain form
915 15027 -11969 -1887 13613 -11776 -836 11950 -11746 649 11141 -11836 691 10190
927 10190 -10758 1345 8992 -9957 1862 7578 -9507 2841 6663 -9358 3073 6064 -9131
940 -9131 2735 5589 -7913 2661 4552 -7163 3209 3693 -6647 3860 2901 -6318 3595 2504
954 2504 -5594 2866 2053 -4222 2485 1252 -3162 2171 373 -2539 2240 331 -2001 1284 629 -1401
970 -1401 720 466 -336 -108 -178 415 101 -646 363 83 -519 648 -447 -305 845 -1216 -45 1370
988 1370 -1346 -451 1597 -1104 -300 1475 -976 42 1082 -1535 788 1110 -2173 814 1590 -2646
1004 -2646 903 2019 -2957 1298 1391 -3421 2474 1254 -4050 3544 1017 -5045 3726 1149 -4806
1019 -4806 4037 869 -4383 4280 93 -4112 4669 -543 -4391 4968 -376 -4272 4704 -214 -3957
1034c957Q114n276k174P740n665j692P421o180j282P495o293j168P057n886m94
1049b240O576o552N43N818o924J237N822p042J590N203o452J348M674n832J409
1064h22L782m950J666K754m378J574K175l246J294J366j821K17P52l48N4o26J428
1081H71j017q28K700j964j250M025l108j723N588m480j533P034n946j491Q171
1096E049o829j518Q913q491l80R770r802k08J0829j1615R41J1650j3509J794J2542
1111I136j5443L228J3069j7340M530J3440j9015O061J3713k0882P826J3530k2798
1124a0945J0093J3318k4455J1586J2905k5721J4180J1911k7050J6050J0893k8257
1136a5492J8233R955k9082K0364Q453k9742K2740O697l0080K4398N008l0159K6667
$$ plain form
1034 -3957 4157 -1119 -3293 4447 -1218 -2910 4511 -1669 -2951 4544 -1749 -2917 4140 -1746 -2240
1049 -2240 4336 -2216 -1673 4145 -2779 -1542 4280 -2762 -1172 4031 -2421 -1073 3601 -2231 -822
1064 -822 2960 -1990 -324 2430 -1948 -374 1801 -1445 -151 1215 -606 -389 363 15 69 -557 871
1081 871 -146 -974 1726 -238 -1488 2537 -571 -2294 3294 -1186 -2719 4315 -1631 -3122 5049
1096 5049 -1780 -3298 5615 -2876 -3256 6514 -3288 -3496 7333 -4282 -3341 8309 -5200 -3406 9136
1111 9136 -6307 -3079 9990 -7350 -2820 10620 -8395 -2334 11379 -9503 -1677 11853 -10945
1124 -10945 -852 12466 -11989 -403 12502 -13219 961 12872 -14178 1872 12765 -15492
1136 -15492 2741 12696 -16386 3978 12431 -17311 5429 12126 -17954 6444 11452 -18707 7960
1149G960K797l0173K8533O79k9478L0180j153k9266L1434l335k8544L3251n518
1162G367k7717L4423p908k6837L5507r773k5270L6094j2258k3366L6560j4467
1174B355k1535L6747j6353j9735L6445j8220j7444L6163j9552j5704L5431k1274
1186b676j3069L4746k2631j0998L3121k3342q326L1375k4028n912L0099k4971
1198f612m137K8323k5198k177K6595k4982j14K4371k4664J449K2097k3827L099
1211e777K0009k2864M136J7612k2097N283J5800k0842N994J3558j9303O567J1634
1224I710j7718P153R637j6377P412P426j3961O985N674j2078O885M238j0616O478
1238H48L082q934O214J824o835M888J024m510L062M80k730K225K2j411P81JK25
$$ plain form
1149 7960 10757 -19416 9117 9796 -19682 10498 9345 -19921 11513 8178 -20366 12885 7367
1162 7367 -20350 14073 6165 -20672 14835 5062 -20208 15886 3628 -19738 16822 2355
1174 2355 -19180 17567 1214 -18521 17924 -296 -17740 18423 -1129 -16833 18598 -2676
1186 -2676 -15745 19001 -3630 -14628 18493 -4849 -13175 18200 -5828 -11740 18359 -6612
1198 -6612 -10749 17574 -7624 -9801 16794 -8188 -8302 16069 -8595 -7146 14951 -8876 -5777
1211 -5777 14232 -8632 -4496 13116 -8981 -3698 12102 -8740 -2746 10812 -8491 -1924 9710
1224 9710 -8008 -855 8782 -7595 -183 7243 -6718 267 5941 -6137 748 4986 -5630 848
1238 848 3930 -5004 1210 3034 -3801 1087 2111 -2399 663 1143 -1587 638 660 -751 30 31 256
1255B56p64N1J544k062M63L035m586J303M125o098J839N228p898K418N876q711
1271c981L228O301j0442L867P174j1510M544P253j2744O010P139j3707P148O364
1285F644j4054Q290O035j4980R716N270j5890J1350M450j6231J2066L948j6610
1298i996J3753K628j6788J5189Q52j6747J6836k41j6737J7170o60j6879J8247
1311F627k008j6334J8924l355j5498J9648m358j5308K0009n429j4379K0040o048
1324B531j3587J9872p361j1808J9651q415j0804J9618r665r783J9448j0115q727
1337i145J9010j1151p086J8338j2073n900J8096j2934m652J7906j3648l800J7161
1350A0122j3885k522J6634j4342j824J5726j4353o34J5043j4878J13J4414j4764
$$ plain form
1255 256 -508 -457 1087 -975 -512 2523 -2063 -760 3365 -2733 -894 4334 -3564 -1146 4730 -3981
1271 -3981 -753 5548 -4894 -1027 6147 -5363 -819 6434 -6310 -300 6839 -6868 280 6644
1285 6644 -7410 880 6915 -8065 1651 6921 -8969 2381 6831 -9400 2666 6614 -9996
1298 -9996 3757 6385 -10403 4786 5638 -11109 5727 5486 -11251 5919 5259 -11620 6627
1311 6627 4619 -11715 7209 3854 -11644 8004 3646 -11662 8347 2918 -11461 8579 2531
1324 2531 -11056 8816 1455 -10353 9298 883 -9921 9697 32 -9751 9697 -418 -9145
1337 -9145 9865 -1286 -8372 9966 -2107 -8007 10089 -2845 -7497 10409 -3239 -7039 10122
1350 10122 -3763 -6285 10349 -3993 -5817 9909 -4444 -5078 9965 -4913 -4800 9614 -5150
1363e150J061J3505j4865K080J2218j4792L459J1176j5191M677J0336j5258N227
1376a517R422j4950N989Q557j4596O730P972j4890P826O894j5240Q820O033j4906
1390g856R055N448j4714R852M304j4186J0208L629j3983J1009K979j4336J1656
1403C065K264j3920J2050J467j3424J2321N44j2744J2463m75j2063J3474j676
1416C346j1635J3559k355j1183J3668k978j0590J4152m124r689J4133n054q821
1429g571J4156n668q265J4288o585p375J4082p126o841J4004p678o064J4074q410
1443i79n343J4024r477m202J3710r832l399J3051j0337k277J2864j0914j582J2187
1457G494j1125l08J1818j1708P4J1227j1654R34J0650j2124K226R468j1786K786
$$ plain form
1363 -5150 -4089 9416 -5449 -3369 8849 -5943 -2484 8692 -6499 -1822 8514 -6744 -1517
1376 -1517 7905 -7045 -1056 7501 -7095 -365 7607 -7283 543 7437 -7803 1017 7050 -7856
1390 -7856 1199 6647 -8067 1785 6089 -8097 2111 5740 -8243 2766 5745 -8591 3065
1403 3065 5329 -8591 3459 4926 -8498 3823 4367 -8377 4086 3611 -8452 5022 3346
1416 3346 -8289 5270 2915 -8268 5400 2422 -8168 5984 1860 -7829 6304 1250 -7571
1429 -7571 6585 917 -7348 6940 355 -7020 7062 -64 -6905 7099 -579 -6643 7431 -979
1443 -979 -6322 7702 -1775 -5977 7733 -2099 -5498 7553 -2784 -5061 7803 -3111 -4693 7494
1457 7494 -3631 -3939 7879 -3829 -3755 7472 -4182 -3248 7402 -4722 -2496 6972 -4814 -2028
1471b028Q724j1490L358P812j1147L995O296j0194L734O242r958M102N334r309
1485d529M287M310q179M295L724p817M640K793p305M493K361o659M390J513n666
1500c349M071J286m616L680N03m011L278M03k906K256l8j339J013M1o62Q52o78
1517b16K49k38J07Q41j151J44J537k223K94K458l306P79L208m456J429L017m911
1534b438K374K720n679L018L267p035M174L011p403M361L202p890N294K718q376
1549d682N977K472r635P785J819r723Q159J732j0600R046J598j0421R621K59j0541
1564g134J1104q20j0968J2403j609j0959J2835k041j0652J3072k981j0070J3982
1577F162m374r730J4375n282r366J5325o057r260J5500o541q397J4806p410o910
$$ plain form
1471 -2028 6696 -4794 -1436 6376 -4771 -776 5520 -4674 -940 5302 -4656 -554 4780 -4529
1485 -4529 -242 4068 -4111 184 3908 -3909 731 3524 -3781 712 3073 -3586 804 2317 -3349
1500 -3349 722 2008 -2608 1072 1575 -2436 842 1245 -1661 595 557 -782 231 272 -390 462 -216
1517 -216 33 -205 -98 743 -408 -264 1273 -950 -656 1802 -1504 -725 2483 -1973 -544 2473 -2438
1534 -2438 -64 2656 -3023 -5 3262 -3773 401 3412 -3991 370 3572 -4318 976 3694 -4682
1549 -4682 1295 3767 -5868 1917 3736 -5987 2172 3904 -6696 2350 3948 -6473 3148 3407 -7134
1564 -7134 3970 3150 -7818 4585 2976 -7983 4852 2811 -7841 5231 2250 -7820 6162
1577 6162 1788 -7942 6433 1151 -8215 7110 1053 -8207 7293 752 -7645 7161 -249 -7159
1591g159J4915q505o404J5064q850n948J4943r045n377J4194r565m041J3348r931
1605b361k706J2756j0685j692J2208j0904p50J1205j0142n44J0362j0681J014
1618b920Q948j0174J817Q443j0355K322P929j0178K319P264r359K641O232q811
1632c882L245N050q275L683M143p677L551L780o663K991K788n512L367J869n199
1647b741L615J067m197L145O23l556K590P43k594J978J5j529J488k30j158J242
1663E01m99j82K33lP8n93N32O10j327N34J207j989N43J653k332R44J698l414J824
1682A8K191m570K373K515n378K757K965n803K793L141o608M043K846p320M762
1697G25K658p837N393K787q529N960K514q624O303K078q561P192J371r169Q102
$$ plain form
1591 -7159 7756 -749 -7153 7911 -939 -6887 8056 -989 -6366 7828 -1737 -5778 7570 -2361
1605 -2361 -5067 7689 -2996 -4688 7520 -3384 -4134 7071 -3071 -3615 6747 -3934 -2920
1618 -2920 6028 -4146 -2329 6114 -4241 -1919 6010 -4168 -1849 5415 -3944 -1303 4929 -3882
1632 -3882 -637 4413 -3862 -179 3964 -3713 -162 3618 -3045 -54 2734 -2778 589 2458 -2741
1647 -2741 874 1941 -2256 889 1512 -2044 546 1289 -1305 673 688 -841 647 417 -741 501
1663 501 2 -180 53 50 128 -465 67 677 -650 -116 1091 -898 -355 1298 -1034 -90 1608 -1806 18
1682 18 2209 -2361 12 2527 -2851 -94 2871 -2932 -139 3002 -3606 437 3283 -4037 725
1697 725 3383 -4454 939 3726 -4803 1157 3671 -4953 1350 3428 -5133 2059 3430 -5739 2363
1712B363J008r348Q850K93r188Q993k23q840R706q32r075J0132j525q899J0965
1727D380k606q356J1267l031p999J1531m128p576J1670m472p097J2245n487o661
1741f320J2376o292n693J1831o420n304J2190p154m887J2190p895l427J1657q874
1755b022k811J1562r044k027J1177r752j079J0769r878p16J0479j0051R1J0069
1769F767j0581R55R512j0816J782Q561j0311K328Q232j1013L029P586j0663L374
1783a258P077j0794M244O236j0340M427N760j0478N025M926r923N214M528r383
1797d739N418L684r043N473L129q633N801K289p941N693K233p825N716J297o817
1812d265N762P07o199N738K26n719N556J56n477N368m76m524M898n32m267M857
$$ plain form
1712 2363 3371 -5977 2873 3166 -6022 2971 2748 -6092 3614 2782 -6293 3839 2314 -6585 4380
1727 4380 1774 -6582 4685 1654 -6345 5186 1058 -6518 5152 680 -6417 5828 341 -6320
1741 -6320 6056 -236 -5929 5902 -518 -5822 6368 -786 -5673 6517 -1378 -4805 6852 -2022
1755 -2022 -4833 6729 -2315 -4342 6835 -2917 -3996 6773 -3105 -3821 6658 -3393 -3302 6767
1769 6767 -3814 -2859 6653 -4163 -2381 6180 -4131 -1803 6429 -4584 -1555 6031 -4632 -1258
1783 -1258 5819 -4975 -731 5505 -4835 -408 5352 -5126 -101 4825 -5098 116 4644 -4739
1797 -4739 679 4363 -4680 793 3922 -4711 1090 3379 -4562 1131 3364 -4461 1255 2552 -4265
1812 -4265 1497 2204 -3995 1743 1969 -3750 1806 1962 -3515 1853 1377 -3147 1751 1219 -3048 1809
1828A809q05l737M673j237l082M061j030k714L829j602k239L588j603j535K898
1843A274j452j246K787j393j250K361j388l37J295q44j80J179r84NO43l97k35
1860a62J00J32k74j9M08R2q11P02p4n54R28j56j025J394o12j473K285n93j508
1879a220K337n70k009K770j006k076L089q33k226L382j557k054L827j938k191
1894b275M101j802k212M269k196j732M082k783j388M711l392j071M390l720p80
1909a798M687m171p48M853m033p78N089m784R5M933n139J13M821m974L77M827
1925C370n176O62M510n426Q13M343n468J374M244n598J915L257n174K137L111
1940B894n384K434K924n323K546K088m774L077J874n045L290J575m878L303J526
$$ plain form
1828 1809 1004 -2733 1940 703 -2379 1682 652 -2062 1767 165 -2074 1514 -89 -1624 1274
1843 1274 -178 -1424 1363 -30 -1280 1081 -307 -644 651 -193 -373 806 -178 -173 470 73 -162
1860 -162 -62 70 -204 -223 185 277 -534 168 94 -460 468 312 -713 681 69 -1404 881 288 -1220
1879 -1220 1117 547 -1462 1308 302 -1774 1315 482 -1744 1638 81 -1973 1854 -84 -2275
1894 -2275 1826 24 -2188 2081 -115 -1847 2235 -548 -1936 2775 -617 -1688 2702 -1018 -1798
1909 -1798 2889 -1282 -2030 2823 -1210 -1988 3101 -1683 -1588 3345 -1794 -1681 3140 -1834 -1457 3370
1925 3370 -1806 -1144 3366 -2060 -1247 3096 -2372 -998 3246 -2352 -437 2820 -2354 -217 2894
1940 2894 -2490 -56 2868 -2455 91 2179 -2595 482 2356 -2689 601 2176 -2702 601 2127
1955B127m818L492R31m484L600J027m667L813N59m194L836M01m111L487L92l753
1971b362L359J29l407L021K80l017L028l97k422L088o72k157K769p78k119K986
1987A329j030j671K494r37j377K333j281r60K289j121j055K042j115r08J925j201
2003b44n80J797j176n83J698j152k93J234o68q08J423p75l80J112p05j79P84o01
2021i6j62O07l59k19L99l39qM69k00j93p8J08k52K95k54K67L7J33j73J62N2m49
2043b53L00k7p8L4K30q14M23N37l84k63P69m21k72L97n17J00O95n73j46J039j131
2064c55k24J227j076%R75r96J73Q41j015L19P41r74%R37j059J65J025j547O77
2083a66R14j320M53Q21j309M78R53j485Q35P24j870J183N08j579R56P04j708Q81
$$ plain form
1955 2127 -2691 801 1732 -2752 848 1875 -2792 1021 1580 -2614 1222 1623 -2488 999 1391 -2362
1971 -2362 997 1126 -2281 740 1020 -1997 1031 634 -1788 1300 628 -1529 1240 462 -1657 1329
1987 1329 299 -1372 1122 185 -1192 1141 -140 -1100 1189 68 -987 1055 -60 -968 957 -244
2003 -244 -824 973 -203 -786 912 -240 -533 701 33 -775 648 -127 -507 605 -100 -279 505 -96
2021 -96 -258 349 -10 -229 170 -169 -177 292 92 -101 -179 -71 -323 -28 -282 -15 22 155 -18 144 196 -253
2043 -253 47 20 -58 -24 206 -608 -185 352 -32 -295 474 53 -219 178 -339 -239 456 -117 -263 776 -355
2064 -355 -579 648 -428 -428 547 -449 -276 565 -450 -131 610 -364 -364 573 -486 -321 704 -843 -166
2083 -166 748 -572 -119 702 -607 -129 824 -661 174 898 -972 211 719 -860 96 800 -908 -27
2101b7Q78j939J195N87j643J218O26k124J553M82k025J588L93j797J522K49j829
2118a093J658K73k315K151N8j895K004k52k142K338l01j925K498m42k339K670
2134I46m83k185K781p71j886K687q42k060L028j020j535K713j384j685L269j378
2150A95j757L042j417j397K611j476j260L148k123o62K787j890j118L017k284
2165e84q21L406k557k99K650k521r8K488k559J03K681k922K80K223k487K38K281
2182A502k597O23J881k441Q51J449k167O33J819k422N23J772k385Q42J110j726
2198g33O00J072j803O98Q53j478Q38O87j045J07O14p61J78M50o28L30L9nk24L54
2218A43n3m32K16M81o86M3J003r41p0O97q11J50J055j159K10J168j834L37J672
$$ plain form
2101 -27 851 -1088 107 694 -949 269 895 -1229 324 806 -1219 369 762 -1035 487 736 -1093
2118 -1093 565 838 -1477 674 732 -1163 841 589 -1553 785 484 -1441 1057 615 -1724 946
2134 946 463 -1722 1059 288 -1598 1089 247 -1813 1215 195 -1340 1373 -11 -1696 1573 195
2150 195 -1562 1480 63 -1334 1277 -199 -1459 1689 -434 -1096 1691 -199 -1317 1700 -584
2165 -584 -1405 2001 -556 -855 1795 -726 -824 1664 -895 -792 1889 -1033 -753 1470 -1017 -779 1502
2182 1502 -1095 -472 1409 -1032 -181 1268 -899 -266 1553 -869 -346 1426 -959 -117 993 -733
2198 -733 -133 939 -864 -166 687 -791 47 734 -311 -204 410 -351 -173 277 -351 -21 18 13 -211 143
2218 143 90 -342 -126 355 -331 -288 715 -226 -296 401 -410 -260 795 -364 -154 1014 -820 -483 1189
2237A189k506J128J461k525J157J776l002J294J659l098J592J456l764K346J778
2252A941l975K313J636m315K476J920m356L009J314m736L526J423n182M034J185
2267B213n462M385P15n176M912L15n390N261k23n027N580m90n375O186q41n654
2283d071O565j181n001O597k145m960P412k642m795P780l095m719P768l173m422
2298d082Q017l753m074Q173m615l327Q001m905l302Q320m945l238Q331n867k079
2313c345Q005o055j635P428o183j065P640o740o61P327o852k69O677o533K97O347
2329D383p068P13O242o809J170N710p326J647N574p362K098M785o896K316M701
2344C878p115K700M071o677K937L849p088L439L239o498L538K837o537L922K102
$$ plain form
2237 1189 -1317 -189 1272 -1253 -96 1680 -1322 -28 1631 -1467 125 1581 -2183 163 1941
2252 1941 -2034 279 1915 -2400 76 1996 -2360 649 1963 -2773 753 2176 -3006 1028 2213
2267 2213 -3249 1136 1851 -3325 1587 1902 -3488 1773 1550 -3477 2103 1613 -3762 2424 1583 -4071
2283 -4071 2494 1313 -3688 2909 764 -4196 3216 574 -4221 3559 464 -4255 3513 340 -4082
2298 -4082 3935 182 -3892 4281 -334 -3661 4340 -565 -3867 4453 -492 -3730 4601 -1266 -3345
2313 -3345 4660 -1395 -3030 4398 -1785 -2850 4790 -1950 -2611 4716 -2136 -2405 4272 -2261 -1964 4383
2329 4383 -2685 -1972 4270 -2539 -1369 4341 -2985 -1338 4236 -3126 -1028 3757 -3139 -823 3878
2344 3878 -3237 -537 3534 -3143 -206 3643 -3445 -6 3233 -3265 273 3110 -3427 495 2597
2359B597n825M130J509n584L994J374n376M340R54n196M281P94n260M415K79m411
2375b985M235L65m454M421k61m169M698q16l684M348r68l101M058r11l103M196
2391A869j186k915L928j271k656M045j515k176L646j562j870L431j661j766L322
2406A663j868j007K975k118j069K975j760j383L383j993j040K522j613o62K388
2421A393j963l67K316j800n53K311j793j94J840j915J70J620j577J92J506k029
2437h43L83J524j850N57J216j656M10J076j549Q30K89j304R58N23j374O97P82
2454F69j215N26O96j226O08M43j143O22K15p63M87M68q05N39K16r52N81K63n92
2473c63N55q7n14N22j70J59l5l5J9j52P8J97l53J89K36n57K35L20k75j1N63q31
$$ plain form
2359 2597 -3228 902 2411 -3173 821 2195 -3181 1159 2113 -3083 1198 1992 -3268 1147 1426 -2985
2375 -2985 1250 1615 -2839 1582 1321 -2848 1850 1034 -2650 1698 730 -2371 1687 776 -2327 1869
2391 1869 683 -2232 1696 425 -2231 1814 299 -1877 1769 207 -1663 1768 107 -1659 1663
2406 1663 -205 -1212 1763 -355 -1424 1551 -209 -1592 1791 -202 -1242 1280 -333 -995 1393
2421 1393 -570 -937 1379 -421 -974 1337 -456 -650 1190 -725 -555 1065 -512 -320 1186 -843
2437 -843 -460 1064 -786 -229 987 -669 -259 817 -732 98 387 -917 41 564 -810 -113 669
2454 669 -546 -20 676 -550 58 501 -642 -20 195 -568 -81 387 -418 121 337 -615 -34 229 -363
2473 -363 192 105 -409 113 -57 102 67 32 51 -101 -23 174 -179 10 246 -311 -76 244 -31 -42 521 -310
2495c10J05O99j070M25P92j173O24P23j530P89O60j560J017N13j615R54Q49k053
2513a161J319Q16k083J250R12k481J986K71k315K214J01k479K445L24k929K494
2529F84K62l176K937K23l071L523l62l132L484m67l187M165j207l052M371j550
2545D45k580L935j433k764M260j732k510M534k250k278M701k472k287N144l016
2560c03j755M879l554j627N273l780j302N337m324j218N431m179j234N406m271
2575a221p69N071m646j22M899m695l77M939m639Q6M584m819K79M354n027J333
2591g70L698m733J051L342m711J639L359m863J753L018n143K222K332m588K564
2606A70J927m258K278K062m949L025J861m625L008J614m486L080Q23l708K622
$$ plain form
2495 -310 -205 494 -576 -151 641 -532 92 815 -715 74 734 -826 191 704 -911 43 892 -1161
2513 -1161 158 974 -1109 141 1053 -1428 558 829 -1486 728 829 -1650 795 1119 -1810 684
2529 684 946 -2230 707 930 -2141 1382 1020 -2112 1372 905 -2282 1883 676 -2376 1995 445
2545 445 -2135 1800 367 -2397 1863 131 -2379 2155 -95 -2373 2328 -144 -2431 2713 -303
2560 -303 -2058 2821 -733 -2360 2913 -867 -2169 3168 -1156 -2374 3057 -1122 -2356 3050 -1221
2575 -1221 -1990 3081 -1565 -1687 3212 -1483 -1860 3079 -1560 -1474 3110 -1709 -1430 2924 -2103 -770
2591 -770 2928 -1805 -754 2588 -2123 -484 2875 -1988 -235 2783 -2360 -138 2194 -2394 170
2606 170 2097 -2161 117 2179 -2770 255 2116 -2509 499 2113 -2373 707 1530 -2178 444
2621D44R75l511K611R08l401K860J56k888K727O1k641K605k9k549K403l68j926
2638a563K506m90j850K120n93j288J846o89p88J736j002q09J417n20o44R56k22
2655A23r33J454p16l16O06k74j43O19n50O0K22k02r1Q7l4J94k23J79p2r3K46P
2677A50l85J56K17m95N19K69q17P02j55l70M68L7j037J177j13q87J082k35q40
2696e57J057l32q68J282m42q77J217m32p71J149k83n30R77m78q73J371o98n24
2714f12J323n52q83J123l89k46Q55o85k39P73n33k9O71o03j78P19j048L23M84
2733B74l84M1J41q9J07j67k03K22L36k95k1P8j17J72l29K82K40n72N14j22l37
2754b29J82P6j88N25l94k15P69o17m40J083m85m48J182q47n93J178n80n45J530
$$ plain form
2621 444 1419 -2092 519 1427 -1974 886 1042 -1846 881 942 -1699 906 877 -1672 731 363 -1563
2638 -1563 943 453 -1397 723 130 -1158 688 -1 -789 947 -55 -864 553 33 -611 345 123
2655 123 -810 644 -72 -388 218 -56 -199 420 -130 -70 152 -50 -141 -54 -88 106 -117 62 -10 -103 143 150
2677 150 -235 -79 138 -357 162 431 -386 316 161 -209 259 296 -741 436 323 -564 518 283 -557
2696 -557 500 168 -700 582 140 -737 480 48 -723 426 143 -387 590 112 -761 610 -88 -612
2714 -612 711 159 -724 399 10 -236 619 -66 -305 468 -65 -94 577 -26 -204 515 -533 -210 274
2733 274 -110 -69 72 -17 90 -77 -280 -58 278 -17 -38 40 -77 95 -234 48 288 -284 230 108 -229
2754 -229 -47 29 -159 366 -28 -243 526 -91 -531 552 67 -381 801 -46 -639 539 -41 -586 944
2773I44j064l58J433j093m67J696j247n87J753j382k91J752j598J98J542j744
2789e13k54K260k237L19J842k277M62J707k206M49J996k581P74J815k793Q19K146
2806A728l210J279J480k731J238J603k603J349J338l048J617J266l124K067J261
2821A510l216K131Q47l424K800M46k933K460O14l143K683N52l269K737J50k784
2837a839K865j17k798L044n04k720L058K4k624K673m06k666L232p11k175L202
2853A538j149k175L266j198k055L545j941j199L026j677j839L592j717j566L212
2868A663j848j200K831j995r39L267j948j022K836k076p34K883k509j81K387k123
2884g08l39K716k524j42K680k453J5K223k354K15K241k642O88J778k476O33K139
$$ plain form
2773 944 -120 -478 955 -138 -605 1091 -156 -743 1010 -372 -663 1089 -509 -311 1231 -513
2789 -513 -767 1493 -744 -425 1417 -860 -398 1309 -897 -448 1548 -1033 -259 1556 -1237 -418 1728
2806 1728 -1482 -203 1277 -1454 -216 1387 -1216 133 1471 -1577 40 1306 -1818 249 1510
2821 1510 -1706 425 1272 -2152 648 1094 -1839 621 1235 -1908 775 1327 -1942 795 945 -1839
2837 -1839 1026 909 -1889 1155 651 -2069 989 1013 -1611 1062 656 -2010 1222 511 -1664 1538
2853 1538 389 -1786 1480 282 -1773 1772 -169 -1368 1658 -19 -1858 1734 17 -1549 1663
2868 1663 -185 -1385 1446 -549 -1488 1779 -169 -1191 1645 -431 -1165 1718 -791 -972 1415 -708
2884 -708 -1047 1669 -855 -997 1683 -770 -755 1468 -886 -671 1570 -1072 -384 1394 -1082 -449 1690
2901A690k886J011J751k643Q05J594k406J069J421k670J200J529k975J379J336
2916A205k641J491J018k308J346J022k410J642M36k060J721O16k256J660N06k460
2932a472J844L70j818J714J54j984J758j82j555J890j81j588J714k06j566J689
2948E81l89j155J589l61j060J628n79j397J786n99o05J432n89j031J503p41l04
2965b91Q98j014j02J332n55r85J487q23l12J102r15k95Q41n11r9N51o12Q1N71
2984C49n21J46K18j79l47O13m18K85m1k02P7L46m22k7L30k97K89J05l51K47j75
3005B5Kp6L00m6k98J07l2j25j2L72k93r8M54j82l17O31n60k88P11k80k84J004
3027G15q85j54R02q72k36J536j331k15J260j116o8J521j445j20J536j421o4J492
$$ plain form
2901 1690 -1196 -185 1566 -1077 -272 1322 -1084 -15 1406 -1264 -64 1465 -1510 -131 1205
2916 1205 -1436 55 1073 -1235 111 1133 -1277 365 801 -1259 462 1078 -1178 482 988 -1472
2932 -1472 372 742 -1076 638 792 -1192 566 384 -1171 719 538 -1050 664 458 -1108 581
2948 581 192 -963 626 265 -795 833 254 -1143 643 44 -561 871 282 -749 754 13 -291
2965 -291 607 -407 -509 823 268 -717 770 -53 -365 737 -178 -473 368 -143 -242 309 -303 -222 349
2984 349 -172 -26 192 13 -334 279 -139 146 105 -97 -20 326 -96 -123 207 -90 199 304 -47 200 25
3005 25 27 -49 251 205 -93 14 -18 -143 -155 217 -76 -174 280 98 -219 412 -148 -436 275 -5 -289 715
3027 715 -170 -324 578 -294 -530 1006 -325 -540 720 -396 -464 1057 -388 -508 1028 -393 -457 1035
3045A035j432J36J223j401P7J647k021Q7J692j998N18J699k014M25J646k506P40
3062d47J574k405J149J328k334J235J344k809J493J371l018J948R70k989J869
3077B79Q43k773K172Q33l083K285M27k747K241N69k857K487L03k816K799O3l052
3094b027K692K75k868K811l8k902L531q40k711L368n82k888L659r01k570L443
3110A452j043k401L734j557k304M077j745j897L467j767j951M116k231j773L897
3125B074k483j405L957k212j372L660k790q53L648l242o25L921l007p28L524k959
3141h92l57L452l206j69L402l511J72L364l438L44K893l010J96K885l376O35K623
3158B007l483P94K672l643J167K425l708J631K188l476J217J937l535J839J698
$$ plain form
3045 1035 -397 -261 962 -439 -362 1285 -736 -649 1043 -955 -437 1262 -752 -327 1319 -1187 -447
3062 -447 1127 -1278 -129 1199 -1135 100 1444 -1365 128 1499 -1519 429 1399 -1590 279
3077 279 1122 -1651 521 1354 -1729 556 983 -1764 477 1046 -1811 676 979 -1837 962 1025 -2027
3094 -2027 665 940 -1928 883 845 -2057 1474 634 -2077 1291 709 -2179 1480 579 -1991 1452
3110 1452 409 -1992 1742 185 -2119 1958 213 -1684 1783 16 -1935 2181 -50 -1823 2074
3125 2074 -409 -1814 2143 -69 -1441 2219 -571 -1424 2224 -1018 -1643 2278 -729 -1457 2067 -892
3141 -892 -1249 2203 -1003 -1172 2230 -1281 -1109 2255 -1183 -839 2054 -956 -760 2125 -1251 -616 2007
3158 2007 -1476 -682 1990 -1653 -486 1939 -1769 -138 2050 -1426 -209 1728 -1807 32 1730
3173A730l496K146J426l832K318J154l201K283J002l376K502O84l394K666N71
3188A183k877K443L48k930K584L34k890K545k27k170K362K6k376K570k36k309
3204a620K671l67j943K035m62j583J863m15j245K079r86j344K246p17j471K173
3220I14j015q37J667j103l84J452q31o17J405o06p67J485p41m41J215j191k2R79
3238E62q19j13O85l26k36P49n22qL90p37N08j2l33M11k49r8M6K11j55K20k42k9
3260i7J04L1O7Lk24K78j85l30M60L8l92M99k24k97N64k69m14Q49n33k77O01m18
3282a66j63P45n22m73J166p76j30J024r85k68J327q98l83J288j182Q7Q87p94k08
3301d24J117j320N21P14r56m2J168j453N04J130j505K70J203j635K29J065j037
$$ plain form
3173 1730 -1766 380 1806 -2026 292 1446 -1755 528 1530 -1846 656 1340 -2054 612 1183
3188 1183 -1694 749 1097 -1833 751 1085 -1805 740 513 -1657 705 731 -1645 925 689 -1620
3204 -1620 1051 684 -1259 776 314 -1269 594 179 -1066 1013 27 -1317 929 212 -1259 914
3220 914 -101 -938 729 -374 -758 694 -137 -754 651 45 -722 763 22 -419 796 -395 -417 562
3238 562 -257 -370 315 -11 -247 502 -20 -28 362 -375 133 121 -212 199 -50 -148 -102 109 -46 174 -68 -97
3260 -97 7 38 105 108 -116 162 -23 -353 107 145 -247 252 28 -269 295 26 -388 461 -72 -349 252 -166
3282 -166 -329 416 -106 -579 587 -189 -319 705 -280 -548 779 -119 -502 786 -396 -309 578 -216 -424
3301 -424 693 -627 -106 608 -348 -390 778 -675 -171 959 -546 -276 927 -708 -479 586 -451
3318d51M3J156j314K56J297j690P98N16j301N63P53j069K38R02j452M77J056j657
3336h79R66L62j047Q89L15j202P51J93q75O70J48o94P89n9o65O74p3p30Q28j23
3356B38o38P90j73o59Q96j70n66L82J44o76N32L22p41P50k32o52M33J32k13J82
3376H1L5k12J92m14L04o0j37J28P1Q5j98K12q5j26K1K26qk74Q1Q5o27Q31j23j05
3400a7J84k21k10M22Q3p63O76om58M35q5l91P37k10m90O47k89l40O62p9r38J028
3422C77k46o63R41n61j14N58j85m26P29k28o55R11n83l84J075m87o77J177p74
3441b15l94J134p09r6N93m77j95J110q80j22O36p88J25O80p04M7Q07p79r2Q37
3461E18p55nR06r69pO83o91K79N75p89j73P75q61N90M40r24M63M82o99o4M90o40
$$ plain form
3318 -451 -408 748 -566 -310 987 -703 95 611 -690 -127 626 -443 -205 697 -755 -278 778 -879
3336 -879 87 449 -598 291 606 -596 155 348 -527 143 291 -403 386 327 -338 336 263 -467 361 238
3356 238 -400 390 217 -442 454 284 -282 100 244 -432 100 422 -319 431 199 -453 -20 112 -101 81
3376 81 116 -96 96 -318 -14 -74 -211 -83 -12 73 -125 87 2 -124 -103 123 115 -159 -78 7 -620 211 88 -17
3400 -17 167 -54 -264 158 241 -522 154 148 -310 125 40 -351 386 176 -314 333 44 -296 366 287 -651 377
3422 377 131 -532 409 -152 -266 292 107 -319 410 182 -473 438 -145 -529 546 59 -618 559 -215
3441 -215 -609 525 -184 -280 313 -164 -359 751 -129 -251 385 -403 -278 402 -302 -255 552 -227 -319 518
3461 518 -237 -242 664 -305 -312 371 -320 -41 534 -255 -428 347 -514 76 516 -408 55 537 -162 -226 264 -376
3483c76M02M07m36p8N51q67O16J64p32O22J42p04L64K6m18L81Lm79N78K13m14
3504c5j53M39m90K34l0j17K51l9j86L27j12n03M55r7L2J12K88k94r8o4K9k5K25
3527A49j37p5q2M07j50J56l05J0J22Op7K07k35Kp4K28j73J0o1Q5o3J05J32j8k53
3552h4j02Q8j3r7K80J72k50K34j21j42J49R1m79O16k10l14M50k04l42N66k78j61
3574a51L55l10l01N10k15k85P61n66j35Q45m84l52O91n15j87O68k04k45P91o94
3594b3j42P20o65k01R41q91J60Q58r71Q4O07r87L1J086p56j07J035j307L46Q72
3614F90j199J61J152j204J57J104j720N77J095j451M87Q38j583J036Q21j681Q62
3631A42P31j718R60J072k307J290N87j994J243P13j950J582O50k244J479N32k134
$$ plain form
3483 -376 26 433 -3 -81 470 -397 219 383 -349 273 415 -289 75 101 -317 64 67 -412 166 379 -35
3504 -35 -188 251 -239 -5 -35 -152 99 60 -126 201 89 -414 41 -56 -24 88 376 82 -16 -80 -51 -76 149
3527 149 12 -63 -145 262 112 268 -37 -27 95 101 24 231 -4 -2 -76 152 -21 -11 -72 13 -50 55 187 169 -84
3552 -84 -186 -98 -111 -208 72 244 -6 228 107 -35 114 205 -274 342 132 -182 268 64 -278 288 10 -151
3574 -151 204 -106 -407 103 -112 -397 364 -202 -337 508 24 -328 363 -152 -339 329 125 -120 671 -23
3594 -23 -165 555 -110 -311 630 -261 -101 757 -214 -130 477 -510 -479 607 -149 -256 779 -528 -182 690
3614 690 -509 -348 804 -400 -243 861 -859 -282 813 -638 -151 687 -896 140 961 -720 142
3631 142 873 -845 115 1187 -1120 170 757 -1237 6 719 -1231 351 1001 -1243 236 768 -1366
3648a366J844L53k174J947J57k041K042J8k214J889J04k093K502j97k364K364
3664G71k30k084K456m90j745K178k63k091K605p24j804K705r03j952K856j107
3680A78j660K648r99j652K650j031j465K562j182j513K901j660q71K628j654r83
3696a103K435j472j177K826k025p95K856j891q03K402j861l68K379j937l06K219
3712A379j728o82K283k054J49K261k355L2K195k290L97J794k048J77J721k295
3728a064O59J670k101M23J466k005Q63J326j973P63P99j595N56J221j821Q51P58
3745G96j462O67Q50j561O10P72j292Q16L30r85M56M90q90L79N42p12J74M44r55
3764e31Q57K80j152O23J49n33M72Q7m72K09K69m24l0O90p98M46j06j59J9K96j31
$$ plain form
3648 -1366 478 831 -1343 604 761 -1280 762 780 -1434 455 559 -1534 968 771 -1593 771
3664 771 541 -1543 913 423 -1322 856 593 -1498 1107 383 -1421 1284 381 -1571 1285 178
3680 178 -1482 1166 167 -1485 1165 134 -1331 1231 49 -1464 1437 -223 -1094 1534 -120 -1103
3696 -1103 1332 -140 -1317 1509 -516 -1311 1545 -346 -1149 1253 -608 -976 1403 -534 -840 1379
3712 1379 -349 -1031 1252 -802 -653 1608 -747 -715 1480 -810 -413 1381 -667 -490 1231 -1064
3728 -1064 -405 1265 -836 -413 1053 -952 -89 1237 -736 27 826 -769 -213 1008 -813 38 796
3745 796 -666 1 851 -710 -100 672 -620 196 526 -459 -3 487 -403 -24 518 -194 -20 424 -531
3764 -531 326 606 -546 77 226 -307 165 252 -220 -11 258 -166 -196 494 -304 142 36 -123 -104 192 61
3785F1k56J14R2m0K27j62k83L31L9m81O96j02m28L25J27o88N48O1p15Q94Jq80
3807e19P42j97p16J172n30l44M17R0q44Q77n9o78J113j23r32R37j14q93J237l62
3827B74p56R00l47o96J046n07m91J021m60p16J393n21o32J145p69n00J345p59
3845c0m04J367r01k89J098j177l99J425j079o1J067p90n49J704j338k53J557j278
3863c30J8J292j344p5J211j227N2J183j026K9Q68r87J17P68j134J68J179j022
3881b60M3R14j601P92R63j528M65P89r81L09P59j108L95O37j094M78N61r30L72
3900b5O85j425Q11M65j081O67L21j140J085J60j233Q90K90j222P62M23j164J057
3918C26L0q53R76O9j176P83J74p29J025j43r75O44M3n43P12j02q91P93J15o07
$$ plain form
3785 61 -195 -81 11 -29 198 36 -247 84 123 -358 338 236 -192 133 260 -428 120 181 -534 360 361 -519
3807 -519 223 26 -690 482 -48 -392 25 115 -729 148 89 -589 524 401 -531 406 292 -601 636 274
3827 274 -482 418 71 -625 421 -86 -577 444 -16 -732 661 140 -492 653 -116 -616 729 -30
3845 -30 -434 933 32 -257 841 -336 -735 690 -389 -450 617 -173 -722 982 -356 -609 948 -330
3863 -330 -312 980 -364 -439 772 -455 -403 780 -246 -217 651 -336 -219 549 -585 -417 762 -260
3881 -260 -217 697 -904 -112 851 -677 -212 577 -404 -95 664 -444 -49 588 -506 -28 533 -397 -25
3900 -25 660 -765 46 511 -570 97 418 -722 363 523 -710 180 470 -752 10 433 -731 326
3918 326 356 -497 479 548 -628 155 329 -400 625 482 -493 151 194 -349 363 261 -630 163 278 -329
3938c29N22J08p31P57k91o15P08q5l45O33l43n58P69k22m31R49m25m75O06qo98
3959e04R65n68o9L85k82k03O79k32j96L28n71P6O07n28j39O33n33q7N13m15j48
3980b89N48n30Q5N45l83m8K91k93j54M70k67o0L79m58K5K48q4l71N92l41j68L66
4002A03m66L16O7j84J97M4k39j40M17L6k83Q2K28k95K35k38j10L42m5j11L2K36
4024B24k99j80M34m14L44K13m72j74M78l39J53L50l75K9J68m10M57J81p20K42
4044a10K26k37p1Q7l21M68L91q52M39M34r53P71K99j049L80O09j055M55K92o80
4064d77M28M12p53M31J00n00N59mn14N31O7q65R53Nj001Q57O2p43P88j30q21Q84
4086B69no82Q92m25n44P07M4o71P78j51o20P43l09n10P29j32n19P96l84l79Q76
$$ plain form
3938 -329 193 301 -430 327 36 -579 129 44 -301 332 -11 -569 200 -22 -453 496 71 -404 202 194 -504
3959 -504 461 -107 -176 209 -73 -276 403 171 -25 303 -268 -192 415 -113 -252 381 -152 -239 274 -141 -289
3980 -289 259 -271 -186 359 -24 -72 219 -74 -228 242 -25 -85 294 -164 -139 109 25 -346 246 -95 -263 103
4002 103 -363 -47 20 -164 33 77 -162 -302 115 151 -132 -50 178 -117 118 -120 -230 112 67 -44 -12 224
4024 224 -75 -255 179 -235 109 322 -150 -324 154 -185 -32 318 -57 -28 140 -270 187 368 -352 -110
4044 -110 116 -121 -192 -105 -426 42 433 -419 20 454 -499 272 571 -478 -98 511 -544 -89 203 -477
4064 -477 -49 363 -390 41 141 -359 200 196 -318 213 280 -585 368 373 -628 229 291 -452 336 206 -615 269
4086 269 264 -418 474 49 -495 212 256 -415 363 212 -408 335 26 -484 245 113 -406 390 6 -373 503
4107E03o67k08Q10l51k73O82m22k99O46m87l82Q56o28j36O64k86l27Q26m17k32
4127a28M96l67j54L55k18k79O09k49k66M24j81m06O84m09k11N42l01N8j50K3P0
4148e8k9L36m63L39q0j73K18J75o05L97l8k33L46L9l78N2N12o08J84L35n63J95
4170a00O50n87Q7L75q20M29L80o79J94N26p89L39M71r94M71L90p08J82O26r67
4190e24M44O63j190O25N83j251N88P38j183O70J10q87Q55R7j033Q92L34j268J007
4209B70J92j103J154J15j501J167J21j260J418R2j455J204n5j305J198R7r84J204
4227E69q8j292J170R0j213J151k07j146J635j12j584J770n94j029J582j94j387
4244h79J262k4j059J244l80q04J280l30j039J379m25j015J389m50q61J358p22
$$ plain form
4107 503 -164 -372 438 87 -186 496 74 -225 421 -66 -448 408 -220 -356 308 22 -305 521 104 -128
4127 -128 368 1 -153 202 -16 -295 314 65 -201 223 42 -364 320 -89 -300 242 -59 -1 -151 -128 -58
4148 -58 -87 249 -214 125 45 -128 90 265 -340 57 19 -214 132 171 -207 -155 357 -251 -67 268 -295 -100
4170 -100 550 -37 50 425 -395 34 414 -265 -71 455 -334 5 476 -518 -47 343 -365 -183 443 -524
4190 -524 -80 583 -607 18 601 -650 -62 676 -507 163 273 -614 241 338 -695 197 531 -737 270
4209 270 462 -641 513 628 -873 294 415 -845 573 665 -790 414 359 -946 252 349 -635 569
4227 569 481 -811 359 449 -764 387 180 -966 669 557 -1027 743 149 -880 702 508 -879
4244 -879 383 359 -700 544 164 -640 640 310 -729 650 225 -790 599 149 -712 646 -76
4261g6o98J433q40n36J600r80n07J424r47o14J476j018j67J191q74m27J083p21
4279a98m22J317r18m0P52p77k37J213q66k60J202r81j41J042r13mQ16q06Q8O47
4299E14r02J05O24m81jN72p29J20P60r81L63L58m92j46O33m01r5M82p17J82N91
4320C59o18O0P79p77p0O28m21R1L63m87J08J61p5j91L27k37o2K07k72n2L91o8
4342A44l12M15p5k90J15J48n43N50k1m10N84j23k64L94k40l41M31k15o6M50l15
4363A6n46Q75m6n71O51n49l93J015k90o12Q40n87k17R49m40n06P96n16n41J006
4383C34l26m81Q51j57o34Q39k19o99J069l04q79J051m30o88J257m92p21J156m04
4402A23o15J312p80n22J278p06n99R92m48n37J255p16p83J300o87o06J509j022
$$ plain form
4261 -76 -774 659 -181 -717 883 -97 -604 820 -127 -741 735 -283 -450 741 -133 -560 523 -198
4279 -198 -620 697 -221 -261 491 -286 -523 690 -176 -436 766 -215 -356 686 -227 -231 585 -221 -133 514
4299 514 -388 -283 341 -140 -141 431 -298 -178 582 -399 -36 322 -170 -316 317 -84 -179 303 -414 -232 359
4320 359 -259 -199 580 -197 -267 361 -60 31 394 -93 15 176 101 -90 237 0 -62 145 -127 -179 212 144
4342 144 -168 247 172 -118 -3 145 -398 152 131 -279 305 182 -82 312 72 -269 162 -53 -119 331 16
4363 16 -530 345 299 -272 379 -170 -563 452 162 -450 390 -197 -414 535 95 -411 385 -131 -672 334
4383 334 8 -473 378 221 -413 426 207 -492 577 273 -606 445 15 -673 584 92 -629 527 123
4402 123 -492 820 40 -482 796 90 -509 483 35 -502 753 37 -746 554 -133 -739 770 -252
4420b52o2R83q70l01J158j041k56J561j200l25J324j226j11J203j100p2J365j133
4438c55J49R35j262R4J282j134O7Q00r01L32N92r83J40R41r84K73P38j470O91
4457e5O18j171N87J017j558N58P98r93J38P44j048K68O77j264O39P31j161P00
4475B25M11j194O30N97j195O29K37p22M80K62q39O13P3n07K29M01q36L13O01o33
4495b25K34K74m34K00L44n51J44L85o36L76N9k84N8K75m44J07N08n23J54K15l75
4516a39L10o9j94J93N1l48K34L25n66J66L81l80l0L44m14k4L27l76L47L4j77J6
4538A1N7k20P3L20n24K49K43l32j63M89k15k86N80n06L64L99o86p7L38j58j42
4559a86L91n52Q6O32l59Q0M5m53K46K74l14O3L70o63L34J98l44K0O21o57L34O5
$$ plain form
4420 -252 -314 669 -201 -502 656 -385 -641 920 -280 -605 719 -507 -618 585 -515 -587 778 -355
4438 -355 -206 729 -533 -439 843 -291 -224 576 -325 7 599 -384 -244 697 -287 -14 724 -746 -55
4457 -55 563 -608 -21 996 -562 -4 794 -199 -61 683 -365 -97 580 -684 -45 686 -475 225
4475 225 636 -558 72 669 -526 103 340 -382 98 360 -479 134 207 -300 -71 330 -506 -193 408 -225
4495 -225 9 283 -151 49 393 -158 -14 371 -265 111 170 -114 -56 219 -225 -118 390 -133 21 236 -139
4516 -139 171 102 -92 101 152 -196 38 363 -203 -37 344 -36 -66 278 -136 -160 167 -209 138 172 -5 11
4538 11 68 -152 -79 241 -283 -34 209 -123 -286 203 -12 -298 282 -224 140 539 -147 -224 114 -44 -186
4559 -186 205 -347 -261 371 12 92 137 -316 -70 204 -110 -47 323 -340 -6 192 -152 -132 489 -168 166 231
4581B31n06K1N30l68r4M38m35J39M68p33K67L99m67N4O11j061O76M2m25J98L58
4602C43o49J04N72p90M41M15q45N27M32q33K27K33m14K00M05o41K49L45o80L73
4622A4L31p80O99j19p69R06j06p59Q53j2n87N97N4q67J005k24o27O38O5r47N67
4643f8M13n86L46J50q37J089k94p22P53k99k59O24nr02Q56k73n50Q68j78m12P58
4664D72l02o97R28l71j35M23k58m93P98k97m69O79k32l58P33n75l50Q15n53j71
4684d13R50n01l14Q30n41l64Q20m29m84Q36p68k09J028l15m46P49n44k30N79n70
4704c36O3M00k40k37N49j51l71O83l76k0L00m43j44M36l65Q1M42m66n5L75j06
4725A9J71J55o80j65O67m9m89Q62n57p8P41m37k43Q6K52m91M82q7m54L26K02n30
$$ plain form
4581 231 -275 -254 276 -92 -186 252 -183 -44 424 -309 -42 357 -110 -56 555 -506 170 212 -213 -15 343
4602 343 -306 -202 370 -420 21 436 -409 118 550 -283 -56 177 -237 -37 368 -273 -24 321 -359 14
4622 14 345 -435 264 145 -624 282 176 -583 270 258 -329 268 322 -545 460 236 -391 247 312 -635 -68
4643 -68 345 -241 105 255 -582 507 213 -509 244 -55 -314 310 305 -597 259 -14 -564 304 126 -286 472
4664 472 170 -527 401 30 -105 318 60 -433 365 68 -401 278 46 -312 421 -154 -504 311 -242 -413
4684 -413 537 36 -278 552 11 -353 467 38 -446 390 -378 -587 441 126 -320 429 -115 -345 234 -336
4704 -336 -273 127 -113 -350 199 48 -323 360 -16 -36 264 -179 -323 113 -252 -171 271 -195 -250 125 19
4725 19 190 345 -335 -500 167 118 -371 491 -66 -144 597 160 -83 3 255 -236 246 159 -295 31 233 -297
4747b97M18j79l04M25L0q3K5k9m3K56o6m98Q08l34n19O25p1m76L66M28p84N68
4769B66l16k53M64q7n82O40J42q36P19j67k95O70m34l07Q59j73r50Q96j41q13
4789f98P66J75o45P03j87p34J107k71o58P37q6m90Q96l79p07Q94j79q70J144l32
4809A86p73J065o48m88R87l77m72R47l81n74J194n09o96J106m36o77R86o62m07
4828f29J186l69p20J142o46m11J210q68n56J318p93j38P87o82k96Q94n86m06J308
4847G45j134OQ58p19k66R75o40l06R36n89mP06q87K30N87n83k70P34n00j87P30
4868D22n60k38Q18n78k77Q66m39k39O68n41j75N28n79K68M85n66j4K98m30J67
4888a16N95p43J58L09l20J44j2L1m55O06l20M1O44n85k34L03l14K50J85j19q3
$$ plain form
4747 -297 121 -58 -362 63 93 10 35 6 -37 219 153 -345 463 129 -390 235 164 -312 54 482 -302 266
4769 266 -50 -303 161 74 -508 132 274 -562 157 -10 -305 365 -69 -376 483 310 -640 256 115 -698
4789 -698 68 243 -402 301 114 -620 487 216 -442 295 209 -281 615 236 -471 423 244 -626 518 186
4809 186 -587 478 -170 -658 329 -48 -520 427 46 -528 666 157 -539 567 131 -546 440 -222 -629
4828 -629 557 188 -532 610 -36 -447 763 -105 -661 657 -136 -274 513 -169 -465 429 -157 -563 745
4847 745 -389 -383 475 -244 -510 465 -175 -481 455 -134 -138 568 -319 -89 498 -85 -355 379 -121 -308 422
4868 422 -138 -376 442 -136 -413 453 14 -225 443 -98 -273 255 -324 -56 429 -137 -151 147 -283 -116
4888 -116 479 -264 -106 203 -117 27 15 46 -409 197 -123 -82 562 -23 -257 46 -268 -18 167 48 -35
4909c5J47m3l20N63q7l14J87n1k12M43l13rJ47M4k75K13m03P3O10m57k83R08o83
4932a50j77Q93m87k14K70j0o69O96Mk80L46k03k35M16k21k27N78l85l88O95l48
4953i6k88O60l12l38O44k16l81M58m16j67Q62m82n57J019l36m95Q28n19j08Q63
4973F23n20k72N51m43k51O64m64k36P05n77r5N73q2m45P33m83j65L50k95o7N06
4994C10m52l72J035p46M7K22j9j04Q08j159M02L77p19K12M26k90j13O02p99K22
5014a10N46m92j36P13o99J24O12r21K34O42q83L02K76m25K00M29p87M52K59m35
5034i9J25J30k20j28L94n35L35L39o68K61M07l77n6M03o85K42L06m75L16K07l93
5055a71K86L37o38J45L49o84K63K78m17K29k2p9J07J21k95K08Q3k50K64N4l20
$$ plain form
4909 -35 112 69 -251 312 225 -89 98 47 -165 278 -35 -44 103 147 -128 85 -318 -245 365 -92 -375 533 -150
4932 -150 -327 566 79 -135 135 125 -544 152 156 -124 222 19 -216 200 -21 -248 330 -55 -443 252 -96
4953 -96 -384 276 -36 -374 270 54 -327 131 -285 -452 410 -72 -629 390 54 -441 387 -132 -240 623
4973 623 103 -169 382 -61 -312 352 -112 -348 357 -220 -315 258 176 -269 464 -19 -184 166 -129 -196 310
4994 310 -142 -514 521 -225 -178 44 25 -79 729 -430 -28 349 -370 -158 268 -22 -135 467 -332 -110
5014 -110 436 -56 -192 521 -178 -54 558 -363 -129 513 -370 -68 208 -217 -17 412 -375 77 336 -99
5034 -99 26 156 -64 -192 202 -333 2 341 -327 -66 341 -36 -92 311 -374 -132 174 -301 15 222 -171
5055 -171 115 452 -186 -41 308 -376 -113 165 -252 -23 -45 -124 -17 104 -191 17 100 -150 114 168 -152
5076a52K85ql71L58R6n80M70Kl16K27K86q35N13M10n05O5K64k11L9K63m54J3L18
5099A77k48j92M42k39L4M42n01m9K94l80K32J58j62l13M04j76j02P07p72lL67
5120A20l51L68J03o06M53M03o86M05L14p23O2M59m80J84K55k83k64N15n42q0O79
5141C05o66M42J50n65J96L53o69N05J10m87L19L85o85K45K53m60J94N29n36J09
5161B7M46p51L68q5k72K04N11o76L64J61r63N42M97o87N58j60m05J48P48o51q1
5182a57O00q11M04M96j104O59J71n89M63M1o35O73J0p76O77L30j094Q36L58r16
5202c64P70O1r86O52Q0o53M76L75p81P30L5p36O89j00o99N73J71p74O19O2o25
5223d25L50L52p04N98j24n67J102l46p85N98j1l28N30k21m50O14j24m15M10J82
$$ plain form
5076 -152 133 125 -246 112 208 -372 98 100 -216 11 297 -538 -25 385 -120 -55 209 -2 37 300 -154 -141 177
5099 177 -71 -263 179 -60 -26 416 -85 -134 160 -220 12 170 8 -305 99 -77 -179 528 -244 -247 120
5120 120 -231 137 240 -366 87 490 -196 209 523 -200 -138 321 -159 25 280 -3 -267 248 -294 -374 305
5141 305 -361 81 231 -334 -138 215 -454 51 161 -326 -7 378 -307 -62 191 -269 -75 454 -82 27
5161 27 473 -278 90 5 -267 -63 448 -228 136 297 -666 -124 373 -314 244 84 -321 -173 575 -76 -157
5182 -157 443 -368 36 532 -572 87 258 -331 132 173 -462 211 221 -555 122 452 -642 194 552 -364
5202 -364 406 467 -519 133 213 -440 36 411 -370 360 395 -341 348 248 -451 122 293 -481 138 200 -425
5223 -425 -75 277 -427 171 47 -520 582 236 -549 49 38 -290 240 19 -431 183 59 -356 54 236
5243B36m46M34k88l04N69L6n23O66k85k95L08j87k28N25j23k59M57o4o27P49j56
5264A95m00L74Qn62L26K71l63L70k4n62N80j20l08J46J29n10M95jk66M57n7n22
5286c44N48J00o92L38P9l63N02J32o40K91J65k11K27N5p19N31J02l87M64j34m92
5307d48N37M1l18N64p2o71O28k2p09O44p7l38N04j75n13M68L01q53P06j12l52
5328b67L81K24p97N81M5m33O24k75m16N29K49p40N81k1o47N92J94j097Q03M9o98
5349e39R77q3r19R52p6q94P79J39q78R00j48p25J053m33n10P74r3n20P01m10l11
5370b64O67m45m14O29j07n83Q23l09m52O83P6p33P93k43o14J133q20k5O17l53
5390E9l43N86l03m36P36m36k20P41k35m94Q47n97k0P33o76m48J020p43k79R14
$$ plain form
5243 236 -210 224 -64 -368 201 237 -286 380 95 -200 108 -79 -307 218 95 -164 293 229 -398 351 195
5264 195 -205 169 177 -385 -59 212 -151 219 195 -367 213 93 -215 -69 60 -450 45 44 -222 235 178 -344
5286 -344 204 304 -388 -50 29 -334 168 300 -340 -49 116 -95 132 187 -532 -1 101 -286 178 44 -448
5307 -448 89 130 -188 376 304 -367 261 239 -470 174 97 -241 263 88 -425 43 344 -509 197 85 -267
5328 -267 114 338 -459 122 167 -266 358 83 -333 196 445 -295 286 265 -382 210 404 -693 110 159 -539
5349 -539 438 355 -564 388 312 -582 197 336 -542 358 210 -515 538 105 -405 369 276 -244 457 47 -264
5370 -264 403 -42 -456 173 66 -517 306 -3 -455 228 304 -429 364 121 -493 640 -180 -205 412 59
5390 59 -284 302 -1 -437 299 -137 -357 384 149 -345 502 -95 -115 618 -58 -506 514 -229 -508 406
5410D06l94j96O27m77j55O21q85J93O29o13L4O46p55K31O05n50j97N19l90j54
5430b55O26k51m31O16l35p0N59o22LN08n45lN83p54K71L28k62q8K70o08N30M03
5452D73m41j51N68p51L33K56n23qM29k26L2K58k09j94L21l58J55K58m88K58J98
5473A90j48n0J23k38O9K64k22k0J30m36M6N51k44J33K54o62Q3K07j79M3J80j15
5495d1l2L53l25N0J95l68O2L08l27j93K79q2R1K61l26N1M73n72R9L63m55o1M25
5518B28j89r4K27k6m27L18n0l89P31m35k9L78j93k82M46k81O7J5q9k35O10o01
5540c00K63J05j21O1N0p9r6L73m38K6M32m49QK14j31MK22k25J01M1l41J74K44
5563A38j89j93L97k79R6K98n32J53L61k26j5J73k68J62J79m31J4K42k03K68K51
$$ plain form
5410 406 12 -184 443 -34 -189 432 -453 -260 369 -244 -210 436 -319 -88 517 -33 -230 289 -101 -255
5430 -255 371 120 -311 305 -30 -100 459 -163 -160 348 -197 -200 383 -371 -100 228 -34 -122 148 -460 70 473
5452 473 32 -119 449 -302 31 287 -236 -244 185 -41 -9 249 40 -154 167 -191 -36 222 -266 -8 190
5473 190 42 -8 115 -123 -54 210 -12 -32 98 -338 -292 259 15 148 402 -260 -177 30 -149 -106 74 -41
5495 -41 -73 280 -45 5 200 -168 -106 202 -125 -318 -39 -121 -30 231 -95 -44 429 -143 -44 319 -136 -197 228
5518 228 39 -55 172 146 -281 37 -13 -402 329 -106 -135 243 50 -232 214 -67 0 15 -74 -309 301 -300
5540 -300 -37 68 -53 8 58 -21 -117 256 -182 -156 276 -173 -165 49 -82 -78 144 -81 20 61 -280 -106 138
5563 138 -51 -244 153 -126 -30 268 -264 -111 250 24 9 182 -86 76 255 -176 -162 80 -123 145 396
5584C96m25M1L46p48L46L42n69K64M46o08N2K65k20M2J46l30K12K54m42K26J06
5605A42j90K51k41l18K38M85n54J09M15o36K75J74k84p7N23o80O66j90p6jJ50
5626A81k90K11j7j57J21K67m64J0L14l46L87Ol64J69R3j90P6J75l15L20k00j94
5648b07J17O3o6J64J07k60J19j29L5J74r2j47K09nk56J66J78m19M20J3l42K03
5670D5J6j79K08j20l1M7J30K2k5M7l93k1M50k89o1J79k68L37qo3j92J33j96K56
5694B4q4m1m4L01m92L21J77p1j47K47m85L39m9k17n6K78l83M20K74n37J48N1j50
5717a76K33N7k72K89m6j9q3K83l17K35k4l03J76M8k48L59J05m11J84L09l59j07
5739h7J0l6J35K86l62L60k56k57J00J74l98K60J67j23M3j41J66J53l8l89L65m3
$$ plain form
5584 396 -29 12 358 -390 -44 298 -271 -7 439 -169 -117 148 -72 -30 116 -214 -2 252 -190 36 142
5605 142 -48 203 -38 -356 -118 367 -187 -78 337 -299 -24 150 -134 -211 312 -368 298 108 32 31 181
5626 181 -109 102 85 -72 49 316 -148 -138 176 -170 217 223 -141 28 121 -69 7 182 -133 187 -13 -207
5648 -207 -90 -27 -93 71 178 -82 37 -92 -57 117 25 -122 87 82 -174 -8 170 -249 171 184 -158 45
5670 45 61 -118 90 -30 -61 -14 116 138 113 160 -233 -254 196 -93 -154 25 -243 94 86 23 -169 -36 -232 24
5694 24 -60 -101 -145 156 -336 -15 162 91 -56 191 -294 45 -4 -221 -277 1 -382 38 312 -225 -77 -26 -176
5717 -176 57 114 -158 131 85 66 -17 266 -51 184 160 -143 33 81 -167 192 297 -114 70 379 20 -87
5739 -87 -77 -113 22 308 -54 306 50 -207 -107 67 -331 -71 96 -27 16 -125 41 194 156 -233 132 89
5761H9m60K76J70k45K72L11o82M01Q9n37M21j1m9k0pl45M80J08m58J71J59n69
5783d36N42j99k05L29J0k29L52o2k45K90j52q9J75R0o15N88q9j07L90l16j61N69
5805D30l78l20M23r7l41M79j95k86L17J43m83M60q8j57N27l89j3l5L4l55M57l5
5827I8m08M35j26j86L28k19M7K84k23k02K88K8k08k5K58l51N24n07j82K33K54
5848A40k83J81K0k75K19J19k83L11j08j84J62o3l86O60J1o41O23k45j2O2J9l5
5870A2J28j42p3J8J71l12L28K9m85O85j06n25L79J22l39K63R6n17Q4K58n12O96
5892B58K9n08L66K84p34M11Q4l86O20m78k51O8M48m51M15j70k85K68J63l97O31
5913C85M6o68N37k43l77L77J4m74O52j82l63O04k58o14Q17J39p58Q54n19k57Q58
$$ plain form
5761 89 -371 -95 75 -170 102 413 -269 132 221 -316 105 94 45 25 18 -327 153 261 -197 -26 133 -436
5783 -436 106 -93 -298 31 41 -188 164 102 -143 147 -5 -94 81 171 -444 144 55 -52 338 22 -139 430
5805 430 52 -268 155 58 -283 196 1 -285 32 175 -308 152 64 -93 434 45 32 -3 31 -324 133 98
5827 98 -310 125 -1 -187 141 -78 -31 253 30 -172 116 144 -64 -89 169 -182 342 -165 -347 -114 140
5848 140 -143 38 58 -217 2 121 -162 149 41 -143 19 -44 -430 230 241 -400 223 -22 -34 28 47 12
5870 12 140 -2 -75 -57 114 -198 130 159 -326 359 253 -272 107 229 -110 153 249 -268 -184 74 -438 258
5892 258 287 -221 145 429 -305 106 190 -196 424 -54 -305 -237 211 -240 175 5 -280 -12 151 -246 385
5913 385 431 -237 300 57 -320 57 71 -403 249 67 -296 308 50 -564 253 392 -366 488 -31 -288 570
5934E70l57o11R08l38o77J143l96p95R11j87o45Q57m19l04N34k93m58Q95l23n12
5954d97Q96l15j83O38o93Q7L01n1n15P03l70k79O70m77J34M99n18l73P79l21k88
5975a73N29o25J87M78n05j95N73l67l17M73j05q3N64o60l8P29m37n0O3l61K61
5996e9L02l50J10L88m17MM45m90j59O10p22Q0P10n53l8M61m93L2M71m30k50P87
6018D39p27l4N60k41j17K22j41o7J50j42Q1k3n0k46O29m34k15M90m10R1M61l43
6040f7P9l4j76J83O2m9j55J9j01JM69l60j8N25l95J99Q1l50n5J78ok97N5J98j26
6065a40M07k09k24N82m32l95P43k96j47n8L5L84L1l13l3L75n25J0N22l68k58O75
6087C66n69j59P58k93k40L39k52k44N34k61k04O28m63o3L61m11k24O29n20K34
$$ plain form
5934 570 213 -398 510 172 -505 638 242 -553 358 171 -474 383 -36 -340 194 -99 -557 338 15 -497
5954 -497 399 84 -99 539 -154 -67 234 183 -332 371 1 -278 392 -85 49 548 30 -343 436 115 -173
5975 -173 356 -269 -82 396 -109 -304 269 -98 -415 58 -47 -130 434 -226 -264 465 28 -22 41 -320 -59
5996 -59 243 -107 3 391 -26 -22 423 -67 -226 384 -338 -258 452 -101 -139 322 -171 -139 332 -98 -348 439
6018 439 -288 -322 238 -3 -120 102 -39 -106 44 -98 -17 -40 -90 -336 293 -141 -356 134 -276 -185 276 -67
6040 -67 12 -22 -198 -15 47 -2 -157 -138 -239 -238 231 -129 -147 378 -17 182 263 -87 -142 36 30 -267 -212 -14 -140
6065 -140 267 58 -166 416 -16 -411 332 36 -111 -169 -134 250 281 -32 -65 310 -215 -205 317 -51 -309 366
6087 366 -203 -362 396 103 -137 202 -50 -294 240 -21 -225 403 -60 -123 238 -173 -397 232 -288 -54
6107e4K02m41L61j16J66N4J56m69k50L90J41j91K54m60L8M54m79K78J53m04Q1
6128a36M19m36p3N28l31J0K78l50J91K3l76K25J96l83K26J06q3j07L36n10K89
6149D2J10k35J19J15n09L10L63m29K87J07n21K56L76n63K85%k50M23j82k53M58
6170C09k82M4RJ5j24P5J55o30L89O3k39M20j93j87K54j13j67L80J37n42J65J21
6192E9k20K10%m20P84m30m24M95M0l56M24j52j79K65K7k87K23p5L5P6j55j51K75
6215F4N1p8J09P0j38J6j83q8K53j1k73L68j57m9K07j87j73K02j4j67K12r9P8K69
6239B82l13j47L72r3j81K78p8k65K02m2n10O93l99J39J30k01J75r4o6m2K37J4
6261I1j95M08j88k92J99R1j36k8k1j86K60j5j05J36J44j40mp5O0Q2j78J3K8nP9
$$ plain form
6107 -54 148 -293 68 -48 118 172 328 -141 -391 -1 140 -51 203 -257 -219 235 -244 34 187 -217 -136
6128 -136 283 -153 -226 302 -29 -19 259 -91 100 123 -253 -28 168 -215 11 117 34 -73 263 -247 42
6149 42 152 -83 36 151 -358 -48 315 -114 173 280 -241 15 391 -172 113 113 -137 286 104 -149 309
6170 309 27 71 80 95 -29 46 201 -429 -40 23 -216 204 11 -176 78 -35 -202 178 315 -227 -62 59
6192 59 -161 49 49 -371 413 -17 -441 54 94 -262 162 10 -169 96 123 -164 59 -16 19 95 -60 -211 64
6215 64 115 37 146 216 78 94 -89 -177 76 65 -208 160 3 -46 161 -26 -199 3 -11 -178 34 -65 13 282
6239 282 -31 -178 194 101 -80 198 120 -145 57 15 -495 198 -201 -62 68 -133 42 -52 -118 -160 77 91
6261 91 -104 304 116 -176 23 114 -22 -50 -71 -257 3 -12 -117 19 163 23 19 -56 4 86 -92 -79 -51 -56 23
6286B3J21j03k35L18jj74J11j66J6Q8O5k08L35Mn20N60j03k92L20m1k99J70K03
6309A92m55L59p5j82L27K9l57K69j40j07J71kp6j2L1j40L70j99k47K46J03k94
6331a89J06L34j91j15J48l36L48j12j54K70m3j84l1O4r9L54q7k16L2J78j85K52
6353A44k03j80M62k16k25M42l96mM53n34K30J31j06m01N45q5k09K05N8j23K24
6374B12j77j27K05L5j64j89M9l1K57J1o8N4K5k88K23o3j36L89M1m33J81Om6n7
6398i1L34k58L0L2%j79K37l14M75k55O9n4m00M64j02Q8k60N04k45k61J65k9j09
6421a59J97O5j21Q6J58k26J73k97O6J33Q9k00K64l75j18K66J08m8k32L22k88J00
6443c7J0k93L61K1n38O03J56k94M7Ql75L81l0j79J79L6k87K64L01o71N49k6l88
$$ plain form
6286 23 144 41 -194 124 123 -51 60 -106 -90 -2 63 -145 190 194 -326 234 131 -161 159 118 -181 -11 192
6309 192 -263 96 21 -161 166 195 -162 107 -33 -140 31 29 -47 -59 -28 -168 202 3 -244 2 105 -189
6331 -189 -83 251 60 -55 93 -243 105 -7 -161 109 66 -118 -149 -85 -184 170 83 -133 -101 77 -108 144
6353 144 -59 -239 223 7 -218 224 -172 -176 277 -257 -27 104 -2 -403 142 57 -152 53 111 -12 212
6374 212 35 -92 113 148 -16 -205 -156 -187 70 81 13 67 92 -196 27 -36 -172 217 258 -175 6 12 -34 -91
6398 -91 243 -15 15 47 47 -132 105 -209 266 11 80 26 -374 90 -12 76 -184 320 75 -186 -21 -50 -159
6421 -159 38 103 -18 68 226 0 173 -124 -58 75 164 -36 228 -147 -265 1 109 61 -171 151 -137 -37
6443 -37 -27 -320 41 62 -476 127 283 -11 36 44 -331 50 20 -159 20 56 -231 33 334 -337 212 186 -202
6466b02J71l3J3L3N8j05J23k7k60M05j2k21L78k72l42N39k06m60M49Q1j20N4L94
6489D38o36N05j97k38L61r5k42K18J68n23R4J03j19L79l28o5K24j08j5K13J87
6510C24l97L43k87j61M41k31L3J71l00J7J77k7l2J91k83j37K62k17l4L09l13K51
6532A00k7k08J30J43j69l78O68j97k07J39k07J26L52l44o9N43m35j61L56k03Q
6553d0J39n65P69q2k85Q5P7k80K67J59j83J24j62k45Q5L41m27J72L06o87L40L01
6575B09j83J44k3j27j54M86k91j10R7j80J15K25l97N93j96l99L58q9k80N9J38
6596em9J4J48l32J66M25j99m7J5j60m0L5P2k51K28n2L6J65j03oPk13J23L19k69
6621B7K21Ok57NOJ69n0K1k59J85j9q2M0o7k9J02O8m1O4j53n6J78O5j94R5j59L22
$$ plain form
6466 -202 -31 -64 -51 -18 40 -65 58 31 -229 176 164 -57 321 49 -293 246 40 -420 29 110 -10 44 438
6489 438 -198 307 110 -128 233 138 -104 114 282 -241 -147 -44 -163 216 -112 -177 47 -61 -76 137 324
6510 324 -73 270 -17 -178 263 32 65 236 -64 -47 130 103 71 262 -21 -158 104 -113 -147 162 -151 100
6532 100 73 -135 -5 138 -31 -409 259 62 -145 -6 -213 -87 265 -79 -148 395 -40 -201 155 -48 -40
6553 -40 99 -466 303 221 -64 21 98 -182 85 244 61 185 23 -222 -137 204 -223 -51 255 -432 -92 209
6575 209 26 170 147 20 -134 352 61 -49 48 -132 -17 208 -189 404 208 -191 167 78 -202 -143 -5
6596 -5 -54 -40 108 -224 -58 367 168 121 136 -24 -64 -29 43 -208 20 -32 4 169 66 60 67 -146 -23 296 27
6621 27 248 254 -3 2 8 177 127 148 -111 74 55 -27 13 -54 -83 19 87 46 110 -43 -99 79 144 -50 45 -114 208
6648B08k73K79j23l02M59l58l1M9j4N3Q2k0l7J0P6j91K29j03j27N09o14n0N18
6671B29j78p4L49m43n9L72j72k22M25k91J4M31l05l8J97m50K87J95n96M10K07
6692B88o40R1R3O7K38P6k14J59q4k49L06m8l53K49K13m22J96J99n19J84M53q09
6714e26O99o0l09L15k7k94K16L22o59L25J19k07R1qk56L11L6l11L54p4k41M67
6736B83j49l14K01L52n12K75j6l65L89l8l39M46j29j27L92l11l92O32k38k36L28
6757A32j45r1J56O3m71M03l52J72K26r8k64K15r0jL14j66l62L50j76J52L13k35
6779D5l16L87K2m18M97j23j32Q2N8k36J33n3j56L78k23K2K82k52j03L04k04k96
6801c02N14j77j30L49k74K84l10M3QK06l46K61o1J43k44l9J63P9Q6j39K3l19J79
$$ plain form
6648 208 -65 214 91 -211 248 -110 -141 -92 -106 -53 29 9 -28 -18 58 -133 96 -7 -134 375 -239 -289 229
6671 229 51 -23 326 -117 -176 196 24 -198 227 -64 -50 381 76 38 235 -215 72 267 -329 81 288
6692 288 -352 -261 -168 -101 137 213 -1 158 74 -175 131 83 -270 -21 192 -230 -34 165 -354 -170 283 -526
6714 -526 173 113 -196 119 92 -202 14 336 -323 2 121 -86 5 -3 -259 52 88 -223 131 57 -184 283
6736 283 134 -180 21 373 -139 136 120 -245 144 106 -233 213 84 -43 349 38 -354 278 40 -196 132
6757 132 -13 -104 52 115 -356 47 -305 -133 93 -5 -269 -54 -144 -145 169 3 -359 -9 -185 -33 280 45
6779 45 -271 116 138 -280 217 94 -38 44 102 -134 -1 -54 -210 168 -55 -33 249 -3 -106 198 -6 -302
6801 -302 212 35 -95 254 -20 264 -46 -3 5 211 -135 126 65 208 -36 -75 88 167 253 114 137 -182 -3
6824cJ34k96j63M21O5j54k72L37q8j31J06M5k6J27j10qJ15l99J42K17j63M9j60
6847b15K80j61L4r3L3K56j35j86K14L3J55j64k7j24L52k60j81L63p2r4p3J08k19
6870a76J51j15J00J10j69J12l6O8k89R3J21j89K87j12J12j27O8k90J56K52m66
6891c39L58J50q2j0J4j83p4L03l04J16j53j19M08j12o0K84R6m27K82r7n9j22P5
6914e5j04L66j38j49K12j30oL61k00k50l2K02j92J94k81k0M71q1j90J42j1j82
6936g3K64m29k6O7K02k01L33j8l53J26j56J99K76k99j5J88j88P6L25l65K12j21
6958B4j92oL00l09J70L20k19o0J84l75J85K00j27k58L51k10k62N35l23P9J15k33
6980a11K3L06k50RJ88o2l88N38k86J0J17k9j30k6L35k38K02L4k58J39n7p5J45
$$ plain form
6824 -3 131 -165 -328 93 158 4 -268 69 -19 -150 -44 1 -25 102 -8 -16 99 -300 -158 59 -104 -55 -215
6847 -215 65 -96 -62 -155 -122 134 -1 -187 27 60 215 51 24 -100 252 -8 -189 174 102 8 -65 43 -176
6870 -176 -25 -140 -40 70 -99 13 -23 45 -244 -151 -30 -219 68 -44 68 -59 9 -281 -125 127 -339
6891 -339 19 169 87 77 91 -92 -166 137 -167 -51 -204 -323 85 -27 -87 197 293 -134 148 51 -8 -130 -55
6914 -55 -159 207 69 -80 132 2 -4 357 157 -93 -125 77 -115 79 -202 -222 249 168 -22 120 109 -73
6936 -73 191 -238 -264 -197 5 -196 137 119 -234 -108 -264 -65 211 -88 -103 85 -103 -27 298 -67 145 24
6958 24 -168 -174 126 -183 -13 307 88 28 212 -163 22 222 95 -163 188 -22 -284 251 -72 7 122 -111
6980 -111 -88 218 -32 -23 165 103 -285 253 -33 -23 94 65 -65 -91 244 6 208 242 -16 123 66 -9 136
7003A36k51K29m7K19k67N1j07n9K48k78j24J38J04k3J95k12J81K02k64j20k6N8
7025a7j05J98j66J26R3l83J65K07k49r2L1J83qJ3r5J88j23j21Q1K07k33QL13k22
7049aJ04j59J18q7R2o4J06j0k33K2K80j54P7J99m02LK83J1j44n4O8k83K08r8K64
7074A46K2O1m15K22m2l4j7J92m00K48K75n86L01J6j61P4J47K0Ok23K02q0j22m4
7098a92J59j75J64Q2j95r1J48q7L40j09N1j72K80j23l2P2j30j22L59k78n5K08
7120A02j16LJ90k57N0K24o32N25q1j76J91J50m04L70k0k01J73J69m63J40K81k62
7142d4j48K24j7P6q9mo6J09J0J6R0Lo7j90k6l0J90M0O0R9k16J36q6k37J76K6j55
7169a20JR3j1L20k35j24K61k37J80j99J78p2j46L31l09K09j70J48o3N2j68j3K21
$$ plain form
7003 136 -115 114 67 286 19 70 -37 -96 152 -126 -250 -112 -8 -31 164 -48 133 335 71 -49 -75 -17
7025 -17 -122 76 -90 36 129 -254 -89 118 -131 -223 -192 -9 -17 -4 -99 89 -34 -155 -74 133 -100 -92 221 -1
7049 -1 103 -56 62 -25 67 3 109 99 -134 -112 168 14 91 290 -112 -109 174 185 41 -13 55 -228 -20 -118 146
7074 146 168 229 -186 36 -6 -40 -57 135 -265 -17 258 -328 -27 -11 -172 -98 49 69 75 -148 54 -26 -148 -192
7098 -192 -33 -208 -44 38 -157 -248 -100 -187 153 44 95 -77 203 80 48 120 -10 -132 227 -51 -106 102
7120 102 -14 -11 179 -78 -28 196 -436 89 8 -168 23 173 -231 139 119 -82 91 260 -203 -63 218 -44
7142 -44 -192 32 15 91 2 -2 -68 41 51 67 157 160 93 -97 -123 -153 37 77 137 236 20 156 70 -167 9 35 -120
7169 -120 -119 -26 -37 283 48 -76 185 -52 128 -71 107 35 -111 220 -89 120 -50 98 35 87 -81 -94 127
7192A27j12j20L3O4J32J10j51Qo4j0j31L05k59n1J06J06J19j19j59M3K79l20O0
7215dj31l2K39p0O0J01Rk12Q6o9j33n6K22L6m2j5k55J73J04k66K03J33j15j2J65
7240A19k05J06n9Lj02J94L4n5L0k24R4M5J20n0pl08M57M9n8j61J04J9j94j98N2
7265a95K67k1N4o9l13J93M34j54n46J47J60J52k53J03j8k8J84j60O0p6j39J69
7287d9L01j34r1L36n92M75k61m9K57j81k7J52q2j76N4N1p1J30j03j11J91L0m6
7310DJ53j08j14K43l39J55J09j27q9J70M2q0J37o9r4l5J6n6K71k28j33J85P8n21
7334d30M88KK15k45k6L4J31j75p7K29Q8k91J93R9j68J85n13J03L10m7k12p7J25
7357e9J08n4J72j29n8n7R2k3J27r8J57k78K65q2j46L4J0j09K13q7j11J11J55o7
$$ plain form
7192 127 15 -105 -72 -8 124 234 83 91 27 17 -114 191 -68 -119 -13 93 212 93 -66 -23 256 -64 -4
7215 -4 -135 -167 72 2 62 163 172 -40 46 -23 -156 -212 10 46 4 -11 -266 -93 11 -255 -52 81 -34 -46 119
7240 119 -86 20 -39 -36 -138 56 90 35 65 -159 -65 -20 100 50 43 -265 192 241 183 22 126 145 -49 -247 -195
7265 -195 72 51 105 36 -277 -84 350 196 -350 -203 -43 109 -144 -41 -59 -87 97 -63 -3 -79 -218 -49
7287 -49 252 118 27 363 -229 246 -15 -64 193 12 -15 137 55 -121 -67 -16 -87 43 -60 -171 20 50 4
7310 4 157 49 -65 178 -161 -6 103 -24 -113 57 99 19 156 87 -7 -42 -26 -82 189 -39 -172 13 91 -430
7334 -430 58 60 275 30 4 38 169 -6 -83 146 234 -57 136 235 67 252 -261 -158 152 105 -107 -184 -59
7357 -59 49 -5 167 38 -20 -77 15 -8 119 21 178 -100 165 83 -63 -29 -19 -128 85 -2 -113 -2 153 86
7381H6J07J18l92n4j31M25k16Q9j75l1J8J05O4j33K71l35M28j64K47k59j71J6
7403h7J32k49J59m1J00J48j97M3J12j44j07L27k90J60k60M4J22J92k32M1j18M35
7425B90n61K74K48k91K24m05J70J9O6j3k76M33k68l0j5K3K30p3j11k93M39r8J02
7448H4j23K0J6J33J20k40k0m7M9J53j93j24P6N4q0J29n8l7K28r7k64K03k15N8
7472a75L12j18j88o1k2R3L92k54J16J95m9l30jQ0kl7j6j04K35j38j64K92k8j24
7496i6J64k22m9M13j13j06J09M9l1m2j55J79P8k42R6j03l7R1K63j61J18q5k75
7519a57R8K07m77L36K02k42J84k50j74M43k43oJ3N9O1Q0j26k9o4J78m05M45k64
7542a31N6J69k6q4q2K52k39p9P9J30o1L0m1J08L3j3j8k65K29m4J86k75j41K99
$$ plain form
7381 86 193 311 -81 -135 -266 159 -57 32 -143 -174 -156 -51 13 -120 151 -184 244 80 327 68 -103 -87
7403 -87 45 -204 -45 -86 14 162 -35 8 120 -24 -131 196 -94 66 -194 -150 -28 164 -68 -27 -145 290
7425 290 -271 3 251 -40 184 -221 -51 -32 34 21 -255 178 -90 -120 -135 -112 118 45 -66 -359 80 -18 84
7448 84 -39 -19 -3 130 250 10 -10 -57 -8 145 -48 -172 -96 -42 -122 7 -51 -88 140 43 -221 -18 -233 -175
7472 -175 137 19 -169 -230 -252 -159 233 -21 95 290 241 -89 -90 -10 -12 -49 -65 -169 66 -72 -236 56 28 -96
7496 -96 68 -154 -203 210 97 -9 100 149 118 76 -79 100 178 -64 32 -71 -108 -17 246 85 203 118 -157
7519 -157 -59 148 -329 7 209 -33 151 -99 -273 170 -73 -79 -66 -7 54 134 8 -21 -85 93 -312 133 -131
7542 -131 -75 94 68 -16 -98 154 -85 -164 -85 45 -16 14 -27 81 114 101 83 -182 47 3 189 -86 -227 72
7566G2j89J60j03J00r0K05j81J36J06j76j8J83k27O4N4j87O2K05k09p8K41k73
7588a43K07rj87m3L23K31l06j11p2j0K67k59jJ87j58L2J11j19r1J65j10Q0J39
7611A23j83jj6l2k3J49R6o9Q0k60K21j2p7J47k16j23R9k2R6M5J12j78j05J84Q
7636D3qP7j92j0M53k46O2M9k56m0kj43K13R7K7nM6k61P5k8Q9k25J26M6j8J83J08
7663B60l78L35k63l1K69k05J73j3n6l6K48n32M28j13k9k15N17m71K83k16J12M
7685G1O9p8k24K30k37J86K3l42L90J23l65J03P9o8j7O7K5J45j50Kj3m0N2k42K67
7710E6J36k11K08l05o9n2O3J67j77J52j63K73p1j09K03q2J45k19p2J09J36Lq1
7733D0J02m18J63L31j65J08k48K29j03J6j86L22lm37K68q5j76K57N2l91L56J35
$$ plain form
7566 72 -117 43 -60 40 -50 155 -26 110 216 40 22 205 -22 42 96 -91 -29 176 -33 -111 130 -143
7588 -143 64 55 -132 -175 148 379 73 -38 -110 -120 147 -112 -113 74 -84 -52 59 -60 -151 14 -96 -16 123
7611 123 -60 -61 -77 -109 -132 17 113 44 124 -136 85 73 -4 143 -73 -196 -97 -119 -23 22 134 -44 -149 35 43
7636 43 35 112 -80 -90 363 117 179 228 -28 -68 -70 -213 0 97 124 119 165 -96 -21 -49 40 -185 -59 -13 -31 152 260
7663 260 -118 217 -46 -77 192 -13 160 147 91 55 303 -229 199 86 57 -158 359 -112 171 -45 67 71
7685 71 140 62 -162 68 -169 17 40 -302 88 211 -154 -51 28 -40 -57 10 35 180 30 32 19 -21 31 -211 56
7710 56 192 -19 189 -116 -185 -237 -174 -7 -184 -32 -195 78 7 -102 101 19 164 -55 -127 -18 118 121 40
7733 40 142 -276 -113 218 53 161 -87 142 39 55 -131 191 188 -249 19 -66 -242 15 67 -324 32 167
7755A67l54L03j47K3m0l1mJ94k89m8N2J72j41J24k06K69J49j31k38L29k15l1j33
7778b26L36o0n2J56j37j55K3j3K62Ml23J47j55K82j55J61j28J0K36j79m9m3J10
7801E2Nj98K24K3j35m4J88j16k24J58P1K86m23J87n3J90k88J97p0j63r3K91k05
7824a40J53J20j61l0P7J28r4k83m0K88rP1L5l9j08O7N6k17l6o5J50n5M40l55k28
7849b75Q8K79l23K05J17j40k22N18l55jK04j84J26Pk79O0K35j97J63j2j3Mj10
7872a05J40N9j14j68K78q6j66J93Mj3kO0m8j07J47m7R8J4j1k03M0J12j52j04K
7897a79J43j19L4J38Jl3K1j47K2J70K4k6n3j84N3J87j02j62K62o0L03m86J3J01
7921g9J81k38P4L15l10j56O7O7k10L95j73J50k7n9l7J3J37j27K08m7l35J58p5
$$ plain form
7755 167 -187 116 -31 -8 -48 -79 -83 111 -178 -226 -174 -2 -143 -19 -225 44 193 62 -176 153 -62 -93 -226
7778 -226 110 50 -2 154 17 -138 -115 -128 134 138 -185 -38 -193 89 -66 95 -33 -23 213 34 -15 -58 52
7801 52 57 -141 83 106 -29 -73 115 -1 -225 -67 4 290 -133 54 1 191 -97 100 30 -133 -226 65 -140
7824 -140 13 133 -28 -58 19 147 53 -230 -270 18 9 80 115 76 -32 35 91 -126 -162 -227 -77 -132 308 -47 -275
7849 -275 -187 92 -231 -26 91 -49 -271 247 -108 -109 95 -89 37 44 -235 -175 60 -137 26 14 1 5 -105
7872 -105 35 94 -20 -188 90 4 -162 31 35 22 20 80 32 -75 72 25 123 137 126 -77 -37 75 -77 -181 -179
7897 -179 -36 -155 -121 17 18 -15 6 -141 -119 51 75 49 -4 -188 -135 52 -50 -212 50 -10 293 -193 -180 -79
7921 -79 102 -136 -62 253 -57 -213 -146 -79 -289 106 -67 83 56 -3 -40 -27 110 -17 191 144 -191 -33 -108
7944a08k50L94j3j71M54k35K9k76l1K50l8nK0N8M1L3l9q4r5K45k92K90jk00q8
7969a12J43j27K84j51M7n5J15q8L94j98j37j72L2Q6j00O3J50j31J8j01M8l0J6
7992fK92k24j52J33J17k6j09p3N5j25J23p6J22J2q9j3J43M7k04L21j60k55L62
8015B15l01J72j37j13J32j07o3L18j79J41j38R1O7k22m7NK48o3J45n3r4r0K19
8038A46k9J10m02L01k41J5O6q5J00n5P0J01k16J56k22J83P1J14j20j78l5K86j48
8061a2j74J69K09j77K84k45q0J28j04j10J51r8K6O2l21L42J6j33j17M31j85J72
8083B34j76J62l67L10k46J12J45n02M41J36l66J33J16k11J88j35n3K79j34k48
8103a82J79J52k6N0M8k63m2J65k6k26J72%J33j7j4R7r0q9J67m43N9K47j28m5J81
$$ plain form
7944 -108 -358 36 23 -148 306 71 100 -176 -207 43 5 0 20 78 119 152 113 29 -66 179 -113 177 176 -24 -112
7969 -112 31 -96 188 37 84 29 144 56 450 252 115 -57 -25 61 -39 24 174 43 61 -40 8 -22 -6
7992 -6 286 62 -90 43 160 134 25 -48 7 -118 5 -71 51 63 -26 -39 104 151 -53 268 108 -147 215
8015 215 -86 86 -51 -164 -32 -139 -202 116 -63 78 -60 31 98 -124 -171 -166 82 19 164 111 17 -73 146
8038 146 117 227 -175 126 -115 -100 -34 -119 -19 -74 -4 97 -119 37 -185 -2 69 183 63 -115 -150 136 -12
8061 -12 -186 -17 192 15 299 54 -26 102 -2 -112 39 -59 -33 29 -292 50 66 -67 -184 247 62 234
8083 234 58 220 -147 163 -83 29 174 -328 113 249 -117 16 132 -79 109 -26 -79 200 66 -182
8103 -182 -3 149 123 173 221 -42 -84 81 55 -171 1 1 134 117 103 200 110 21 188 -255 -196 51 -77 -122 59
8128E9mJ76j09m3j58L1K26j30L32m46J16o9K2K7J9R9l15J43R9l3q5l7J85k47J44
8153Bj16J28J35m44J22J46o8Q2J33l22O5J20j27J42p3j5J85l33L48l3j63K1l5
8176a00l9L06j71K53m35O9K7j1J49k82K42j35K69J29l38
$$ plain form
8128 59 55 231 122 79 -79 -48 178 48 380 -66 50 -19 3 30 49 148 -167 -24 75 42 -43 -80 105 -142 2
8153 2 -114 14 149 -295 -173 -27 -95 -13 120 -202 -137 -17 -144 -2 -75 -90 95 -238 110 77 -86 -65 -100
8176 -100 -139 167 -4 249 -186 -117 -90 -101 48 -234 8 -127 142 271 -67
8191f7
$$ Imaginary data points
##PAGE= N=2
##DATA TABLE= (X++(I..I)), XYDATA
0@%%%%%%%Qj6J6j6J6k4L2m0M8n6O4p3R7j20J36j53J77k08K43k83L26l71M21m80
31b56N44o13O90p73Q64r65J078j200J330j472J627j797J985k190K411k652K916
48A527l207L529l886M280m718N209n764O399p126P969q963J0150j1598J3403j5712
63h508J8767k2983K9145l8899N6379r5975L26789k00743m98808Q32514l90785
74F893l97611P75769l92425l66089P70447m42283k96849P34616m52056k67607
84c27195P20191m76099k14624O80013m81030j71995O47385n00889j16057O09140
94C68840n13209p1804N79318n21467l2371N40016n19424K887N01877n16016M2356
105a38997M60400n14903P5543M28691n11912J02713L93951m98277J22046L56249
$$ plain form
0 0 0 0 0 0 0 0 0 8 -8 8 -8 8 -16 16 -24 24 -32 32 -41 56 -64 72 -81 96 -112 131 -152 174 -197 224 -256
31 -256 288 -325 365 -408 456 -509 569 -631 699 -773 854 -943 1042 -1148 1263 -1389 1527
48 1527 -1680 1849 -2037 2243 -2475 2734 -3030 3369 -3757 4212 -4751 5399 -6199 7204 -8508
63 -8508 10259 -12724 16421 -22478 33901 -62074 264715 63972 -434836 397678 6893
74 6893 -390718 385051 -7374 -373463 396984 -45299 -342148 392468 -59588 -327195
84 -327195 392996 -83103 -297727 382286 -98744 -270739 376646 -124243 -240300 368840
94 368840 -144369 -216173 363145 -158322 -190693 349323 -170101 -167214 334663 -181353 -138997
105 -138997 321403 -193500 -117957 310734 -201178 -98465 295486 -202791 -80745 275504
115B75504m77149J44374L09694m54704J65952K68193m35147J84997K33324m13466
125a98428J93272K00923l86519J96565J67939l55200K01175J32657l26639K06077
135C1822J03268l01917K06343Q0570k78118K01098O2327k50442J91165M4035k24461
146a34310J84349K6435k00816J75962J4940j81824J66696O406j60790J50904k095
157D5857j35614J36363j1280j12288J22280k0367r2086J09770k3233p6308R4128
168C7222k2964n9943P5889k0675m3748N9746k1186l0312M7194k0156k0666L6729
180A7130j6597j4546K5751j1508q210J3802n081l038K365O09O67n556O901J981
194D670j3622J3735J175k0083K1745J297k6931K7652O42l1513L2458l51l4614
$$ plain form
115 275504 -201645 -57271 252423 -202281 -36329 231864 -203283 -18286 215038 -198428
125 -198428 -5156 195767 -190752 5813 173752 -181448 19727 152384 -174255 31822
135 31822 135090 -166827 39516 120086 -158032 43066 105393 -145049 46116 90151 -134310
146 -134310 50039 76474 -124342 51620 66560 -115264 51432 57838 -102952 47952 45857
157 45857 -89757 46606 35326 -76962 45318 24951 -67135 42635 19402 -56906 37222
168 37222 14258 -45685 30204 9529 -34219 25527 4341 -25971 21223 1067 -19599 17130
180 17130 533 -14013 11738 230 -7980 5822 741 -2297 68 677 1344 -4212 2689 4670
194 4670 -8952 4783 5958 -14125 7620 8917 -18014 9638 10280 -21233 11225 10874 -23740
207b3740L7727l249l7385M3977o899l9517M8927j0495m0671N3929j4586l9692
219c1674N6992j8544l8797N9191k3272l6198O1778k7271l3740O3043l2146l1000
231c1638O5131l6568k7925O5871l9917k5015O6416m3384k1242O5036m6789j6815
243b6839O3986m9383j2535O3318n2750r562O2396n4387o854O0806n5595k552N8144
256C8193n7265J539N4827n8888N866N3160n9750Q447N0372n9291J0745M6862n9039
269b4222J4464M3040n8702J8672L9268n9380K1992L6815n9279K3885L3393n7888
281b7942K6805K9425n6268L0287K4053n6644L4251K1768n6277L6607J9135n6339
293c1139L8045J6197n3742L9874J2001n3151M3350Q451n2058M5497O013n2405
$$ plain form
207 -23740 13987 10738 -26647 17330 10431 -29086 19841 9346 -31325 22604 8018 -31674
219 -31674 25318 6774 -32023 27168 3896 -32302 29476 2205 -31535 31508 -638 -31638
231 -31638 33493 -3075 -31000 34871 -5046 -30061 36355 -7029 -28271 36765 -10024 -26839
243 -26839 37147 -12236 -24771 38547 -14203 -23765 38631 -15756 -22610 38196 -17399 -19951 38193
256 38193 -19072 -17533 37294 -21594 -15728 37432 -22318 -13871 36501 -22790 -12045 34817 -24222
269 -24222 -9758 33282 -25420 -6748 32520 -26860 -4868 31947 -27332 -3447 29946 -27942
281 -27942 -1137 28288 -27980 2307 26360 -30284 3967 25735 -30542 6065 25200 -31139
293 -31139 6906 23103 -30639 9235 21236 -31915 11435 19886 -32172 13325 19338 -33067
305c3067M6792M379n0266M7047J090m6759M7374l332m4179M9485o977m2652N1289
318B0224r355m1380N0959j1602l8038N0894j5285l4461N1213k0029l0600N3801
330B6341k4743k9356N4178k6306k7200N4151k7988k4239N2576l0875k0496N2434
342B8477l3362j8471N2513l4899j7201N1504l4971j4708M8612l5006j1071M4703
354B6120l5420p111M2759l6837m563M0262l6704j455L7234l6089J459L2581l5742
367a3506N901K9222l6772R573K6670l7516J2231K4931l7466J3370K3069l6456
379a6749J4886J9928l5217J6487J8286l4688J7180J7227l4507J7193J5883l1838
391a5929J6723J3813k9471J6244J1260k6667J6333Q661k4303J6012P099k1456
$$ plain form
305 -33067 13725 18104 -32162 14885 15975 -30784 16590 13258 -30921 18564 11587 -31065 20224
318 20224 10869 -30511 20448 8846 -29192 21702 6417 -28044 23169 3140 -27460 26341
330 26341 1598 -27758 26420 114 -27086 27065 -923 -25162 27414 -3461 -23957 28477
342 28477 -4885 -23356 29157 -5742 -22943 28561 -6410 -21118 27494 -7512 -18583 26120
354 26120 -9300 -16411 26348 -10489 -15052 25210 -11494 -12949 24285 -11804 -10345 22236 -13506
367 -13506 -7605 21617 -15155 -5582 21088 -16428 -4197 20734 -16732 -3362 19707 -16749
379 -16749 -1863 18065 -17152 -665 17621 -17067 113 17340 -17167 26 15909 -15929
391 -15929 794 14607 -14864 1380 12640 -14027 2306 10967 -13336 2676 9775 -11681
403a1681J4569N057j8479J3973K834j5983J3514J071j3780J3834o23j2668J3011
416D649j242j1741J3292k152j0510J2878l120r294J2541l211r609J2850l288r031
430f988J2251l715q228J1900l956p395J0709l898o294J0787m080o412J0014m521
444A74n184J0039n006m669R692o274l049J0083p065k615R542q290j398J0735r497
459b782o78J0444j0920K23J2053j2727L47J2981j4429J405J4448j6784K255J5675
473A1511j9121L764J6765k2351N584J8168k5035P565J8407k8350J0456J8915l1047
486a4769J4137J7519l4083J7267J6930l5874K1090J5092l8263K4915J3623m0437
498b2853K8610J1949m2807L2871J0219m5269L7311Q433m7747M1418O074m9739
$$ plain form
403 -11681 2888 7945 -10534 3439 6273 -9710 3804 4875 -8905 4929 4306 -8362 4649
416 4649 3407 -8334 4958 2806 -7704 5174 2054 -7240 5301 2090 -7519 5331 2043 -6988
430 -6988 5263 1548 -6680 5220 1264 -6131 4578 680 -5614 5173 1093 -5319 4695 174
444 174 -5010 5029 23 -4646 5046 -1228 -4277 5806 -1259 -3874 5668 -2622 -4020 6715 -2782
459 -2782 -3460 6984 -3936 -3713 8340 -4387 -4040 8941 -5488 -4083 10365 -6419 -4164 11511
473 11511 -7610 -3846 12919 -9432 -3848 14320 -10715 -3150 15257 -13093 -2637 16278 -14769
486 -14769 -632 16887 -17196 71 17001 -18873 2217 17309 -20954 3961 17584 -22853
498 -22853 5757 17706 -25101 7770 17989 -27280 10031 18464 -29283 12135 18209 -31530
510c1530M5970L350n1338N0707L59n3657N5857l001n4573O0420o736n6031O5576
523B5373j0483n6267O9998j5859n5679P4747k1505n4057P9367k7993n1757Q2729
535C8614l3879m9252Q6207m0157m5674Q8825m6362m1686R0709n2581l7262R2361
547D9863n8719l2924R4044o4389k8583R5715p0742k4044R6696p5713j9246R6613
559E8571q1155j3718R6998q7114p734R6661r2907j303R4973r7292N615R2384j01733
572c7754J2642Q9116j05906K1010Q4978j09681K8230Q1140j12927L5968P6337
583F3153j15404M3352P0248j16322N0615O4185j17899N8662N7825j19255O5006
594D166N2229j18847P0064M7044j18205P4850M0440j16413P9785L3725j14546
$$ plain form
510 -31530 14440 17790 -33548 17159 17518 -36139 19718 16717 -37856 22564 15828 -40203 25373
523 25373 14890 -41377 28621 12762 -42917 31830 10325 -43732 35635 7642 -44115 38614
535 38614 4735 -44517 41690 1533 -44141 44684 -1678 -43364 47345 -5236 -42498 49863
547 49863 -8856 -41780 52264 -12125 -40708 55007 -15735 -39779 56917 -18796 -38042 58571
559 58571 -22584 -36302 60696 -26418 -34152 62509 -30398 -31701 63272 -34020 -28405 63979 -37754
572 -37754 -25112 64004 -41902 -20892 64086 -45595 -17365 63775 -49152 -13184 63153
583 63153 -52251 -8899 61349 -54973 -4358 59827 -58072 590 58415 -60840 4166
594 4166 56395 -62452 7612 54656 -63549 11301 51741 -64672 15113 48838 -65708
605f5708Q4854K7386j13373Q9247K1278j10709R2767J4237j07033R6885O104j03312
617f7377J01335k046r8861J04679r432r4589J06744j6691q8499J08193k4152q1998
629f2694J09107l2116p5646J10450l8537p0557J10562m2880o5648J09174m6666
640D549n9162J06509n1575n1825J04437n6548m5185J02832o1105l9110J00148
651E3965o3603l3189R5569o5244k6131R0899o8468j8660Q7225p1836j2371Q3682
663E1838p4067o603Q0083p4814j886P4712p5649M950O9700p6629J0098O5292p7162
676c0137J4272O1330p5801J6875N5994p2785K0161M9333o9257K3006M3231o6662
688c0440K6023L8395o3583K6575L4175n8766K6442K8370n3167K6834K2376m7917
$$ plain form
605 -65708 19146 46532 -66841 22406 43684 -67025 25742 39979 -67054 29831 35935 -67377
617 -67377 33958 31912 -66949 37730 28298 -66291 40453 23762 -64737 43456 19304 -62694
629 -62694 46413 14297 -61349 49101 10564 -59993 50569 7689 -57959 51215 4549
640 4549 -54613 51896 321 -51504 52933 -3615 -48800 54032 -7073 -46183 53965
651 53965 -9638 -42827 52742 -12502 -38633 52266 -16202 -34862 52363 -19473 -31844 51838
663 51838 -22229 -28832 51251 -23563 -25449 49263 -26386 -21436 48264 -28365 -18267 47025 -30137
676 -30137 -15865 45465 -30336 -13461 42533 -30252 -10091 39242 -30015 -7009 36222 -30440
688 -30440 -4417 33978 -29605 -3030 31145 -27621 -1179 27191 -25976 858 23234 -24683
700b4683K8279J6837m4600K9214J3152m0796K8552R455l5993K6886N818l0326
712a8205K5770J984k6931K5419k61k3195K3452j121j9965J9667j880j4999J6117
725E852k910j0329J2571l785p249R874k783n183O150j380k115J173L09J797l791
740a799P41N042p191J666P096j0336M315P270j4435Q234Q045j8899J1332R178
754A0259k2378J3879R450k4965J7024Q055k7370K1573N987l0271K6786L905l3059
767b1125L0930K252l5014L4606l06l5704L8900m155l6551M3242p499l7906M8218
780A9888j1124l8748N2064j4116l8256N4089j7742l6827N7035k1965l5574O0068
792B8792k6307l4266O2663l0476l2004O3963l3869k9351O4814l7831k6437O5709
$$ plain form
700 -24683 3596 20433 -24167 5047 18199 -22597 5955 15410 -20583 6303 12121 -18205
712 -18205 7565 9549 -17382 8037 7776 -15419 8033 6912 -13053 6614 4734 -10265 5852
725 5852 2942 -7387 5184 1399 -5850 4024 1241 -3942 2208 828 -1287 -114 195 1992 -1799
740 -1799 -1058 3984 -3207 -1541 5555 -4781 -466 6804 -7631 603 8648 -10251 1081 10259
754 10259 -12119 1760 11210 -13755 3269 11324 -16046 5527 11514 -18757 8029 11934 -21125
767 -21125 9805 12057 -22957 11649 11343 -24361 14539 10384 -26167 17075 9576 -28330 19888
780 19888 8764 -29984 22080 7964 -30292 23797 6055 -30772 26263 4298 -31276 28792
792 28792 2485 -31781 30882 406 -31598 32365 -1504 -30855 33959 -3872 -30309 35400
804C5400m2117k2247O6031m6024j9238O6405m9375j5489O5589n2782j1019O4404
816C9538n5624o703O2969n8856k429O1380o0795J547N8988o2655O002N6631o4479
829b4486J0088N3363o5595J4841N0429o6369J8423M6728o7045K2824M2983o6828
841c0644K6359L9234o6477K9851L5205o5746L2627L1162o4587L5627K7480o3502
853c3411L8407K3394o2208M0468J9582n9803M2356J5554n7206M3238J1570n4958
865c3017M5015P571n1754M6018L700m9192M6097J077m5475M5474j948m2420M5232
878A6378n259l8838M5506q736l5776M4710j0779l2394M3557j2643k9215M2041
890A8552j4830k5266M0206j6822k1943L8872j8473j9113L7406j9176j6564L5228
$$ plain form
804 35400 -6717 -28964 37067 -8957 -28195 38210 -11165 -26654 38935 -13847 -24866 39538
816 39538 -16086 -22789 40180 -18676 -21105 40275 -20520 -18973 40015 -22640 -16638 39993 -24486
829 -24486 -14398 38965 -26630 -11789 38640 -27729 -9306 37422 -29623 -6799 36184 -30644
841 -30644 -4285 34949 -31528 -1677 33528 -32218 409 31571 -33016 2611 30091 -33411
853 -33411 4996 28390 -33818 6650 26232 -33571 8785 24339 -32867 10371 21941 -33017
865 -33017 11998 19569 -32185 13833 17533 -31659 14438 15515 -29960 15514 13566 -28854 16378
878 16378 11119 -27719 17787 9051 -26725 17985 7206 -25188 18369 5726 -23489 18552
890 18552 3722 -21544 18662 1840 -20103 18769 296 -18817 18589 -587 -17151 18077
902A8077j9816j3588L2852k0712j0583L1274k1914p801K8920k1947o068K7423
914A6117k1205m815K4879k1002k384K2372k0689L25J9798k0661J394J8510j9495
927f856J837J6454j8060K428J4411j6929M059J2061j6438M920J0971j5771N517
940a396J0054j5191M882Q850j3250N398O836j2130O255M982j1415O779M186j0301
954e461N869L692q265M338L018o497L906J336m629L847L55m089L393Q14l374K230
970D83N17j752Q91j13J7m3n01Q71j00r50J089l68o20J504j463m0J957k263k80
989a164K975k224r11K857k014m08K329k531R51K094l998J867K823m775J848L101
1005B820n471K200L115n252L186K065o433N095J689p901O364K015q472O760J302
$$ plain form
902 18077 -1739 -15327 17525 -3187 -13770 17504 -4410 -12211 16709 -5238 -11306 16117
914 16117 -5088 -9903 14976 -6026 -8410 13962 -6727 -6402 13396 -7265 -5871 12639 -6856
927 -6856 -5019 11435 -6625 -4197 10214 -6715 -2656 9405 -7033 -2113 8858 -6913 -1396
940 -1396 8658 -6533 -1651 7199 -6051 -653 6183 -5947 308 5290 -6125 654 4840 -5461
954 -5461 408 4100 -4165 173 3191 -3306 600 1936 -2693 1154 1509 -2580 813 1627 -1747 483
970 483 1000 -752 139 26 43 0 -501 370 270 -680 409 41 -579 925 -538 -578 1379 -884 -1164
989 -1164 1811 -413 -1324 1533 -481 -889 1440 -1091 -140 1954 -2044 -177 2646 -2129 -281 2820
1005 2820 -2651 -451 2664 -2588 598 2663 -3770 1325 3014 -4887 1477 3492 -4980 1780 3082
1020C082q052P127M77p753P999m94p718Q591j107p415Q481j186p183P828j040
1035A637n911P465k215n140P257k401n015P809k821n118Q019l039m708P784l387
1050B16l825P103m241k473P317m900k570P347m550k425O446m201j662N548l875
1065g45j047M415l708l84L511k859m94K790j835l72J172m53k43k48R08l3j581
1082a206K300m45k310K972m83l801N208j568m596O876k131n214P697k617n648
1097d966R281m017n554J0503n290n971J2321o799n996J4026q616n776J5155r812
1111a511n656J6672j1933m948J7842j3640m455J9145j5567l510J9918j7635k427
1124g705K1261j9723j316K2176k2221M48K2377k3840K000K2367k5681M052K2262
$$ plain form
1020 3082 -4970 2157 2634 -5119 2880 2386 -5332 3259 2152 -5263 3218 2032 -5151 2677 1637
1035 1637 -4274 3191 976 -4164 3093 692 -4323 3486 665 -4453 3566 527 -4181 3603 216
1050 216 -3609 3494 -747 -3220 4097 -803 -3373 3974 -576 -3001 3445 -756 -2418 3130 -745
1065 -745 -1792 2623 -1085 -1469 2042 -817 -1311 1479 -356 -728 444 -9 -252 -500 408 375 -1206
1082 -1206 1094 649 -1661 1311 828 -2973 2235 667 -3929 2947 816 -4398 3299 682 -4966
1097 -4966 4315 298 -5256 5247 -43 -6014 6307 -492 -6488 7538 -1078 -6854 8301 -1511
1111 -1511 -7167 9505 -2428 -7376 10466 -3174 -7629 11516 -4051 -7561 12357 -5278 -7705
1124 -7705 13556 -6167 -7483 14693 -7528 -7080 15297 -8543 -6543 15824 -9857 -5805 16457
1137A6457k7481N840K2142k9286Q306K1397l0795R992K0459l1840J2989J8985
1149A7165l3210J4931J8147l3842J7074J6722l4520J8519J5496l5062K1098J3742
1161A6260l5601K3043J1868l5426K5037R740l5425K6777P672l4954K8676N274
1173A2941l3912K9620L466l3129L0923P04l1439L1763j237l0299L2286l423k8325
1186b0061L2743n621k6371L2391p516k4106L2353r435k2112L1878j0777k0230
1198a6864L1011j2252j7769L0409j3839j5197K8696j4537j2860K7135j4963j1057
1210a2087K5579j5636q652K3775j5620p173K2142j5576n452J9950j4659l889J7883
1223A0585j4427k332J5804j3801r62J4027j3213J55J1923j1842J072R760j0519
$$ plain form
1137 16457 -11024 -5184 16958 -12328 -4022 17375 -13420 -3428 17031 -14809 -1820 17165
1149 17165 -16045 -1114 17033 -16809 265 16987 -17533 986 16482 -18580 2518 16260
1161 16260 -19341 3702 15570 -19856 5181 14921 -20504 6273 13945 -21009 7667 12941
1173 12941 -20971 8649 12115 -21014 9909 10613 -20826 10937 9700 -20599 11687 8264 -20061
1186 -20061 12682 7061 -19310 13081 5565 -18541 13812 4377 -17735 14143 3366 -16864
1198 -16864 14147 1895 -15874 14535 696 -14501 14195 -342 -13202 13933 -1030 -12087
1210 -12087 13492 -2144 -10796 12979 -2641 -9814 12328 -3248 -8700 11250 -3409 -7298 10585
1223 10585 -3842 -6174 9630 -4171 -5133 8894 -4319 -4164 7759 -4083 -3011 6749 -3770
1236c770J572P939r131J899N790p427K388M257n917J637L060l859J251J431j922
1251h02P57K92j42k63j33J045j098q04L143k750j292M853l408k118O264m541k109
1268c106Q012o225k236R083p454j986J0009q622j462J0937r986j120J1860j1348
1282c644k42J1691j2293R12J2147j3903K110J2063j4731L159J1566j5793M577
1295b381J1696j6756N707J0999j7683P291J0822j8384Q466R683j9537J0248R792
1308I963k0323J1189Q523j9954J1887P653j9893J3216O649k0044J3922N611j9958
1321a1559J4671N189j9973J5557L555j8688J5784K079j7969J6729N80j7130J6695
1334E520m33j6127J6979j299j5306J7231k988j4127J7849m280j3344J7913n285
$$ plain form
1236 -3770 -2198 5741 -3390 -1491 4299 -3128 -740 3517 -2400 -763 2297 -1562 -311 1120 -802
1251 -802 -45 247 105 -158 -291 754 -344 -1148 1995 -755 -2047 2806 -602 -2720 3544 -997 -3106
1268 -3106 4906 -1319 -3555 5528 -1926 -3912 6097 -2525 -3987 6950 -3036 -4156 7704 -3644
1282 -3644 -3886 7805 -4488 -3576 8571 -5332 -3222 8841 -5890 -2731 8835 -6958 -2381
1295 -2381 9315 -7441 -1734 9265 -8418 -1127 9695 -8689 -223 9460 -10077 171 9963
1308 9963 -10360 829 9352 -10602 1285 8938 -10955 2261 8910 -11134 2788 8399 -11559
1321 -11559 3112 8301 -11672 3885 7440 -11248 4536 6615 -11354 5375 5955 -11175 5520
1334 5520 5087 -11040 5939 4640 -10666 6565 3577 -10550 7299 3019 -10325 7588 2303
1347B303j2533J8062n848j1638J7676o699j0573J7444p672r518J7600q454q752
1360h602J7193q776q016J6695r416o334J5880j0312n109J5100j0518m121J4824
1373H488j1120l041J4233j2203j493J3926j2431q48J2926j2630O2J2614j3221
1386d738J063J2488j3932J917J1813j3971K479J1154j3978L322J0436j4157M252
1399a852R846j4340M654R582j4407N393Q720j4342O156Q068j4584P001P365j4790
1413g530Q106O296j4629Q992N320j4557R558M588j4319J0214L708j3786J0491
1426B452K690j3185J0962J857j3014J1836J204j3079J2257J62j2297J2565q99
1439C511j1589J2709j491j1077J3182k354j0845J3490l273r909J3398m218r169
$$ plain form
1347 2303 -10230 7832 1984 -9654 8022 1323 -9250 8194 522 -8996 8604 150 -8602
1360 -8602 8591 -185 -8201 8494 -922 -7256 8624 -1688 -6797 8303 -2215 -6336 8488
1373 8488 -2632 -5673 8560 -3643 -5136 8790 -3641 -4489 8437 -4193 -4131 8483 -4738
1386 -4738 -3675 8813 -5119 -3202 8611 -5360 -2881 8273 -5705 -2383 8053 -6104 -1852
1399 -1852 7994 -6346 -1692 7890 -6517 -1124 7596 -6746 -590 7478 -7106 -105 7260 -7530
1413 -7530 576 6872 -7757 1235 6555 -8002 1556 6144 -8175 2039 5747 -8039 2452
1426 2452 5142 -8043 2919 4776 -8238 3598 4802 -8277 3980 4142 -8155 4410 3511
1439 3511 -8078 4631 3140 -7937 5245 2891 -7954 5536 2263 -7646 5752 1534 -7635
1452g635J3556m602q450J3456n823p230J3587p059o410J3275p146n821J3202p876
1466i76n006J2890q388l754J1891q333l010J1005q279k331J0336q280j550R497
1480E712q036p25Q621p919j54P462p464J49P031p132M37O431p128R35N692o495
1496b583J261M713n714J510L796m989J542K945m568K021K227l640J085J922k408
1511h80N94J037j358O94K14l86J6p0L99l07o32J761j303r76K905j975j212L645
1529B166k690j249M236l425q45M994m797k36N628n847M30N762o579L17O462o976
1545b649R68O415q032J867O579r200L090O548j0130L603O841j0839L988O609j0932
1560e274M845O350j2007O398N949j2981P286N829j3850Q544N182j3746Q936M799
$$ plain form
1452 -7635 5921 1319 -7131 6325 502 -6728 6859 -200 -6610 6665 -481 -6302 6900 -976
1466 -976 -5982 6908 -1480 -5234 6657 -1676 -4686 6319 -1960 -4291 6045 -2235 -3785 5712
1480 5712 -2324 -3049 5572 -2347 -2501 4961 -2503 -2354 4677 -2455 -2018 4413 -2715 -1780 3912 -2583
1496 -2583 -1322 3391 -2323 -813 2983 -2006 -464 2481 -2087 -66 2161 -1479 -394 1528 -880
1511 -880 -286 751 -607 87 301 -85 -69 -139 260 -47 -679 1082 -221 -1197 1708 -267 -1479 2166
1529 2166 -524 -1773 2463 -962 -1807 3187 -1610 -1846 3782 -2065 -1635 4127 -2452 -2135 4327 -2649
1545 -2649 -1681 4734 -3298 -1431 5148 -4052 -962 5586 -4544 -941 5900 -4939 -951 5658 -5274
1560 -5274 -429 5921 -6086 312 6261 -6720 566 6395 -7455 1089 6271 -7475 1461 6260
1574F260j4167J0117L191j3720J0999K849j4518J2283K249j4265J2378J375j3505
1587h474J2376N74j2743J2778p60j2243J3462j646j1924J3890k022j1610J3405
1600E063k493j0275J3166l413r394J3128m311q649J3327n123q041J2984n572o489
1614f092J2322o168n654J1518o684m558J1133p034l559J0747p426l035J0051p035
1628a474k306Q952o758j420Q084p032o97P476o879l01O550n974j97N613n152M5
1644a470M560n158R79L656m313J177K867l940J093K272l009R93J644k397Q84Q14
1660F52j373Q64J96j043N71K17k9k65QP57q15m22J736j335o21K185j834n89K829
1679A689k722j75L439l668K12M155m293k73M921n288R9N436n600M91N465o270
$$ plain form
1574 6260 -7907 2210 5401 -8319 2680 5529 -8989 3294 5543 -8722 3656 5031 -8474
1587 -8474 3902 4476 -8267 4511 3751 -8492 4970 3324 -8600 5290 3268 -8342 5063
1600 5063 2570 -7705 5461 2048 -7346 5782 1471 -7178 6149 1026 -7015 5969 397 -6092
1614 -6092 6230 62 -5592 5926 -758 -5316 5817 -1217 -4776 5971 -1455 -4490 5561 -1474
1628 -1474 -3780 5172 -1586 -3006 5078 -1954 -2651 4825 -2054 -2355 4195 -1779 -1976 3637 -1515 -1470
1644 -1470 3090 -2068 -1089 2567 -1746 -569 2298 -1642 -549 1723 -1286 -293 1351 -1046 -162 652
1660 652 -721 143 339 -704 -133 84 55 -210 -202 555 -260 -682 1054 -281 -902 1283 -551 -1140 1689
1679 1689 -1033 -1208 2231 -1437 -1225 2930 -1363 -1636 3285 -2003 -1904 3532 -2068 -1577 3888 -2382
1695b382O41O046p296J532N828p863J990O293q395K394O078r015L048O255r545
1710d391L840N861j0104M384N684j0483N153N400j0773N613M957j0682O353M192
1724E004j1401P576L701j1327P983L151j1252Q595K513j1148R129J569j1039J0042
1738C096P33j0800J0351J53j0514J0716o91j0109J1316j574r550J1170j932r361
1752f996J1710k702q741J1711l791q002J2177m267p559J2090m918o907J1948n475
1766B78o231J1934o220n383J1751o855m577J1412p246l764J0935p417l285J0668
1780F000p958k202J0133q123j535R660q669o24R428q804j89Q713q788K87Q259
1795E588q700P50P746q705J667O905q582J666O588q125J706O166q015K570M970
$$ plain form
1695 -2382 -1741 4305 -2991 -1459 4369 -3494 -1504 4789 -3606 -1212 4866 -4149 -1101 5154 -4391
1710 -4391 -551 5310 -4794 -410 5274 -5209 -56 5344 -5429 184 5141 -5541 812 5004
1724 5004 -6397 1179 4880 -6447 1536 4687 -6565 2030 4543 -6605 2524 4093 -6946 3096
1738 3096 3829 -6971 3380 3533 -6981 3735 3044 -7065 4251 2677 -6873 4297 2365 -6996
1752 -6996 4714 2012 -6729 4982 1191 -6811 5366 1099 -6460 5630 712 -6195 5753 278
1766 278 -5953 5981 -239 -5622 6129 -726 -5303 6109 -1137 -4901 6034 -1383 -4668 6000
1780 6000 -1958 -4160 5973 -2150 -3685 5975 -2694 -3318 6110 -2694 -2883 5830 -2958 -2671 5588
1795 5588 -3112 -2362 5384 -3321 -1654 5251 -3331 -1665 4923 -3202 -1496 4670 -3345 -775 4195
$$ [...]
8191H8
##END NTUPLES=NMR FID
##END=
