##TITLE=1H_Pr 4989-27
 CCl4, 8 sc, 
 28.9.2020
##JCAMPDX= 6.0         $$ Bruker NMR JCAMP-DX V2.0
##DATA TYPE= NMR FID
##DATA CLASS= NTUPLES
##ORIGIN= UXNMR, Bruker Analytische Messtechnik GmbH
##OWNER= root
$$ XWIN-NMR		Version 3.5
$$ Mon Sep 28 11:08:46 2020 Russian Standard Time (UT+4h)  she@DPX200
##.OBSERVE FREQUENCY= 200.1315066352
##.OBSERVE NUCLEUS= ^1H
##.DELAY= (6, 6)
##.ACQUISITION MODE= SIMULTANEOUS
##.ACQUISITION SCHEME= undefined
##.AVERAGES= 8
##.DIGITISER RES= 18
##SPECTROMETER/DATA SYSTEM= spect
##.PULSE SEQUENCE= zg30
##.SOLVENT NAME= CDCl3
##.SHIFT REFERENCE= (INTERNAL, CDCl3, 0, 15.7039)
##AUDIT TRAIL= $$ (NUMBER, WHEN, WHO, WHERE, WHAT)
$$ ##TITLE= Audit trail, XWIN-NMR		Version 3.5
$$ ##JCAMPDX= 5.01
$$ ##ORIGIN= Bruker BioSpin GmbH
$$ ##OWNER= she
$$ F:/spectra/data/she/nmr/H-F/1/audita.txt
$$ ##AUDIT TRAIL=  $$ (NUMBER, WHEN, WHO, WHERE, WHAT)
(   1,<2020-09-28 11:07:55.32 +0400>,<she>,<DPX200>,
      <created by zg, POWCHK disabled, PULCHK disabled
       configuration hash MD5:
       00 E9 B6 7A A2 85 ED C7 34 08 36 98 17 FE 4E 26
       data hash MD5: 16K
       C5 EB 57 68 7B 98 7C 65 61 40 6C 40 84 48 13 D3>)
$$ ##END=
$$ 
$$ hash MD5
$$ 90 D3 E3 F0 CC EB 7E D5 04 E1 5E 73 96 31 C7 BF
##$RELAX= 
##$RELAX= 
##$RELAX= 
##$RELAX= 
##$RELAX= 
##$RELAX= 
$$ Bruker specific parameters
$$ --------------------------
##$DU= <F:/spectra>
##$EXPNO= 1
##$NAME= <H-F>
##$PROCNO= 1
##$TYPE= <nmr>
##$USER= <she>
##$AMP= (0..31)
100 100 100 100 100 100 100 100 100 100 100 100 100 100 100 100 100 100 
100 100 100 100 100 100 100 100 100 100 100 100 100 100 
##$AQSEQ= 0
##$AQ_mod= 1
##$AUNM= <au_zg>
##$AUTOPOS= <>
##$BF1= 200.13
##$BF2= 200.13
##$BF3= 200.13
##$BF4= 200.13
##$BF5= 200.13
##$BF6= 200.13
##$BF7= 200.13
##$BF8= 200.13
##$BYTORDA= 1
##$CFDGTYP= 0
##$CFRGTYP= 5
##$CHEMSTR= <none>
##$CNST= (0..31)
1 1 145 1 1 1 1 1 1 1 1 1 1 1 1 1 1 1 1 1 1 1 1 1 1 1 1 1 1 1 1 1 
##$CPDPRG= <>
##$CPDPRG1= <>
##$CPDPRG2= <>
##$CPDPRG3= <>
##$CPDPRG4= <mlev>
##$CPDPRG5= <mlev>
##$CPDPRG6= <mlev>
##$CPDPRG7= <mlev>
##$CPDPRG8= <mlev>
##$CPDPRGB= <>
##$CPDPRGT= <>
##$D= (0..31)
0 1.2 0 0 0 0 0 0 0 0.06 0 0.03 0 0 0 0 0.0002 0 0 0 0 0 0 0 0 0 0 0 0 
0 0 0 
##$DATE= 1601276874
##$DBL= (0..7)
120 120 120 120 120 120 120 120 
##$DBP= (0..7)
150 150 150 150 150 150 150 150 
##$DBP07= 0
##$DBPNAM0= <>
##$DBPNAM1= <>
##$DBPNAM2= <>
##$DBPNAM3= <>
##$DBPNAM4= <>
##$DBPNAM5= <>
##$DBPNAM6= <>
##$DBPNAM7= <>
##$DBPOAL= (0..7)
0.5 0.5 0.5 0.5 0.5 0.5 0.5 0.5 
##$DBPOFFS= (0..7)
0 0 0 0 0 0 0 0 
##$DE= 6
##$DECBNUC= <off>
##$DECIM= 32
##$DECNUC= <off>
##$DECSTAT= 4
##$DIGMOD= 1
##$DIGTYP= 9
##$DL= (0..7)
0 120 120 120 120 120 120 120 
##$DP= (0..7)
150 150 150 150 150 150 150 150 
##$DP07= 0
##$DPNAME0= <>
##$DPNAME1= <>
##$DPNAME2= <>
##$DPNAME3= <>
##$DPNAME4= <>
##$DPNAME5= <>
##$DPNAME6= <>
##$DPNAME7= <>
##$DPOAL= (0..7)
0.5 0.5 0.5 0.5 0.5 0.5 0.5 0.5 
##$DPOFFS= (0..7)
0 0 0 0 0 0 0 0 
##$DQDMODE= 0
##$DR= 18
##$DS= 0
##$DSLIST= <SSSSSSSSSSSSSSS>
$$ [...]
##$SUBNAM2= <"">
##$SUBNAM3= <"">
##$SUBNAM4= <"">
##$SUBNAM5= <"">
##$SUBNAM6= <"">
##$SUBNAM7= <"">
##$SUBNAM8= <"">
##$SUBNAM9= <"">
##$SW= 16.880792210976
##$SWIBOX= (0..15)
0 0 2 0 0 0 0 0 0 0 0 0 0 0 0 0 
##$SW_h= 3378.37837837838
##$TD= 16384
##$TD0= 1
##$TE= 0
##$TE2= 300
##$TE3= 300
##$TEG= 300
##$TL= (0..7)
0 120 120 120 120 120 120 120 
##$TP= (0..7)
150 150 150 150 150 150 150 150 
##$TP07= 0
##$TPNAME0= <>
##$TPNAME1= <>
##$TPNAME2= <>
##$TPNAME3= <>
##$TPNAME4= <>
##$TPNAME5= <>
##$TPNAME6= <>
##$TPNAME7= <>
##$TPOAL= (0..7)
0.5 0.5 0.5 0.5 0.5 0.5 0.5 0.5 
##$TPOFFS= (0..7)
0 0 0 0 0 0 0 0 
##$TUNHIN= 0
##$TUNHOUT= 0
##$TUNXOUT= 0
##$USERA1= <user>
##$USERA2= <user>
##$USERA3= <user>
##$USERA4= <user>
##$USERA5= <user>
##$V9= 5
##$VALIST= <valist>
##$VCLIST= <CCCCCCCCCCCCCCC>
##$VD= 0
##$VDLIST= <DDDDDDDDDDDDDDD>
##$VPLIST= <PPPPPPPPPPPPPPP>
##$VTLIST= <TTTTTTTTTTTTTTT>
##$WBST= 1024
##$WBSW= 4
##$XGAIN= (0..3)
0 0 0 0 
##$XL= 0
##$YL= 0
##$YMAX_a= 547202
##$YMIN_a= -502208
##$ZGOPTNS= <>
##$ZL1= 120
##$ZL2= 120
##$ZL3= 120
##$ZL4= 120
##$ABSF1= 10
##$ABSF2= 0
##$ABSG= 5
##$ABSL= 3
##$ALPHA= 0
##$AQORDER= 0
##$ASSFAC= 0
##$ASSFACI= 0
##$ASSFACX= 0
##$ASSWID= 0
##$AUNMP= <proc_1d>
##$AZFE= 0.1
##$AZFW= 0.1
##$BCFW= 1
##$BC_mod= 2
##$BYTORDP= 1
##$COROFFS= 0
##$CY= 11.3945322036743
##$DATMOD= 1
##$DC= 2
##$DFILT= <>
##$DTYPP= 0
##$F1P= 16.9975609425685
##$F2P= -3.02152046262296
##$FCOR= 0.5
##$FTSIZE= 0
##$FT_mod= 4
##$GAMMA= 1
##$GB= 0.15
##$INTBC= 1
##$INTSCL= 1
##$ISEN= 128
##$LB= 0.24
##$LEV0= 0
##$LPBIN= 0
##$MAXI= 10000
##$MC2= 0
##$MEAN= 0
##$ME_mod= 0
##$MI= 1.114404
##$NCOEF= 0
##$NC_proc= 0
##$NLEV= 6
##$NOISF1= 3.799351
##$NOISF2= 2.8
##$NSP= 1
##$NTH_PI= 0
##$NZP= 0
##$OFFSET= 15.70392
##$PC= 1
##$PHC0= -9966.374
##$PHC1= 8.6009
##$PH_mod= 1
##$PKNL= yes
##$PPARMOD= 0
##$PSCAL= 0
##$PSIGN= 0
##$REVERSE= no
##$SF= 200.130013532006
##$SI= 16384
##$SIGF1= 3
##$SIGF2= 2
##$SINO= 400
##$SIOLD= 16384
##$SREGLST= <1H.CDCl3>
##$SSB= 0
##$STSI= 0
##$STSR= 0
##$SW_p= 3612.71676300578
##$SYMM= 0
##$S_DEV= 0
##$TDeff= 0
##$TDoff= 0
##$TI= <>
##$TILT= no
##$TM1= 0
##$TM2= 0
##$TOPLEV= 0
##$USERP1= <user>
##$USERP2= <user>
##$USERP3= <user>
##$USERP4= <user>
##$USERP5= <user>
##$WDW= 1
##$XDIM= 8192
##$YMAX_p= 0
##$YMIN_p= 0
$$ End of Bruker specific parameters
$$ ---------------------------------
##NTUPLES= NMR FID
##VAR_NAME=  TIME,          FID/REAL,        FID/IMAG
##SYMBOL=    X,             R,               I
##VAR_TYPE=  INDEPENDENT,   DEPENDENT,       DEPENDENT
##VAR_FORM=  AFFN,          ASDF,            ASDF
##VAR_DIM=   8192,          8192,            8192
##UNITS=     SECONDS,       ARBITRARY UNITS, ARBITRARY UNITS
##FACTOR=    0.000296,      1,               1
##FIRST=     0,             0,               0
##LAST=      2.424536,      0,               0
##MIN=       0,             -502208,         0
##MAX=       2.424536,      547202,          0
$$ Real data points
##PAGE= N=1
##DATA TABLE= (X++(R..R)), XYDATA
0@%%%%%%%%%%%%%%Qj6J6j6J6j6K4l2L8m6N2o0P2q8J04j20J39j61J87k17K49k84
36a51L22l64M13m67N25n89O59p37Q22r18J023j133J255j390J538j703J882k075
54a088K291k531K796l094L429l807M238m734N317o008O826p801Q931r999R492
69D258p441M85524o83945j06758Q55564q22354K4733P63026p86075M7624P35382
80E09538q15701J18970O74795p95712J45017O36419q01182J99487N74608p76738
90c30499K33264N24309p70316K80570M63620p51106L11128M18669p29953L41127
100i187L64543p05816L61383L16741o77089L87738K65382o51821M05935K22167
110B79976o20889M18046J77297n86050M20852J35996n42292M23185R2672n01133
$$ plain form
0 0 0 0 0 0 0 0 0 0 0 0 0 0 0 0 8 -8 8 -8 8 -8 16 -16 22 -24 28 -32 40 -48 56 -64 75 -86 101 -116 133 -151
36 -151 171 -193 220 -247 278 -311 348 -389 433 -485 538 -595 660 -730 808 -895 987 -1088
54 -1088 1203 -1328 1468 -1626 1803 -2004 2234 -2500 2817 -3191 3635 -4166 4765 -5234 4258
69 4258 -3183 482341 -201604 -308362 547202 -275152 -250419 512607 -273468 -225844 509538
80 509538 -306163 -187193 487602 -308110 -163093 473326 -327856 -128369 446239 -330499
90 -330499 -97235 427074 -343242 -62672 400948 -350158 -39030 379639 -350314 -9187
100 -9187 355356 -350460 10923 327664 -349425 38313 303695 -348126 57809 279976
110 279976 -340913 77133 254430 -331620 89232 225228 -317064 106121 198793 -302340
120c02340M20384N4573m63091M16447K3630m22447M05441l712l83751L90225l0658
131A04701l40342L74786n5580l01800L57848p3153k66185L38679q6301k36321
141a83668L15760r2724k04241K93267j00729j76615K72800j06547j50767K50951
151A17487j10138j27481K30303j07390j04565K02184j05822q2650J78679j01228
161a0621o1036J54128r8310m4885J33679q9183l1688J10593q0868k0084Q9372
172E1097o8882q747O9376n9738j891N1716m9324K420L8867l6809L851K5470k5970
185h564L028J4884j3481K289M911m618J219k482P644l007q852J5210q180j3920
199a3919K6743j1029j8497L4449j7127k1012M1148k1735k1773M7762k7701k1596
$$ plain form
120 -302340 118044 172617 -290474 125973 149603 -272844 132597 128885 -254866 135359 104701
131 104701 -235641 139145 83565 -218235 139613 66460 -199725 138954 52653 -183668
141 -183668 132092 39368 -164873 128394 27665 -148950 123850 17303 -133464 117487
151 117487 7349 -120132 110171 2781 -101784 100400 -5422 -88072 90607 -10621
161 -10621 -71657 82471 -15839 -60724 72955 -16228 -47916 62677 -18191 -38275 51097
172 51097 -17785 -26532 42844 -16894 -18785 32931 -16393 -13973 24894 -11915 -8064 17406 -8564
185 -8564 -5536 9348 -4133 -1844 3067 -1551 -332 -2814 4830 1823 -7029 8181 1 -13919
199 -13919 12824 1795 -16702 17747 620 -20392 20756 -979 -22752 25010 -2691 -24287
211b4287N3132l3014k1257N7759l9044k0190O1301m4303j6740O4394m8942j3580
223b4771O3905n5156q892O5227n8261m247O4847o3345j73O3996o7005M607O2523
236D3255o9675R342O0806p1735J3965N7454p4296J8745N4925p5901K3933N1865
248D2683p6960K7554M8558p7273L0677M3852p6122L4972M0656p5506L8269L5458
260C6818p5925M1746L2253p4182M4783K7883p2383M7102K3199p0608M9301J8070
272B8057o8107N2863J4142o6775N4399J0357o4180N5729N672o2020N7400J870
284A9407n7369O0248m597n6863O1043p495n2894O3309j1334n1050O3021j4957
296A0469m6758O4804j9918m5058O4924k3117m1028O7047k6344l9907O6053k9266
$$ plain form
211 -24287 28845 -4169 -25426 32333 -6711 -26901 34400 -9903 -26643 37751 -11191 -24771
223 -24771 39134 -16022 -24914 40313 -17948 -22195 42652 -20693 -20866 43130 -23875 -19268 43255
236 43255 -26420 -17078 43728 -28007 -14042 43412 -30884 -12139 42786 -33115 -9182 42683
248 42683 -34277 -6723 41835 -35438 -4761 39091 -37031 -2059 38597 -36909 1360 36818
260 36818 -39107 2639 34892 -39290 5493 33376 -39007 8095 31294 -39314 9987 28057
272 28057 -40050 12813 26955 -39820 14579 24936 -39244 16485 22157 -39863 17537 19407
284 19407 -37962 22286 17689 -39174 21869 14374 -38520 24789 13455 -37595 25426 10469
296 10469 -36289 28515 8597 -36461 28463 5346 -35682 31365 5021 -34886 31167 1901
308A901l5844O5733l1760l1779O5243l5681k8151O4549l9373k5004O5324m1165
320f007k1664O2372m3825j6857O1689m6116j2791N8719n0159q100N9929n2040
332a4850n113N6768n4733j747N5531n4600K733N2345n7167N793N1114n8699R617
345a3008M8799n9256J1867M5862n8072J4297M2791n7567J7505L7828n7231K0769
357e416L5653n6026K3351L1179n5230K5143K7440n2169K7507K2367n0388L0497
369C908J8538m8828L2140J4532m7383L3838J2284m5233L4204R104m2775L5677
381A0006N494m0938L5680L412l8250L6715R54l6757L4662l50l3194L4430j975
394I889l0781L2601m234k6690L1783n890k4739K9415o545k0822K7666q025j7879
$$ plain form
308 1901 -33943 31790 30 -31749 33494 -2187 -30338 34211 -5162 -30166 35158 -6007
320 -6007 -27671 34701 -9124 -25981 35708 -10408 -23199 35520 -14639 -22739 37190 -14850
332 -14850 -19963 36805 -17928 -19675 35856 -18744 -16011 36334 -20833 -15040 36074 -22625 -13008
345 -13008 35791 -23465 -11598 34264 -23808 -9511 33280 -24287 -6782 31046 -26185 -5416
357 -5416 30237 -25789 -2438 28741 -26489 -1346 26094 -26075 1432 23799 -26589 3908
369 3908 22446 -26382 5758 20290 -27093 6745 19029 -26204 8000 17104 -25671 10006
381 10006 15500 -25438 10242 13654 -24596 12119 13073 -23684 10978 10628 -22566 11864 9889
394 9889 -20892 11709 7475 -19215 12568 6678 -18061 11354 4809 -16013 11653 3628 -14251
407a4251K5222q464j4699K2497j0009j1908K2003r501j0099J9279j1057q258J8545
420I300j0155o676J6998j1792m936J6764j1851l659J5129j2504k958J4822j1864
433c382k088J4568j2013j691J2599j2588k42J3300j1731J79J1018j2667N17J1922
447G701j1755J630R850j3085K822J0401j2084L496Q621j4410M827R324j3338N814
461a86Q259j6025P135R239j6422Q211Q789j9160J0726J0033k2052J2682R636k4140
475a3275J5753R603k7577J8656R233k9542K3015P927l3515K6089O532l4465L1557
488I991L665l7628L5119J041l7521L9845k737l9033M3244n407l8889M7860r561
501I989m0552N2216j3204m0469N6797j6950m1332O1403k1969m1564O6348k6375
$$ plain form
407 -14251 10971 2507 -12192 10305 296 -11612 10391 890 -9209 10070 -987 -9245 9300
420 9300 -855 -7531 9467 -2325 -7261 9503 -2348 -6007 9122 -3382 -6340 8482 -3382
433 -3382 -5470 9098 -2915 -4606 7993 -4595 -4837 8463 -3268 -3089 7929 -4738 -4221 7701
447 7701 -4054 -2424 7426 -5659 -2837 7564 -4520 -1024 7597 -6813 -1986 7338 -6000 -186
461 -186 8073 -7952 -817 8422 -8000 211 9000 -10160 566 10599 -11453 1229 10865 -13275
475 -13275 2478 12081 -15496 3160 12393 -17149 5866 13793 -19722 6367 12899 -21566 9991
488 9991 13656 -23972 11147 12188 -25333 14512 11775 -27258 15986 10579 -28310 19550 9989
501 9989 -30563 21653 8449 -32020 24777 7827 -33505 27898 5929 -35635 30713 4338
513D338m1922P2150l2011m1695P7321l7849m0439Q2061m4557l8813Q6892n0922
525e446l5385R0293n8610l2047R3777o6154k6294R5768p3546k0990R7010q0656
537b2280j3681R7024q7732p624R6533r3363k34R6195j00218O821R4796j06643
549d0406J4252R4022j11937K1211R2007j17563K8405R0124j22249L5542Q7348
560G0756j27311M3258Q4146j31492N1793Q0064j35704N9315P4975j38231O8557
571A26O9104j40681P6577O1668j42016Q5902N4166j42672R3741M6292j42840J02299
583B1666L7351j41792J09852K7799j39458J17250J8429j37146J23933R811j35051
594h7356J29567J324j31069J34266p241j26803J38348j5854j22543J42484k4144
$$ plain form
513 4338 -37584 34566 2555 -39140 38181 332 -40107 41954 -2603 -41416 45476 -5446
525 -5446 -40831 49462 -9148 -41195 52582 -13572 -39866 55902 -17644 -38634 58376 -22280
537 -22280 -35961 61063 -26669 -34293 62240 -31123 -31357 64838 -35380 -28559 66237 -40406
549 -40406 -26154 67868 -44069 -22858 69149 -48414 -20009 70115 -52134 -16592 70756
560 70756 -56555 -13297 70849 -60643 -8850 71214 -64490 -5175 69800 -68431 126
571 126 69230 -71451 5126 66794 -75222 10680 64846 -77826 15915 62207 -80633 21666
583 21666 59017 -82775 27077 54876 -84582 32668 51097 -86049 37884 47695 -87356
594 -87356 42211 43535 -87534 46732 39491 -87312 51036 35182 -87361 55123 30979
605C0979j18170J45889l1961j12926J48680m0635j06529J50669m9800r8965J52525
616F9756n9194r0954J53447o8190q2494J53243p6297p3638J52248q4706o3781
627g0560J50561r2531n3461J47514r9856m4075J44997j05650l5366J41445j10302
638b7284k6778J36170j13542j7737J31276j18102q557J25973j21249l3J20233
649H0370j23057P129J13541j23523J5314J06413j24461K3208R8548j25046L1459
660b0105R1762j24746L7493Q4319j24179M4352P6758j21919N0276O7946j20177
671e8220N6543O0570j17717O1368N3270j14844O4316M6506j09839O6927L8497
682D7377j04391O9254L0357r8481P0750K4242r3383P1430J8317q7602P0350J2800
$$ plain form
605 30979 -87191 58698 26737 -86189 62491 21856 -84673 65996 16196 -82769 69756
616 69756 10562 -80392 73055 4865 -77629 75614 -683 -74321 77927 -6779 -70560
627 -70560 80001 -12530 -65991 81523 -18333 -62408 82589 -23061 -58427 83018 -27284
638 -27284 -54062 82108 -31434 -49171 82105 -35997 -44554 81419 -39830 -39863 80370
649 80370 -42687 -35558 77983 -45540 -30226 76187 -48274 -25066 73482 -51564 -20105
660 -20105 71657 -53089 -15596 68723 -55456 -11104 65654 -56265 -5989 61957 -58220
671 -58220 -1677 58893 -58824 2544 55814 -59030 5286 51792 -58047 8880 47377
682 47377 -57014 12240 42597 -55884 14866 39108 -54275 17155 35472 -52130 18220 31020
694C1020q0024O9223O466p2857O7531K80o5056O6856m309o0016O4161q590n2221
707c7536O1609j2492m5703N7434j5746l8063N4668j8573l3503N0614j9853k7718
719b4862M6859k0182k2850M0832k0498j6883L5889k0376j2517L0883j8913r196
731a1814K5607j6107p161J9856j2684l795J3810j0073r57Q128o488M17L230k774
745h05J073j340K265R81p153P620J080j1381J2082K93j5335J7074j366j8141K2075
760I022m259k0454K7471o904k3266L2970j0258k5103L8218j3788k5784M2282j8318
773A829k5446M7502k3475k5759N1960k8232k4896N6394l3066k4373N9640l7645
785e567k1945O2624m3325j9400O4707m8263j5726O6968n3880j2930O8359n8302
$$ plain form
694 31020 -49004 20219 26685 -46172 21359 21639 -43417 23439 19130 -40886 23275 14685 -37536
707 -37536 24073 11581 -34122 23312 7566 -30497 24171 5598 -27905 22709 2856 -24862
719 -24862 21997 1815 -21035 19797 -701 -17584 18305 -2071 -14588 16295 -2618 -11814
731 -11814 13793 -2314 -9475 10381 -2303 -6098 7712 -2361 -3318 4810 -1678 -1261 1969 -805
745 -805 268 -1072 1193 2174 -4979 2641 3721 -7660 4422 4715 -10620 6454 5088 -13053 9022
760 9022 4763 -15691 11780 4876 -18390 14580 4322 -20781 17437 3649 -22135 20147 1829
773 1829 -23617 23885 410 -25349 26611 -1621 -26517 29877 -3189 -27562 32078 -5567
785 -5567 -27512 35112 -8213 -27613 37094 -11169 -26895 40073 -13807 -26737 41622 -16680
797a6680q652O8647o2537m802O8614o6745O5O8031p1685N391O7376p5473J0583
810a7867O5394p8919J6276O2522q1217K1110N9892q3676K7010N6399q6135L2389
822f822N2919q7341L7672M8743q8666M3122M4121q8347M7427L9111q8313N2017
834E643L4282q6799N6039K8851q6060O0068K3684q4513O3786J7850q1692O6680
846A7819J2715p9168O8904P037p5898P1172K066p2520P2470k858o8670P3872q061
859A8880o4963P4045j2022o0260P4347j6804n5932P3634k0951n1077P3404k4611
871G690m6641P1285k7764m1214O9997l0897l7108O7784l3735l1838O5921l5651
883b171k8221O3215l7496k3248O0691l9155j8643N7043m0282j4382N4013m1294
$$ plain form
797 -16680 -25332 43315 -19222 -24024 44590 -22155 -22090 45941 -25744 -20353 47023 -28450 -17867
810 -17867 47527 -31392 -15116 47406 -33811 -12701 47191 -36485 -9475 46924 -39211 -6822
822 -6822 46097 -41244 -3572 45171 -43495 -373 43748 -44599 2828 41939 -46374 5643
834 5643 39925 -46874 9165 38016 -48044 12024 35708 -48805 14981 32831 -48861 17819
846 17819 30534 -48634 20270 27307 -48591 22581 24647 -47873 24597 21739 -46931 26941 18880
859 18880 -46083 27962 15940 -44320 30027 13223 -42709 30925 9974 -41103 32301 7690
871 7690 -38951 32334 4570 -36644 33353 2456 -34652 33132 -603 -32441 33480 -2171
883 -2171 -30392 32823 -4673 -27921 32770 -6385 -25028 32015 -8267 -22649 31364 -9930
895i930j0390N1147m2299o844M7809m1686l643M4180m1424o43M0653m1485L107
908a1448L7429m0962N416L3788l9656P543L0635l8272R970K6397l6670J1782K3610
921A9562l5139J3098K0595l3961J4065J8539l1745J4313J5493k9215J4736J3212
933A3553k7376J5131J0906k5846J5253R567k4046J5174P300k1574J4661N479j9412
946a1230J5049L022j7480J5092J478j5873J4265M25j3340J2791n17j1104J1666
959D244j765r177J0991k492p679J0099k597o759Q655k361n172P097k535l574N768
974B743k507k408M677k674j413L699k402j151K696j542k84J377j225L30O56j459
990h87J012L53r07J140r18o9Q10j580J127J549l102J155J717l042K074J619m377
$$ plain form
895 -9930 -20320 30827 -11472 -18316 29493 -12193 -15836 28344 -13080 -13723 26930 -14555 -11448
908 -11448 25981 -14981 -9565 24223 -15433 -7890 22745 -15527 -5557 20840 -15830 -4048 19562
921 19562 -15577 -2479 18116 -15845 -1780 16759 -14986 -673 14820 -14395 341 13553
933 13553 -13823 1308 12214 -13632 1621 11188 -12858 2316 9616 -11958 2703 8182 -11230
946 -11230 3819 6841 -10639 4453 5931 -9942 4323 4748 -8592 4199 3682 -7422 4244
959 4244 2479 -6698 4293 1801 -5878 4221 1624 -5135 3520 1159 -4013 3084 549 -3025 2743
974 2743 236 -2172 2505 -169 -1582 2117 -285 -1436 1260 -282 -566 811 -414 -84 572 -887
990 -887 125 478 -429 711 -207 -276 534 -1046 81 1630 -1472 -317 1400 -1642 432 2051 -2326
1007b326K870J036n057N215K10n803O468q01o676P995j483o862R110k522o797
1022e423J0019m091n958J0620m589o754J1683m979o339J1340n176n749J0585n367
1036a78n214J1021o174m662J0801n965m312J0191o351l939R910o327k898R640
1050E543p095j946Q657p553j107Q868p885n33Q477q053O24P241q223J170O040
1065D225p383K192N320p457K328M139n835J919L369n171K078K087l164J964M57
1080A068j890Q04K13k8l1j029J803r99j533L916k567k349N613m167j897P433n219
1097h59k680Q407o968j625J0102q518k104J1272j0554q01J2809j2100r75J3833
1111I239j4316N35J5447j7071J441J6429j9304L071J7589k2306N158J8281k4856
$$ plain form
1007 -2326 544 1580 -3477 1738 1948 -3855 2613 1812 -4864 3131 1648 -5214 3896 1374 -5423
1022 -5423 4596 505 -5453 5167 578 -6176 5507 528 -5811 5529 353 -5396 5189 -178
1036 -178 -5392 5629 -545 -5207 5594 -371 -4683 5508 -843 -4782 5128 -1199 -4097 5543
1050 5543 -1552 -3498 5159 -2394 -3501 5367 -2518 -3051 5426 -2627 -2003 5238 -2985 -1815 4225
1065 4225 -3158 -966 4354 -3103 -775 3364 -2471 -552 2817 -2354 -276 1811 -1353 611 1068
1080 1068 -822 -18 195 167 136 -893 910 -89 -1622 2294 -273 -2622 2991 -1176 -3073 4360 -859
1097 -859 -3539 4868 -2100 -3725 6377 -2141 -4245 7027 -3527 -4328 8481 -3619 -4594 9239
1111 9239 -5077 -4542 10905 -6166 -4725 11704 -7600 -4529 13060 -9246 -4088 14193 -10663
1124a0663O987J8811k7330R095J9029k9853J1749J8861l2266J4404J8393l3999
1136a6782J6696J7704l6375J9993J6328l7346K2693J4532l8765K5533J2706l9431
1148b2514K8595J0846m0462L1193Q276m0778L4196O063m1121L6718L307m0958
1160b6639L9509N77m0474M1877k718l9753M3851n366l8471M5589q278l7372M6805
1173A9137j1107l5874M8501j4418l3487M9358j7517l1127M9227j9748k8915M9922
1185B3952k2983k5711M9239k5276k2749M9027k7799k0303M8010k9873j6385M6371
1197B5520l1191j3302M4391l2553j0447M2530l3245p683M0468l4138m331L8104
1209B4123l4466k100L5334l3986L15L2909l4088K748L0108l2905M145K7286l1848
$$ plain form
1124 -10663 -3676 15135 -12195 -3100 15929 -13924 -2175 16686 -15580 -1176 17217 -16782
1136 -16782 -86 17618 -18757 1236 17564 -19782 2911 17443 -21322 4211 16917 -22514
1148 -22514 6081 16927 -23535 7658 15934 -24844 9352 15415 -25706 11012 14319 -26639
1160 -26639 12870 13447 -27027 14850 12132 -27621 16230 10864 -27607 17982 9704 -27668 19137
1173 19137 8030 -27844 20657 6239 -27248 22110 4593 -26534 22693 2945 -25970 23952
1185 23952 969 -24742 24497 -779 -23528 25499 -2300 -22603 25407 -4466 -20851 25520
1197 25520 -5671 -18973 25418 -7135 -17582 24948 -8297 -15980 24488 -9650 -13981 24123
1209 24123 -10343 -12443 22891 -11095 -10780 22129 -11959 -9211 20897 -12008 -7863 19423 -12425
1222a2425N951K4421l0080P364K1535k8822Q540J8612k6877R834J5347k4701J0255
1235a046J2980k2701J0763J0272k0187J0344Q203j7817J0176O441j5403R625L937
1248E587j2733Q473L085r847P198J558p800N630J155n612M393P13l623K339K79
1263G95j391O89kL26j549M88K407l286P63L778n401J158N270p573K459O049r089
1280d109L109O840j1091M413P172j2519N903P283j4311P276P760j5470Q502P066
1294G824j6751R881O764j7126J1354N858j8111J3246M797j8727J4592M134j9662
1307a1927J6355K855j9434J7526J649j9696J8634O31j9850K0336r37j9339K0754
1320G557j890j9030K1448l229j8267K1870m455j6993K2469o250j6170K2620p123
$$ plain form
1222 -12425 -6474 17947 -12133 -4769 16766 -12056 -3516 15096 -11781 -1947 13400 -11301 -1046
1235 -1046 11934 -10767 -4 10268 -9919 425 8628 -9189 987 7428 -7975 1650 5587
1248 5587 -7146 1327 4412 -5435 1763 3321 -4479 1151 2306 -3306 1087 1800 -1823 516 795
1263 795 -596 93 91 417 -1132 -644 1763 -1523 -760 3018 -2383 -1225 4045 -3528 -1069 4980 -4109
1280 -4109 -1000 5840 -5251 -838 6334 -6185 -282 7001 -7310 -34 7726 -7744 758 7824
1294 7824 -8927 954 7718 -9408 1946 7804 -10307 2939 7736 -10991 3601 7735 -11927
1307 -11927 4428 7283 -12151 5375 7024 -12672 5962 6593 -13257 7079 6142 -13197 7557
1320 7557 5667 -13363 8085 4856 -13411 8459 4004 -12989 9480 3230 -12940 9680 2557
1333B557j5267K2879q358j3683K2462r842j2132K2182j0792j0923K2198j2157
1345h76r639K2241j3451q043K1426j3851o695K0526j4691n087K0042j5650m300
1358h048J9830j6160k808J8909j6312j935J7946j6786k28J6801j7098P18J6331
1371A1160j7663J803J5528j7389K888J4303j7841L900J3506j7491N108J2197j8014
1384h005O432J1123j7848P377J0410j8012Q024R698j7770Q651Q576j7460R566
1397G62P524j7687J0766O572j7300J1174N836j7098J1851M693j7047J3086L773
1410F905j6611J3443K437j6224J4366J439j5994J5211K54j5416J5765q25j4865
1423a0115J6121k239j4048J6977l320j3520J7386m210j2985J7343n253j2324J8175
$$ plain form
1333 2557 -12710 10169 1811 -11872 10590 748 -11384 10798 6 -10917 11281 -876
1345 -876 -10515 11726 -1725 -9768 11658 -2193 -8888 11638 -3053 -8140 11902 -3748 -8048
1358 -8048 11782 -4378 -7186 11723 -4589 -6524 11422 -5364 -5592 11209 -5889 -5171 11160
1371 11160 -6503 -4700 10828 -6561 -3673 10630 -7211 -3311 10195 -7296 -2188 10009 -8005
1384 -8005 -1573 9550 -8298 -921 9489 -8523 -499 9199 -8571 80 8656 -8804 762
1397 762 8286 -9401 1365 7937 -9363 1811 7647 -9451 2400 7093 -9954 3132 6905
1410 6905 -9706 3737 6174 -10050 4316 5755 -10239 4972 5226 -10190 5575 4750 -10115
1423 -10115 6006 3767 -10281 6696 3376 -10144 7242 3032 -9953 7390 2137 -10187 7988
1436G988o003j1822J8654p623j0756J8554q515r946J8699r457q942J9048j0881
1449a002p724J8903j2024o726J8836j2796n626J9061j4079m293J8734j5035l255
1462g026J7692j5143j534J6834j5605p47J6065j5977M79J5401j6349J486J4350
1475I926j5795K368J3208j5717K766J2046j5198L957J1276j5024M384R886j4593
1488f510N315Q856j4119N651P913j3569O352O600j2918O831N213j1796O782M805
1502E406j1404P047L638j0268O953K235q562O254J763p173N808J059o371N062
1516A447K20m605M344j13l439K917J20k304J968k79r43R97l52k35k0K66Q21j509
1534f99K05J726k621J018K443m096J607K801m843K152L174n882L339K984p369
$$ plain form
1436 7988 1985 -9837 8817 1194 -9562 8992 477 -9469 9230 -227 -9169 9879 -1002
1449 -1002 -8726 10177 -1847 -8573 10263 -2533 -8159 10902 -3177 -7470 11264 -3771 -7026
1462 -7026 10666 -4477 -6011 10823 -4782 -5529 10536 -5441 -4962 10439 -5910 -4424 9926
1475 9926 -5869 -3501 9707 -6010 -3244 8802 -6396 -2439 8837 -6187 -1803 8083 -6510
1488 -6510 -1195 7661 -6458 -807 7106 -6463 -111 6489 -6429 402 5615 -6181 601 5406
1502 5406 -5998 1049 4687 -5581 1372 3607 -4955 1299 3062 -4111 1697 2756 -3615 1447
1516 1447 1667 -2938 1406 1293 -2146 771 891 -1413 555 276 -667 330 -22 -257 -277 -11 810 -699
1534 -699 -494 1232 -1389 -371 2072 -2024 -417 2384 -2459 -307 2867 -3015 324 3308 -4061
1549d061M712L089q558N600L752r998O392L936j0776P613L096j1929R410K766
1563E044j2957J0660K407j3543J1865J713j4138J3013P69j4176J4093k76j4226
1576i752J5379j537j4090J6266k348j4222J7046l657j3291J7748m988j2874J8587
1589H267o223j2332J9064p626j1618J9897q615j0909J9771j0072r251J9367j0314
1602e94q839J9656j1600p421J9425j2559o432J8721j2644n429J8222j3603l654
1615f751J7023j4190k138J5994j4321j098J5999j5189k72J4641j4720R03J3472
1628I353j5120K688J1948j4881L390J1119j4499L714J0057j3729M117R035j2897
1641e705M774P532j2050M675O509j1099M932N712r755M194M787q508L927L815
$$ plain form
1549 -4061 651 3740 -4818 782 4534 -5464 928 4864 -5912 1701 4797 -7132 2278 5044
1563 5044 -7913 2747 5154 -8389 3476 5189 -8949 4064 4833 -9343 4750 4474 -9752
1576 -9752 5627 4090 -10000 6266 3918 -10304 6742 3085 -10206 7542 2554 -10320 8267
1589 8267 2044 -10288 8776 1150 -10468 9429 814 -10095 9676 -396 -9647 9720 -594
1602 -594 -9433 10223 -1377 -8798 10627 -1932 -8364 10357 -2287 -7716 10506 -3097 -6751
1615 -6751 10272 -3918 -6056 9938 -4383 -5481 10518 -4671 -4943 9698 -5022 -4119 9353
1628 9353 -5767 -3079 8869 -6012 -2622 8497 -6002 -2288 7769 -5960 -1843 7192 -5705
1641 -5705 -931 6601 -5449 -774 5735 -5364 -432 5280 -4475 -281 4506 -4002 -75 3740
1655C740p689M383K412o145L799J891n270L612J276m314K841Q53k667J805K18
1670G45j424J157k45o90Q73m24P0l35k5J250j868P23J696k862P72K980m155J137
1688f25K983m326J608L481n784K116M168o971L257M421q154L674M502r028M816
1703A38M649r944N457M331j0451O839M303j1765P767L835j2022Q729L124j2114
1717g124R562K438j2563J0908J038j2309J1772Q09j3100J2806j36j2939J3708
1730D870r60j2960J4731k344j2506J5606l508j2297J6208m445j2061J6989n258
1743B065j1437J7377o724j0652J7497p695r494J8248r193q658J8099r964p943
1756h474J7948j0714p166J8385j2207n640J8084j2870m988J7891j3452l789J7594
$$ plain form
1655 3740 -3949 434 2846 -3299 500 2391 -2879 733 2009 -2305 536 1389 -1278 527 745
1670 745 -679 478 233 -457 416 -8 62 -273 -298 952 -916 -193 1503 -1359 -587 2393 -1762 -625
1688 -625 2358 -1968 -360 3121 -2663 -547 3621 -3350 -93 4328 -3826 -152 4350 -4678 138
1703 138 4787 -5157 300 4631 -5820 1019 5322 -6443 1324 5159 -6863 1866 4990 -7124
1717 -7124 2438 4876 -7687 3221 4259 -8050 3722 4531 -8569 4237 4101 -8838 4870
1730 4870 3910 -9050 5681 3337 -9169 6437 2929 -9368 6840 2395 -9666 7323 2065
1743 2065 -9372 8005 1281 -9371 8126 431 -9063 9185 -8 -8666 9433 -531 -8474
1756 -8474 9474 -1240 -8406 9979 -2228 -7868 10216 -2654 -7642 10249 -3203 -6992 10602
1769A0602j4633k376J6795j5015j402J6378j5437m65J6037j6087R64J5084j6540
1782f095J933J4531j6627K635J3435j6460L683J2612j6842M941J1598j6693N640
1795a709J0567j6319O607R303j6274P468Q485j6221Q091P575j5503Q473O510j4986
1809g933Q992N592j4544R518M193j3722R628L773j2825R715K210j1803R939J554
1823D287j1158R719R26j0167R778k07r535R585o86q444R336r85q072R081j791
1838A667o734Q710k513n816Q012k377n327P666k428m716P012k973l621O517k811
1853B68l192N966k965k634M950k647k218M744k578j418L851k632q65L061k028
1868c37p03K492j761l44J507j062k41J139p89j19K91j51K3J88L0k29q6N24l06
$$ plain form
1769 10602 -4031 -6407 10388 -4627 -6029 10349 -5088 -5553 10484 -5603 -4639 10445 -6095
1782 -6095 -4162 10369 -6258 -3623 9812 -6648 -2965 9647 -7195 -2254 9344 -7349 -1709
1795 -1709 8858 -7461 -854 8449 -7825 -357 8128 -8093 -2 7573 -7930 543 7053 -7933
1809 -7933 1059 6651 -7893 1625 5818 -7904 1724 5497 -7328 2387 4597 -7206 2733 4287
1823 4287 -6871 2848 3774 -6393 3385 3178 -6357 3228 2542 -5902 3434 2449 -5623 3458 1667
1838 1667 -5067 3643 1130 -4686 3326 949 -4378 3288 860 -3856 3156 183 -3438 3079 268
1853 268 -2924 3042 77 -2557 2393 -254 -2472 2272 -306 -1724 2127 -505 -1370 1691 -337
1868 -337 -1040 1452 -309 -653 854 -208 -449 690 -99 -218 73 -78 -55 133 163 -66 -152 372 66
1887F6p96J337m48j131J804n49j356K283o64k393L027r77j757L265j763j651L388
1904A685j550k269M061j955j777M155k774j760M790l107j619N034l781j061M970
1919C042m141q63N094m296o79N194n081J5N223n473j4N521n519M28N124n613P12
1936a326M965n678P09M907n915J691M058n789J978L647n737J829L985o330K486
1951e20L898o235K922K711n905L274L041o186L466K196n527L528J652n111L374
1966E78J629n290L889J077m568L698Q81m634L616Q31m579L832L09l823L950l30
1982A066l414L604k82l022L182l03k637K843l48k686L180o96j805K393p07j771
1998a403K374p23j418K176q73j306J936r22o49J464o91r35J727p72p65J652p80
$$ plain form
1887 66 -730 607 159 -972 832 283 -1073 1210 546 -1847 1180 203 -1554 1711 -52 -1703 1685
1904 1685 135 -2134 1927 -28 -1805 2350 -424 -2184 2606 -501 -2120 2914 -867 -1928 3042
1919 3042 -1099 -1962 3132 -1164 -1843 3351 -1730 -1715 3508 -1965 -1979 3542 -1977 -1549 3575 -2038 -1326
1936 -1326 3639 -2039 -1330 3577 -2338 -647 3411 -2378 -400 3247 -2490 -661 3324 -3006 -520
1951 -520 3378 -2857 65 2776 -3129 145 3186 -3000 466 2662 -2865 663 2315 -2796 578
1966 578 2207 -3083 806 1883 -2685 1013 1894 -2740 876 1707 -2872 960 1269 -2554 1396 1066
1982 1066 -2348 1256 974 -2048 1134 831 -1806 1037 689 -1997 1183 487 -1318 1075 368 -1403
1998 -1403 971 248 -1170 1006 133 -1173 763 -159 -808 656 -35 -970 757 -15 -780 872 92
2015I2n31P42l42j10L37k51n3M18k57k4J02k80j1K86RJ94l48j04%Q6K83m1m32
2038b35M1K11k64O98o29m02Q32k57m16P25l43k16N93m61k44R75p59j97R78p88
2058a58l34J018n99l16R03l81o08Q37p46P9O86n40k70J099q63j69J035r10r3R18
2078E88j054K93P29r56K58Q16j148L72O67j287N90Q21j291O48O50j095L10Q58
2096G69j227M20O65j193O86N68j266Q02M59j341O03N69j174O60O10j155Q18M79
2114G52j630Q44O25j567J363K80j576J279J2j340J292M00j805J729j68j715K001
2131G76k81j496J696O7k000K016j01j992K129m40j528J967m03j572K306n37k164
2148a557K768q00j787K713j368j521K922r84j918L029j456j796L435j638j312
$$ plain form
2015 92 -439 303 -39 -149 188 -63 -116 302 45 21 123 -157 -168 118 127 321 -27 -131 -131 -45 238 197 -235
2038 -235 -194 17 -247 451 -178 -580 252 -5 -421 304 -39 -255 338 -123 -367 608 -151 -348 630 -158
2058 -158 -492 526 -73 -389 514 133 -475 362 -384 -305 381 -159 -429 670 -193 -362 673 -237 -330 588
2078 588 -466 -173 556 -400 -142 674 -474 -102 565 -722 -132 689 -602 46 696 -399 -89 769
2096 769 -458 -38 627 -566 120 688 -578 224 683 -658 -55 514 -660 0 610 -545 273 752
2114 752 -878 -34 591 -976 387 667 -909 370 382 -958 334 734 -1071 658 490 -1225 776
2131 776 495 -1001 695 762 -1238 778 677 -1315 814 374 -1154 813 410 -1162 1144 607 -1557
2148 -1557 1211 411 -1376 1337 -31 -1552 1370 386 -1532 1497 41 -1755 1680 42 -1270
2163a270L066k137r72K956j998q31K884k059r12K857j668j092K877k246n88K926
2179A793k525l33K883k457k48K658k368j99K465k636K50K371k621L45J996k481
2195a107Q92J493k251N93J628k329Q32J348k250Q22J317k061Q05J217j769M20
2211d00J179j445O19O27q73M11J49o56M15K03m05L20j43M19p53M46N03q49k41
2230d74J033j042J53J276j423k31J808j732L30J634k175L11K063k465L24K281
2246A671k996Q33K680m069J689K364m163J887K582m523J934K624n200K851K554
2261B718n627L032K603o088L817K747o903M535K395p497N392J974p852O274J901
2276C421q481P011J192q401P567P52q533P793O82q445Q558m55q743R597j014q651
$$ plain form
2163 -1270 1796 -341 -1313 1643 -355 -1186 1698 -361 -1273 1584 -84 -1176 1701 -545 -1133 1793
2179 1793 -732 -1065 1818 -639 -887 1771 -597 -796 1669 -967 -717 1654 -967 -622 1374 -1107
2195 -1107 -215 1278 -973 -380 1248 -1081 -249 1099 -1151 -329 988 -1073 -268 949 -820 -400
2211 -400 779 -666 -47 580 -293 118 267 -389 26 229 -176 144 1 420 -333 113 616 -233 -474
2230 -474 559 -483 -330 946 -477 -708 1100 -632 -302 1332 -843 -532 1531 -934 -610 1671
2246 1671 -1325 -492 2188 -1881 -192 2172 -1991 -104 2478 -2045 -111 2513 -2687 164 2718
2261 2718 -2909 123 2726 -3362 455 3202 -3701 834 3229 -4268 1124 3098 -4754 1520 3421
2276 3421 -5060 1951 3143 -5258 2309 3061 -5472 2321 3003 -5442 3116 2661 -6082 3515 2501 -6150
2292f150R944j578q616J0687k365q065J0688k903q090J1494l788p646J1939m729
2306H22p313J2482n481p010J2652o027o282J2992p192n687J2899p786n138J3027
2320F958q424m341J2998r128l379J2756r803k443J2311j0311j683J1900j0692
2333c281q92J1591j0920k58J1137j1568J075J0559j1980K085R673j1923K238R667
2347G203j2099L061Q774j2129L755Q206j2180M682P153j2178N272O600j2171N860
2361a91N982j1559O106M978j1232O628M231j1126P300L442j0722P798K530j0082
2375e917P740K239j0153Q001J680r432Q259Q27q956Q215M12q265Q154m87p710
2390e393Q295p93p227Q129j333o480P970j705n811P510k116n491P651k379n070
$$ plain form
2292 -6150 3794 2216 -6400 4287 1922 -6143 4545 1642 -6448 5046 1258 -6388 5551 822
2306 822 -6491 5991 510 -6500 6152 125 -6157 6835 -357 -6044 6855 -931 -6069 6958
2320 6958 -1466 -5807 7191 -1937 -5316 7440 -2363 -4806 7505 -2806 -4489 7411 -3281
2333 -3281 -4173 7418 -3502 -3760 7377 -4191 -3116 7443 -4537 -2452 7221 -4702 -2464 7203
2347 7203 -4896 -1835 6939 -5190 -1435 6771 -5409 -727 6426 -5752 -480 6120 -6051 -191
2361 -191 5791 -5768 338 5316 -5916 712 4943 -6183 1117 4559 -6163 1635 4165 -5917
2375 -5917 1823 4062 -6091 1910 3590 -5842 2417 3244 -5712 2503 2915 -5350 2804 2317 -5393
2390 -5393 2902 2109 -5118 3011 1678 -4802 3168 1463 -4348 3162 1046 -4445 3206 827 -4243
2405d243P931l315m556P754l195l999P225l733l473P217m120k881P085m312k494
2420c109O660m375k116O496m542j298N796m698r67N407m542p48N526m864p62N411
2436C275m793r4M695m700K65M359n069J016M030m806R57L698m917J059L869m892
2452b048J488K997m757J899K653m410K096K360m431K137K187m328K306J730m175
2467b296K488J510l626K260J143l151K319P69l384K249J328l303K296O58k753
2482a493J944P04k523K318k28k203K291j80j877J757j19j541J832l09j454J648
2498E67k43j117J321k43r75J180m70n41Q67k6o52N06k4j10P8p4k76K49K7K35p23
2519d44K43P71j209Q04L16j172P75Q43j910R93J072k283J747M98k791K606K34
$$ plain form
2405 -4243 3688 373 -4183 3571 376 -3623 3602 -131 -3604 3613 -507 -3388 3697 -615 -3109
2420 -3109 3551 -824 -2940 3556 -986 -2284 3512 -1186 -2153 3254 -1288 -2036 3490 -1374 -2136 3275
2436 3275 -1518 -1612 3083 -1617 -1352 3007 -2062 -1046 2984 -1822 -865 2833 -2084 -1025 2844 -2048
2452 -2048 -560 2437 -2320 -421 2232 -2178 -82 2278 -2153 -16 2171 -2157 149 1879 -2296
2467 -2296 192 1702 -1924 336 1479 -1672 647 1416 -1968 281 1609 -1694 602 1260 -1493
2482 -1493 451 1155 -1368 950 722 -1481 810 630 -1247 510 391 -1150 682 373 -1081 567
2498 567 324 -793 528 285 -690 490 20 -521 346 320 -332 174 150 40 118 44 -232 17 44 279 -444
2519 -444 -201 570 -639 165 481 -691 84 927 -983 10 1082 -1201 546 1044 -1747 859 1093
2536A093l069K831L36l352L505j11l594L613nl810M232m01m204M665n58m162N306
2553B315j423m073N518j439m254N990j977l957O179k542l779O429k849l818P305
2568C625l704l515P068l901l113P655m827k743P638n186k533P979n653j787P779
2583D782o131j716P739o507j053P859p548J91P393p376P2P265p718N29P278p990
2599b931R67O904q217J848O132q293K302N958q486K862N761q692L283M795q332
2614d139L904M418q508M343L790p911M733L092q158M854L215p677M763K683p568
2629d166N241J806o981N425J276o535N569R23o326N444J53n636N657k0n454N819
2645B195n66m828N141o70m389N051j165l435M546j151l309M597j445k809M137
$$ plain form
2536 1093 -1976 855 1191 -2161 1344 1233 -2361 1252 1247 -2563 1669 1268 -2936 1729 1171 -2991 2315
2553 2315 892 -3181 2337 898 -3356 2634 657 -3300 2879 337 -3442 2987 138 -3680 3625
2568 3625 -79 -3594 3474 -427 -3540 4115 -712 -3455 4183 -1003 -3536 4443 -1210 -2997 4782
2583 4782 -1349 -3065 4674 -1833 -2886 4973 -2575 -2384 5009 -2367 -2295 4970 -2748 -2219 5059 -2931
2599 -2931 -1964 4940 -3277 -1429 4703 -3590 -1288 4670 -3816 -954 4807 -3885 -602 4193 -4139
2614 -4139 -235 4183 -4325 18 3808 -4103 630 3722 -4436 418 3633 -4044 719 3402 -4166
2629 -4166 1075 2881 -4100 1325 2601 -3934 1635 2558 -3768 1676 1829 -3807 1850 1830 -3624 2195
2645 2195 1629 -3199 1942 1272 -3117 1934 769 -2666 1880 729 -2580 2017 572 -2237 1900
2660A900j660k274L728j647j964M023k167j700L450j854j285K880j662r53K638
2675A453j679o53K122j578m10J707j254l41J554j361M0J090j096Q9Q95j067Q1
2692d08R50r59K78M93p27J87L67l83L60m9k55K00o1k04L55o5j21K02k66J95P0
2713A59r0J01o8j57M0O0j17M10j31l76qJ31r3K71K4l00M2L55l26J95m5k56N4K46
2737A21j49J5QJ92k37K73j84l19O67l8o27P24J3r96P35J61j096J149j47q01J022
2758D86j95j283J596m49j046J729n82j450K338r35j474K595j314j376K584j253
2774b9j574K929j369j413L052j865j308L417k307j099L893k877q47L635l019p09
2790a490L954l440m75L886l501l92M018l862o5M089m308M37M025m705J054L798
$$ plain form
2660 1900 240 -2034 1694 47 -1917 2106 -61 -1761 1689 -165 -1450 1430 -232 -1185 1453
2675 1453 -226 -879 1243 -335 -745 962 -292 -633 921 -440 -400 690 -406 -317 578 -489 -408
2692 -408 542 -417 -139 354 -373 -186 181 -202 158 109 -146 54 -7 -211 144 79 -42 160 -106 89 159
2713 159 69 170 102 -55 -15 45 -72 338 207 -169 -177 -46 -139 132 156 -144 -102 253 -73 122 77 -179 -125 121
2737 121 -28 -13 -5 187 -50 223 39 -280 387 349 -278 446 459 -537 198 359 -737 412 265 -536 486
2758 486 291 -992 604 155 -891 838 256 -1194 1144 209 -1265 1330 16 -1360 1224 -29
2774 -29 -1603 1326 -43 -1456 1596 -269 -1577 1840 -467 -1566 2327 -550 -1397 2238 -781 -1490
2790 -1490 2464 -976 -1451 2435 -1066 -1458 2560 -1302 -1367 2722 -1586 -1149 2876 -1829 -775 3023
2806C023n166J294L719n186J616L779n577J801L777n716K290L259n865K734L288
2821C070n815K898K931o023L166K484n790L614J971o003M102K235o294M301J753
2836B600o190M681R26n570N178O92n895N169O00n667N314k0n494N621l39n046
2852c440N593r85m648N818j220m639N712j544l816N845j992m046O200k483l454
2867c099N934k634l175N903k816l105N868l155k484O037l634k499O117m024j788
2882b554N758l795j602N248m220q47N107m195j236N681m879l69N044m534rM415
2898C013m468J2M594m926Q04L848m645M10M309m915R08L689m875J477L357m956
2914b364K188L093n118K067K307m345K354K126m631K303K213m313K372K084m599
$$ plain form
2806 3023 -2143 -849 2870 -2316 -700 3079 -2498 -697 3080 -2636 -346 2913 -2952 -218 3070
2821 3070 -2745 153 3084 -2939 227 2711 -3079 535 2506 -3497 605 2840 -3454 847 2600
2836 2600 -3590 1091 2017 -3553 1625 2317 -3578 1591 2191 -3476 1838 1818 -3676 1945 1606 -3440
2852 -3440 2153 1168 -3480 2338 1118 -3521 2191 647 -3169 2676 684 -3362 2838 355 -3099
2867 -3099 2835 201 -2974 2929 113 -2992 2876 -279 -2763 3274 -360 -2859 3258 -766 -2554
2882 -2554 3204 -591 -2193 3055 -1165 -2012 3095 -1100 -2336 3345 -1534 -1903 3141 -1393 -1402 3013
2898 3013 -1455 -1443 3151 -1775 -971 2877 -1768 -1358 2951 -1964 -1056 2633 -2242 -765 2592 -2364
2914 -2364 -176 2917 -2201 -134 2173 -2172 182 2308 -2323 -20 2193 -2120 252 2336 -2263
2929b263K663J531m230K872J356m260L078P60m031L217P01l767L218N77l371L272
2945A323j40l268L274k98l134L419j83l325L811o67k772L185p07k415L460j135
2961D28k341L322j148j887K864j086j709L207j744j530L274j449j696L084j648
2976e9j278K982j799j049K655j918o94K514j921k59K253j966k97K184j960j64
2992g76J871j485j43J786j809l5J545j564L58J209j622M16J172j639M99Q95r64
3009b86K89P36j230L34O18q50M23M90q12M55J60p78P77k37l84N57J56m10M8m9
3029Gj59J07j88K87J94m61K70K63n68J39L77p25Q15l95l93J001o44n44J268p90
3049a39o44J627j100k19J090q71l11J682j721J46J608j732l0J958k169K39J932
$$ plain form
2929 -2263 400 1931 -2299 573 1929 -2331 747 1507 -2524 693 1394 -2373 845 1422 -1949 1323
2945 1323 1183 -2085 1189 891 -2243 1176 993 -2332 1479 812 -1960 1225 518 -1897 1563 428
2961 428 -1913 1409 261 -1626 1238 152 -1557 1650 -94 -1624 1650 201 -1495 1589 -59
2976 -59 -1337 1645 -154 -1203 1452 -466 -1160 1354 -567 -826 1427 -539 -836 1348 -612 -776
2992 -776 1095 -390 -533 1253 -556 -591 954 -610 -252 957 -665 -249 923 -716 -217 678 -286
3009 -286 3 739 -491 -157 461 -389 34 524 -288 167 327 -451 326 89 -295 262 418 8 56 7
3029 7 -152 -45 -233 54 248 -213 57 320 -248 -109 268 -457 358 -37 -430 571 -73 -617 651 -139
3049 -139 -783 844 -256 -475 615 -256 -567 1115 -606 -460 1148 -584 -614 1344 -825 -586 1346
3066A346k337M21J742k189O06J943k704Q18J998k978J412J483l003J390J771l600
3082a881K126J530l455J742J384l135K118J230l737K569J144m013K966J058l975
3097b329L257Q73m470L770N99m729M375R2m117M217k86m034M371l96l797M301
3113A697q15l716N221j409m080N232j246l948N503k036l198N473k371l005N507
3128B809k771l045O062l484k452O232l654k537O259l951j865N668m265j768O330
3143C568m859j029O051n096j078O072n286m94O019n727j22N821n780M2N819o369
3159b448Q44N708o747J301N109o653K093M893o970J857M781p030K534M502p143
3174c369L136M035p302L476L540p085L578L375p121L951K701o684M523K438p119
$$ plain form
3066 1346 -991 -570 1172 -1017 -411 1532 -1172 -354 1644 -1334 78 1561 -1442 -52 1719 -1881
3082 -1881 245 1775 -1680 62 1446 -1689 429 1659 -2078 491 1635 -2378 588 1646 -2329
3097 -2329 928 1801 -2669 1101 1700 -3029 1346 1438 -2679 1538 1252 -2782 1589 1193 -2604 1697
3113 1697 882 -2834 2387 978 -3102 2130 884 -3064 2439 403 -2795 2678 307 -2698 2809
3128 2809 38 -3007 3055 -429 -2881 3351 -303 -2840 3419 -532 -2397 3271 -994 -2762 3568
3143 3568 -1291 -2320 3731 -1365 -2443 3629 -1657 -2151 3868 -1859 -1981 3840 -1940 -1898 3921 -2448
3159 -2448 -1604 4104 -2643 -1342 3767 -2886 -793 4100 -2870 -1013 3768 -3262 -728 3774 -3369
3174 -3369 -233 3802 -3500 -24 3516 -3569 9 3384 -3737 214 2915 -3769 754 3192 -3927
3189c927N095J853o941N100J497o841N614J245o602N609L98n996N832K49o288
3204d103O157l33n410N793n86n276O176j138n164O479j970m402O381j792m221
3219c409O076k066l983O386k873l242O094l034k786N537k954k249N554l508k230
3234b687N397l443j481N112l522j353M609l309j166M506l536m63L992l613m65
3249a422L873l640K03L539l972L99L086l285J91K955k980N48K139k873Q99J611
3265A271k420R65J494k470J090J231k286R64J121k002J357N35j740J039L11j265
3281h05J118J56j040R70l15n38O21j16o68Q25N7q25P79k50j29L23m56k1L92l25
3301b47N35m6o38O64j89n84Q01m04l45Q24l08n64J176q43k40P98p72K7R92q89
$$ plain form
3189 -3927 1168 3021 -3920 1180 2677 -4164 1450 2695 -3907 1702 2100 -3896 1936 2185 -4103
3204 -4103 2054 1721 -3689 2104 1518 -3758 2418 1280 -3884 2595 625 -3777 2604 812 -3409
3219 -3409 2667 601 -3382 3004 131 -3111 2983 -51 -2837 2700 -254 -2503 3051 -457 -2687
3234 -2687 2710 -733 -2214 2898 -624 -1977 2632 -677 -1843 2663 -873 -1336 2656 -957 -1422
3249 -1422 2451 -1189 -986 2553 -1419 -1020 2066 -1219 -1028 1927 -1053 -505 1634 -1239 -340 1271
3265 1271 -1149 -184 1310 -1160 -70 1161 -1125 -161 960 -1042 315 850 -890 149 460 -805
3281 -805 313 469 -571 399 84 -454 167 51 -617 208 265 -560 219 -31 -160 163 -293 -314 78 -247
3301 -247 288 242 -396 268 79 -505 296 -108 -453 371 63 -501 675 -168 -408 390 -382 -355 637 -252
3321b52K08P50j570O21J136j470L31J041j213L71Q67j401O49R78j704N30R05j625
3339h48P74J004j818J221M30j540R77N43j510J194J59j465J389m8j377J232L64
3356F81j596J378j30j377J550j92j289J474k20r93J083l1j057J133k63q30R48
3373B69j93n33J079n61n07P12j36m38O30k22l70N30k48k35N44l07l7J13k27J37
3393@K66l71K23l5j36K52k62J34Kj77J35J47m25M99j08m71K66N0k83N63m9o21
3415d01O82o9p99J137m62p59R87j32p40R35k64o15R51l57o30J109o87o24J518
3434G80p15q13J356o45n58J597j236k17J115q67n18J513j034m36J547j242r3J524
3452A058j612L35J137j566m3J563j385Q9J304j643M63J338j553K32R21j098K96
$$ plain form
3321 -252 -44 706 -864 -243 893 -577 -246 795 -418 -47 820 -581 68 1046 -658 -128 777 -848
3339 -848 -74 930 -888 333 763 -777 200 743 -767 427 586 -879 510 462 -915 317 681
3356 681 -915 463 333 -1044 506 314 -975 499 279 -714 369 338 -719 414 151 -679 269
3373 269 76 -457 622 61 -446 266 130 -308 322 100 -270 260 12 -223 321 14 -23 90 -137 0
3393 0 266 -105 118 83 -53 199 -63 71 73 -104 31 178 -247 252 144 -327 -61 -11 -294 269 220 -401
3415 -401 281 212 -587 550 88 -671 316 184 -556 379 115 -500 451 94 -536 573 -114 -738 780
3434 780 65 -748 608 -37 -595 1002 -234 -451 664 -203 -721 792 -242 -678 869 -373 -466 1058
3452 1058 -554 -219 918 -648 -691 872 -513 -424 880 -763 -300 1038 -515 -283 638 -460 -164
3469a64Q97j141L89O31j109K61R94j179O44N46j534N84P92j080M49N94j154N79
3487aN28j018P06N17j365R33N3q56Q30J37j082P77J55p48Q33k03m75M51K10q70
3507d88Q38j0o26M86K40p43O21k84k80NK67l68N63j76m01M92n1l24L36j91J14
3528B0J78n2k86J23M3k14L81j11k0J47j32j98J79j80K05j50M8M0j08KJ72J38j36
3551H9M3j30K38k30r6k8L01k82J29L6k74J41J06k80L31J26m65K66K42m26L28j98
3573c3j03L61R0n47N80k15j57K33k20n49P96n6l06M95o74r0Q25m16k72P54p02
3594b06J11O84m20n85R38q16N2O41n90l40J297j294L47Q70j244J74J104j209J38
3613c48J128j351L04J123j383K63J169j690N50J072j694N20J501k021O12J199
$$ plain form
3469 -164 733 -408 -19 612 -497 -236 758 -421 223 769 -765 -181 611 -469 -20 574 -580 -1
3487 -1 527 -491 215 732 -633 300 353 -503 327 464 -618 159 314 -434 399 196 -279 172 382 -488
3507 -488 350 340 -286 200 440 -303 318 34 -246 -241 26 -342 221 45 -356 136 85 -239 97 -94 20
3528 20 198 146 -140 -17 26 -188 193 82 62 209 77 -121 58 -122 83 -67 -19 21 -87 -85 87 225 89
3551 89 132 2 240 10 -86 -114 187 -95 34 70 -204 -63 43 -237 94 220 -245 21 263 -163 165 -33
3573 -33 -136 225 315 -232 348 133 -24 209 -11 -560 236 180 -126 369 -305 -395 430 14 -258 496 -206
3594 -206 -95 589 169 -416 522 -294 -242 399 -191 -531 766 -528 -181 689 -555 -381 723 -486 -348
3613 -348 780 -571 -267 856 -527 -264 905 -785 -235 837 -857 -337 1164 -857 -245 954
3629I54j962J033J137k175J002R59j937Q57J333k454J334J020k382J591Q67k361
3645a184J703N43k496J631J051l043K161P78k877K428L79k842K662K95l151K929
3661I67J16l205L065j32k896L177k72k982L480m20l359L793p39k966M051r73k940
3678b235L961j137k912M341j639k941M758k032k445M470k289k188M653k537j874
3693b046M547k940k090N017k982j600M923l409j586M995l428j375M550l714m95
3708a633M635l879r15M739m228j91M330m170n2M499m804M38M123m843J059L721
3724B829m858J051L628m402R17L400m804J673L140m669J569L086m950K054K813
3739B477m898K604K274m850K517K042m517K392K052m416K567J808m418L197J026
$$ plain form
3629 954 -1008 25 1162 -1013 -11 948 -989 -132 1201 -1253 81 1101 -1281 310 1177 -1184
3645 -1184 519 1062 -1434 197 1248 -1795 366 1144 -1733 695 1074 -1768 894 1189 -1962 967
3661 967 1083 -2122 943 811 -2085 1092 820 -2162 1318 898 -2461 1332 593 -2373 1678 705 -2235
3678 -2235 1726 589 -2323 2018 379 -2562 2196 164 -2281 2189 -100 -2288 2365 -172 -2046
3693 -2046 2501 -439 -2529 2488 -494 -2094 2829 -580 -2166 2829 -599 -1974 2576 -1138 -1633
3708 -1633 3002 -877 -1792 2947 -1281 -1472 2858 -1312 -1364 3135 -1669 -1231 2892 -1951 -892 2829
3724 2829 -2029 -978 2650 -1752 -835 2565 -2239 -566 2574 -2095 -526 2560 -2390 -336 2477
3739 2477 -2421 183 2457 -2393 124 2166 -2351 41 2093 -2323 244 2052 -2366 831 1857
3754A857m139K819P88l454L218M28l529L032n4l137L445k26k983K841n3k587K709
3771I75j50k534K425j48k193K816q13j842K506n80j597J895l99j715K331r95j096
3788a114J966q05q49J614r41q56J852q08q76J585o14o48J014n84l62J102j025
3805c49j16Q37m59k61O62j30l61M09o22J72M42j96j89K52k64J2J44K57j67j09
3825c6K53m02jL07k84m18O37m2m03P46j26n77O92l40k26R54o37o41J147o65m94
3846e56R38m86o97J306p39m83J324o10o67J442j063j50J293j099r8J387j194l64
3864e16J360j362Q6J223j163q5J335j420K24J310j649L88J186j643K43J566j832
3881g49N22J186j886P41J099j744O71J179j794P92R67j818L38J554k092P41J028
$$ plain form
3754 1857 -2282 537 1325 -2129 1089 1517 -2012 1020 966 -2171 1274 1048 -1935 906 853 -1734 975
3771 975 825 -1709 716 568 -1625 1191 378 -1464 1042 462 -1135 760 361 -1354 977 -18 -1114
3788 -1114 852 47 -802 812 -129 -985 867 59 -817 768 154 -494 520 -64 -426 676 -349
3805 -349 -465 372 -87 -348 314 184 -177 232 -390 -218 224 28 -161 91 -173 -161 -17 240 73 -36
3825 -36 217 -185 -186 121 -163 -581 56 14 -389 357 231 -346 346 6 -220 734 97 -544 603 -62 -556
3846 -556 382 -104 -801 505 -234 -717 607 -3 -670 772 -291 -441 852 -247 -345 1042 -152 -516
3864 -516 844 -518 -432 791 -372 -457 878 -542 -318 992 -657 -269 917 -726 -483 1083 -749
3881 -749 -227 959 -927 -186 913 -831 -160 1019 -775 17 984 -834 -496 1058 -1034 -293 735
3898G35j671R55R47k050J227O06j872J238N71k001J128R45j797J144R02k071J681
3915F17J06j869J701J75j743J388K15j805J516J76j735K011l04j760K135m11j636
3932a223K071p69q41J501l53j392J922n21j400J787n18j058J722n79j482K005
3948H72q18r91J648r35m40J603j180l55J581r03j061K029j236m94J791j314n99
3965h02J846j401l03J751j739Q0J527j573J3J768j896J16J603j519J07J556j680
3982e46J41J400j602K5J635j909P50R42j502O08Q78j611P32Q36j305M83Q02j546
4000g89N57J058j510P77N37j336O15N84j114Q24J78j060P92L25j147R35K05j199
4018g68Q98K55r88Q30K0q55J007k9r29O96L39o00K21J93q61Q09l2l53L37j05m81
$$ plain form
3898 735 -936 19 966 -1084 143 749 -1123 115 686 -1315 -187 758 -1039 105 1007 -1064 617
3915 617 723 -1146 555 730 -1013 375 590 -1215 301 477 -1258 753 449 -1311 824 413 -1223
3932 -1223 848 79 -762 739 386 -1006 916 395 -1005 782 264 -794 928 349 -1133 872
3948 872 54 -937 711 -224 -664 939 -241 -596 985 82 -979 1050 -186 -680 1111 -203 -802
3965 -802 1044 -357 -660 1091 -648 -568 959 -614 -601 1167 -729 -613 990 -529 -422 1134 -546
3982 -546 -405 995 -607 -582 1053 -856 -106 836 -666 -58 820 -791 -59 777 -528 -45 757 -789
4000 -789 -232 826 -684 93 630 -706 -91 493 -621 203 381 -679 113 438 -709 226 431 -768
4018 -768 130 385 -603 227 247 -608 399 370 -559 137 476 -124 97 290 -571 238 206 -147 190 85 -396
4039c96O83k98m34O83j53q0N9k11J35L8M8L0l53L76j9k48K32j70j63M89L0o84
4061d06O37k11j58K77O3p02O81K8r03Q96R8n89N21l7o95J001l29p68J149j70j100
4082g17J194m81o04J024l39n57J045k43j086J014Pj065J458o91p83J395n66q28
4100h23J545p75q02J614p76n99J176q64j65J397j055m23J212r25l19J649j375
4117c08m27J778j259l63J446j495J2J525j219m7J028j177K11J039j287O9J377
4134I03j298j40J265j194K37J022j184M28O59j325M55Q86j287P49M51j150J87
4151c36Q32q51J60Q86j146L38N78p69K02M83n31p4M30l21J12M24n43J16K35m37
4171b12J15J38Q8j12J73j88l42M55j65l60N51j13j62L04M4k31o4K90k56J5L64
$$ plain form
4039 -396 287 -11 -445 238 85 5 64 -147 -12 26 74 104 -249 127 108 -140 92 -78 -241 248 278 -406
4061 -406 231 20 -138 139 202 -500 181 209 -694 202 300 -289 232 195 -500 501 172 -596 553 383 -717
4082 -717 477 -4 -608 416 77 -480 565 322 -764 250 257 -808 650 -41 -824 571 5 -823
4100 -823 722 -53 -855 759 -17 -616 560 -304 -469 928 -127 -550 662 -263 -582 1067 -308
4117 -308 -735 1043 -216 -579 867 -628 -616 909 -310 -357 671 -506 -295 744 -543 -474 903
4134 903 -395 -535 730 -464 -227 795 -389 39 698 -627 -172 714 -573 176 627 -523 -336
4151 -336 496 -355 -195 691 -455 -117 461 -308 -106 377 -154 -228 202 -119 -7 417 -126 -10 225 -212
4171 -212 -97 41 129 17 190 2 -340 115 -50 -410 141 28 -134 170 214 -17 -81 209 -47 -32 332
4192C32p69M56L09o86O40L09j058O28K79q51Q41M9j143R08L54j328Q55L03j291
4211h63J353J02j365R05O14j617J151M38j748J421L8j443J618M7j675J396L4j589
4229a183J881j42j673J850n05j408K214n96j729K331o75j636K326o20j715K274
4245I94o69j445K141p23j823K652j277j244K737j277j333K621j354j207K606j376
4261B3j330K864j654j106K602j826p55K691j809p34K565k081m67K711k446m23
4277a175K937k436k43K711k642j1K497k447R4K367k380J8K456k813O05J962k586
4294a086O92J958k465L77J643k173P75J668k774J151J603k578J003J377k311J037
4310a03J191k238J256Q82k023R53J234k216J113P85j808J063P23j922J241Q65
$$ plain form
4192 332 -437 19 328 -358 282 591 -467 161 440 -411 430 479 -664 244 598 -730 125 428 -863
4211 -863 490 592 -773 132 746 -871 280 718 -1030 391 429 -1014 604 651 -1024 372 406 -1183
4229 -1183 698 556 -1117 733 228 -1180 1034 438 -1291 1040 365 -1271 1055 435 -1280 994
4245 994 325 -1120 1021 298 -1525 1127 -150 -1394 1343 66 -1267 1354 0 -1207 1399 23
4261 23 -1307 1557 -97 -1203 1399 -427 -1182 1509 -300 -1034 1531 -550 -1017 1694 -752 -1175
4277 -1175 1762 -674 -917 1794 -848 -859 1638 -809 -715 1652 -728 -710 1746 -1067 -462 1500 -1086
4294 -1086 -394 1564 -901 -524 1119 -1054 -279 1389 -1385 -234 1369 -1209 -206 1171 -1140 -103
4310 -103 1088 -1150 106 988 -1035 -82 1152 -1064 49 834 -974 89 812 -1110 131 996
4326I96k142J083P09j600J112N75j511Q17O74j568J095N29j711J200J13j106Q34
4343I9L36q49N78K77r31R94mj253J177j87n57P50r3p22M43K87q38P77p5o69P40
4364B80L9p18M99J41o82L30N34o72Q9M93m70K23K85m29j94P71l54m72R51q41j74
4385c71Q98n18k73O91k60n29R89o24n19J058o33n57J353r20m50J323r50l18J389
4404G79q76m84J545j235l44J459j252j44J307r55m87J697j431l0J625j461n27
4421h14J778j501l26J880j296l90J912j759qJ989k108N1J946k259K30K180k392
4438h87N56J778k212K58J958k553Q77J708k442O45J883k618P74J486k264Q28J595
4455A370k328R86J181k432J131J314k358R53J203k301R07J513k352J422R42k265
$$ plain form
4326 996 -1146 -63 646 -954 158 733 -778 39 713 -855 240 769 -942 258 371 -735 99
4343 99 435 -414 164 441 -490 504 500 -753 424 237 -320 430 337 -385 58 345 -493 284 209 -460 280
4364 280 319 -399 100 241 -441 -111 423 -249 -160 333 -137 86 371 -58 -252 519 165 -307 644 -197 -371
4385 -371 527 9 -264 427 167 -362 627 3 -516 542 -91 -648 705 -215 -665 658 -292 -610 779
4404 779 -97 -581 964 -271 -615 844 -408 -552 755 -200 -687 1010 -421 -451 1174 -287 -814
4421 -814 964 -537 -863 1017 -279 -669 1243 -516 -524 1465 -643 -592 1354 -905 -675 1505 -887
4438 -887 -331 1447 -765 -507 1451 -1102 -225 1483 -959 -314 1569 -1049 -275 1211 -1053 -225 1370
4455 1370 -958 28 1209 -1223 -92 1222 -1136 -183 1020 -1281 -374 1139 -1213 209 1151 -1114
4471a114J203J027k270J319Q40k132J361L15j652J269P33k203J794M27k122J516
4487C11K56j632J589K21j927J748p9j542J391J68j567J494q9j309J571j11j281
4504g88J139J78j357J410j03j329J151j65r75J295l52r96J699n91r57J188N5j128
4522f26J219m18r16R01m1o38P15J13p37N49j07l18P39k62l92O25m75l56M19n4
4542f0k47M12k25k41N31k7n26L33M12o76N85j31l12J89K93l33K70j7n70M42J7
4563A19m75M72jm51M74J09m56J39L40m42K67N22q67L72L04p79J54M77o55J52O77
4584D52q19L99K22p10M14M28q49O99M8n65M28K08n99L53L90j040M53O47p60K44
4604D3L24q71N16M40j048O95K29o99O38L23r27M58K34q10O24K31q19N08M17r71
$$ plain form
4471 -1114 89 1116 -1154 165 1005 -1127 234 549 -1103 166 899 -1304 490 917 -1205 311
4487 311 567 -1065 524 745 -1182 566 487 -1055 336 504 -1063 431 342 -967 604 493 -788
4504 -788 351 529 -828 582 479 -850 301 136 -839 456 104 -892 807 216 -741 447 502 -626
4522 -626 593 175 -741 160 119 -519 196 309 -428 121 14 -304 435 173 -219 406 -69 -425 -6 -60
4542 -60 -307 105 -120 -361 170 143 -383 -50 362 -314 271 140 -172 17 310 -23 247 230 -340 102 119
4563 119 -356 116 115 -336 138 247 -209 -70 270 -172 95 617 -250 122 426 -353 -199 278 -377 -225 452
4584 452 -367 32 254 -456 -42 386 -463 236 284 -281 147 355 -244 109 499 -541 -88 559 -201 43
4604 43 367 -504 12 452 -596 99 328 -371 267 590 -337 121 355 -455 169 400 -419 89 506 -465
4624d65N35J55j122J113J56r19O95L00j072N93L56j101J047m6j028J149r8p38
4642d90J060l32j143J285k38p95J006l4j045J212k79q58J150l67r09J389n73o11
4660e72J361p12q80J437o84p49J451n63q72J515r36o33J509q02n00J311q70p42
4678i31J808j024n13J405r07n40J334r21k77J529j208n23J707j280j87J519j373
4695c82o9J397j578K0J753j870M39J303j219k33J287j567L29J319j578L93J451
4712A195j310j96J284j621N23Q93j466L72J173j518O00Q36j494M45Q55r60L14
4729g5Q21j452L67J030j212L17R24j210L33Q18j116L78M81p60L40N27r42K44R38
4748G51j193P23M52j321M74O00j026N23N40q01N3Q55j053L32L71m56K99M21p85
$$ plain form
4624 -465 70 225 -897 216 372 -547 148 448 -624 -31 325 -776 271 225 -803 346 248 -490
4642 -490 570 238 -905 380 142 -653 353 319 -726 486 207 -651 499 132 -777 612 39 -572
4660 -572 789 77 -803 634 -50 -799 652 89 -783 732 -204 -837 672 -130 -630 681 -189 -931
4678 -931 877 -147 -660 745 -162 -702 632 -289 -566 963 -245 -768 939 -341 -528 991 -382
4695 -382 -451 946 -632 -612 1141 -729 -290 1013 -206 -439 848 -719 -390 929 -649 -256 1195
4712 1195 -115 -311 973 -648 -125 768 -698 -326 847 -671 -71 765 -729 -284 571 -389 -75
4729 -75 746 -706 -339 691 -521 -204 720 -490 -157 661 -455 -77 404 -356 -16 511 -431 -187 751
4748 751 -442 281 733 -588 -114 486 -540 -17 523 -278 -225 630 -423 -91 280 -176 123 544 -241
4767b41J01P72r25LP13o96J4Q73r81M49L69l49n27R87l82o19Q72n11k41R86m60
4788B07p63P16l09n68J279n82l59J165r05l21R86p01m75J307p31o42J421q93o86
4807h54J687q81p81J694q39j090J943r63n76J556j070q63J983j186o91K050j326
4824b07q14K195j348o80K165j466o16J855j432n91K050j397n51J921j548k95K054
4841A295j864l10K154j848k27K153j941K4J714j963R8K069k125K60J934k471O32
4858d16J701k090L19J493k057M87J926j946K3J809k145O78J236j901O20J379j909
4875g93O68J174k081P72J345j933O11J101j618P67R62j903R39J013j779Q42P79
4892H66j852P59J115j652Q20O03j435R17P21j745J047N90j561R65N10j196O50
$$ plain form
4767 -241 -140 632 -293 -290 423 -273 -259 614 -367 82 451 102 -425 562 180 -439 433 -78 -319 667 207
4788 207 -556 160 -149 -717 562 -20 -379 786 -119 -440 546 -155 -630 677 -54 -696 725 -168 -854
4807 -854 833 -48 -829 865 26 -1064 879 -84 -660 896 -174 -1037 946 -240 -931 1119 -207
4824 -207 -1021 1174 -174 -854 1311 -155 -771 1084 -348 -939 1111 -286 -837 1084 -464 -759 1295
4841 1295 -569 -879 1275 -573 -800 1353 -588 -564 1150 -813 -715 1354 -771 -511 1423 -1048 -416
4858 -416 1285 -805 -486 1007 -1050 -563 1363 -583 -560 1249 -896 -218 1018 -883 -263 1116 -793
4875 -793 -125 1049 -1032 -260 1085 -848 -237 864 -754 13 975 -928 11 1024 -755 87 866
4892 866 -986 -227 888 -764 56 659 -776 141 862 -883 164 754 -807 158 668 -528 122
4909A22K93j196P49P06j540J116L65j109N32L53q63N34K44j111J026L60j006M66
4927D1M33q57J93P04r69L77N56o89K44M84q36K82N10q78M03L78p20l0P88o09J71
4948b4M23n68L8N08n75J68M92o01QM79m26l1N10n84n4N04m72m7Q37p34l30Q19
4970C40o61Q6P72o19k17O60m99j6P40q98o0O98m80P9O02r39J72R07q35p7Q89p84
4992a40j32Q51j100K97P92j071K26J104j112j2P26p23K27Q42j215N04N96r68L6
5011b72P72q74J46R34j044O6P72r82L18O71q11M07N15p90Q4P44j054L32N59j144
5031f51O53M65r20M16L84p19P11J14r40N78M43j247N83M30p99O12K62p06L42L02
5051C13j015P57M41r54O53K6q99Q94q3n62P26j98l59N47j51o40N44L82o94K81
$$ plain form
4909 122 415 -781 -32 674 -866 250 615 -494 38 391 -472 62 306 -805 221 581 -425 41
4927 41 474 -383 -190 514 -455 -78 478 -211 33 517 -319 -37 473 -405 -2 376 -344 -374 414 -195 -24
4948 -24 399 -169 -131 377 -198 -30 462 -139 -131 348 -78 -109 401 -183 -237 267 -205 -252 585 -149 -479 340
4970 340 -321 -235 537 -82 -299 361 -138 -154 586 -312 -372 326 -154 -75 527 -412 -240 667 -168 -245 644 -140
4992 -140 -272 579 -521 -224 568 -503 -277 827 -285 -297 429 -294 -67 775 -440 64 660 -308 -272
5011 -272 500 -374 -228 706 -338 -272 500 -482 -164 507 -304 103 618 -172 -88 656 -398 -66 493 -651
5031 -651 2 467 -453 -37 347 -372 339 453 -487 91 534 -713 -130 300 -499 113 375 -331 11 313
5051 313 -702 55 496 -458 195 221 -678 216 133 -429 297 99 -260 287 136 -504 40 422 -272 9
5071IK27o91M79l7m76Q09p2p65R72k74n58O58j97m02J30K86o33O94N0n29P57l52
5093H5k33K87q2m49O75l04j36O22n06K1L27L8n55J76K51n55N70j68j52K95j28
5114G9l64M32k08k90P35m07m40N44r6m55N31k5l27N36j4m90N33j74j76P4J32l00
5136a70K79o9k96L74K00n32J65K56m27P7K15m10N72J16q42N04K09n53N24R2q12
5157e28M00M14p76M51K26l84Q6N15q17K94P18j061N70K54p47N74K79q40N86L41
5177E55j157O71N07j121O41M70j025N41N61j209O60L13j150P91N01j280P71O45
5195F85j492R98L92j402J169J41j212J023N4j182J111J46j484J394K84j521J315
5212D19j02j166J260j18j182J327l0j542J705j39j252J522l53j114J285l62j112
$$ plain form
5071 9 236 -455 24 -13 -489 320 248 -517 455 181 -377 281 84 -318 -188 98 -535 159 209 -320 437 85
5093 85 -148 139 57 -392 283 -21 -157 465 -41 -20 307 345 -210 -34 217 -338 232 64 -88 207 79
5114 79 -285 147 -61 -351 384 -23 -463 81 -15 -470 61 36 -291 245 231 -259 274 100 -76 -2 130 -170
5136 -170 109 40 -256 118 318 -214 -49 207 -220 -143 72 -338 234 350 -492 12 221 -332 192 284 -528
5157 -528 -128 286 -490 -39 187 -197 -111 404 -413 -119 599 -462 108 362 -385 189 468 -372 214 555
5177 555 -602 69 576 -545 96 566 -459 82 643 -566 94 407 -743 48 549 -731 40 685
5195 685 -807 191 583 -819 350 491 -721 302 356 -826 285 431 -1053 341 625 -896 419
5212 419 317 -849 411 293 -889 438 408 -1134 571 432 -820 702 349 -765 520 158 -954
5229i54J586l24j051J222k10j064J506o37j044J369j98r52J444n16r50J420p65
5246a18p98J501m90q12J545o31r35J371p17n09J244n14r10J436n14q60J446p33
5264Bm98J151q92j31J076q78n09J496r36l71J221p27o09J217m79p58R99l86k77
5283b89Q08m04o96R52l96m69R23m39k75N74k75l82P81j86n20O25l52k35O70l36
5303G9m23Q22m21l46P59k98o18Q29j71n61Q58l93n65O23J82r11R63j98n97N36
5323A49J18p58N81J23p86P70R9q68R07M1j110J059j18r01R68K13j124J089n1j296
5343h95J079k81m95Q19j52r33J067Op80R66k08j154J259k02q89J449m40p67J074
5362E23n60p34J384m19j073J336l71q89J196k63j022J487m17q34J530m37j055
$$ plain form
5229 -954 632 308 -743 479 269 -795 711 74 -970 399 201 -751 693 177 -773 647 -118
5246 -118 -916 585 95 -717 828 197 -738 633 -84 -593 651 137 -773 663 149 -711 735 2
5264 2 -496 655 -237 -368 708 -170 -679 817 -119 -490 731 4 -605 612 133 -625 374 -12 -289
5283 -289 519 115 -581 371 -25 -494 429 -10 -285 289 14 -368 413 227 -293 332 -20 -255 415 79
5303 79 -344 478 57 -289 470 172 -446 383 212 -349 509 116 -449 174 356 -555 408 210 -387 149
5323 149 267 -491 90 213 -573 197 296 -572 335 376 -734 325 207 -694 274 487 -637 452 401 -895
5343 -895 184 -97 -592 227 75 -858 209 215 -565 401 193 -961 298 96 -793 656 216 -551 523
5362 523 -37 -771 613 194 -879 457 86 -803 393 130 -892 595 178 -656 874 437 -618
5379f18J602q88q81J572p14q32J406n92p61J399o31j191J767m50r45J466p86n60
5397f37J322n29o89J391r68n69J393q92p51J782r33m58J544j176m19J381r46l71
5415e25J699j221o28J667j354k13J726j306m26J314j299k1J501j410J24J503j675
5432e44J72J481j864M20J211j390P5J344j410l5J411j542M53J176j485L58J126
5449I57j475L09J052j364M68P01j228M91Q41j311L61Q90j539P57O68j213M28Q84
5467F77j249L63R74j261N60P99j527O07O34j259O41O52j323R53K53j117P21O58
5485G56j350N36O98j169M45N83j159R14L34j192O35N82j061L88L25q22P11R2p64
5504e18P97q6q33P83K99j013P56K91r90O44L18q88M59K63r35J065j25p65P27J3
$$ plain form
5379 -618 984 96 -785 787 73 -759 647 55 -706 693 62 -1129 638 188 -757 709 -77 -637
5397 -637 685 156 -533 858 -110 -679 714 -178 -929 853 -80 -538 1006 -170 -589 792 -154 -525
5415 -525 1174 -47 -675 992 -362 -575 1151 -155 -581 733 -566 -587 914 -496 -372 1131 -544
5432 -544 -372 1109 -755 -335 876 -514 -439 905 -505 -540 871 -671 -218 958 -527 -169 957
5449 957 -518 -209 843 -521 -53 648 -580 -89 752 -559 -198 692 -847 -90 578 -635 -207 677
5467 677 -572 -209 765 -496 64 863 -664 -57 577 -682 -41 611 -712 241 494 -623 98 756
5485 756 -594 -58 640 -529 -84 499 -660 254 588 -604 31 613 -448 -60 265 -557 154 246 -518
5504 -518 279 193 -640 143 442 -571 185 476 -514 130 448 -440 19 282 -653 412 287 -478 249 262
5524B62r59P55L58q76L59K57l69M88N3o88M91K93j094N61J75l90M13K37o23K74
5544b3M53p63M12K30o70L45M99q54O19No57N61J12o57L79L35n07J84M27n41K97
5565A86l1n03L65J66n34M46L41q51L93K53n58M34J20p42N42K45o43L59K52n63
5585c23L92M42q71L76L86o19L14J41o34O27L70p83N1N14p85N95J85m59R6L11n90
5606b64O45m8p19J87L35k65L27Q0o65N82k2n53O39M0p87O78K28q34M91J23o25
5627d27M28K50o80L87M15q95N45L09n10N43k10m19M33r0l08L74K22p03N18m9m97
5648c64N98j64n71Q00L4p98O44p4m22N19k62k35M05J22p70P85l12k83N16n7m9
5669F2K78l74j61L83m0l18M97j84n35O39p1m61L52q6k16L91j47j05K39k12k75
$$ plain form
5524 262 -697 58 416 -460 -101 156 -213 275 328 -360 131 424 -670 -109 66 -324 89 326 -297 -23
5544 -23 430 -333 79 309 -361 -16 483 -371 248 253 -404 157 269 -388 -9 326 -181 3 430 -111 186
5565 186 155 -348 17 183 -351 95 436 -415 -22 231 -327 107 227 -515 27 272 -371 -12 240 -323
5585 -323 69 511 -360 16 402 -217 97 238 -396 231 601 -182 -131 383 -402 193 378 -81 15 326 -264
5606 -264 381 333 -386 -199 136 -129 198 278 -387 195 173 -380 259 299 -488 190 418 -416 75 198 -427
5627 -427 1 251 -429 -42 373 -522 23 332 -178 365 155 -264 169 79 -229 145 367 -336 182 133 -364
5648 -364 234 70 -501 299 333 -465 179 105 -317 202 -60 -295 110 232 -538 247 -65 -348 168 111 62
5669 62 340 -34 -195 188 148 -170 327 143 -392 247 176 -285 67 -19 -235 156 9 -96 143 -69 -344
5690c44O69l42k71K89J86k27K16j8k11L29l82k06L67j31l21M43K37l84J93k74
5710a82m3K64lk50K99j04k77L29o2j74L35n29J42O03m15k62M48l31J9M90m30k6
5732a59K28m9k51L57j41N3K09j02l15L66j69k23J89P3m35P52l42k48L78k61k0
5753a10M63m70q4J95J80n40M63j54n7K43J31m96K97Pj69L45o8m48M14Q0m74M48
5775A96j84l65K67L21m14L31J02m22L92R8o40M61p4k76M76k86m03N77P3n21L89
5796I8K8m83Q93o30k48O87l70j45L50p9m16L91q3j96L14k79l94P38J73o99Q70
5817E20l62m97Q35k68p24Q81m00n43Q90l79l39O48j60k77L41k4m47P30m37m33
5837d45P46m1p93J105o89j6M48k04l63L92j47M2K18l62k52M22j77m66J013o82
$$ plain form
5690 -344 325 -17 -288 1 187 -40 176 158 -53 276 -106 -312 55 -76 -397 46 283 -101 92 -182
5710 -182 -225 39 36 -214 85 -19 -296 33 -29 -203 132 -397 -255 348 -67 -329 119 -212 -193 297 -133 -159
5732 -159 69 20 -231 126 -15 38 247 145 -170 196 27 -196 -7 66 -369 383 41 -207 171 -90 -110
5753 -110 353 -117 -201 -6 174 -366 97 -57 -114 129 260 -236 61 68 -101 244 176 -272 142 222 -252 196
5775 196 12 -353 -86 235 -179 152 254 -168 224 322 -318 143 69 -207 269 -17 -420 157 230 -291 98
5796 98 126 -357 536 -94 -342 345 -25 -170 180 101 -315 76 -7 -203 111 -168 -562 176 349 -350 520
5817 520 158 -339 496 228 -496 385 -15 -558 332 -47 -386 262 102 -175 166 142 -305 425 -12 -445
5837 -445 301 260 -533 572 -117 -133 315 111 -252 140 -7 35 253 -109 -361 61 -116 -582 431 -251
5857b51n1O12k00l47O13l73m62Q19m14l20P61k54n29P79l33m15O60l04l50Q07
5877D48m93l68R78n22l65M93l58l30N52L7l14N77k60m45M78r3m45P79k84l78N88
5898B75k43n32N62K66o74M63j71m11R54n07l30Q04l55m94O06k7o44Q01j68m80
5918c05L14P6p07J003k93o53Q87n5p65P99L7r54Q28j29o32R49m04n13Q56k21p38
5939f20Q95R8j007Q75j12q78J167l44n83Q98l07o37R65l05p75J296n87q96J291
5958D34m59p01R69l28n36J383n99q03J052l79p11J612q63q64J596n68j087J537
5976F85o48q34J517p32p39J597r43m27J443j125m00J523j129m74J536r84o25J584
5994H25r16o54J794j129l60J533j200m66J252j000n08J499p69l94J367j296k56
$$ plain form
5857 -251 -302 310 110 -237 376 3 -459 360 -54 -374 387 133 -396 383 50 -365 295 -9 -359 448
5877 448 -45 -413 565 43 -322 171 -187 -517 35 72 -242 335 75 -370 108 15 -430 349 65 -313 275
5898 275 32 -500 62 328 -346 117 -54 -465 489 -18 -348 456 101 -393 213 186 -458 343 175 -305
5918 -305 9 85 -622 381 88 -565 322 267 -498 301 338 -616 212 83 -549 400 -4 -517 339 118 -620
5939 -620 275 373 -634 241 129 -749 418 74 -509 389 82 -555 410 105 -670 626 39 -857 434
5958 434 -25 -726 243 -85 -621 762 163 -640 412 33 -678 934 71 -793 803 235 -852 685
5976 685 37 -797 720 -12 -751 846 -97 -524 919 -206 -606 917 -212 -686 850 -134 -759 825
5994 825 -91 -745 1049 -80 -440 1093 -107 -573 679 -321 -829 670 -99 -493 874 -422 -678
6011f78J534j093k58J393j117l53J354j253j12J559j522J33J229j190k6J032r89
6028c57J17Q40q47j75R10r41QJ126j172l5J177j175K34Q70j205L04J068j396K93
6047c56R43j218N06P98j244J23J177j268M69P34j271M46Q99j391N32O19q84K53
6065a33N73j165O88N15r08J80Q49r79J55O15n17P0N75r48L74O93j109L39M61n49
6085b21K47L63q36M15M44o49K07K67p86P08N4o81N91J08n44K57N46p83L36L27
6105C70r71O72J54l97J06L48m93J30J60k97J78K77l30l5K91m84K37J13j02oL14
6126B35o22N29K02l10R1J8l94L23K52l65J47j4j14J89r2m4j28K77n21L30K46l18
6148h3M9L92n44J74M10p62K94L04l81K03J33m87L90L86r23J77N87o06L50p9n76
$$ plain form
6011 -678 856 -237 -495 898 -219 -572 782 -471 -583 976 -546 -413 816 -374 -400 632 -357
6028 -357 -240 600 -247 -422 488 -453 -445 681 -491 -526 651 -524 -290 580 -625 -321 747 -649 -356
6047 -356 587 -631 -125 673 -571 -448 729 -539 -70 664 -607 -161 738 -653 -121 498 -386 -133
6065 -133 440 -725 -37 478 -430 -250 599 -380 -225 390 -127 -57 518 -430 -56 637 -472 -133 328 -221
6085 -221 26 389 -447 -32 412 -237 -30 237 -549 159 213 -468 123 231 -313 -56 490 -293 43 370
6105 370 -601 71 225 -172 -66 282 -211 -81 79 -218 -40 237 -93 -128 163 -321 -84 29 -73 -79 235
6126 235 -387 142 344 34 125 143 -251 72 324 -41 106 92 -22 167 75 31 -97 180 -341 -11 235 -83
6148 -83 -34 358 -186 -12 398 -364 -70 234 -147 56 189 -298 92 478 -445 -268 319 -287 63 -16 -592
6169e92P68N0n62K63K93n53L41K60n13Q2M09n72N29R2n30M18K17p13O50k75n95
6190e33O14M39o01R0J67m62N10L6n88L30J41n00N44Rm30M37O6p12N58k5m08K73
6212d5K48p48P32P0o44N67J97q41P30r5p99R21L3o22N04r1m52N18n8n92P36l21
6234e2k37M93j11n17Q57l24m89P53l64l03O47r7p70Q18k40m68Q30l00m42O83l50
6255A7l65N59r8p08J089o28k94P12o27J57N34m06j17O88n09k07N45j80m44N82
6275C00j03n67J054o45m22R52r98K54N92n35oO14p09l0P21n77j34O58o68J10L92
6296B53n97J56O97q44O8N63m99J16M02l91j9N38p52J81K81l17K34L66r19M17N23
6317D57o99K81P8k75k5M55m92j94N14m51J40L97l72K2M75n09J68L96m28j70K83
$$ plain form
6169 -592 176 226 -336 -73 220 -333 8 268 -245 -163 246 -326 203 295 -235 183 400 -313 337 62 -533
6190 -533 81 520 -81 9 176 -286 224 260 -328 2 143 -357 187 196 -234 203 269 -443 115 90 -318 -45
6212 -45 203 -545 187 257 -387 180 377 -464 266 171 -628 293 326 -296 208 117 -335 183 125 -467 269 -52
6234 -52 -289 204 93 -424 433 109 -380 373 9 -294 353 256 -514 304 64 -404 426 126 -316 367 17
6255 17 -348 211 113 -595 494 -134 -428 284 -343 -186 348 -58 -175 513 4 -203 342 162 -282 300
6275 300 197 -370 684 39 -383 569 -429 -175 417 -118 -124 490 -219 -249 472 -105 -239 419 -249 -139 253
6296 253 -344 -188 509 -335 -267 296 -203 -87 315 -76 -95 443 -309 -128 153 -164 70 436 -483 -66 457
6317 457 -242 39 117 -158 -183 272 -220 -414 100 -351 -211 186 -186 -164 311 -198 -30 366 -62 -232 51
6338E1k08J55K54l51J52Q2k17l2J70n2J0K20l28m3NJ8N1K99l22L9ONJ16P8k31
6363g3k4J91O1m54M65j24k75K38m4q7L58j04n03M85j87J71K30j41k90J03m1j01
6385a46M16n15pM75qm47L7K12j19L33k80j96L47l2k55M14k20o5K61l0m17L33l9
6408E2k57L41J57n27N64k77k00L40j00l33K24k6k22J96K38k61P9J05j99O4J64
6429A22k79L85j29o68P08j56k56N48l42k60M56k24Q0J63k77K51Q0q9r2J28L7l66
6451a80M36k37k60L52K4q2J05k06j86N38m3l04J68Q4m40L11Pj69K84l43lL30j39
6474D7k08Q4O0p5K94l8m09K76J59l26k9J93j49J75k24p2L23J1k07J41q3j88K72
6497B7P2n46O58k34j89K82N5m04M34J14n49K74O9m59L68m3j09L43pk81K05R1l11
$$ plain form
6338 51 -157 -2 252 -99 53 135 -82 -114 56 4 14 234 -94 -137 -132 -114 -63 236 -86 -47 -41 -36 80 158 -73
6363 -73 -97 94 155 -299 166 42 -233 5 -39 -126 232 128 -375 110 -77 94 324 183 -107 -4 -45 -146
6385 -146 270 -245 -252 223 215 -232 -195 17 -102 231 -49 -245 102 70 -185 229 9 -56 205 175 -242 91 52
6408 52 -205 136 293 -234 330 53 -147 193 93 -240 -16 -42 -264 -68 170 -91 -12 93 -106 -42 122
6429 122 -157 228 99 -569 139 -17 -273 275 -67 -327 129 -95 -15 148 -129 122 202 113 21 149 186 -180
6451 -180 256 19 -241 111 135 53 158 -48 -234 304 261 -43 125 209 -231 80 87 -82 202 -141 -144 186 47
6474 47 -161 -77 -17 -92 202 164 -245 31 190 -136 -165 28 -121 54 -170 -242 81 92 -115 26 -57 -245 27
6497 27 99 -447 211 -23 -212 70 125 -279 155 269 -280 -6 63 -396 -28 -71 -180 163 156 -125 80 171 -140
6520a40J77j90j71M05K3m14N26R0o63O98m59r5K83Q3m46N09k6l98L83J32l29K92
6542B70k67m91P37j77l64N78k2n88O83k92m92P87qq37N58N8n02O80l17n22R55
6563D27o22j12O45k34m92O76k80m78Q90m75k47P75n97j06N42m70k75J109o06l07
6583b37N36k68n00J004o33k59N36m20O2O86p81l2Q29q06n4P95o21k32Q69n97j92
6604c15P06n72l3P07q59J91O69n55o6N16n12K7N79p89L32M43q67J84O75n67J41
6625C5M06p46K25O30q31K60M83p79O8N71l86J03M89r58M34M00o53O0N50o39L87
6646A09L30n89N7L65o94K43M96p65M98L95m85q5L26m62J67J68m10L03L53m75O3
6667i2N27o04J24K33l68L8J72j39K20J87l91Q6M95j054O89K72r22M18K10k41J45
$$ plain form
6520 -140 37 -153 -324 81 104 -310 216 306 -357 341 -118 -213 70 153 -293 216 190 -208 175 307 -22 270
6542 270 3 -488 249 72 -292 286 264 -324 359 67 -425 362 354 -483 75 133 -369 311 -6 -528 427
6563 427 -195 -307 338 104 -388 288 8 -470 420 -55 -302 473 -124 -230 312 -158 -433 676 70 -237
6583 -237 299 31 -469 535 -98 -357 179 -241 -179 507 -274 -306 523 -283 -337 458 -163 -395 474 -123 -315
6604 -315 391 -181 -214 493 -366 -175 494 -61 -127 389 -123 -96 483 -306 26 469 -398 -214 461 -106 35
6625 35 441 -305 -80 550 -281 -21 462 -317 -249 322 -64 39 528 -430 4 404 -249 -189 361 -278 109
6646 109 439 -150 -93 272 -422 -179 317 -448 50 445 -40 -125 201 -261 -94 74 -336 -33 320 -155 -92
6667 -92 435 -169 -45 188 -180 -142 30 -109 111 298 -93 -7 488 -566 123 395 -527 -109 101 -140 5
6688EL34n51%J53j67K60J64l86L06r9k94L33L0j94J25J47l34M08q5k08m3L27l13
6711h2J01K71k64k78M95m28O3L67m90J48R4k84m0L91k47N7L05m78J21M36m26J13
6733e5M68m32j34M38n59L00K88n45J21L69n84L22L56p34L56K87n08J26K56l74
6753b38L69J96o81L87M46n06J8K49n87K78M69q35J12Q85r56M11K97o70J61O65
6773D70p67L02M06r75P33N1n03M06M7o38N14M50j161P82K87q91P97m6o63L45M28
6794C74p80O84m8p54P91j41n84P22j44m22M88k17o20J147m04m56O56j34n03N35
6814A90k13m69Q64m32l78Q86k92m98Q39o12l93R30m15l10P92k61n99Q42n61k92
6834c82O50k92j86N59k69o55R50p57l1R73o53m20R86p23j2N17k78m52R62m75l70
$$ plain form
6688 5 339 -212 -212 -59 -226 34 198 -188 118 19 -275 58 88 -106 19 166 -168 240 155 -53 -96 231 -82
6711 -82 19 290 26 -252 243 -185 -122 245 -245 -97 -3 -287 -327 64 -183 -126 179 -299 -178 258 -168 -55
6733 -55 413 -19 -153 285 -274 26 314 -231 -110 259 -325 -3 353 -381 -25 262 -246 -120 136 -238
6753 -238 131 327 -354 33 479 -27 -9 240 -347 -69 400 -435 -323 562 -394 17 314 -356 -195 470
6773 470 -297 5 411 -564 169 220 -283 123 170 -468 46 496 -665 117 404 -487 310 264 -399 -54 374
6794 374 -406 278 230 -524 267 126 -458 264 120 -302 186 -31 -651 496 92 -364 292 158 -345 190
6814 190 -23 -492 372 -60 -438 448 156 -342 497 -115 -508 422 7 -303 489 228 -371 471 -90 -382
6834 -382 268 -24 -210 349 80 -575 375 -382 -413 560 -93 -513 473 -250 -262 255 -23 -475 487 12 -358
6855c58Q03n14l55P80n50j03N25l42j65P50l93m90P33l99l81R21o01r9O52n37
6875a23N8L40l02k69P05n24K07L53o73L23L09o30J75J59Qj74L97o10K47L6j42
6896a30K84J91m04K57J85n74L12J52k80j2K34j93J68k37l22K00L47n54M52j07
6916c1j99N80k03l01j18L76l60K41K39k71j51L42l28J52j5j07K22r8l5J41J52
6937B28k43j35K45l47J28L75k97m3P2j65R2K69j61l9n0J25j16K0P3k28J42J59
6959A04k17L09j21l56L32j44k54O80k28m51P20k50l91L59j06j8O10m92k28M05
6979B63k25l12L65l39j38P08k81NK10l55r6M72l68lL23m00P9K60j3l34L04k41
7001a16k23L91j9l07M13l52n1N69o40J38M40m99J45L05n10J15N92p59K45K95l83
$$ plain form
6855 -358 445 -69 -424 356 -194 -297 228 -114 -279 471 78 -412 321 -78 -459 462 -139 -238 414 -123
6875 -123 -65 275 -27 -296 409 -115 92 445 -228 95 404 -226 -51 108 116 -58 339 -271 -24 12 -130
6896 -130 154 345 -59 198 383 -191 121 273 -7 -19 215 22 190 -47 -369 -169 178 -376 76 -31
6916 -31 -230 350 147 -154 -272 104 -256 -15 224 -47 -198 144 -184 -32 -47 -154 68 -30 -65 76 228
6937 228 -15 -150 95 -252 -124 251 -46 -89 -17 -182 -90 179 18 -21 -71 54 -62 -42 31 -197 -55 104
6959 104 -113 196 75 -281 51 -93 -347 333 105 -346 374 124 -267 92 -14 -32 578 86 -142 263
6979 263 38 -274 91 -248 -386 322 41 46 256 -99 -195 277 -91 -94 229 -171 -92 168 155 -179 125 -116
7001 -116 -339 52 33 -274 139 -213 -264 305 -335 -197 243 -256 -111 194 -316 -201 391 -368 -123 172 -211
7022b11K44J06j49k03M16l59R9K83l36r8N61p36K78K88k28l6J96k89L68jm54M44
7044A83K9l8k51N28p23L01l3l24K90K93l02K07m5k85K38r5n7J1m6j66L79l05L3
7067a78j00L34j27K86l12j52L95k16k22J64R5j2L6J12k0k61J75J17l10L09rj26
7089b2J9k6N2J25k62K3L87l97M4K63k17k50M02k23j02L37j62k53M87o1l35J28
7111d3K58m62K04R8Q5J13l70J32K12l05j81K35Q0l43L87m2l64M47m9M2K20l22
7133C2j78P3J64l35L02P1j83K14k52j34O71j90n73N55k69l46N36k58m4L21q9m71
7155c83M41j4o6N23n73k48L28L5k18K89l16J16L26j12j83L55o41J58N81k45l07
7176a54L24l47J34L42m60M13j23l45l8M49n09L33J45n39M37l0j91K0M25m41J48
$$ plain form
7022 -211 33 139 -10 -213 203 -156 -57 226 -110 -208 353 -383 -105 183 -45 -81 115 -174 194 193 -261 183
7044 183 212 174 -77 451 -272 29 -4 -328 -38 255 -47 160 115 -170 68 -27 -84 -73 -119 -285 94 -211 -178
7067 -178 -278 56 -71 215 -97 -249 146 -70 -292 -128 -33 -45 -9 103 83 -178 -3 114 -196 113 104 -22
7089 -22 -3 -29 23 148 -114 -91 296 -101 -57 206 -11 -261 141 -82 -184 153 -9 -262 225 164 -171 -43
7111 -43 215 -247 -43 55 140 253 -117 15 227 -78 -259 -24 56 -287 100 58 -306 141 92 134 354 32
7133 32 -146 -73 91 -244 58 129 -54 160 -92 -226 445 255 -318 237 -32 -378 158 -100 -144 177 88 -383
7155 -383 58 44 -22 501 -72 -320 8 43 -175 114 -202 -86 240 128 -55 300 -341 -183 398 153 -154
7176 -154 170 -177 -43 299 -161 252 129 -216 -254 195 -314 19 164 -375 62 32 -159 -139 286 -155 -7
7197gJ99k28j43K58j68J64p8j35K60M1k60L96m65o1J64N5L0j09J51q6j13J62o2
7220c5RJ50k5o7r1L3J40j45k40L80r4R9j81L1k9q8K61k12o8K25j02L13l48J46
7244F2J82k74q7l6K82k29K47K94n57J58l7M5k1J73n05M03jn29M29K1o3L78l32
7267CN7k5L22l99J06p4Kl0M9J01j9j19m2J43r4Oj55M73m69N09l27k21R9K86n83
7292d01M85n5k11K62j8j80K42r1j32R5p9j63K44P0j89K02j92j8MK74k21j09L29
7315A48p5m1o6LJ78j27q8j16q0K60J24m9l36M02N0k98J67p0K0j4K50m70J58Q7
7339A7k91J03Q7j10J09L73n69K71J08k55j4L00m68M58P9k79L6J85k07J13J36l91
7361b09K90m6l75O90l78k02K16N0k76K49R9l99M79K3o99Q20l19l64M26Pk88M95
$$ plain form
7197 -7 192 -36 -179 79 -89 75 -3 -138 122 163 -97 299 -166 -227 -63 -8 22 -87 64 -22 -135 27 -35
7220 -35 -26 124 99 32 -59 -26 114 -31 -271 109 15 114 -67 -36 -65 -153 108 -104 -172 53 -49 264 -84 62
7244 62 244 -30 -117 -153 129 -100 147 441 -116 42 5 50 29 202 -303 100 99 -430 -1 20 -43 335 3
7267 3 60 35 357 -42 64 -10 -8 -38 11 112 93 -26 -68 75 -19 -13 -168 305 -164 345 18 -203 -104 182 -401
7292 -401 84 29 -182 80 62 -118 124 33 -99 -4 -83 -246 -2 68 -121 81 -111 -129 -125 149 -72 -181 148
7315 148 73 32 -34 -31 147 20 -68 -184 -264 -4 120 71 -265 137 187 -111 56 -14 6 -8 242 -228 -70 17
7339 17 -274 -171 -84 -194 -85 288 -281 -10 98 -157 -171 129 -339 119 198 -81 -45 140 -67 46 182 -209
7361 -209 81 35 -340 350 -28 -230 -14 36 -240 9 108 -291 188 211 -488 332 13 -351 75 82 -206 289
7383B89l18k56P46o00l59Q65k86l30P48m47n26M43R2m24N91k57k25N04k45l34
7403c29M97j65k30O48o34R0M64n08K2J69k01rN67p80J01N89m46o2O80n63l74P93
7425C19l41j93L37j9k13K59l09j47P91o50J00M28l95k6L45n27J02L62l72J70j17
7446i6qJ12Q2rj68L45o07K56M34m38J28n1j63L18P0k41K37j75j45L35J6l85N8
7469i5J59j50J13J69j86M9j9r0j43J48k40M14k22m7k8J55K8k95M79k06j16P6K3
7492b4l07K78Q9j77K30O4j37J15r7j11J21p6k38M32j99p8K11k49J43K45k25m1
7514c1L3L0j40J88q5m12K91K02j68K6J97l68N45k20k03K95j95k90N82j84l86L25
7536C2J00m6J13k90j92M75j18j64K19j84l01N75m24N5M20l07n3M34n05K2N64o19
$$ plain form
7383 289 -29 -285 461 -139 -498 367 81 -249 499 52 -474 -31 61 -363 228 -29 -254 250 5 -329
7403 -329 168 3 -227 421 -213 -123 341 -167 -145 24 -177 -186 381 -399 -298 291 -155 -217 463 -100 -474 319
7425 319 -22 -215 122 103 -110 149 -160 -307 484 -166 -66 362 -33 -59 286 -241 -139 223 -149 21 -96
7446 -96 -104 8 90 81 -87 258 -349 -93 341 -97 31 -20 -183 135 205 -36 201 26 -119 216 232 -153 -95
7469 -95 64 -86 27 196 10 59 40 -50 -193 -45 -285 129 -93 -140 -168 -13 15 -280 199 -7 -123 -47 -24
7492 -24 -331 -53 36 -141 89 153 16 131 34 -77 44 -32 -270 162 -37 -115 96 -153 -10 235 10 -31
7514 -31 2 32 -108 80 -5 -417 -126 76 -92 -66 131 -237 308 88 -115 180 -15 -305 277 93 -293 32
7536 32 132 86 199 -91 -283 192 74 -90 129 -55 -356 219 -205 -150 270 -37 -90 344 -161 -139 425 -194
7558a94J49J07k79J03N67o33m5O09l03l06O00n07k60M62j27j85N94p23J53N68
7578C50o45J24J65j28j01L52k95l3L22j97p5L62l64K05L4r9k08O21o57J82N94
7599E09q73N09J70m41J83K65m67K95j24j37M06k58j07J08L02m16QK97k62J02J13
7620A82k48R7J01k85L55J28n01K99r7j47q6K30lj0n8m17O35k53p9J30J74m79L37
7643En2j52K26K39k47k6J92k11N7j35k23M27Lo3J25l06j6L16k73K9O8K33k55K
7667c7K0l9j9K20k03J0P4k04M47k59j35J17J15r8j57K33l49K82J35l08kJ54J09
7690A06k73K84l6k49M01l08q3K40l59K8K41J64l21J45QJ19n6p9j26K37l19K41
7712EJ22m37Q8K78q0r0L99m65K15R7j81N2J28k16J35p7k29K86K55l65J26Q7j21
$$ plain form
7558 -194 -45 62 -217 -114 453 -180 -225 384 81 -225 375 -132 -392 70 -57 -242 352 -371 -218 350
7578 350 -295 -171 -6 -134 -235 117 -178 -211 111 -86 -161 201 -163 42 76 -23 -231 390 -267 -85 509
7599 509 -364 145 315 -126 57 322 -145 150 26 -111 295 37 -70 38 340 -76 -68 229 -33 69 182
7620 182 -66 31 132 -153 202 330 -171 128 31 -116 -202 28 25 15 -43 -460 175 -78 -157 -27 147 -332 5
7643 5 -47 -199 27 266 19 -7 185 -26 31 -104 -327 100 103 40 165 -141 -157 159 -114 -85 -17 216 -39 -37
7667 -37 -17 -56 -75 145 -58 -48 26 -178 269 10 -125 -8 107 9 -148 85 -264 18 153 -155 -157 -3 106
7690 106 -167 117 81 -168 233 -75 -158 82 -277 -249 -8 156 -165 -20 -12 107 51 -28 -154 83 -236 5
7712 5 127 -310 -222 56 -24 -114 285 -180 35 132 -49 3 131 -85 50 -27 -256 30 285 -80 46 133 12
7735A2p6L53n58L13K34k61L7M6j77l6M47m56J08Q3k85L87J09k95j75N09n52J75
7757e8L06o08M80J25j53l2P3k95J96L52o61O02j70l97K17P4j79j04K98k62L47
7778A51l7k73J81J71m30L19J44m51L89J00m49J85K2l08M22J4m61M85j54k14M45
7799B51l29j33J53K21l45K06j65j65K61L7j43K96j13k81L55l59K52P2l07J74L40
7820B78l16q2M06l72m2L59k65n5J7l2J96K2l2j23J95k64P2L04j71j80J06J09k33
7843a03K64K7l40L10k60n5J15L3L7Q7r9j73J76l5j85K81j97J95o3l3R4j52k4J87
7867H7L25n58Q7J42k10O9M4l1J04J61p0p9K5p8PM7j63P2J36j99J03M2k12K83l38
7892b04M47l28k30K53k89K78L4q4K30j37K05k47M89l73k22L42j32J81j90m6p2
$$ plain form
7735 12 -64 289 -269 44 278 17 54 100 -77 -113 334 -122 -14 69 -216 171 280 -15 -190 319 -233 -58
7757 -58 248 -360 120 245 92 60 133 -162 34 386 -275 327 157 -240 -23 51 -128 -232 66 -196 151
7778 151 114 -159 22 193 -237 82 226 -225 164 264 -185 0 22 -286 136 150 -311 174 20 -194 251
7799 251 -78 -211 -58 163 -182 24 -141 -306 -45 -8 -151 145 32 -249 106 -253 -1 71 -236 -62 278
7820 278 -38 -120 286 -86 -128 231 -34 -89 -72 -104 92 114 82 -41 154 -110 -38 266 95 -85 21 130 -103
7843 -103 161 188 -152 158 -102 -157 -42 -9 28 115 16 -157 19 -16 -201 80 -117 78 15 -18 76 -76 -100 87
7867 87 412 -146 -59 83 -127 -58 -14 -45 59 220 150 71 96 18 25 72 -91 -19 117 -82 21 63 -149 134 -204
7892 -204 243 -85 -315 -62 -351 -73 -39 -123 107 -30 175 -72 417 44 -178 164 32 213 23 -23 -95
7913i5J32j70O4K15k89J69O7q7R1j44M9j46K42j15j9q0k23M27n5j74L05K9l67
7936a74J79l7k02J37j0j78N08k98nQ8j4J77m2j39j36J26J07k46J36J14j49L26
7958B68k05j52oJ83p8j3j13J15Q4n8r1L13j30j48J43q9j69O74p22k09Q18n91J19
7981e7J08k5j63K63k62J51J84k84q2M93m64J09K76m13J80J41q1j02J76Q9lL2m46
8004a80OM40l71J54R1k79K62N3k19P6J30l65J49J1j4l8K60k68J73o4j12J12L36
8027C43l03j94J27J54k50R8k20L30J78k67mj29rL09J28j92j27l2J36L2j28m0o3
8050a23K04k6j41J43r4Pnj08M34m8k11j10J05k74K74l5j20J06J28r5J12k17k6
8073a20K7M9L1j49J58m3o7L7K04j63L47m45j02L72q5k13K13P5l7J71k66m3R3K14
$$ plain form
7913 -95 37 -133 -69 146 -143 26 93 6 97 -47 2 -144 98 -17 -36 -116 -339 88 33 -141 164 193 -174
7936 -174 5 -32 -234 -97 -107 -285 223 -75 -80 8 -6 171 129 -10 -146 -20 87 -159 -23 91 -58 268
7958 268 63 -89 -95 88 10 -3 -116 -1 83 25 -66 247 117 -31 112 23 -146 528 -194 -403 415 -176 -57
7981 -57 51 26 -137 126 -136 15 199 -85 -167 326 -138 -29 247 -166 14 155 74 -28 148 237 234 266 -180
8004 -180 -174 266 -105 49 140 -139 123 176 -43 33 163 -202 -53 -42 -56 -94 166 -102 71 7 -105 7 343
8027 343 40 -154 -27 127 -123 -25 -245 85 263 -4 -8 -137 -146 163 291 99 -28 -60 76 108 -20 -60 -123
8050 -123 81 55 -86 57 -37 -30 -35 -143 291 243 32 -78 27 -247 27 -8 -128 -22 106 11 123 -94 -120
8073 -120 -93 -44 -13 -162 -4 -47 -114 -77 127 -36 311 -134 -236 136 51 -162 51 126 89 260 -6 -49 44 258
8097B58l59J57o6k3J82l59J50J20r4j4J50l70J87K09n8m0J55j94j08L44k34r0
8119i7O2q8j54K98J7l71N24l88K9L04k72K30J03l88p0O29n46K02Q0l64K67K63
8141B70l72o3J74j77L61o1k63J00J73l38N3K60pM4n1j84j54K54l28M40q1K1J73
8164B44K10o18J29J56k43o3J6K2J61l5k38N12j4k95K05k31l04M83n3r3K17j60
8186Hl00M02j84j77L56
$$ plain form
8097 258 -101 56 -10 -33 149 -210 -60 60 -34 -48 102 -268 -81 128 70 30 185 -9 -117 227 -7 -97
8119 -97 -35 -123 -277 21 38 -333 191 -197 -168 136 -136 94 197 -191 -261 368 -178 24 104 -260 7 270
8141 270 -102 -165 9 -168 193 132 -131 -31 142 -196 -143 117 110 154 103 -81 -235 19 -309 131 50 71 244
8164 244 454 -164 -35 121 -122 -185 -169 -147 14 -21 -259 253 239 -56 149 -82 -386 97 44 -49 168 8
8186 8 -292 110 -74 -251 105
8191A05
$$ Imaginary data points
##PAGE= N=2
##DATA TABLE= (X++(I..I)), XYDATA
0@%%%%%%%Qj6J6j6J6k4L3m1N1n9P2q9J13j36J55j80K10k49K91l34L83m37M99n70
31c04O49p33Q24r26J039j162J297j443J602j776J965k172K399k649K920l214L537
48A853l891M281m712N188n718O314o985P746q620R633j0822J2238j3956J6090
62H639j8810K2392k7315L4476m5757O5882j11257L74220k25222n79456R64316
73D62108m61380m53664R04299m59024m29255R01672n19548l45673Q60404n29404
83f9465l12483Q42115n62064k45188P98430n70636j97881P62395n92793j36040
93b83610P17583o03780q5793O83058o12279l9268O35654o12940K052N95844o10114
104b13593M7382N47482o08910Q6097N08501o02446J20362M61695n87812J48065
$$ plain form
0 0 0 0 0 0 0 0 0 8 -8 8 -8 8 -16 17 -24 27 -32 40 -49 64 -72 83 -97 113 -136 155 -179 204 -233 266 -304
31 -304 345 -388 436 -490 549 -613 684 -759 843 -933 1032 -1140 1259 -1390 1530 -1684 1853
48 1853 -2038 2243 -2469 2719 -2999 3315 -3670 4076 -4544 5089 -5733 6505 -7451 8639
62 8639 -10171 12221 -15094 19382 -26375 39507 -71750 302470 77248 -502208 462108
73 462108 728 -452936 451363 -7661 -436916 464756 -54792 -400465 459939 -69465
83 -69465 -381948 460167 -101897 -347085 451345 -119291 -317172 445223 -147570 -283610
93 -283610 433973 -169807 -255600 427458 -184821 -224089 411565 -201375 -199323 396521 -213593
104 -213593 -166211 381271 -227639 -141542 366959 -235487 -115125 346570 -241242 -93177
114i3177M18169n65196J74595L65896n41151J96576L20360n16777K16840K79794
124B55929m90440K28044K39685m61297K35449K00949m27231K42413J60938l94451
134b10012K45797J28560l63374K44590R9088l33803K38715P8269l01720K28474
144E4584N5891k72557K20842L5956k45305K11129J9549k18756K01305O452j92722
155a23632J83318o050j63581J68316j5690j37477J51305k5980j13430J36358k9892
166B3565r3520J17781l3263p2862J00321l2015n4738Q1970l3847l8690O5477l0579
178d00k5912N1400k5316j7766L5773j9524j0250K2609j1342m926J0527n873m28
191a428J027K228J739j0383R404K442j7892J9365L598k7050K5585K206l3293L3243
$$ plain form
114 -93177 324992 -240204 -65609 300287 -240864 -44288 276072 -240705 -23865 255929
124 255929 -234511 -6467 233218 -228079 7370 208319 -218912 23501 184439 -210012
134 -210012 35785 164345 -199029 45561 144649 -189154 49561 127830 -173890 54584
144 54584 110475 -162082 58760 94716 -150589 60540 80089 -138667 62638 69090 -123632
155 -123632 59686 53636 -109945 58371 42681 -94796 56509 30529 -82901 53457 23565
166 23565 -69955 47826 14563 -58299 42022 10007 -44731 37239 3392 -35298 30179 -400
178 -400 -26312 25088 -228 -17994 17779 -1745 -11995 10614 -728 -5654 4873 -1000 -1428
191 -1428 -401 1827 3566 -6817 2587 5029 -12863 6502 10100 -16950 8635 10841 -22452 10791
205A0791J202l7615M0146k048m1149M6690n769m3918N2522r242m6083N8148j3326
218A0349m5874O3322j8395m6278O6010k3743m3062P0394k8122m1106P1904l4301
230A098l8608P4761l8907l4882P5810m3329l1151P6676m7666k7756P5733n2018
242a0239k2348P5616n5066j8084P4601n9010j3877P2931o1652j0334P1012o2206
254a8656n187O8135o4558j095O4357o6816L726O3096o7783P909N9771o8819J0823
267a5097N5964o8802J5544N1764o8533K0058M8204o9692K3736M4610o9484K7047
279d681M0191o8612L0690L7032o6998L4294L0458o7911L8085K8503o6192M1573
291F432K4296o7489M3686K1151o4294M6677J5728o4337M9762J2961o2123N2833
$$ plain form
205 10791 11993 -25622 14524 12476 -28673 18017 12248 -31670 20852 11610 -34473 23675 10349
218 10349 -35525 27797 9402 -36876 29134 5391 -37671 32723 4601 -36505 35399 1098
230 1098 -37510 37251 -1656 -36538 39272 -4057 -35208 41468 -6198 -33954 41779 -10239
242 -10239 -32587 43029 -12037 -30121 44480 -14530 -28407 44524 -17128 -27462 43550 -18656
254 -18656 -23843 44292 -20266 -21361 42996 -23820 -20094 43002 -24781 -16872 42899 -25920 -15097
267 -15097 40867 -27935 -12391 39373 -29160 -9102 39102 -30590 -6854 37756 -31728 -4681
279 -4681 35510 -33102 -2412 34620 -32378 1916 32374 -35537 2548 31051 -35141 6432
291 6432 30728 -36761 6925 28076 -36218 10459 26187 -38150 11612 24573 -37550 15283
303A5283Q535o2490N3861N980n9398N5662K114n6687N6990k387n5203N8977o613
316A4624n2281O1233r576n0642O0528j2791m6774O1995j7343m3667O1832k2027
328E111l9247O4418k5329l8087O3076k8912l3989O4137l0530l0854O2528l5083
340b761k6992O2947l7518k4240O2426m0209k1195O1239m0872j7975N8650m2381
352h881j4261N5285m3724r398N4154m5234o890N0575m5762l485M8145m5039K30
365a4285M3623m5803M742M0373m6188P739L6738m6340J1555L4784m6449J3450
377f061L1396m5371J6275K7810m5073J8145K5496m2864J9919K2701m3262J9941
389i48K0543l9448K1050J7326l7744K0751J5162l4910K1523J1524l2513K0690
$$ plain form
303 15283 23818 -38672 15189 21169 -38229 17433 19547 -37140 19850 17463 -37740 21237 14624
316 14624 -37657 23576 14000 -36642 23886 11095 -35679 26316 8973 -34694 27138 5111
328 5111 -34136 30282 4953 -33134 29942 1030 -32959 31178 648 -30206 32322 -2761
340 -2761 -29753 33194 -4324 -28564 33862 -6347 -27542 33697 -7175 -25150 33500 -8881
352 -8881 -23142 32143 -11581 -20979 33175 -12059 -18949 31626 -14136 -17621 30524 -14515 -14285
365 -14285 29338 -16465 -11723 28650 -17538 -9799 26939 -19401 -7846 26938 -19511 -6061
377 -6061 25335 -20036 -3761 24049 -21024 -2879 22617 -20247 -328 22373 -20889 -948
389 -948 19595 -19853 1197 18523 -19221 1530 16692 -18218 3305 14829 -17684 3006
401C006R915k9048K0299P117k6096J9638M725k3383J8488K601k0054J8840R10
414F958j8239J6611o15j6164J7590j399j4301J5966l441j2689J6553m269j1537
427h976J5721n088j0603J5836n239r607J5189n840r274J4110o268p479J5180o677
441I85p681J3365p641o107J4367p020n970J2317q474m206J3605q237m340J1862
455F825j0164k419J4225j0554k344J2826j2893r35J4997j3918o19J5160j5991
468e804N89J7231j8846J279J8521k1471L084K0094k4815M537K2130k8243P187
481d527K2703l3125J0249K3984l5540J3933K3144m0108J7570K3052m2472K1883
493G46K1154m6290K6488K0107m8241L0838J8012n1654L5131J6818n4324M0450
$$ plain form
401 3006 12921 -16127 4172 11289 -14807 4831 9556 -13827 4661 7262 -12792 6048 6958
414 6958 -11281 5330 4715 -11449 6141 4742 -9559 6407 2966 -9723 6830 2561 -8976
427 -8976 6745 1657 -8946 6890 1651 -7956 7233 1393 -7881 6229 -39 -7518 7662 985
441 985 -6696 6669 -972 -7079 7288 268 -5702 6615 -1859 -6065 7540 -697 -5037 6825
455 6825 -3339 -5758 8467 -2087 -4431 8395 -4498 -5433 9564 -4354 -4973 10187 -5804
468 -5804 -5215 12016 -6830 -5551 12970 -8501 -5417 14677 -10138 -5601 16529 -11714 -4527
481 -4527 18176 -14949 -4700 19284 -16256 -2323 20821 -19287 -1717 21335 -21137 746
493 746 21900 -24390 2098 22205 -26036 4802 22814 -28840 6291 23109 -31215 9235
505I235J4699n7914M4985J2348o0126N0708R913o3454N6585O635o6552O3375L129
518B3566o9302O9367j201p1324P6349n885p2069Q2341j2998p1980Q8708j9060
530A6512p0505R4190k7027o8473R9506l4467o5218J03896m2729o1790J07858m9531
542B222n7429J11328n8134n3052J14059o5234m7704J16604p2958m2693J19088
553F6097q0770l7589J21023q7421l2080J22428r4708k6114J23668j01809j9794
564d7069J23954j08855j3016J23391j14934m364J21439j22002L550J18768j27607
575d6745J3484J15324j33681K2769J11154j38534L2199J05794j42882M2479R9127
586H0488j45950N2363R2458j48725O1355Q5732j50758O9931P9370j51817P7242
$$ plain form
505 9235 23934 -33980 11005 23353 -36773 13935 23848 -39606 16979 23614 -42938 20437 23566
518 23566 -45736 23631 22430 -48894 27455 21570 -50499 31842 18844 -53136 35572 16512
530 16512 -53993 40197 13170 -55303 44203 9736 -55482 48414 5685 -56105 51753 2222
542 2222 -55207 56121 -2013 -55065 58994 -6240 -53944 62660 -10298 -52991 66097
553 66097 -14673 -52262 68761 -18660 -50740 71688 -23020 -49134 74534 -27275 -47069
564 -47069 76885 -31970 -44986 78405 -36529 -40893 80546 -41456 -37906 80862 -46745
575 -46745 -33261 82063 -51618 -28849 82305 -56229 -24030 81764 -61118 -18639 80488
586 80488 -65462 -13099 79359 -69366 -8011 77721 -73037 -3106 76264 -75553 1689
597A689P2454j52334Q4585O5222j52267R2128N7524j51894R9238N0211j51236
608h4680J05616M2191j49161J11827L3066j45662J17883K3584j42641J24808J3018
619D9849j38055J29866L199j32516J33759o713j26370J38021j7236j19428J40767
630E5143k7541j11863J43417l6262j04951J44089m4193r7807J44191n1104q9504
641g6385J42821n8793q1719J42604o6003p2946J40812p2332o5477J38198p7096
652f316n6941J34588q2146m8256J30123q6799l8983J26649r1549l1416J22207
663G1161r5054k2687J17520r7790j4557J10435r9622o547J05399j01834R43R9261
675F6628j03151P679R3546j02134J2980Q6094j00764J9061P8429r8574K4421P0966
$$ plain form
597 1689 74143 -78191 6394 71616 -80651 11477 69001 -82893 16345 66556 -84680
608 -84680 20936 63127 -86034 25793 58859 -86803 31080 54664 -87977 36831 49849
619 49849 -88206 41660 44859 -87657 46102 39389 -86981 51040 33804 -85624 55143
630 55143 27602 -84261 59156 22894 -82057 62032 17839 -79968 64223 13119 -76385
641 -76385 66436 7643 -74076 68528 2525 -70421 70391 -1941 -67418 70780 -6316
652 -6316 -63257 71331 -10815 -59071 71052 -15747 -54730 71919 -19630 -51046 71161
663 71161 -23893 -46580 70940 -26850 -41407 69028 -30594 -37141 68258 -33576 -32633 66628
675 66628 -36523 -28844 64702 -37432 -24452 61642 -39122 -20061 58368 -40206 -15785 55181
687E5181r6225K8805O4423r2785L1295N7429q7887L3979M9712q3401L7051M1910
699C9487p7479L9418L4628p3798M0642K9240o7955M1975K2267o2235M1182J6671
711B4043n5603M1634J0621n1242M1165O796m5172L9241L501m0404L6410O10l3578
724b1978L3299k544k7924L0049m322k2560K5938m885j8243K1045m564j3165J6064
737F210m700p775J0936m194l822N738k684P0M55o98K717n445K590O097j1210N518
753a97P814j6110R108Q976k0668J2851Q951k4950J7815Q704k9958K2757Q367l4043
767b0583K7852P543l8171L2544N422m0367L8061K242m3179M3635o75m5450M9265
780A8139m112m7420N3694p072m8007N8150j2083m8382O3541j6480m7759O7235
$$ plain form
687 55181 -41044 -12239 52184 -40601 -9306 48123 -39764 -5785 43927 -39474 -2423 39487
699 39487 -37992 1426 36054 -37744 2898 32138 -35817 6158 28425 -33810 7372 24043
711 24043 -31560 10074 20695 -30547 10618 17414 -27758 11483 14984 -25420 10990 11600 -21978
724 -21978 11321 8777 -19147 10902 6580 -15980 9958 5073 -13170 7875 3311 -9854 6210
737 6210 1510 -6265 4671 477 -3345 2393 -291 -221 234 -464 2253 -3192 -602 5495 -5715 -197
753 -197 7617 -8493 615 9591 -11077 1774 10725 -14225 3590 12294 -17664 5093 13460 -20583
767 -20583 7269 14812 -23359 9185 14607 -25760 12301 14543 -28636 14999 14324 -31126 18139
780 18139 14027 -33393 20301 13229 -34778 23372 11289 -37093 26448 9968 -37791 29444
792B9444k1163m7545P1397k5953m5333P4166l1272m3322P6931l6015m0733P9036
804C9638m1475l7380Q1451m6795l3440Q2169n1711k9218Q2587n6679k4353Q2714
816D7508o1297j9512Q2136o5816j4524Q1282o9719r211P9480p3632l480P7574
828E0789p6408K000P3927p9109P548P1856q1571J3428O7153q3229J8375O4293
840D9052q4141K3169N9628q4991K8341N5407q5252L2760N0311q4619L7611M5445
852D2721q3918M1477M0457q2632M5000L5213q0838M8009L0698p8403N0678K4885
864C3347p6281N3532K0224p2923N5080J5559p0112N5886J1051o5776N7252N629
876B2468o2201N7837J486n7760N8395k713n4744N7804n946n0173N7938j0422m5680
$$ plain form
792 29444 8281 -39264 32133 6180 -39153 35013 3741 -39581 37350 1335 -39398 39638
804 39638 -1837 -39217 42234 -4561 -38001 44168 -7543 -36761 45826 -10853 -35206 47508
816 47508 -13789 -33301 48835 -16981 -31505 49777 -19942 -29153 50327 -23305 -26785 50789
828 50789 -25619 -23619 50308 -28801 -21253 50603 -30968 -17540 49613 -33616 -15241 49052
840 49052 -35089 -11920 47708 -37283 -8942 46465 -38787 -6027 44284 -40335 -2724 42721
852 42721 -41197 280 40737 -41895 3105 38318 -42520 5489 36187 -42216 8462 33347
864 33347 -42934 10598 30822 -42101 12979 28538 -41574 14312 25363 -40413 16839 22468
876 22468 -39733 18104 19590 -38170 20225 17512 -37232 20572 14626 -35547 22391 11969 -33711
889c3711N6193j3055m1452N5701j6496l7425N4267j8930l3607N2520k0788k9587
901b6370N0265k2970k5364M7972k4252k1276M5820k6229j8353M3892k7013j4603
913a8481M0949k7231j1484L7373k7532q154L5122k7489n881L2546k7444l713L0262
926A8843k6824k010K7343k5577k43K4658k4774J682K2174k4301L063K0283k2952
939h635L793J8142k1729M590J5676k0251O179J2696j9095P345J0695j7832P606
952h20R603j6271P371P121j4121P776N199j2418P727L618j1060P701K728r510
966e356O925J874q137O185J066n952N043K40m838M626m46l685L811l29l329L466
982A164l28j974J861p86p25J347j050J44J003j325P67K44q85J109o53n10J885
$$ plain form
889 -33711 22482 9427 -32025 23676 7180 -30245 24022 5092 -28515 24005 3217 -26370
901 -26370 23895 925 -24439 23533 -719 -21995 23825 -2404 -20757 23135 -3878 -18481
913 -18481 22468 -4763 -16247 21126 -6406 -14560 20562 -6927 -12808 19738 -7706 -11419 18843
926 18843 -7981 -9991 17352 -8225 -8468 16190 -8584 -6902 15272 -9029 -5966 14317 -8635
939 -8635 -4842 13300 -8429 -3839 11837 -8414 -2235 10461 -8634 -1289 9406 -8426 -820
952 -820 8783 -7488 -117 7004 -7117 659 5858 -6560 1167 4785 -6275 1426 4154 -5356
966 -5356 1569 3443 -4694 1491 2557 -3395 1648 1888 -2950 1676 1230 -2455 1356 1027 -2302 1164
982 1164 836 -1138 723 -63 -788 559 -491 -347 656 -669 98 342 -543 566 -87 -597 1288
999A288j878p06L225k752L0L130l849N03L428m913K631K804o374L695L194q178
1015d722N420L425r197O307K637r453P654J736r802Q435J084j0130R472Q90j0040
1030f284R295M02r939R595M8r486R703j66r249R511o86q798R597j152q423R680
1046C648j254p854R392k642o859R738l351n766R619m279n302R499m636m281Q909
1061D581n558l070Q332n395k086P535n518j659O596n069p26N301m592m34M237
1076B475l252J29K090k026q9J085l52Q6o42Q64K33k026K981o06l874M522l47m644
1094c393O378j613o125P974k331n882R722l636p371J1639m822p547J3963o456
1108E00q408J5423p909p828J7724j0221q462J9493j1931q148K1745j4382p985
$$ plain form
999 1288 -590 -1296 1929 -823 -793 2337 -1512 -1009 2419 -2494 137 2941 -3433 262 3456 -4722
1015 -4722 698 4123 -5074 1233 3870 -5583 2071 3807 -5995 2440 3524 -6606 2866 3756 -6284
1030 -6284 3011 3413 -6526 3069 3117 -6369 3334 3168 -6081 3430 2744 -6054 3543 2391 -6032 3648
1046 3648 2394 -5460 3932 1290 -5569 4169 818 -4948 4671 392 -4910 4589 -47 -4328 4581
1061 4581 -977 -4047 4285 -1110 -3196 4339 -1179 -2838 3758 -1311 -2037 3264 -1328 -1762 2475
1076 2475 -777 -648 1442 -584 -673 412 60 146 -496 368 601 -1425 1556 950 -2924 1598 1251 -3393
1094 -3393 2985 1372 -4753 3221 890 -4992 4730 1094 -6277 5362 540 -7007 6956 500
1108 500 -7908 7515 -394 -8222 9502 -719 -9181 10312 -1619 -9767 11978 -2404 -10389
1121a0389K4096j7201p145K5627j9672o307K7246k2395m653K8617k5373l065K9600
1134A8986k7862j230L0001l0958J287L1025l3039L179L0338l5726O081L0189l8080
1147a5809R170K9711m0218J1863K8372m1802J4746K7598m3958J7599K6355m5700
1159b2073K1112K4441m6762K3553K2654m7690K6957K0422m8192K9606J7795m8794
1171b6971L2469J5461m8502L4995J2343m7889L7268R557m7138L9288O359m5736
1183b8496M0932L035m4018M2475J08m2220M3485l129m0001M4135n967l7067M4659
1196A7931r045l5004M4067j1285l1615M3867j3894k8810M3059j5724k6013M2138
1208A9672j7725k3175M0819j8992k0385L9418k0223j7499L7243k1144j4870L5348
$$ plain form
1121 -10389 13707 -3494 -10639 14988 -4684 -10991 16255 -6140 -10793 17824 -7549 -10614 18986
1134 18986 -8876 -10106 19895 -11063 -9776 21249 -11790 -8611 21727 -13999 -7918 22271 -15809
1147 -15809 -6639 23072 -17146 -5283 23089 -18713 -3967 23631 -20327 -2728 23627 -22073
1159 -22073 -961 23480 -23282 271 22925 -24765 2192 22614 -25578 4028 21823 -26971
1171 -26971 5498 20959 -27543 7452 19795 -28094 9174 18731 -28407 10881 17240 -28496
1183 -28496 12436 15471 -28547 13928 14036 -28184 15301 12172 -27829 16306 10339 -26728 17931
1196 17931 8886 -26118 17949 6664 -24951 18916 5022 -23788 19271 3547 -22466 19672
1208 19672 1947 -21228 19591 599 -19786 19632 -591 -18090 19153 -1991 -16861 18487
1220A8487k1402j2189L3051k1643r313K9934k1913o893K7665k0911m547K4267
1232A4593k0198k562K1935j9749q46J9222j8577N82J6379j6430J529J3651j5017
1245e488K414J0816j2911K821Q947j0790K631O837r251K876N064o655K211L141
1259B663m629J558J838k119M30M07k39k33n59K412j818j321M436l561j793O211
1275C683n012j718P885o214j961R224q079j833J0618r687r97J1740j1217m85J2729
1290H676j2919j5J3192j4693J694J3714j5387K618J3202j7058L963J3615j8766
1303h164N500J3514j9638O827J3367k1099Q409J2312k1786J0101J1994k2320J1287
1316C04J0938k3038J2350J0721k3351J3481Q999k2969J4968P819k2819J5674O223
$$ plain form
1220 18487 -2915 -15104 17947 -3696 -13009 16925 -4988 -11881 15784 -5127 -9674 14593
1232 14593 -5605 -8167 13768 -5981 -6827 12395 -6182 -5600 10779 -5651 -4122 9529 -5488
1245 -5488 -3074 7742 -5169 -2348 6599 -4191 -1560 5277 -3974 -1098 3966 -2689 -478 2663
1259 2663 -1966 -408 1430 -689 -259 148 -91 -324 -883 1529 -289 -1610 2826 -735 -2528 3683
1275 3683 -1329 -3047 4838 -1376 -3337 5887 -2192 -4025 6593 -3094 -4091 7649 -3568 -4053 8676
1290 8676 -4243 -4258 8934 -5759 -4065 9649 -5738 -3120 10082 -6976 -3013 10602 -8164
1303 -8164 -2664 10850 -8788 -1961 11406 -9693 -1284 11028 -10758 -657 11337 -10983 304
1316 304 11242 -11796 554 11275 -12076 1405 10404 -12565 2403 10222 -12597 3077 9300
1329I300k2620J7035N182k1934J7477L970k1302J8110K312k0347J8750M18j9273
1342a2922J9509p32j8469J9774k007j7709K0166l629j6142K0428m746j5229K0782
1355I074o376j4315K0352o824j2931K0539p982j2164K0187q775j0958J9931r950
1368a92r464J9689j0925q298J9521j1481p197J8242j1755o244J8089j2437m504
1381f956J7129j3584l395J6928j4069k169J6283j4591r21J5581j4910k22J5012
1394A0116j5741R59J4507j5784J856J4096j6216K809J3292j6521L555J2981j7141
1407g232N276J1526j7088N853J1148j7695P141J0465j8009Q203R204j7610Q837
1420A9Q607j7700R815P620j7876J1013O727j7685J1960N208j7772J2714M710j7523
$$ plain form
1329 9300 -13320 3715 8897 -13037 4440 8410 -12892 5218 7530 -12817 5933 6351 -12922
1342 -12922 6587 5855 -12614 7160 5153 -12556 7610 3981 -12161 8267 3521 -11708 9074
1355 9074 2698 -11617 8735 1911 -11020 9519 1537 -10627 9560 785 -10173 9758 -192
1368 -192 -9656 10033 -892 -9190 10331 -1150 -8347 9895 -1860 -8104 9985 -2452 -6956
1381 -6956 10173 -3411 -6806 10122 -3947 -6116 10167 -4424 -5345 10236 -4674 -4896 10116
1394 10116 -5625 -4666 9841 -5943 -4087 10009 -6207 -3398 9894 -6627 -3072 9909 -7232
1407 -7232 -1956 9570 -7518 -1665 9483 -8212 -1071 9394 -8615 -412 8792 -8818 19
1420 19 8626 -9074 741 8361 -9515 1498 8225 -9460 2500 7708 -10064 2650 7360 -10163
1434a0163J3574L416j7212J4457K151j6765J5104J371j6665J5885M14j6219J6646
1447E994j020j5817J7344k404j5247J7957l367j3812J8191m755j3436J8547o172
$$ plain form
1434 -10163 3411 6827 -10385 4072 6223 -10542 4562 5933 -10732 5153 5567 -10652 5994
1447 5994 4974 -10843 6501 4097 -11150 6807 3440 -10372 7819 3064 -10372 8175 2003
$$ [...]
8191a73
##END NTUPLES=NMR FID
##END=
