##TITLE=1H_Pr 4989-23
 CDCl3, 8 sc, 
 23.9.2020
##JCAMPDX= 6.0         $$ Bruker NMR JCAMP-DX V2.0
##DATA TYPE= NMR FID
##DATA CLASS= NTUPLES
##ORIGIN= UXNMR, Bruker Analytische Messtechnik GmbH
##OWNER= root
$$ XWIN-NMR		Version 3.5
$$ Wed Sep 23 09:44:02 2020 Russian Standard Time (UT+4h)  she@DPX200
##.OBSERVE FREQUENCY= 200.1315066352
##.OBSERVE NUCLEUS= ^1H
##.DELAY= (6, 6)
##.ACQUISITION MODE= SIMULTANEOUS
##.ACQUISITION SCHEME= undefined
##.AVERAGES= 8
##.DIGITISER RES= 18
##SPECTROMETER/DATA SYSTEM= spect
##.PULSE SEQUENCE= zg30
##.SOLVENT NAME= CDCl3
##.SHIFT REFERENCE= (INTERNAL, CDCl3, 0, 15.7039)
##AUDIT TRAIL= $$ (NUMBER, WHEN, WHO, WHERE, WHAT)
$$ ##TITLE= Audit trail, XWIN-NMR		Version 3.5
$$ ##JCAMPDX= 5.01
$$ ##ORIGIN= Bruker BioSpin GmbH
$$ ##OWNER= she
$$ F:/spectra/data/she/nmr/H-F/1/audita.txt
$$ ##AUDIT TRAIL=  $$ (NUMBER, WHEN, WHO, WHERE, WHAT)
(   1,<2020-09-23 09:42:57.04 +0400>,<she>,<DPX200>,
      <created by zg, POWCHK disabled, PULCHK disabled
       configuration hash MD5:
       00 E9 B6 7A A2 85 ED C7 34 08 36 98 17 FE 4E 26
       data hash MD5: 16K
       B6 9F DE D1 AD 1D C6 3C 92 E6 08 3F 40 25 87 A1>)
$$ ##END=
$$ 
$$ hash MD5
$$ D8 6A EE 63 BA 87 6F EC 93 92 54 2A A6 0F 1C F1
##$RELAX= 
##$RELAX= 
##$RELAX= 
##$RELAX= 
##$RELAX= 
##$RELAX= 
$$ Bruker specific parameters
$$ --------------------------
##$DU= <F:/spectra>
##$EXPNO= 1
##$NAME= <H-F>
##$PROCNO= 1
##$TYPE= <nmr>
##$USER= <she>
##$AMP= (0..31)
100 100 100 100 100 100 100 100 100 100 100 100 100 100 100 100 100 100 
100 100 100 100 100 100 100 100 100 100 100 100 100 100 
##$AQSEQ= 0
##$AQ_mod= 1
##$AUNM= <au_zg>
##$AUTOPOS= <>
##$BF1= 200.13
##$BF2= 200.13
##$BF3= 200.13
##$BF4= 200.13
##$BF5= 200.13
##$BF6= 200.13
##$BF7= 200.13
##$BF8= 200.13
##$BYTORDA= 1
##$CFDGTYP= 0
##$CFRGTYP= 5
##$CHEMSTR= <none>
##$CNST= (0..31)
1 1 145 1 1 1 1 1 1 1 1 1 1 1 1 1 1 1 1 1 1 1 1 1 1 1 1 1 1 1 1 1 
##$CPDPRG= <>
##$CPDPRG1= <>
##$CPDPRG2= <>
##$CPDPRG3= <>
##$CPDPRG4= <mlev>
##$CPDPRG5= <mlev>
##$CPDPRG6= <mlev>
##$CPDPRG7= <mlev>
##$CPDPRG8= <mlev>
##$CPDPRGB= <>
##$CPDPRGT= <>
##$D= (0..31)
0 1.2 0 0 0 0 0 0 0 0.06 0 0.03 0 0 0 0 0.0002 0 0 0 0 0 0 0 0 0 0 0 0 
0 0 0 
##$DATE= 1600839776
##$DBL= (0..7)
120 120 120 120 120 120 120 120 
##$DBP= (0..7)
150 150 150 150 150 150 150 150 
##$DBP07= 0
##$DBPNAM0= <>
##$DBPNAM1= <>
##$DBPNAM2= <>
##$DBPNAM3= <>
##$DBPNAM4= <>
##$DBPNAM5= <>
##$DBPNAM6= <>
##$DBPNAM7= <>
##$DBPOAL= (0..7)
0.5 0.5 0.5 0.5 0.5 0.5 0.5 0.5 
##$DBPOFFS= (0..7)
0 0 0 0 0 0 0 0 
##$DE= 6
##$DECBNUC= <off>
##$DECIM= 32
##$DECNUC= <off>
##$DECSTAT= 4
##$DIGMOD= 1
##$DIGTYP= 9
##$DL= (0..7)
0 120 120 120 120 120 120 120 
##$DP= (0..7)
150 150 150 150 150 150 150 150 
##$DP07= 0
##$DPNAME0= <>
##$DPNAME1= <>
##$DPNAME2= <>
##$DPNAME3= <>
##$DPNAME4= <>
##$DPNAME5= <>
##$DPNAME6= <>
##$DPNAME7= <>
##$DPOAL= (0..7)
0.5 0.5 0.5 0.5 0.5 0.5 0.5 0.5 
##$DPOFFS= (0..7)
0 0 0 0 0 0 0 0 
##$DQDMODE= 0
##$DR= 18
##$DS= 0
##$DSLIST= <SSSSSSSSSSSSSSS>
$$ [...]
##$SUBNAM2= <"">
##$SUBNAM3= <"">
##$SUBNAM4= <"">
##$SUBNAM5= <"">
##$SUBNAM6= <"">
##$SUBNAM7= <"">
##$SUBNAM8= <"">
##$SUBNAM9= <"">
##$SW= 16.880792210976
##$SWIBOX= (0..15)
0 0 2 0 0 0 0 0 0 0 0 0 0 0 0 0 
##$SW_h= 3378.37837837838
##$TD= 16384
##$TD0= 1
##$TE= 0
##$TE2= 300
##$TE3= 300
##$TEG= 300
##$TL= (0..7)
0 120 120 120 120 120 120 120 
##$TP= (0..7)
150 150 150 150 150 150 150 150 
##$TP07= 0
##$TPNAME0= <>
##$TPNAME1= <>
##$TPNAME2= <>
##$TPNAME3= <>
##$TPNAME4= <>
##$TPNAME5= <>
##$TPNAME6= <>
##$TPNAME7= <>
##$TPOAL= (0..7)
0.5 0.5 0.5 0.5 0.5 0.5 0.5 0.5 
##$TPOFFS= (0..7)
0 0 0 0 0 0 0 0 
##$TUNHIN= 0
##$TUNHOUT= 0
##$TUNXOUT= 0
##$USERA1= <user>
##$USERA2= <user>
##$USERA3= <user>
##$USERA4= <user>
##$USERA5= <user>
##$V9= 5
##$VALIST= <valist>
##$VCLIST= <CCCCCCCCCCCCCCC>
##$VD= 0
##$VDLIST= <DDDDDDDDDDDDDDD>
##$VPLIST= <PPPPPPPPPPPPPPP>
##$VTLIST= <TTTTTTTTTTTTTTT>
##$WBST= 1024
##$WBSW= 4
##$XGAIN= (0..3)
0 0 0 0 
##$XL= 0
##$YL= 0
##$YMAX_a= 208074
##$YMIN_a= -192275
##$ZGOPTNS= <>
##$ZL1= 120
##$ZL2= 120
##$ZL3= 120
##$ZL4= 120
##$ABSF1= 10
##$ABSF2= 0
##$ABSG= 5
##$ABSL= 3
##$ALPHA= 0
##$AQORDER= 0
##$ASSFAC= 0
##$ASSFACI= 0
##$ASSFACX= 0
##$ASSWID= 0
##$AUNMP= <proc_1d>
##$AZFE= 0.1
##$AZFW= 0.1
##$BCFW= 1
##$BC_mod= 2
##$BYTORDP= 1
##$COROFFS= 0
##$CY= 11.3945322036743
##$DATMOD= 1
##$DC= 2
##$DFILT= <>
##$DTYPP= 0
##$F1P= 16.9975609425685
##$F2P= -3.02152046262296
##$FCOR= 0.5
##$FTSIZE= 0
##$FT_mod= 4
##$GAMMA= 1
##$GB= 0.15
##$INTBC= 1
##$INTSCL= 1
##$ISEN= 128
##$LB= 0.24
##$LEV0= 0
##$LPBIN= 0
##$MAXI= 10000
##$MC2= 0
##$MEAN= 0
##$ME_mod= 0
##$MI= 1.114404
##$NCOEF= 0
##$NC_proc= 0
##$NLEV= 6
##$NOISF1= 3.799351
##$NOISF2= 2.8
##$NSP= 1
##$NTH_PI= 0
##$NZP= 0
##$OFFSET= 15.70392
##$PC= 1
##$PHC0= -9973.97
##$PHC1= 17.4009
##$PH_mod= 1
##$PKNL= yes
##$PPARMOD= 0
##$PSCAL= 0
##$PSIGN= 0
##$REVERSE= no
##$SF= 200.130013532006
##$SI= 16384
##$SIGF1= 3
##$SIGF2= 2
##$SINO= 400
##$SIOLD= 16384
##$SREGLST= <1H.CDCl3>
##$SSB= 0
##$STSI= 0
##$STSR= 0
##$SW_p= 3612.71676300578
##$SYMM= 0
##$S_DEV= 0
##$TDeff= 0
##$TDoff= 0
##$TI= <>
##$TILT= no
##$TM1= 0
##$TM2= 0
##$TOPLEV= 0
##$USERP1= <user>
##$USERP2= <user>
##$USERP3= <user>
##$USERP4= <user>
##$USERP5= <user>
##$WDW= 1
##$XDIM= 8192
##$YMAX_p= 0
##$YMIN_p= 0
$$ End of Bruker specific parameters
$$ ---------------------------------
##NTUPLES= NMR FID
##VAR_NAME=  TIME,          FID/REAL,        FID/IMAG
##SYMBOL=    X,             R,               I
##VAR_TYPE=  INDEPENDENT,   DEPENDENT,       DEPENDENT
##VAR_FORM=  AFFN,          ASDF,            ASDF
##VAR_DIM=   8192,          8192,            8192
##UNITS=     SECONDS,       ARBITRARY UNITS, ARBITRARY UNITS
##FACTOR=    0.000296,      1,               1
##FIRST=     0,             0,               0
##LAST=      2.424536,      0,               0
##MIN=       0,             -192275,         0
##MAX=       2.424536,      208074,          0
$$ Real data points
##PAGE= N=1
##DATA TABLE= (X++(R..R)), XYDATA
0@%%%%%%%%%%%%%%%Qj6J6j6J9k7L2l5M3n2O0p0P8q8J04j20J36j52J69j88K11k35
37a23K60k88L18l50L86m25M65n09N56o07O65p27P91q62R41j030J127j234J357
56G11j496J655j841K060k320K636l029L529m190N110o488Q810j3750K3362J75111
71A89870k65903m8302L32409l01162j3270K98651k80543q816K82859k80686P493
82h7400K67347k71835O520K60732k67467J1740K48095k53549O978K42843k53331
93h9327K0233K24193k43109K4584K12519k37495L1166K03088k36877M0598J89675
104A39248k30485M5839J80611k26105M9985J68973k13404M5882J60085k02098
114h1469M6338J46820j90218N1511J29144j77355N0863J23734j76498N7204J14638
$$ y = [0, 0, 0, 0, 0, 0, 0, 0, 0, 0, 0, 0, 0, 0, 0, 0, 8, -8, 8, -8, 11, -16, 16, -19, 24, -28, 32, -38, 40, -48, 56, -64, 72, -80, 89, -99, 112, -123, 137, -151, 167, -183, 203, -222, 243, -266, 290, -317, 348, -379, 412, -450, 491, -539, 588, -646, 711, -785, 870, -971, 1089, -1231, 1405, -1624, 1905, -2285, 2825, -3663, 5147, -8603, 14759, 189870, -76033, -124335, 208074, -93088, -106358, 192293, -88250, -97066, 185793, -94893, -87400, 179947, -91888, -85368, 175364, -92103, -80363, 167732, -85817, -78839, 164004, -89327, -69094, 155099, -88010, -63426, 149093, -88402, -57236, 145852, -91025, -50427, 139248, -91237, -45398, 135213, -90892, -40907, 128066, -85338, -39456, 120629, -81469, -35131, 111689, -78529, -27018, 102126, -75229, -24366, 99368, -77130, -19926, 94712]
125I4712j68926N6686J06139j58767N6103R3319j44245N5107Q0291j30401N2970
136g012P1996j22988N4926O0159j09679M9165N6254j00643M4496N2760r4731M3489
148a808M6122q5600L9055M2821p7523L5373L6793o6439K8933L2375n8326K8705
160D81K4312m9857K7382J7870m0705K0391J8949l6433J7079J5323k7116J0953
172a371J2186j8858O736Q121j1712L670O190q438K539N464p399K129K673j598
186C32l358M438J196o500M475L837q337J463R631j1844J116J3052j4808P78J4957
201A0428j6486J144J5945j7339N82J9308k1644J880K1982k6133M379K1823k5936
214a0067L314K3881k7580L891K4023k9180O049K2823k9400P862K1347k9459Q393
$$ y = [94712, -74214, -17528, 88611, -70156, -14053, 79266, -64979, -9872, 70419, -59982, -7012, 64984, -58004, -3078, 57081, -52598, -3433, 52821, -47822, -3326, 49434, -45297, -1808, 44314, -41286, -2231, 40590, -36933, -1560, 35233, -31206, -2273, 30102, -28224, 481, 24793, -25064, 2318, 20188, -20517, -126, 18823, -17610, -531, 14792, -12324, -1371, 10815, -8043, -1307, 6814, -4898, -1228, 4962, -3476, -937, 4527, -2872, -743, 1930, 332, -3026, 1412, 2608, -3892, 583, 4420, -3917, -2454, 7177, -4667, -3551, 9501, -5307, -4529, 10428, -6058, -4914, 11031, -6308, -5726, 13582, -8062, -6182, 15800, -10333, -5954, 15869, -10067, -6753, 17128, -10452, -6561, 17462, -11718, -5669, 17154, -12246, -4384, 16963, -12496, -4103]
227d103K1037k9725Q033K3011l2404J0266K1430l1099R946K0833l0159Q443K1957
240A7466l1155J0242K0801l1276J1067J9945l1581J2099J9566l1313J0988K0871
252A7720l2160J2142J9246l1981J3901J6601k9752J2877J7130l0257J3597J6794
264A5858l0761J4263J5722k9599J4344J4429k8246J4031J3706k8153J4708J3663
276A3965k8981J6680J1185k7067J5823J1044k6185J4837J1225k6651J6554R678
288A2107k6737J7592Q399k5574J6855Q734k5533J6730R102k6190J7924P336k5457
301a4712J8684O368k4627J7763P349k5655J8707O745k4972J8776M974k3430J8598
314D568M440k2605J8519M158k3393J9636L816k3798K0724K161k1873J9572K314
$$ y = [-4103, 16934, -12791, -4758, 18253, -14151, -3885, 17545, -13554, -3608, 17225, -12934, -4491, 17466, -13689, -3447, 17354, -13922, -2855, 17090, -14491, -2392, 17174, -14139, -3151, 17720, -14440, -2298, 16948, -15033, -1132, 15469, -14283, -1406, 15724, -14533, -936, 15858, -14903, -640, 15082, -14517, -173, 14256, -13990, 41, 13747, -14406, 302, 13965, -15016, 1664, 12849, -14218, 1605, 12649, -13536, 1301, 12526, -14125, 2429, 12107, -14630, 2962, 11361, -14213, 2642, 11376, -14157, 2573, 11675, -14515, 3409, 10745, -14712, 3972, 10340, -14287, 3476, 10825, -14830, 3877, 10622, -14350, 4426, 9400, -14030, 4568, 9008, -13597, 4922, 9080, -14313, 5323, 9139, -14659, 6065, 8226, -13647, 5925, 8239]
327H239k2049K0148J563k2285K1642L5k1854K1903q8k1400K0789K57k0726K0707
341F881J92k1266K1579j365j9604K0766r28j9316J9244M35j9287J9272j344j7191
355a1932J8876k520j5586J7811k341j5269J7747k427j5360J8006l464j3800J7180
368F921m615j1608J5934m096j2068J7090n435j1571J7055n834j0491J5531m952
381A861j0127J4727m872r706J4266m551r458J3997m911q135J2236l882p866J1211
395D790l720p525J1631m835n928J0406m404n615R618m069m862Q720l793m797Q510
410D127m423l385P726m560k416O150k981m048P374l704l245O918l867l041O405
425C030k921l431O758l559l262O863l580l439P498m685k059O092l480k893O693
$$ y = [8239, -13810, 6338, 7901, -14384, 7258, 7293, -14561, 7342, 7254, -14146, 6643, 6900, -13826, 6881, 7073, -14193, 7386, 6021, -13583, 7183, 6255, -13061, 6183, 6618, -12669, 6603, 5259, -11932, 6944, 4424, -11162, 6649, 4308, -10961, 6786, 4359, -11001, 7005, 3541, -10259, 6921, 2306, -9302, 6632, 2536, -9532, 7558, 2123, -9448, 7607, 1773, -8718, 6813, 1861, -8266, 6461, 1589, -8117, 6149, 1598, -7860, 6137, 1226, -6909, 5327, 1445, -6421, 4790, 1070, -6455, 5176, 341, -5587, 4819, 415, -5200, 4418, 349, -4513, 4207, 414, -4383, 4127, -296, -3681, 4045, -515, -2931, 3219, 238, -3810, 3564, -140, -3385, 3533, -334, -3375, 3030, 109, -3322, 3436, -123, -3385, 3478, -102, -3541, 3957, -728, -2787, 3305, -175, -3068, 3625]
440C625m186k910P951n659j753O491m333k356P495n397j818P202n974j435Q200
455E143p630l46Q417q316k08Q567p952j632J0895j0265k00J0401j0133l33J0643
470G051j0532k50J1217j1617M16J1991j3108Q80J3492j5167J786J3207j5069J097
484d606J5627j7993K740J5816k0048N215J5476k1235N318J7634k4395P097J7734
497A4380k5446P650J8926k7758R699J7705k8302J0808J7525k8835J1836J8293
509A6481l1967J4978J6893l2401J5350J7614l3623J5713J8909l5262J6397J9748
521A8830l7159J7506K0297l8763J9580J9401l9823K0435K0295m2767K3765J9436
533B1033m4228K6174J7343m3673K6863J7018m5075K9290J5159m4999L0700J3978
$$ y = [3625, -561, -3471, 4480, -1179, -2932, 3559, -774, -3130, 4365, -1032, -2850, 4352, -1622, -3057, 5143, -2487, -2833, 5584, -2732, -2940, 5627, -2325, -3957, 6938, -3327, -3527, 6874, -3259, -3592, 7051, -3481, -3731, 7486, -4131, -3715, 8276, -4832, -3952, 9540, -5627, -3841, 9366, -5703, -4606, 11021, -6972, -4232, 11584, -8464, -3249, 12227, -9008, -3690, 13944, -10451, -3354, 14380, -11066, -3416, 15510, -12248, -2549, 15156, -13146, -2338, 15187, -13648, -1812, 16481, -15486, -508, 16385, -16016, -666, 16948, -16675, -962, 17947, -17315, -918, 18830, -18329, -823, 19474, -19289, 291, 19692, -20131, 304, 20599, -22168, 1597, 21033, -23195, 2979, 20322, -23351, 3512, 20530, -24545, 4745, 19904, -25095, 5605, 19583]
545A9583m5621L3084J1795m5067L3556J1986m6419L5100J2233m8538L7313J0585
557A9590m7940L7388J0807m9342L9379R558m9604M1448P497m9599M3659M972m8304
570c0491M4002L033m6755M4004K615m6796M5239K40m5044M5086n34m4528M4780
583A4851J85m5619M6490j758m4550M7036k918m4664M8912n635m2932M8747o001
596A2144m2871M9566p447m1719M9581r617l8084M7641j0123l7533M8547j1813
608H272l6671M8867j2645l6525M9338j3155l5600M8989j3907l4680M8866j5409
620E740l3509N0594j8569l0721M9604j9984k8981M8749k0792k7193M7883k1832
632I89k4337M5696k1747k2719M3599k1562k0596M1066k0370j9857M0433k1201
$$ y = [19583, -26038, 7046, 18841, -26226, 7330, 19316, -27103, 7997, 20230, -28308, 9005, 19590, -28350, 9038, 19845, -29497, 9882, 19440, -30164, 11284, 18781, -30818, 12841, 17813, -30491, 13511, 16544, -30211, 13793, 16408, -30388, 14851, 15091, -29953, 15133, 14599, -29929, 14851, 15036, -30583, 15907, 14149, -30401, 16635, 13717, -30947, 17965, 12330, -30602, 18145, 12144, -30727, 18839, 11392, -30327, 19254, 9637, -28447, 19194, 9071, -28462, 20085, 8272, -28399, 20468, 7823, -28702, 20636, 7481, -28119, 20870, 6963, -27717, 21149, 5740, -27769, 22825, 4256, -26465, 23139, 3155, -25826, 22923, 2131, -25062, 22821, 989, -23348, 22348, 601, -22118, 21481, -81, -20677, 20389, 19, -19838, 20595, -606]
644f06j8425L9317k1649j7008L7961k0959j6906L8120k1785j5404L6393k1661
656b612j3239L4039k1861j0733L2838k2964r168L2006k2906q958L1602k2987p587
669a2530K9344k0937p652K7584k0197o364K6151k0345m887K4822k0298l635K2604
682A3660j8857k832K0468j7052k064J7786j5981n97J5497j4779J93J2994j2290
695c854j84J1688j1487M66R966j0191J434P757r026J725O634p395M90N771n551
710a757%M297l348K12K017j627P0K11K45m41l05J294m67k193L564j152m080O578
728C118k233n589Q258k032p055R285j720q346J0896k649r255J3021m063r704J4094
743F026l653j1133J5543m623j1994J8106o585j1759J9027p976j1478K0357q816
$$ y = [-606, -19031, 20286, -1363, -18371, 19590, -1369, -18275, 19845, -1940, -17344, 19049, -2612, -15851, 18188, -3673, -14406, 18432, -4532, -13700, 18306, -4600, -13558, 18044, -4943, -12530, 16814, -4123, -11775, 15809, -4388, -10752, 15399, -4946, -9833, 14989, -5309, -8944, 13660, -5197, -8029, 12439, -4613, -6677, 11109, -4872, -5469, 10028, -4751, -4558, 8436, -3854, -4038, 7650, -3837, -3371, 6595, -3596, -2162, 5595, -3431, -1706, 4928, -2467, -1977, 3794, -1757, -1757, 2540, -808, -596, 1421, -206, -136, 75, 320, -121, -426, 868, 401, -1792, 1772, 620, -3460, 3118, 885, -4704, 3554, 1522, -5533, 3752, 2032, -6314, 4582, 1933, -7322, 5699, 1636, -8068, 6026, 2373, -8760, 6783, 2160, -9834, 8272, 1687, -10072, 8955, 979, -10499, 9858, 1042]
756A042j2809K2194r463j2941K3501j1370j2145K3980j2381j1814K5428j4080
768h58j2184K7733j5990j2132K8495j6652j2040K8721j6982j1566K9248j8761
780b968j0583L0089k0045j0007L0876k1532r196L0897k2003r072L1536k3022q203
793a3233L1899k4586p035L1783k4999o527L1621k5435n910L2059k6871m901L1935
806A9800k7729l926L1346k7819k889L1091k8299k597L0654k8590j529K9976k8850
819i361n12K9075k8647J49K8089k8945J372K7845k9507K369K6560k9062L287K5116
833A7828k8241L380K4407k8206M587K3078k7614N351K1729k7140N858K0836k6468
846a0615N808K0300k6221O598J9068k5892P723J7075k4389P476J6540k4107P957
$$ y = [1042, -11767, 10427, 964, -11977, 11524, 154, -11991, 11989, -392, -12206, 13222, -858, -13042, 14691, -1299, -13431, 15064, -1588, -13628, 15093, -1889, -13455, 15793, -2968, -13551, 16538, -3507, -13514, 17362, -4170, -13366, 17531, -4472, -13544, 17992, -5030, -13233, 18666, -5920, -12955, 18828, -6171, -12698, 18923, -6512, -12422, 19637, -7234, -12135, 19800, -7929, -11855, 19491, -8328, -11217, 19874, -8425, -11022, 19632, -8958, -10487, 19489, -9361, -9873, 19202, -9445, -9296, 18793, -10152, -8780, 19065, -10442, -8073, 18487, -10575, -7288, 17828, -10413, -7033, 17374, -10832, -6245, 16833, -10781, -5430, 16299, -10841, -4983, 15853, -10615, -4807, 15493, -10728, -4130, 14938, -10954, -3231, 13844, -10545, -3069, 13471, -10636, -2679]
859b679J5846k3740Q739J4076k2367Q453J3142k1853R315J2083k0948R137J1163
872A0367k0454R724J0164j8914Q941R473j7702Q299Q742j7480R274P366j6167
885h367R114O680j5352Q646O300j4700Q001O378j4038Q605M800j3201Q586L344
899D796j0769P243L586j0717O979L351r943O976K049q253O269J520p762O083J474
914B882p221N691J479o790N482O56n521M600N92m988M586K85n065N254p94l728
930b600M126l04l273L070j37k503K465r2k502K803n21k121K606n21j544J350K81
947E83j703J707q8j231R20n05j94Q00j06k59N7K62j88l76M93K42o45l83J707j922
967h29L18J457j420K68J018j481J64J735k650J343J311k340J043J506k720J235
$$ y = [-2679, 13167, -10573, -1834, 12242, -10125, -1672, 11470, -10383, -1068, 11015, -9933, -796, 10367, -10087, -363, 9801, -9113, -172, 9301, -8401, -102, 8640, -8840, 434, 7800, -8367, 747, 7427, -7925, 721, 7021, -7679, 322, 6700, -7338, 1267, 6067, -7134, 1452, 4796, -5973, 1270, 4856, -5861, 1118, 4469, -5474, 1502, 3551, -4702, 1567, 3087, -4675, 1408, 2882, -4339, 1352, 2831, -3959, 1523, 2179, -3342, 1258, 1850, -3138, 1448, 1733, -3332, 1922, 1128, -2600, 1526, 1222, -2051, 1019, 882, -1621, 844, 752, -1750, 1053, 532, -1589, 1017, 496, -1048, 302, 583, -1120, 587, 499, -732, 188, -317, -511, 289, 183, -76, -19, 243, 55, -321, 172, 414, -231, -614, 1093, -829, -511, 946, -474, -206, 812, -669, -505, 1230, -1420, -77, 1234, -1106, -63, 1443, -1277, -42]
983d2J370k638J623O91k580K255P87l552K919O70l044J491K003l764J864J766
999A819l708J985J520l725K070J961l861J654K354m000J438K786m487K363J491
1014A660l790K949J127m346K490J971m323K776P92l265K660M13k809K661m36k025
1030a495K207J53k479K323M43k517J748J95j404Q76O98j950J852l98p35J052m75
1047I4o18P41j91k10K18m13O75p05J56P01j97j125K014j535l58J816j556m5J655
1066A117j724m14K633k337l91K962k965j27L715l618m36M152l893l17N155n456
1082a944K50N906o941J482N583p384J512O291q413K732O198r680L483O428j0224
1097d721L832O688j0645M280O173j0519L914P623j2550N106P562j2928N459P747
$$ y = [-42, 1328, -1310, 313, 1004, -1576, 679, 1466, -2086, 833, 1503, -1541, -50, 1953, -1811, 53, 1819, -1889, 96, 1616, -2109, -39, 1922, -1939, -285, 2069, -1931, -493, 2293, -2194, 169, 1660, -2130, 819, 1946, -2400, 90, 2061, -2262, 514, 1306, -1959, 701, 1114, -1695, 966, 530, -1495, 712, 865, -1614, 709, 1152, -1365, 383, 578, -826, 50, 748, -1202, 650, 252, -483, 569, 94, -524, 217, 26, -184, 34, -379, 296, -409, -253, 448, 251, -874, 1140, -395, -753, 1063, -493, -538, 1117, -607, -1021, 1612, -725, -1116, 1846, -1119, -1246, 2469, -1149, -1585, 2567, -1326, -1643, 3512, -1944, -1694, 4212, -2729, -1247, 4336, -3048, -1536, 4755, -3658, -926, 5272, -4408, -925, 5503, -4721, -889, 5799, -4846, -566, 5607, -4912, -998, 6625, -5925, -819, 6743, -6185, -726, 7021]
1111G021j3796O182P992j4607O871P936j5196P622P758j5714Q662O817j5873R067
1125G42O881j6269R907O353j6645J0502O170j6387R995O475j6620J0092O499j6826
1139i131J0671O044j6794J0926N590j6726J1548N305j7006J1898M854j7068J2902
1152C013L624j6452J2999L372j6146J2701L369j5928J2800K444j5129J3066J613
1165E346j4638J3136J229j4238J3167Q51j3415J2551O92j3119J2686j99j2111
1178h062J2156l43j1419J1701q32j0103J1040j544r241J0502j780q076R563j334
1192B228p888Q955j104p096Q078j763o035P243j416m865O171j376m547N883j706
1207G62l940N103j242l178M094o61k820L010q22j719K311q40o90J223m31k84N3
$$ y = [7021, -6775, -593, 7399, -7208, -337, 7599, -7597, 25, 7783, -7931, 731, 7548, -8325, 742, 7623, -8646, 1261, 7614, -9031, 1471, 7641, -8746, 1249, 7724, -8896, 1196, 7695, -9131, 1540, 7584, -9210, 1716, 7306, -9420, 2128, 7433, -9573, 2325, 7179, -9889, 3013, 6637, -9815, 3184, 6556, -9590, 3111, 6480, -9448, 3352, 5796, -9333, 3733, 5346, -9292, 3844, 5073, -9165, 4002, 4853, -8562, 3989, 4681, -8438, 4248, 4049, -8062, 4094, 3751, -7668, 4033, 3201, -6902, 4138, 2594, -6647, 3855, 2075, -6001, 3562, 2228, -5660, 3295, 2191, -4905, 3173, 1410, -4625, 2618, 1202, -3663, 2508, 1132, -3415, 2468, 762, -3178, 1925, 683, -2495, 1599, 938, -1882, 1128, 306, -1413, 898, 58, -632, 591, 160, -124, -71]
1224g1M2Q1r8n1R00j588N01J284k229J191J826l868K173J938m177K081K790n445
1242b720K429L294o131L289L041o815M190L031p704M665L404q710N311L516q981
1257d891N491L702r166N686L331r325O199L211r669O753K897r846P583K028r865
1272e881P762K139j0043P876K067j0200Q342J947j0439Q684J728j0105Q505J443
1286C825j0318R217J076j0524R605Q66j0316R618M61r935R333O64j0292R716K68
1301C264r712R539K71r389R243m30q963R693r65q342R153j249p856R468j597p654
1317e526R180j620p597R320k238o778R051k414o643Q886k508o034Q502k216o180
1332d815Q364k507n843Q770l246n188P723k341n439P662k295n126P565k531m633
$$ y = [-71, -29, 52, -46, -97, 803, -785, -284, 1000, -1229, -38, 1788, -2080, 93, 2031, -2146, -65, 2725, -2720, -291, 3003, -3128, 161, 3202, -3613, 577, 3608, -4096, 569, 3973, -4737, 574, 4090, -4891, 600, 4302, -4864, 822, 4153, -5172, 1027, 4238, -5431, 1322, 4219, -5627, 1956, 3984, -5881, 1881, 4020, -6023, 1853, 3920, -6280, 2062, 4009, -6430, 2254, 3982, -6123, 2382, 3825, -6493, 2724, 3800, -6724, 2881, 3747, -6569, 3049, 3510, -6425, 2908, 3572, -6720, 2996, 3264, -6448, 3091, 3362, -6027, 3216, 2786, -6177, 3516, 2551, -5791, 3362, 2113, -5743, 3725, 2128, -5526, 3654, 2034, -5563, 3757, 1519, -5259, 3792, 1378, -5265, 3621, 1113, -4921, 3581, 1365, -4815, 3549, 1042, -4801, 3969, 723, -4465, 3258, 917, -4522, 3140, 845, -4281, 3284, 753, -3880]
1347c880P442l169m180O848k682m197P049k743l909O602l083l617O665l337k812
1362c003N791k890k644N926l455k527N990l437k429N443l104k268N576l103k396
1377b530N436l228k309N702l622j789N245l175k155N131l349j701N278l806j120
1392a992N146m234r69M841l738r49M636l810o71M537m119k61M214l824n00M313
1408B620l891o17M995m529j09M473m417k16M508m163j52M719m974N03M331m948
1424a867N82M333m928Q67L745m547P79L962m754P75L780m629J029L251l999P70
1440h51L388m162Q84L484m310N73L502m357J057K660l406R97K523l362R44K522
1456B086l740J589J229k515R14J647k401J046J244j971R27J061k357J117J045
$$ y = [-3880, 3562, 393, -3787, 3061, 379, -3818, 3231, 488, -3421, 3181, 98, -3519, 3146, -191, -3003, 2788, -102, -2746, 3180, -275, -2802, 3188, -249, -2678, 2765, -339, -2607, 2969, -134, -2530, 2906, -322, -2631, 3071, -551, -2340, 2905, -270, -2425, 2706, -643, -2344, 2934, -872, -1992, 3154, -1080, -2049, 2792, -946, -1895, 2741, -1069, -1740, 2797, -1322, -1583, 2631, -1193, -1693, 2620, -1271, -1888, 3107, -1422, -1531, 2942, -1475, -1691, 2817, -1346, -1498, 3221, -1753, -1250, 3081, -1867, -1285, 3048, -1880, -1013, 2732, -1815, -1036, 2926, -1828, -1053, 2727, -1902, -873, 2378, -1621, -851, 2537, -1625, -741, 2743, -1567, -994, 2508, -1849, -792, 1868, -1538, -541, 1982, -1380, -436, 2086, -1654, -65, 1164, -1351, -437, 1210, -1191, -145, 1099, -872, 55, 1116, -1241, -124, 921]
1471I21j837J158K88j087P33J27q94J149m98n90J041n39j85M66n43M08J05r29
1489g06J057k22p37J165m93p59J656q96r76J905j116n34J641r40j324K694j626
1506b11q35K528j660j199L219k270j024L581k714r79M260l442r44M358l638r61
1522a931M627l460j336N087l654j345N033m179q80N183m482o23N243m837l04N209
1538C351n131l6N525n765N77N139n615L52N162n346K8N473o032O93N245n678O20
1555a438N081n815N97N389o090O57N447o060Q27N148o201J194M972o185J462M770
1571C755o318J734M113n957J879L806n427J872L346m968J658L040m687J620K885
1586B351m334J959K540m474J592K619m123J527K295l761K098J503l705K267J283
$$ y = [921, -916, 242, 530, -557, 176, 303, -591, 558, 60, -530, 511, -28, -213, 253, -290, 118, 223, -706, 351, 129, -608, 557, 64, -695, 961, 65, -911, 994, -122, -656, 985, 45, -1279, 1415, -211, -1046, 1482, -178, -1377, 1842, -428, -1452, 2129, -585, -1564, 2696, -746, -1690, 2668, -970, -1931, 2696, -764, -2100, 2987, -667, -2012, 3021, -1158, -2038, 3145, -1337, -1960, 3283, -1554, -1858, 3351, -1780, -1816, 3709, -2056, -1479, 3660, -1955, -1603, 3559, -1787, -1759, 3714, -2318, -1625, 3620, -2058, -1438, 3643, -2172, -1575, 3814, -2276, -1619, 3828, -2232, -1405, 3743, -2458, -1264, 3708, -2477, -1015, 3755, -2563, -829, 3284, -2673, -794, 3012, -2415, -543, 2803, -2165, -507, 2533, -2154, -534, 2351, -1983, -24, 2516, -1958, -366, 2253, -1870, -343, 1952, -1809, 289, 1792, -1913, 354, 1637]
1601A637l488J927J603l082J332J397k702J512R72k080R57P27j478N09R97j110
1617c70K22M03o01K88M9J38k35P3K04k39Q8J44k80r6R46j045j43J346j340j56
1637f04J841j626m81K294j892n57K588k133m27K835k868K02L104l290j37L478
1653B327l648n4L929l628k79M031m086K58L720m129Q5M373m566K19M566n005M86
1670a401M614n033M81M828n629P86M823n718R73M659n474J178M270n512J169M099
1686C113n454J478M208o056K180M098o362K049M330o597K279M462o758K466M019
1701C455o437K789L785o917L311L572o858L085L781o937L393L805p430L889K942
1716C228o892L916L040o764L743K967o815L934K718o644M109K180o054L784K417
$$ y = [1637, -1851, 76, 1679, -1403, -71, 1326, -1376, 136, 1108, -972, -15, 712, -766, -257, 740, -370, -148, 255, -346, -58, -9, 129, -106, -33, 171, -68, 20, 164, -116, -212, 734, -311, -454, 892, -448, -604, 1237, -389, -870, 1424, -468, -1025, 1563, -570, -997, 1838, -1030, -828, 2276, -1014, -1151, 2327, -1321, -1375, 2554, -1074, -1353, 2678, -1408, -1150, 2570, -1559, -1474, 2899, -1667, -1448, 3118, -1887, -1401, 3213, -1820, -1339, 3489, -2140, -1354, 3469, -2249, -1276, 3383, -2091, -913, 3357, -2155, -986, 3113, -2341, -863, 3345, -2711, -531, 3567, -2795, -746, 3584, -3013, -734, 3728, -3030, -564, 3455, -2982, -193, 3592, -3325, -14, 3558, -3300, -215, 3566, -3371, 22, 3827, -3603, 286, 3228, -3664, 252, 3292, -3472, 271, 3238, -3577, 357, 3075, -3569, 540, 2720, -3334, 450, 2867]
1731B867o096L821K382o287M045J810n770L994J501n603M147J705n681M053J438
1746B326n497L966J389n010L703J350n110L675J330n223M028R16m436L731N70
1761A708m387L612O34l993L734L76m154L473M32l780L570L0l421L049L26l638
1777b429L479o6k959L116o53k333K936m65k297K693m68k304K631l82k210K702
1793I91m73j640J917m46j270J509n55r36J526l72q55J299m51p66J005l89o46O91
1811A39K78q16N36p6l74M57j23J2J0K8o7n6J69j46o3K3J30l78M93o8o85P82L00
1834E05r84L67O55j219P86N27j205P14M79j737J309M52j729J268P09j917J321
1851C01N68k251J499O85k030J720K76k289J961P83k667K012L04k671K391L76k608
$$ y = [2867, -3229, 592, 2974, -3313, 732, 2542, -3228, 766, 2267, -3336, 811, 2516, -3165, 888, 2326, -3171, 795, 2184, -2826, 877, 2227, -2883, 792, 2122, -3101, 927, 1843, -2593, 1138, 1708, -2679, 933, 1567, -2426, 1308, 1684, -2470, 1003, 1435, -2345, 1225, 1255, -2166, 883, 1209, -2429, 1050, 984, -1975, 1141, 488, -1845, 1091, 626, -1671, 1022, 554, -1750, 881, 499, -1711, 991, 518, -1122, 795, 349, -921, 588, 33, -903, 623, 251, -604, 695, 244, -522, 483, 94, -552, 139, 417, -399, 137, 61, -313, 144, 21, 33, 43, 71, 4, -52, 117, -29, -92, -69, 61, -317, 176, 108, -577, 205, 505, -479, -112, 543, -676, 110, 637, -568, 146, 625, -1112, 197, 649, -1080, 188, 897, -1020, 301, 869, -1382, 117, 802, -1228, 492, 768, -1521, 440, 1223, -1444, 568, 872, -1799, 592, 968, -1640]
1868a640K185M42k750K384M08k831K466O6k667K376N22k674K510j01k487K842
1884A051j55k962K911K9k440K613k51k675K950k42k609K613J19k643K620j67k625
1901a863K660P2k539K859m36k361K594k72k518K801n67j896K542q05j950K782
1917A103n24k153K847j022j504K374p89j694K383q77j434K175m61j588K239q10
1933B65j612K324q76j337J995m20j177J777q89q10J540n24j195J604r28o24J569
1950F82o11o40J281q70o94J462o11m41P85j79o26Q42k36m03P34o15j48P36l98
1969E0r8O03k67m30O47n67Q8K83j79j1j79J67j77K27m8k43J21K6K0k82K39j73
1991a83J13L49l51j51M27k88j30L74n1j93O04n09j90K17Q2l53L35J51o95Q29k87
$$ y = [-1640, 545, 987, -1763, 621, 1029, -1802, 664, 730, -1937, 439, 961, -1713, 797, 696, -1791, 1051, 896, -2066, 845, 874, -1566, 1047, 796, -1879, 1071, 829, -1780, 833, 952, -1691, 929, 762, -1863, 797, 869, -1670, 1189, 753, -1608, 986, 714, -1804, 997, 430, -1466, 1076, 271, -1679, 1103, 579, -1574, 1273, 251, -1253, 1121, 332, -1362, 1021, 144, -1290, 885, 424, -1164, 1075, 265, -1347, 977, 101, -1236, 759, 339, -838, 939, 50, -760, 780, 256, -939, 665, -263, -887, 682, 71, -569, 712, -158, -852, 610, -1, -442, 343, 164, -462, 380, 144, -259, 475, -140, -288, 448, 50, -48, 555, 288, -142, 505, -62, 26, 309, 130, 119, -60, 107, -70, 157, 109, -134, -13, 13, 33, -249, -10, -183, -70, 279, -72, -223, 204, -84, -214, 160, 109, -84, 520, 11, -179, 38, 120, -233, 102, 253, -442, 387, 100]
2012A00l95O11l13k20L38J42m82M00j56l64O07j65k75J69N4k99O51n52j96O73
2032C28o6o68P03l63k56O07k54m36P90l45m38P49m60m10Q57n01k7O52o61k8K85
2053E8k4l64O03m98j02O57m46k03P15o57o0O79j56n39N01j71m17P51l45pM21n79
2075a83j71O09m91K21K73n24J22M70m69j18O43o49K69J96k67j66P17p03K41J77
2095A97j94k2M74m27k43L95n03L26L63n22Q5L32m18J1K91l06Q0N51l11M3R2l17
2117b3o8L63k86l8K00Nom0k74K60Q9j74P1J50l76K84k21k30L99k79M67l37o1L95
2141B70k33M4o4j18K01j03RRJ70j53m43N61j61k03K37j09r3P4P8l12O33k17n39
2164d62R74n92k86P91o18k97R69n28n97J316q44l68J272q83n89J619q27j143J967
$$ y = [100, -295, 316, 3, -217, 121, 263, -219, 181, 25, -339, 268, 103, -172, -3, 51, -248, 403, -149, -345, 328, 262, -406, 297, -66, -322, 285, 31, -405, 385, 40, -398, 351, -109, -519, 338, -163, -190, 462, -199, -227, 58, 34, -330, 273, -225, -327, 330, -116, -319, 396, -261, -321, 358, 202, -337, 164, -7, -424, 327, -18, -25, 396, -183, -354, 255, -236, -15, 258, -266, -144, 326, -143, -261, 382, -267, 2, 198, -69, -235, 482, -221, 20, 197, 3, -19, 455, 28, -215, 180, -323, 3, 366, -156, -71, 261, -157, -146, 145, -161, -81, 470, 159, 202, 294, -23, -91, 272, -14, -52, 148, 153, 147, 107, -167, 93, 182, 8, 79, 229, -147, 137, -84, -314, 85, -194, 273, -64, -125, 270, 37, 81, 17, -101, 100, -3, 6, 15, 185, 32, -411, 150, -11, -214, 23, -86, -179, -105, -27, -339, 294, 77, -462, 512, -80, -366, 425, -193, -490, 479, -49, -646, 670, -174, -542, 730, -153, -742, 877, 50, -1093, 874]
2183H74r20q64J797j112p61J880j064r70J903q81r30K016j305p80K474j603p74
2200a020K550j761p38K466k024o49K662j917p09K797k124p09K900k376l71K781
2216A758k711k47L440l017l72L324l063k59L185l084m29L469k860j52L271l445
2232a192R5L315l267l54L695l452O4L315l679L98L480l826N41L380m248Q66L556
2249B687m219P33L317m357J071L331m434J295L133m372J323L130m421J231L042
2264B490m605J636L097m617J469K909m429J795K878m593J602K924m714J941K651
2279B434m376J610K253m170K326K055m120J972K194m417K441J699l958K255J611
2294A809l563J902J789m134K286J677l749K302J280l301K120J172l487K034J435
$$ y = [874, -46, -910, 887, -225, -986, 894, -170, -1140, 763, -118, -1048, 968, -337, -1117, 1357, -246, -1020, 1530, -231, -969, 1497, -527, -1176, 1486, -431, -1140, 1657, -467, -1176, 1724, -652, -1023, 1758, -953, -1200, 2240, -777, -1149, 2175, -888, -1147, 2038, -1046, -1475, 1994, -866, -1018, 2253, -1192, -1097, 2218, -1049, -1403, 2292, -1160, -1096, 2219, -1460, -1062, 2418, -1408, -867, 2513, -1735, -869, 2687, -1532, -799, 2518, -1839, -768, 2563, -1871, -576, 2557, -1815, -492, 2638, -1783, -552, 2490, -2115, -479, 2618, -1999, -530, 2379, -2050, -255, 2623, -1970, -368, 2556, -2158, -217, 2434, -1942, -332, 1921, -2249, 77, 2132, -1988, -16, 2178, -2239, 202, 1901, -2057, 198, 1809, -1754, 148, 1937, -2197, 89, 1766, -1983, 319, 1599, -1702, 418, 1590, -1897, 137, 1572]
2309A572l260K070J008k920J757R97k836K099R30l012K074N21k484K182M20k502
2325a384J764L75k186J887K59k108J956P1j762J525J96j775J810mj813J917l14
2342D14j190J274oj564J418K20j577J342K72j435J134m7j064J201jj048Q91l1
2360B03p87J040k08r26Q96J27q93R52m55l98O29M1o94M41K23o83P35j31k90L38
2380A60k3m96P00k69l39O32k84m20M16J49n31K13Q7l99N33k59J10J25k62J69k7
2401a5J72j17j6n9N4J0K54k29M3j23K19j65j67L38l90L74j52%q9K64l53L24l3
2424A44m37M72k21k75L26J03j79J39R7n18M37K13q06O41J16o78O77K4n26N90q
2445C31r02R64k24p80O83J41q60J178k1j207R97K01j152P97M69j545J363K28j594
$$ y = [1572, -1688, 382, 1390, -1530, 227, 1224, -1612, 487, 1417, -1595, 479, 1000, -1484, 698, 1118, -1384, 380, 755, -1431, 456, 715, -1393, 563, 634, -1128, 397, 593, -1182, 628, 624, -1189, 728, 414, -776, 498, 492, -1072, 346, 566, -1011, 331, 603, -832, 302, 255, -809, 392, 391, -657, 234, 203, -584, 456, 248, -678, 218, 345, -548, 404, -51, -449, 180, 221, -473, -32, 191, -492, 243, 112, -178, 160, 137, -359, 341, 72, -267, 365, 81, -339, 77, 226, -305, -92, -5, -404, 129, -130, -20, 105, -157, 12, -15, 157, 40, 24, -35, 19, 29, 283, 54, 97, -26, 193, 28, -139, 199, -191, 183, 31, 31, -58, 206, -147, 177, 144, -293, 179, -42, -317, 9, 112, -67, 72, 169, -349, 88, 301, -505, 136, 252, -426, 251, 275, -251, 339, 331, -571, 393, 169, -611, 72, 213, -647, 531, 510, -697, 300, 501, -651, 146, 615, -930, 433, 661, -933]
2464i33J261P1j355J439j27j187J627m78j172J639k80j671J790r0j584J829o07
2481A72j120J894o72j790K279m14j558K166l58j904K214o14j640K337o53j994
2497a655L006r49j875K586p60j765K649j022j745K999j358j586K878j398j709
2512a704L187j344j632L209j604j836L203j593j335L301j856j693L324j761j558
2527a692L463k011j558L543j627j467K883j781j336L416k222r66L098k080j194
2542a531L326k015j283L332k336p78L029k083j093L129k278o85L005k191r27L060
2558A681k332n62K962k442n11K677k167k48K605k384k29K385k060k41K369k309
2574h06J71J858j654l41K090k000L04J615k045K92J516j678L0J600j419j55J666
$$ y = [-933, 328, 399, -956, 483, 356, -831, 796, 318, -854, 785, 505, -1166, 624, 534, -1050, 779, 172, -948, 946, 274, -1516, 763, 349, -1209, 957, 599, -1305, 909, 295, -1345, 992, 339, -1655, 1351, 402, -1473, 1113, 353, -1412, 1237, 215, -1530, 1469, 111, -1475, 1403, 5, -1704, 1483, 139, -1493, 1716, 112, -1724, 1479, -114, -1449, 1852, -4, -1697, 1627, -134, -1692, 1771, -240, -1798, 1745, 118, -1349, 1534, -247, -1583, 1833, -389, -1355, 1743, -337, -1531, 1795, -220, -1503, 1829, -507, -1285, 1744, -339, -1432, 1697, -581, -1266, 1739, -452, -1379, 1681, -651, -1213, 1749, -693, -1204, 1473, -694, -942, 1663, -721, -950, 1435, -625, -866, 1503, -806, -635, 1223, -431, -772, 1318, -682, -378, 1237, -808, -516, 1000, -678, -648, 952, -467, -622, 1044]
2591A044j706M51J286j796O46J014j700L38J338j587K95J366j462M13O65r95K18
2608a72P91r81L40P12j000L84K65o36K40N20p42K58K85n95J73N91o04j40P31n14
2628i4k2K62k46K33j96j19L33k31k92K99J05K2j83j8K86k68J75K12k47j2K18k09
2650Hj34K29k79J28J74l00P2K61k28n3L85l39K2Q1j91JJ50j7LO6p4K32j18j20
2674d1J56q0r2R1J61k77K52j98O4j5p7K97j31l00J56Om12M98J63k95K32k47k37
2697c26O31m8o00N98j12n88N93N3o50O75N5n73P44j26r12R65n4j046J287o14n99
2718f47J224k52j103J157l06p81J202j13j257J619l89r35J231n12j065J486l43
2735B16j261J891q30j061J809n95r08J397p28r75K145r03j160K045j084r40K026
$$ y = [1044, -662, -211, 1075, -721, -75, 939, -761, -423, 915, -672, -377, 989, -473, -60, 605, -390, -172, 619, -362, -22, 690, -310, 74, 339, -297, -57, 463, -279, -21, 264, -331, -158, 433, -171, -311, 420, -94, -116, 146, -100, 133, -63, -182, 151, -80, -372, -73, 32, 54, -129, -147, 139, -129, 46, 258, 11, -1, 217, 8, -126, 103, -176, -48, 126, -174, -102, 159, -69, -122, 263, -76, -54, 27, -164, -163, -13, -30, -27, 39, -35, 197, 79, -41, 115, 35, -57, 34, 195, -82, 170, -28, 36, 21, -56, 241, 110, -190, -34, -28, -440, 58, 221, -74, 158, -89, -326, 305, 257, -343, 255, 143, -445, 148, 201, -449, 226, 281, -292, 452, 326, -586, 379, 325, -721, 566, -48, -647, 577, 325, -778, 379, 73, -708, 494, 381, -876, 743, 354, -581, 650, 138, -927, 559, 216, -1045, 846, 16, -1045, 764, 169, -739, 658, -70, -1045, 1100, 197, -963, 1082, -2, -942, 1084]
2752A084j034q89J912j106p97K091j296r49K167j157r44J979j123j045K170j337
2768b74o94K057j271q75K439j708l68J701j274m36J798j388o81K249j611m97J962
2785A129j700J6J966j947k56J805j385k93K089j717k70J917j789l32J939j483
2801c11l9J500j710K71J367j646L2J635j740J51J809k025K23J601j592o2J314
2818G78j355K06J363j615L30J034j421L27J335j487o4J426j473L97J030j283L09
2835a63Q51j163L01Q06j280N35O63j026M45R14j550O48N08j067O61M77j010K89
2853a61M27o18M03P63j499O66O03q91K71K35o50L28J46m06N23Q7o28M22K40o47
2873c86N78j70l24L17K8j12l69N11k32K71j32k0K90l49l00N91j3k21M36l41j8
$$ y = [1084, 50, -839, 1073, -33, -830, 1261, -35, -984, 1183, 26, -918, 1061, -62, -1107, 1063, -274, -968, 1089, -182, -1057, 1382, -326, -694, 1007, -267, -703, 1095, -293, -974, 1275, -336, -833, 1129, -571, -555, 1411, -536, -792, 1013, -372, -665, 1424, -293, -563, 1354, -435, -767, 1172, -311, -350, 1150, -560, -289, 1078, -568, -536, 1099, -641, -490, 1319, -706, -483, 1118, -474, -536, 778, -577, -371, 992, -623, -293, 741, -680, -353, 982, -505, -569, 857, -616, -219, 811, -472, -163, 688, -475, -174, 632, -648, -113, 550, -476, -31, 883, -667, -19, 489, -578, 83, 560, -450, -161, 266, -352, 51, 814, -685, -19, 584, -307, -36, 199, -451, -123, 23, -383, 140, 227, -401, 21, 261, -386, 192, 22, -302, 15, 43, -69, -438, 73, -159, 112, -20, -40, 250, -99, -399, 192, 179, -42, 394, 53, 35]
2894C5N3k01j21K57q0q3P2J8m9K83m51L18n9K15j38m0j78K91j43L3J13k80r0M23
2918A98k47J2K26k07J70Q0p3j93K60n60j36Q55m15k52N63o94K71O96p28O5M08
2939B99o19K27N35n93J14M49n28k16N96p80L78N16q31O13K89q36L39P46j286L96
2959a92P10r26L28O85j251L86Q62j346N36Q72j427P37N60j238P79P87j645Q13
2977C0M30j323Q44O97j402P82O55j410O95Q93j744J021O16j726J277M89j632J025
2995B17M39j534J014P97j997J252N30j699J442L85k102J518M98j869J378O09k132
3012a254J706M01k011J716K73k197J665N14k150K017J71k260J946M23k176J607
3028C91K92k270K179K02k278J917L92k095J946r1k048K041lj964K151k08k255
$$ y = [35, 88, -113, -234, 23, -57, -140, -68, -50, -99, 184, -267, 51, -8, 207, 69, 29, -149, 142, -1, 32, 145, -135, -225, 198, -49, -37, 189, -18, 152, 232, 159, -34, 226, -334, -470, 385, -30, -282, 281, -413, -142, 554, -174, -109, 299, -320, -93, 442, -151, -37, 412, -116, -332, 264, -516, -138, 378, -453, 160, 449, -387, -48, 698, -588, -192, 518, -408, -80, 605, -646, -260, 602, -744, -208, 664, -763, -26, 534, -704, 75, 862, -783, 30, 460, -863, -19, 678, -724, 58, 713, -697, -2, 891, -853, 168, 784, -942, 335, 824, -808, 217, 656, -878, 136, 933, -1064, 188, 718, -981, 461, 846, -1256, 262, 760, -1109, 269, 878, -1254, 452, 853, -1158, 558, 831, -1366, 299, 813, -1337, 680, 851, -1409, 537, 960, -1216, 391, 683, -1587, 592, 794, -1484, 433, 825, -1270, 676, 585, -1463, 578, 575, -1389, 762, 554, -1701]
3045a701K429q3k071K416k54k266K244m18j949K384k13j954K386p05j453K237
3061A029o10j894K560p82j875K652p39k016K923q42j931K770r87j814K534q22
3077A56j780K981j188j716K625j140j148K452q99j389K258j223j343K709j317
3092C8j318K808j702q37K366j212j308K322j263j061K258j179q43K314j566q80
3108a063J995j169r80K508j287q24K213j658m58J977j508p59K160j541k98J958
3124A266j677m70J995j603k38K080j965k21K121j560k40J422j324k64J597j442
3140e23k9J468j357J4J529j500P6J177j396P5J558j783L91R19j055k8J268j425
3158f21K20J017j055P1J098j336L07J032j042j6R54j128K42Q47j020L94M88r63
$$ y = [-1701, 728, 645, -1426, 990, 736, -1530, 714, 296, -1653, 731, 518, -1436, 950, 245, -1208, 1029, 419, -1475, 1085, 303, -1572, 1080, 341, -1675, 1248, 406, -1525, 1245, 258, -1556, 978, 156, -1624, 1357, 169, -1547, 1078, -62, -1210, 1242, 343, -1046, 1212, -11, -1354, 1355, 38, -1280, 1528, -174, -1011, 1355, 143, -1165, 1157, -106, -1167, 1091, -88, -931, 1383, -183, -1063, 932, -237, -1217, 1291, 4, -820, 1393, -265, -723, 1254, -254, -1013, 1147, -394, -692, 1266, -411, -881, 1114, -489, -727, 1353, -612, -833, 1288, -272, -512, 910, -414, -678, 919, -523, -552, 916, -441, -427, 1102, -398, -322, 855, -541, -466, 1092, -691, -300, 619, -436, -464, 804, -621, -401, 616, -439, -368, 730, -606, -299, 733, -309, -325, 629, -499, -257, 590, -430, -36, 452, -511]
3176e11O52L14n69J58M01o89J81K24k57j28M27l09Q1L64n97K53J98m34L25j31
3196d7j02K85p8j64N0J37K14m38O8K56j93O9j4o6j41J40J51j00K46j92l79N51
3218B53l47P3J88j53p7K59k47k64O69l99j44M11k43n07J134o28l45P11n59k50
3238d65Q47n00j29O36l90l67P91o01q7O80m85p6O22m91l39P76m54r9M69m60n7
3259a79P37q88n2Q77q05QR21q56k1P69q58q1Q11q44p6J039r28N7R35r81kR16p71
3282b72J67O57o24J27N65r63K35M31n58R6O05p37P4P67q35K56K71l96p6P85r27
3303c52L24K94n72M30L45r27M12L61o22K10M94n10o4K64k37J11Q8k45J58J09k56
3324a85L59q5j95K01j76P1K13k87Q1m8L17k01k14K19j29P8K2q5L21m69j3K28K63
$$ y = [-511, 141, 455, -114, 44, 445, -244, -63, 161, -96, -224, 203, -106, -25, 339, -258, -5, 193, -241, 84, -47, -149, 136, 58, -106, -56, 81, 295, -143, -75, 181, -12, 57, 43, -23, -164, -24, 127, 27, 273, 81, -298, 253, -94, -21, 167, 14, -63, 196, -51, -315, 354, -45, -189, 222, -21, -528, 606, -22, -367, 344, -215, -465, 382, -118, -247, 389, -1, -368, 423, -178, -265, 415, -70, -146, 476, -15, -354, 422, -32, -131, 338, -122, -179, 558, -330, -382, 495, -310, -302, 619, -237, -258, 511, -347, -428, 383, -461, -537, 502, -426, -369, 566, -415, -417, 499, -272, -105, 552, -72, 55, 620, -343, -108, 323, -235, -139, 466, -271, -197, 570, -265, -9, 262, -134, -210, 575, -352, -28, 266, -306, 124, 469, -458, -46, 315, -307, -97, 397, -113, -177, 87, -150, -39, 49, -196, -38, 71, -185, 174, 89, -106, 95, -81, -10, 203, -84, -3, -51, 266, 65, -149, 70, -59, 19, 41, -44, 277, -192, -205, 23, 286]
3347B86l51j94J75J65k04j9J85j59j61M71m9j1j9j09k82L88k29p3M03j85j68K72
3369A32n9k08L65k60j01L45m25K12L33k35k60L26l84p1N55l87p1K99q8j40K99
3390A77j03k66N23l98J31K9k54J82K35k08k79L3r9J72L00k76j37K48jj21K56p3
3412G1KN7k41J55J42j83l8K34j69m2KJ61k94J51K5M3o4j4n2j47N15J1m14K21j99
3437f7Q1K4j72J23L10j47j08o3j9j23K29J41l19M66m82j31J95r8j25N01k39k26
3459b49M81m25j11K15l0n0L02j87k37N50k73j93L58l6k90P48o38k71P30m59j23
3480a88O55p42j07Q58p20j36Q68o24k97R52o44j32N84l55k67O92p53R3R61j078
3500c80L56P82r96J9O26r54P9J098r75k8P56p77K31P51p90j96Q61q52K76O65j034
$$ y = [286, -65, -259, -84, 81, -123, -142, 43, -116, -277, 194, 145, 134, 115, 6, -276, 112, -117, -190, 213, 28, -140, 132, 73, -135, 230, -30, -131, 214, -211, 1, 334, 99, -161, 165, -219, -290, 265, -122, -193, 106, 18, -122, 177, 74, -192, 331, -67, 64, 93, -161, 21, 256, 48, -231, -198, -297, -125, 175, -101, -238, 10, 9, -112, 144, 71, 73, 130, -111, 44, 186, 3, -35, 199, 30, -12, -10, 151, -143, 8, 33, 76, 12, -2, -54, -201, 314, 325, -89, 132, -67, 14, 38, -134, -11, 299, 152, 44, -19, -38, -161, 68, 209, -110, 356, -126, -257, -62, -160, -285, 216, -23, -249, 232, -193, -304, -89, -119, -169, 133, -54, -291, 259, -14, -207, 151, 115, -175, 573, -65, -336, 394, -65, -188, 467, -275, -382, 476, -244, -380, 488, -136, -433, 519, -125, -257, 327, -28, -295, 397, -356, -263, 698, -380, -24, 758, -238, -219, 407, -547, -468, 630, -345, -373, 383, -394, -163, 588, -202, -398, 463, -389, -113, 552, -482]
3521d82N29N93j006Q7R58j002lJ162j408M72O98j083K68P99j172K99J067j197
3539d21M76O60j148L98N53j244N53P03r47K94J006j367N55N93j445R80O51j612
3557g62P16O49j354J057M92j536P50P93j693R15Q24j791R94Q64j812R11R63j944
3575i64J004Q99j793Q38Q08j535O74O30j390P95Q82j732Q46P52j889J375O26j859
3593a033J255M95j772J219K98j570J330P79k080J653J97j692J277O0j493J379
3609C02M17j786J553L26j900J437R9j638J627m5j279J495R1j671J246K58j374
3626h42J277M7j510J419j01j298J391K88j621J492q9j177J278l31j130J419k53
3643B59j162J515j58j508J692l72j210J377j77q90J227l40r70J047l63o37J213
$$ y = [-482, 47, 640, -366, -279, 679, -323, -326, 836, -572, -100, 598, -485, -217, 582, -590, -291, 776, -421, 55, 715, -433, -35, 518, -726, -173, 530, -417, -123, 883, -484, 71, 664, -781, 199, 850, -762, -46, 603, -751, 306, 798, -738, 12, 805, -888, 27, 851, -940, 54, 918, -894, 17, 980, -964, 40, 939, -854, -16, 792, -743, -69, 561, -829, -34, 848, -884, -38, 714, -1175, 200, 826, -1033, 222, 717, -1055, 164, 462, -1108, 222, 1001, -1079, 574, 771, -921, 356, 416, -1077, 302, 719, -1067, 486, 812, -1088, 349, 448, -1190, 437, 392, -887, 608, 699, -972, 274, 532, -842, 435, 482, -1028, 391, 290, -1008, 383, 671, -950, 542, 453, -724, 554, 223, -907, 512, 259, -903, 612, 454, -1054, 638, 266, -944, 433, 256, -634, 593, 253, -717, 330, -33, -670, 543]
3660E43k40j053J480o59p58J204l96q53J193o31l55J004m92m95Q26m70k70L26
3678i6K03l59N52n36j05P64n02l22N42k37j10M86k51j52J87k7j36K16K94l40j53
3699h2Q3J43k6k93RK37O4j47j25K24N7l07J42K69l69n6M56n0j60L21m25j5K45
3722A95o08N62J22q36O99J3o15P57r8n32L74K67p87Q05q6p63Q31K02r02P01J01
3743D02r02P33l0p42O76K91q61P53M5r11O95L29j096J104o4j268J108L7r42R95
3763C52K8j132J397l94q67R24P2j091J305k03j169J229l33j047J564m73j000J252
3781D14j54o16P89j81j034J280l92o40J165o34o29J027l12r51J330m43n22R73
3799D70m42o02J140n86m77J208p27n14R86n40l77J006m01o99P95l02m63J226o94
$$ y = [543, 303, -750, 730, 71, -687, 517, 121, -732, 461, -170, -525, 479, -13, -508, 318, -152, -422, -96, 107, -252, 300, -236, -341, 423, -79, -401, 141, -96, -206, 280, 29, -123, 64, 37, -99, 117, 411, 71, -82, 1, 144, 118, -175, -166, 71, 135, -12, -137, 87, 144, -163, -21, 248, -121, -177, 279, 229, 69, 390, -35, -50, 195, -413, 149, 271, -565, 134, 147, -468, 289, 191, -341, 33, 300, -487, 318, 232, -531, 300, 502, -400, 301, 402, -500, 233, 203, -539, 137, 428, -433, 320, 365, -546, 149, 478, -618, 486, 422, -846, 262, 299, -643, 352, 380, -752, 645, 251, -616, 308, 380, -711, 594, 391, -778, 451, 118, -929, 635, 162, -838, 414, 260, -356, 433, 252, -782, 498, 106, -534, 631, -3, -632, 395, 83, -868, 462, 19, -503, 470, 28, -574, 566, -20, -497, 711, -16, -530, 456, -84, -461, 545, 144, -555, 240, -62, -525, 701, 7]
3818Gm24J109q72k62Q92m34n73J065m97m43R64p23j86R98q57k22Q58l11n09J075
3838F55r04k2N05m21k69P69l33k78O51m49k24P47m22l75P00l29m14O66m09k1O88
3859E11o57k63Q16l61k15K56k06o7N64n10n1N59n32J05L0j90O2O81q26M4L40l65
3881b75J52L24l42Q0M64o21J70M98p90L3O00l10q5M73n63R7M23k51j30L29l49
3902g3j7L34m58J31K58j86j67M85n11L9N86o42P4O55m73k5J33j88rJ22r1m5J65
3925I7m68M53J42m85L46J54p1kk96j05J95M16m07K04j08k70N07j41o0j46J11l32
3947b66J99j35K20k56K10N8k23K06j5K3K7J3l16k0L42m6j72oL89k42QN4k23J84
3971A3l25M86J25l98J72L5N3l81K39k22J51L01k57j7K29l59K98J11k79k70M01
$$ y = [7, -417, 692, -180, -442, 450, 16, -557, 508, 11, -432, 532, -191, -377, 621, -236, -458, 400, 89, -420, 655, -249, -271, 234, -187, -456, 313, -20, -298, 353, -96, -320, 427, 5, -370, 330, 1, -413, 253, -156, -177, 511, -146, -409, 407, 46, -169, 87, -119, -186, 378, -132, -183, 376, -156, -51, -21, -211, -149, 532, -294, -250, 90, -275, -123, 201, -141, -61, 403, -218, -48, 450, -340, -307, 293, -17, -102, 371, -192, -95, 328, 77, -53, 276, -73, -90, 244, -214, -83, 175, -11, -178, 307, -204, -165, 421, -221, -147, 508, 35, 10, 143, -45, -54, 68, -23, -68, 97, -371, 82, 224, -261, 85, 239, 168, 166, -130, -235, -40, 376, -31, 173, 65, -205, 302, 161, 101, -45, 66, -266, -67, -202, 18, -238, -28, 30, -193, 13, -2, 21, 48, 61, -255, -275, 67, 21, -151, -157, 232, -10, -2, 52, -171, 13, -312, 174, 299, -99, 73, 108, 161, -220, 19, -203, -52, 249, -8, -25, 204, -155, 143, 254, -25, -295, 106]
3992A06j11k23L35m2J41M5l00l5K50l29J86L79m86j50N64n29L6J89j00n8L92k66
4014fj12M81m36J86L69o13K12J42m18M39J88m41rL55n90J17M67m23j04M95k71
4035B8j30M22n12K68K24l80J16o1k71R7K97%j6J67k47j52O62p35L25J58o35M72
4057I7J16m47O4J47L1k22J48j13M1J91N7j35q9J58O9k28M1K6J6J29k1l30M29l34
4081a59J53K39l30l0M29l32j77M73m10n7L97j66j37M80l89Q3J10j82l04O27n42
4102b24J58L65l80l16Q26p40P7N05n71m8P48q23K60M87l80J2N91q16j36R14n43
4123c4j79N36o78o8Q90q82L04O80q83J51N37p67J15P99j050N01O21j085M49N69
4143E26q99L03P42r49L15M32j053O26L48j027N30O13j179M32O25r16O23L96j038
$$ y = [106, -5, -228, 107, 65, 206, 251, -49, -84, 166, -163, 23, 402, -84, -234, 330, -199, -163, 26, -74, -132, 260, -6, -118, 363, -73, 113, 482, -131, 81, 223, -195, 244, 432, -9, -18, 337, -253, -136, 331, -92, -196, 299, 28, -102, 320, -192, 76, 300, -80, 36, -25, -296, -199, 98, 98, 82, 249, 2, -150, 512, -223, 102, 260, -375, 97, 213, -234, -170, -23, 8, -214, -66, -179, -138, 53, 110, -25, -114, 44, 113, -115, -74, -48, -32, 97, 76, -254, 175, -159, -6, 233, -97, -127, 302, -30, -207, 266, -144, -201, 196, 30, -107, 373, -16, 67, 177, -5, -309, 318, -224, -66, 299, -81, -397, 429, -311, -234, 271, -300, -348, 400, -423, -163, 324, -56, -44, 547, -269, -405, 509, -34, -213, 323, -355, -423, 467, -415, -111, 569, -314, -163, 374, -393, -278, 521, -529, -28, 593, -492, -43, 526, -373, -70, 672, -277, 38, 470, -583, 43, 391, -636, -106, 507, -672, -240, 385, -531, 92, 488, -550]
4162e50N70R11j469M82L82j033N64O65r44N30L01r37N15M28r89N72N09r55L96
4181e2N34j032M08N24r83N11N06p00J69O16r35J31P05r57N43M57r60P13J4o04
4201c92L72L81o16K86J98l72K51M0l84P6M45o87N79J00m98J69J34l00K63M6l13
4222b22L92k49j0J64k12R4O8k48J99J49n9n0J54j41q3L09k77m9KK13k3J5r2p0
4246b6l4j08j2J49J39k48J07j12M59l47K52J90n75n5L50k43m1L82l67m1L12k90
4268a59J18L43l85J13J43n56K32N31o66L24M43q34L44K93m57P2M63o02J61O71
4288E92r21N26m1m81J41M42p07N40L25j055P84M2n91L18K18o07M33N57r41L80
4308d6N72q17N30J18q31M34M93q98K65L89p27O02N05j174N83O02j094O28K35p96
$$ y = [-550, 20, 931, -538, -56, 326, -707, -143, 522, -422, 108, 409, -528, -13, 415, -574, -2, 507, -448, -52, 482, -550, -142, 382, -601, -90, 416, -284, -115, 501, -434, -303, 402, -555, -12, 445, -515, 198, 212, -392, -20, 361, -255, 31, 229, -143, 108, 148, -236, -160, 285, -402, 177, 277, -221, -52, 82, -218, 45, 91, -222, 170, -79, -89, 75, -137, -43, 25, -223, -24, 125, 66, 16, 170, 29, -54, 255, -22, -71, -69, 144, 121, 136, 44, -26, -60, -168, -180, -31, 108, -140, -33, -145, 314, -33, 219, 409, -166, -221, 129, -114, -155, 227, -140, -181, 131, -159, -41, 302, -83, 30, 173, -383, -151, 380, -286, 38, 481, -353, -9, 284, -173, -101, 362, -240, -79, 592, -329, 197, 156, -325, -184, 258, -449, 91, 416, -639, 145, 187, -404, -86, 132, -475, -42, 515, -426, -46, 526, -291, 239, 357, -474, -40, 453, -445, -180, 209, -518, 84, 589, -585, -2, 600, -494, 134, 369, -427]
4328d27O17K65j365J004J04p80Q72J43j013O63L92j039P01M4q46R59L4q15R32
4347D45J10j076Q96j23r29R13M5r44J008Q8j076R13O4j009Q12J63p48R40l18p59
4367e85R36k28p22R25n9p68P65j6p01O36m9n24P24k97l54O15q2n86M87j33l83
4388c99P68k85l46L97j99k05M13Rl67N03k37j73K63R4l61L08j69k28K87j58m3
4409a28K36L7k28K87j04k1N9j14q2L09l8k51J89p5j58J2j91L43q3m5J12j26M7
4432a3j39J16j43J95j31J17J18k19L27j34j94J76r5P3N6J34m48K98J65n98K86
4453e3Q8k14M21k55k45L55K8m27L05L25m29J05J91l00J75J90l02J78m6m38O78
4474C30k12k39L14j65k30J81K12n06O99k47k41K08J16m57L63N2k09L05k56j53
$$ y = [-427, 190, 455, -910, 94, 198, -582, 290, 433, -580, 83, 475, -564, 137, 181, -665, 294, 328, -487, 445, 555, -521, 375, 252, -677, 236, 281, -663, 345, 433, -643, 270, 334, -675, 137, 300, -448, 492, 174, -585, 351, 123, -599, 326, 267, -501, 264, 248, -453, 183, 134, -390, 334, 37, -317, 298, 216, -370, 117, -16, -399, 369, 84, -262, 135, -64, -269, 144, 153, -214, 289, 52, -121, 142, 236, -125, 183, 14, -214, 73, -85, -128, 108, 145, -83, 204, 100, 79, 138, 24, -58, 251, 213, -38, 151, 76, -82, -70, -261, 82, -1, -46, 66, -60, -13, -152, -36, -179, 16, -115, 2, 120, -99, 228, 94, -100, 76, -19, 54, 110, 244, -204, 94, 259, -339, -53, 35, -179, 242, -13, -258, 97, 125, -302, 3, 328, -101, 4, 195, -105, 70, 260, -42, 136, 90, -348, 330, 118, -121, 193, 28, -202, -21, 191, -315, 384, 137, -104, 104, 220, -237, 126, 178, -31, 274, 18, -135]
4494a35K68j03l75O46k48k02M74o8l97J75l4k66N55q1m71M93J84p36M54m8m35
4515c50O64j80m99O25j65m64M85L8m87O01l10j57O52k94l82J46J26k10L28j38
4535B9k96L65j42k11K95M6m47O62l16k66L79j31l16M00j42L5K06j18l04M58k23
4556c7l3L84l69k43N03l78K07J47l63J14L73l25r8N52m78r3L72l83K09J31k56
4577f4J49k0J49Ok04k3j07M49l10j85K85l0j96K59k80m6L49l54m2L73j15k30K04
4600A7p9J4Q6k03J72jJ55r4J9j9j22K01J15l39KJ94k29J33j44J53O5k51K34l4
4624D5m6j28J18l51M06j36K38r8k6l5L4j53K99j66Q4k01O7J53N6k12j49K13K08
4647B20k15k3K3k20M21k52j28K22n4j20L99k50j64K11p1l42O81m51p8K99m7n0
$$ y = [-135, 133, 30, -345, 301, 53, -149, 325, 257, -140, 35, 1, -265, 290, 209, -262, 231, 415, -321, 133, 85, -350, 314, 134, -365, 260, 95, -369, 116, 154, -333, 268, -42, -199, 453, 159, -223, -77, 49, -161, 167, 29, -267, 98, -44, -255, 40, 86, -361, 301, -15, -281, 98, -33, -349, 51, -91, -56, 150, 32, -272, 186, -37, -70, 314, -55, -298, 205, -173, 34, 181, -182, -68, 305, -20, -118, 434, -44, -137, 235, -148, 61, 192, -64, 85, 65, 214, 220, 16, -7, -114, 335, 25, -160, 125, 95, -101, 158, -122, -168, 181, -173, -215, 158, 43, -187, 17, -62, -48, 38, -165, 7, 6, 161, 67, 86, 67, -55, 146, 261, -78, -76, 118, -111, 22, -122, 31, 96, -155, 79, 45, -1, -129, -11, -362, 44, -92, 146, 48, 22, -13, 21, -132, 167, 1, 85, -116, -49, 104, 160, -52, -201, 12, 220, 5, -18, 5, -215, 206, -46, -174, 48, -6, -126, 273, 23, -141, 70, -1, -343, 338, -113, -191, 108, 61, 11]
4669A1J71k01j30L25m05J33J87p2j03L58j06k09L59n57q3N90k02m38N62k94r0
4690a94P13n68l59O53l80j58O74l29m29O80n46N6N45j91m45Q34m95l81Q16o70
4710a74j73N97k57l05P27o25K4N48l95k18N04l69j66P72n82k90Q72p48M3M88m52
4731a79k00Q52o85J33M62m52NM79o21k39P03m21J5N63p22R7N24m48O0N20n99q3
4753b36P58o12j19O43o31L35L91r00K40N42q07K21O44q32L60J06m47K46K85m25
4773b38K04J46k86K26J55l32K65K74p52K92L07l36j15L87p53N23M05o45M46k05
4793c2j56K81n9k32K94R0k48J20j00j32L16N8o18J57L89k37J98j23Q9m11M14J94
4815B52k37r3l4J06j37M70l50q2J97j53j12K72l8k64M70k60k4J50l33j45L04j13
$$ y = [11, 182, -19, -149, 176, -229, -96, 91, 19, -84, 274, 168, -41, 318, -239, -322, 268, 66, -372, 190, -104, -194, 519, -49, -408, 245, -135, -293, 381, 52, -377, 303, -243, -187, 358, 167, -278, 556, 61, -320, 496, -174, -347, 250, -7, -312, 415, -210, -186, 362, -33, -251, 253, -116, -282, 490, -92, -382, 490, -258, -215, 273, -179, -379, 473, -212, -79, 383, -69, -64, 415, -206, -445, 258, -163, -148, 415, -307, -210, 314, -134, -74, 446, -153, -236, 522, -90, -209, 434, -197, 138, 529, -371, -131, 411, -396, -175, 469, -363, -3, 103, -344, -98, 187, -238, -34, 112, -174, 52, 207, -125, 140, 414, -338, -46, 261, -75, -190, 197, -556, -33, 372, -273, 173, -32, -188, 93, 34, -198, 96, 186, -62, 58, -42, -174, 142, 200, -418, -261, 128, -109, 89, -34, 55, -356, 58, 252, 15, -78, -112, -6, -143, 327, -23, -105, 92, -61, -173, 99, 61, -203, 267, 7, -17, 133, -200, -345, -41, -154]
4837a54J83K40k67j19K51k97j8L73l96%M54k11j6J20l33K08K21m33Q8M81o56M98
4859B17m5l16J69K82m22J81l1k91R5N15k93k12M05k58j91M69k94k88M35o09M27
4880e5M23n32K11K09k53K32J27l24J44J4j77j14L96n42P5L20j91L34m4m13j05
4901b65L82k49K99l9m49K59L53l20L21k02k12RP01p00jK51m59J95K60k40KK48
4923A44j51K19j44l78K57J40m23L33K4L4q0J87m44L54L9j84o3L37l81J61k25J25
4945a19r8K31J79k73K22l56M57k94K0L0kM8P0J73l59q7K9L8P0M8k48L42j39q2
4969a00K24r5Q7j26L2o4j69K98k1j77p4K6K66j86N5K34m28K02J55k28L03l83J22
4992d7p8J71r2K09j79r5j04J72J66J06k91P1J42j12j24L97l78q5M30m12J07J07
$$ y = [-154, 29, 269, 2, -117, 134, -163, -181, 192, -204, -204, 250, 39, 23, 143, -190, 18, 239, -194, -106, 375, -281, 217, 172, -144, 25, 307, -115, 66, 35, -256, -161, 354, 61, -151, 254, -4, -195, 274, -20, -308, 127, -482, -55, 368, -164, 47, 256, 3, 235, 362, 38, 182, 196, 19, -95, 301, -241, -166, 154, -37, 297, 253, -160, -265, 117, -132, 167, 128, -321, -62, 291, -29, 292, 90, -122, -113, 588, -112, -113, 138, -321, -126, 134, -106, -104, 144, -7, 212, 68, -310, -53, 87, -336, -3, 21, 55, -25, 162, -282, 72, 111, -73, -136, 201, -180, -19, -244, -119, -217, 14, 193, -80, 142, -214, 243, -51, -31, -1, -3, 45, 115, 288, -71, -158, -129, -91, -21, 27, -221, 121, -18, -100, 124, 29, 116, -10, 22, -42, -211, 87, 66, -111, -185, -159, 107, -79, -24, 210, -218, -16, 139, -89, 214, -169, -47, -125, 46, -46, 163, -16, -111, -215, -43, 123, 229, -62, 9, 151, 39, -85, 312, -66, -151, 279, -133, -26, 81]
5014H1k81L88N9l68M4K80j41l5K02l30J90J4k96K73J0j86j16K30l2n7K91n36K67
5037d9J25k67J47J21l38L26K22j39k8N7m76N46l07m7K22J06m11J85j58j44J40
5058a67L21k81P1K15o37O32Jl86K58K27n08K49R1q5j60J78r9J63K26n69K87K94
5080C21n76K78K54m42K06K1k17L46j55k33K83J88n96N13q4k04N8K30l58L22J92
5101C47m11LQ8%LK77m79K18L5k65M09k0k67L30j3m13J49Q5j21J98m6k15K02Kk01
5126a05J95m9j85K67ok95K33j86n6J34K91l57J24r0k0L71l14Q7J1ll9J5O9k2j5
5151E5j38J2m5J3J71J3J74k12j19j79J78J0n6K93l90J98m8p4j9J24r2k6Q0j59
5175b36L63o1p9J69J58k31J2L19o25L57Rk28K07P1l89L41J74m73J44L47m48N4
$$ y = [81, -200, 188, 247, -121, -77, 203, 62, 27, 229, -101, 89, 103, -193, 80, 90, -96, -212, 18, -14, -71, 220, -316, -49, 76, -191, -44, 77, -261, 65, 287, 148, 120, 177, -299, 247, -60, -107, 115, 221, -190, -5, -163, -307, -167, 154, -127, -56, 159, -478, 154, 155, -231, 27, 254, -254, -5, 86, 1, -159, 19, -80, 83, 309, -260, 27, 321, -255, 23, 277, -165, 41, 62, -155, 191, 36, -197, 86, 274, -322, 191, 107, -97, -39, 191, -167, 155, 347, -64, -61, 27, 27, 30, 307, -172, 46, 81, -184, 225, 205, -62, 268, 255, -158, -9, 76, -45, 153, 107, -108, 94, 96, -105, 90, 41, -144, 123, 117, -178, 55, -131, -187, -53, 238, -119, 5, -85, -105, 266, -48, 39, 50, 47, 8, 23, 92, 70, 55, -83, -71, -116, -103, 68, 81, 255, 43, -76, -255, -77, -67, -123, 170, -220, -22, -70, -144, -163, -39, -131, -157, -77, -236, 127, 66, -13, 156, 314, 83, 95, 414, -211, 146, 155, -73, 134, 205, -184, 157, 331, -142, 2, 349, -99, -45]
5197d5J29k25K6M39o38K51J38j43J59J75l39K19O9n15K94J32k22J67j8m73M89
5218F9O6m95N48j25m13N40J16l61K35l2m08K8K73k76L91K04p34K83J52m93O16
5239A84P9p97R61j08o00P7M53o65N11km03M56K9m96M47L2o73N86J78n67L78J04
5261A64o14O02l7m84M39Q6m66M95m1m04O33J06q18O67k21m29L27lm23O49q3n74
5283d29P97k98j12J46j4l32L28k03k03P01l63k8J80j98k68O11k68k36K74j4j33
5304f2K60m21J4J30L8lj97M61m75M26j10k50K74P1n83M63n9l28N12k2l48O0L48
5327A99k71K90k90O2R3j22J28Kj36j48M08j22j79J04Q9k9q9K11m69K01L08k80
5349d0j16K94k22J81j70Q4J50m09L01J19m0j82O7K9l7j08K69k47J34Q6j26K00
$$ y = [-45, 84, -141, -115, 324, -314, -63, 75, -68, 91, 266, -73, 146, 215, -300, -6, 126, -96, 71, 53, -420, 69, 135, -360, 188, 63, -350, 190, 306, -55, 180, 148, -260, -232, 41, -235, 156, 360, -374, -91, 61, -432, 184, 263, -534, 427, 319, -281, -204, 249, -416, 95, 93, -310, 146, 175, -321, 126, 158, -515, 71, 249, -318, 60, 164, -450, 152, 115, -369, 70, 156, -310, 185, 144, -260, 373, 479, -339, 328, 107, -322, 5, 2, -421, 228, 145, -429, 368, 70, -42, 104, 90, -242, 86, -117, -320, 381, 18, -10, 170, -28, -296, 315, 47, -189, 85, 71, -62, 198, -223, -209, -79, -41, -44, -241, 220, -255, 171, 61, -189, 85, 156, -427, 36, -23, -351, 161, 139, -209, -149, 199, -72, 218, -72, -10, 83, -39, 89, 91, -45, -193, 215, 93, -86, 18, 107, 78, -11, 200, -269, -68, 240, -40, -156, 138, -84, 97, -73, 11, 161, -248, 53, 172, 132, -50, 17, 46, 9, -99, 170, -77, 57, 143, 17, 217]
5371B17o4P9k48j1J26l03K90J34n95K46J40r6M33n71j07N88k78p7L17l00k66L96
5393E0n1n69N13J66k53L50k32j15J81R9l19K39ml38M13r5j06J45J67m37K86q3
5415GJ8m6M13m65J24o3l1K93m81J12K21N3l66L23J27m73M51l76lK49j01j8M1j
5439Hj71K59o2j02J92lq3K04l62k40N32j44k84M83j58m81N86p6k98L17k27J34
5461B4J38j58p2J6J41j2O9m32R2M86k59k36K95j37r2K54j01K20o7o6k32K98l49
5484a80k5M22o0j15O2j07k41J97J60l38N65m29q2J88J49k06K33k47J45Nk5j13
5506d2J92l15N3L17r8k64J29m9NJ94r8k20N5N5P7m4L8l4oK98l36J88k14O7m6N6
5532d2k3K48k20R7J46k52O3l0j75K45j49L37k01J33k06j67M21l78L29k64J05k37
$$ y = [217, 153, 232, -16, -27, 99, -204, 86, 220, -375, -129, 11, -85, 348, -223, -330, 258, -20, -97, 220, -80, -346, 50, -1, -570, -57, 109, -144, 206, -26, -141, 40, 139, -180, 59, 55, -283, 130, 35, -71, 74, 241, -196, 90, 7, 25, -21, 392, -73, 51, -12, -43, 250, -231, -119, 102, 155, -211, 112, 239, -234, 217, -159, -162, 87, -14, -32, 9, 8, -163, 96, 34, -68, 124, 121, 38, 242, -120, -360, 172, 28, -256, 227, 69, -412, 174, 98, -200, 117, -110, 24, 162, 4, -68, -52, 89, 77, 146, -286, -194, 292, 33, -203, 92, -45, -137, 117, 16, 236, 169, 103, -129, 169, -180, -205, 217, 157, 42, 104, -3, -244, -47, 113, -225, 340, -89, -171, 17, 166, -40, 193, -54, 91, 96, 71, -42, 150, -165, -112, 205, 107, -157, -28, -77, -72, 122, 24, -196, -141, -86, -9, -53, -15, -49, -55, 243, -93, 95, -119, -52, -98, -42, -65, 183, -37, 60, 206, -46, 17, -13, -188, 57, -92, 245, 44, 177, -29, -196, 225, -153, 176, -88, 17, -220]
5554b20K68l9q1j36J65P2J41J7k62j22L21M2l61K32j81K15j69l7J54J4O1o4k40
5577b10K72k36L2J16Q0N7k7j1J12P0p7j60P8m9k05J44k12M06k14r2K75mm5k34
5601a34O1l1J94k81J07j22K92J4p1r9J78K7j83J02J23l02k55N86n6l06J71J70
5623A85j97K51j6k84K97l89R0J15JM2P5j12j84o8J60Q5Q2j50k9p4J2N2o7K1j60
5648b62L43j83r0K06R5j37O3n8j11M28m21K62l7j68J9j0k2L8K13j38q8K16k09
5671e1j18J86n6Q0J24j23j52J64J56k59n9L1O8O0j33J47j20J27J60j61p5q5j07
5694a96K08Oj92J42j30K65j24L17k60P7j71o8R4j3J11k06L00j2l48L72j77K19
5716B14k09J26P0l31J68P4j06j54L75m30p9O16j98j27J39L4j25J69j54j86J67
$$ y = [-220, 48, 9, -72, -208, -43, 29, 170, 187, -75, -197, 124, 166, -195, 37, -144, 71, -98, -135, 19, 33, 94, 30, -210, 62, -174, -142, -26, 54, 111, 84, 73, 185, 255, 178, 18, 96, 47, -158, -14, -226, 180, -34, -126, 149, 145, 100, -134, -73, -104, 90, -191, -84, -206, 86, 100, 29, -70, 108, 135, -48, 54, 177, -125, -380, 206, 150, -156, 15, 185, -12, 239, 223, -61, 236, -153, -63, 52, 53, 95, 170, 58, -126, -194, -34, 51, 133, -17, -46, -120, -108, -56, -123, -102, -262, 81, -102, -192, 14, 109, -28, 35, -23, -134, 294, -127, 135, 98, -70, -51, -61, -83, -45, 168, 30, -58, 158, -51, -169, 17, -39, 41, 165, 42, -110, 54, 210, -49, -108, -77, -9, 51, -82, 65, -55, 72, 232, 71, -4, -89, -196, 12, 18, -174, -32, -162, 103, -21, 296, 36, 113, -58, -126, -32, -45, 66, -140, 160, 148, -200, 172, -5, 214, 5, 131, 201, -130, 38, 112, 6, -148, 227, -203, -282, 334, 136, 9, 148, 182, 57, 226, 72, -114, 53]
5737E3j71J29K53l86J23j32j26Q9K31p6J6K74j11k64L04j10nJ59k41k72L81k2
5759I6j86L78k14p1M31l04j70J00j39L4K03k86J31K72m39K5L22k99R2K46l97L33
5781A58m6k01j14K75k31J65K82m00R9K91l62K4J85k01p7K40j50k03O07m89j7M81
5803C16m52J90K06n78L90L70o22M12j28k25K90j23K7NJ13m11K70J97l73L08K80
5824D62n07p6J77n13K55M39k82R5J14m37M77J8m84J73l2N4j1L00k60K51J6n34
5846c05M11K16m03j4R1q3j96N68n32J17K23k92L2J50K23l92L16n15K99N6j26j25
5868b81K01q7K34O9j57kJ00Q7j25p5j00L16j67p3j34K37J51q0l14K81r1P2o3p6
5892g7J27j8o1j30K80m6j20Q7m02J49M17m04L47k32j11L99j03k60J97l5Jn6N9
$$ y = [53, -118, 11, 264, -122, 1, -131, -257, -168, 63, -13, 3, 277, 166, -98, 206, 96, 91, 250, 9, -263, 118, 96, -90, 288, 74, 3, 434, 130, -40, 60, -79, -45, 158, -128, 3, 275, -164, -139, 183, -116, -24, 222, -175, 158, 112, -89, -203, 72, -159, 6, 288, -112, -13, 278, -84, -60, 125, -76, -153, 87, -63, -266, 341, -148, -165, 316, -136, 54, 260, -318, 72, 442, -180, 232, 104, -121, 169, 46, 73, 78, 191, -220, 50, 247, -126, 182, 462, -45, -121, 56, -457, -202, 237, -45, 50, 164, -273, 204, 222, -262, -89, -121, -67, -78, 222, -38, 213, 229, -305, 106, 322, -81, -95, -4, -87, -283, 285, -247, -130, 93, -199, -167, -17, 206, -186, 130, -385, -86, -30, -156, -281, -80, -167, 67, 136, -21, -23, 77, 164, 39, -36, -136, 180, 13, -60, -194, 43, 194, 114, -200, 81, -10, 62, -1, -77, 50, 32, -29, -159, 121, 75, -45, 42, -360, -211, 206, -198, 149, -83, -194, 205, 102, -158, 39, 4, 5, -51, 8]
5915HL8P7L25o37J18N22l22l53K91l26K33N9pk9J90m20J74K81l75Q0K70l7k79
5938a19L76n49L32O2l81L57N6n20L38L70l23l63L85j12O8n3j5rK99m38K66K15
5960B42n06L86J46l76j5M42m66J53N05p28L22O4k20J59J13k32J65J62n52J42L60
5981B66m32j4K99k87K26J85o71N35L29n56M7K20m65M10l9m41N85j93j08L84P1
6002C51o60L58N4m69N46J33n49O34j95n16L54M32n09K2L57m38N08n40r7K55j59
6023a28K8J63K86n77L32q3M2OO9k07K05Ql13L37O2k02J67k10k17J61J43l38K25
6046d1J12l4K44j65m30K50K18k54J26O0j16k4O8k5j00J26j29O0K24o3j93J34j87
6069a39J12R4k44K53j19j11j34K10r4L81l24j27K23L5l1j89O8J32J10k25n6K25
$$ y = [8, 46, 123, 448, -189, -71, 451, 129, -224, 67, -259, -26, 33, 26, -3, 187, -233, -59, 222, -153, -73, 197, 160, -119, 257, -292, 40, 102, -279, 78, 134, -386, -48, 322, -1, -364, 21, -91, -23, -76, -91, -100, 199, -239, 27, 242, -264, 122, 268, -108, -123, 319, -147, 6, 511, -217, 105, 169, -51, 108, 221, -11, 154, 316, -236, -94, 266, -166, -180, 119, -168, 58, 243, -428, 107, 436, -120, -73, 147, -318, 92, 53, -388, 197, 4, -104, 280, 351, -309, 49, 103, -366, 180, 313, -236, 398, 203, -313, 41, 473, -36, -14, 343, -95, 413, -127, -224, 31, -128, -100, 63, 349, -228, 104, 21, 63, 69, 138, -69, 136, 144, -169, 168, 230, 28, 195, -15, -232, -71, 72, -266, -41, 71, 37, 281, 116, -314, -64, 154, -100, 26, 86, -30, -54, 14, -11, -111, 15, -114, -54, 170, 107, -86, 48, -139, -27, 67, -177, 76, -43, -154, -288, -78, -172, 209, -115, -242, -19, 16, -15, -204, -136, -4, 106, -119, -175, 50]
6091E0l2k2l5pj83J53nj29M59k91j5K32j18l3m1o7N8r4J85j51J60j13j02K5L7
6116g9J81K4nk44L39j42j33k0J60P9k74O0l4l5K19N3k53J45o3K57k00j50j62M28
6140A51O2j12pL7J2p3j44J91j53KJ74r0k34q1K49J94l04l6P4L67k88K01l3k7k00
6165f8O1m4J99m21K27K16l50L05o5j56M5J28j94K46m2l66L99M9j51p3J10m30M54
6188G9j11j77L62N5l56K05J5j83N5L1j84L84p7l47L81k20m3K75j54J43k26J7R0
6211A4Q1k47J98n6j5K03j28j11PL25l61O2R8q6R6O0l22J69J40k23K4k16K41M4
6235cJ72M5k18j55j85N10j36L2RJ4k70J76R9j42K28k26p5j5J97M4j71O3R6p0l23
6260c04J59K99o8k9q0J07r2k20J84l9M3J04j78R7j04K99j14k09J80j37J73k18
$$ y = [50, 18, -4, -39, -46, -229, -76, -81, -210, 249, -42, -57, 175, 57, 24, -17, -84, -26, -120, 65, -86, 74, -39, -141, -116, -79, 102, 126, 121, -123, 216, 74, -59, -79, 81, 160, -114, -54, -88, -123, 96, 149, -104, 41, -22, 235, 35, -115, -277, 151, 213, 101, 94, 131, 143, 70, -74, 117, -36, -34, 140, 50, -184, -265, -16, 178, -126, -162, -88, 279, -9, 192, 159, 132, -68, -7, -51, 148, -273, -46, 170, -180, 125, 60, -96, -51, 77, -117, 129, 87, -279, 120, 169, 18, -55, 55, -375, 79, -32, -209, 153, 208, -148, 57, 72, -111, -56, -25, -209, 175, 98, -249, 132, -88, -131, 144, -10, 133, -93, -76, 14, 95, -152, 46, -10, -25, 178, 50, -61, -54, 271, -90, -28, 70, -16, 80, 140, -182, -13, 127, -96, -72, -288, -47, -3, 169, 214, -4, -159, -344, 166, 30, 62, 71, 85, -185, -9, 90, -52, 176, -50, -125, -140, 57, 101, -70, -7, 89, 19, -304, -145, 154, 86, 57, -23, 84, -8, -228, -44, -83, -40, 64, -114, -17, -121, 178, 64, -145, 35, -102, 71, -147]
6282a47L20j65J81j97o3N2k56K20J24k68J62J73j96qJ81k12L8J56j73J02Q8k13
6304a01j83L92j8j64P4J23k74P7M7j43J48J4j00J11q2J1J59M8k01L36l13n5M6
6327d8J3P8j02J52j79J69J61l72J55O3m2Rl9k74K69J89l26L83j70k13J19m6J0
6350d1K26o4n0j54K1J29j0j75J44j8P1l33L17j10Q0J27k98J99l7J09j29j11J51
6373D4J98K5k87k99L68j07L19l22JJ86j51j70m8L58p6l4K8K73m87K18j88L97k88
6396d2n6L15k79j17O0L15k14j26J47K16l12K48j54J28j0j27q5K97l26k97L90L7
6418Hk05K00k01K17Q3r5J17n4K7j25N5L6k42K79n3J20l62j8J41L3o8k5K43Jj80
6443f8j16M12l89J97J49l56J83K32k63N6K62q4n45N45j68NjM8j56K44m46M0J64
$$ y = [-147, 173, 8, 189, -8, -71, -19, -275, -55, 69, -199, -37, 136, -60, -68, 113, -99, -61, 95, -78, 24, 112, -101, -284, 108, 90, -74, 0, 123, -151, -74, -27, -170, -22, -8, -108, 3, -79, -68, 91, 139, -62, 274, -39, -94, -48, -35, 43, -59, 93, -86, 83, 244, -128, 27, 90, 48, 57, 18, -256, 13, 202, -124, 259, 89, -124, -5, -51, -41, 185, 121, 71, -83, -62, 67, 57, -118, 26, 8, 79, -254, 63, -47, 33, 160, -138, 61, 24, 133, 4, -107, 44, 242, 267, -20, -319, 49, -58, 261, -61, -60, 126, -25, -195, -243, 115, 39, 5, 33, 306, -181, 37, -151, 246, -42, -98, 217, -62, -179, -119, 196, -18, -144, 3, 219, -93, 155, 1, 129, 119, -8, -93, 204, -122, -419, -29, 8, -197, 3, -198, 19, 102, 7, 124, 70, 97, -28, 27, 63, -179, 100, 47, 167, -195, -213, -72, -39, -107, -132, 111, 112, -68, -184, 228, -161, 36, 185, -171, 12, 244, -19, 37, 299, 215, -330, 215, 47, 52, 51, 99, -57, 187, -259, -219, -55]
6466e5l1j20K14J00j63L65m77J54J08l9l08L00L7j75J58k20J66J46J49l96L71
6487B84m61o1N41m12r6L83j2j43J05l18K58pm25L82M2J13k11j03k9J39K03J28
6509C00m83L15m8o1R0q6j53M58m95m3L01k49J14J71L3j89J05j40J59L25n10M2
6531d4L24m65K70n0j23qJ28j80N5J67k56O2K47k15j71L39k42m4N41o82J43N52
6553C48p00M04l4k9L23m25J07K57r4j41J75m4k08K4Q1k87J8N82l25n7K47j77n
6576D0j05l56O08O0l33MM58m17j95N23l37O9R2k42R9L50n44K03J30k87n6L61k63
6599a38l2L18l37L26j35j5q6K57m16J22J60J26j15N1j98L25j75j29%K29o1l7m1
6622aq9P1R9j77J75J45k64K75j45k04R3l0j58J67j32K29M5o8j95m9K45l9p8J42
$$ y = [-55, -86, -206, 8, 108, -55, 310, -167, -13, 95, 56, -252, 48, 85, -90, 68, -152, 14, 160, 309, -87, 284, -177, -238, 303, -109, -205, 178, 166, 23, 128, -190, 68, 61, -364, 18, 60, 173, -38, -141, -170, -31, 172, 300, -183, 132, 84, 23, 113, 27, -126, 332, -163, -206, 95, -154, -40, 131, 164, -25, 80, -60, 99, 424, -86, -44, 280, -185, 85, 35, -88, -96, 32, -148, -93, 74, -182, -120, 127, -88, -259, 80, -162, -206, 335, -347, -204, 348, -352, 52, 18, -11, 312, -113, -6, 251, 157, 16, 191, 147, -61, -37, 44, -243, -225, 357, 32, -25, 222, 45, 40, -65, -421, 187, 247, -86, -82, 376, -41, -236, 287, -50, 19, 111, -131, -32, 318, -226, -23, 107, -180, -236, 125, -138, -170, 148, -189, 137, 2, -13, -99, 158, -258, -136, 24, 150, 35, 86, -112, 213, 38, -91, -91, 138, 77, 40, -1, -90, -19, 80, -97, 78, 223, -41, 234, 89, -115, -22, -52, -210, -43, -175, 54, 99, 31, -164, -213, 32, -7, -85, 57]
6646E7Q0k77L13l73l6K77q2K41j85m6q9l2O0K42J0k56J76j40Q0l7P7o7j9qL4j13
6672a13L5K29o4j21m4O4p4R4p3J11m1k34J1L09j64O1m2K4R3M9l25M11j42m8J2
6697A8R2j69J52kl62K62L56l58j53M49n36M54j39j08j79K95mq3O1p8j22L21l53
6720a86J00O7o4k5L30k79Q4P0j89J19j1k32Q3J43l3j02L73n68M63r3r6%J33k94
6744b07K81j16j8R3P4l07k82P69m16Q8p9j42L12M2j92J13L9J6K1J1r1L4j77o2
6768a96L24j88M0O7K1k58L10q1j0K8j14O0o9L00l94J31J72k52P5J98k95J16j17
6791a32P8N5K12k70J29k29K21P3j32o8R7J41k22J15R5j78J80R0l75j4J86J00j27
6814B5o5j85K22r5J78K1R0j97J37n0J1O3P6m1k75J26q7L06k81j18K75M2M1j33
$$ y = [57, 137, -140, 173, -200, -236, 41, -41, 200, 15, -31, -120, -152, -92, 150, 160, -96, 80, -60, 20, -17, 60, -7, -26, -34, 0, -113, -78, 151, 87, -34, -78, -14, -88, 6, -67, 44, 3, -231, -220, 89, -75, -14, -56, -32, 61, 110, -215, 196, 54, 6, 18, 110, -59, 93, 91, -271, -9, 347, -11, -164, 285, -251, 203, 64, -44, -223, 72, 68, -15, 46, -32, -154, 167, -186, -86, -19, -83, -108, 222, -57, 27, 97, -92, 27, 16, -216, -133, 10, -23, -125, 248, -320, 143, 50, -46, -46, 87, -207, 74, -42, -60, 33, 107, -200, -482, 287, -129, -41, -120, -262, 50, 92, -100, 13, 52, 68, 89, 100, 9, 43, -134, -196, 128, -60, -20, 47, 68, -190, 120, 39, 29, 57, -57, 3, -66, 234, -160, -29, 143, -109, -34, 164, -131, -15, -132, -54, 1, 213, -57, 72, -157, 64, 137, 5, -63, 34, 175, -47, 68, 163, -15, 165, 255, -120, -134, 52, 152, 25, -40, -225, -3, -98, 80, 101, 191, -6, 131, 81, 92, 155, 231, 190, -85, 41, -46, 260, -21, -139, 136, 178, 219, 86]
6838H6n8N6J46q7j57J60j29n8L8nK03j81R6j80N2n6K32p3j57J20j93K49j35J31
6862A00o0M1n3Jk51R3M0J72K5J84n36K18j16N3L10l08M3k43M69k19L6m5Q1j43
6886a08L16m0k48K37l4j77l4K72k16N5j77N7L71r9k95K66j67m6J52j67j29P3O1
6909g7j30K72j02l18N64k4r7J16r1j69J65J99o02M71l04J71J22j60p3K44K0j72
6931B5L3R7M7k39P9l3Pj51R3K74k50l15M58j8m6lq4r3N25n87O8N1J15k52L36j90
6957e3p6K29j87J90j23K51k65p0Q3mJ66j06M9nO2m4n5j58nJ84o1OJ23q2j45K70
6983A74j40j10J57L2K9j02k84K48k34L73j97J29j30J51j42K26k89j3J77j7N1J04
7005A93l63N5L88m04k1K06l22K12p5J61j31J76J25l45l4m8L77k69J78K1J29k12
$$ y = [86, 28, 84, 230, 143, -14, 146, 17, -41, -3, -8, 195, 14, 110, -70, -18, -74, 158, 85, -72, 48, -145, 104, -31, 100, 40, 81, 28, 29, -222, -129, -89, 83, 108, 292, -244, -26, -142, -89, 221, -87, -44, -287, 182, -37, -1, -46, 35, -108, 208, 168, -80, 157, 123, -54, -88, 184, -32, 23, -154, -97, 274, 175, -120, 146, -21, -67, 85, -82, -211, -138, -77, -207, 65, -37, -355, 209, 185, 88, 204, 113, -56, 109, 308, -294, 177, -127, 44, 166, 6, -67, 177, 197, 25, 58, 155, 202, -37, 42, 9, 16, -135, -42, 232, -18, -333, 125, 107, 61, 58, -26, -119, 406, -181, -113, -62, 53, -199, 137, -53, -129, 100, -87, 103, -20, 231, -34, -104, -21, -25, 141, 35, 84, 79, 141, 97, 42, -116, -121, 63, 2, 8, 131, 49, -96, 174, 34, -76, 81, 113, 142, 40, -244, 4, -230, 143, -54, 75, -55, 96, -46, 180, -109, -122, 55, 38, 89, 193, -170, -115, 273, -131, -152, 54, -268, -56, -131, 30, -101, 75, 200, -145, -179, -227, 150, -119, 59, 80, 209, -3]
7027cr0L86l83J05j11J79j91J70j55m7J70j72o9L91p6m05N58j59k17k7K12k49
7049a83L16J25m56L01N5l79M68l98J81l6j49R7J15L5k52L02k56K2K8k12J48L70
7071B42k86j92N51k51j48J50J4j97J53j70M4L6k1J58k58K22j41L77l33N0J28l04
7093a76K05l1J4J00j66J16k79M23j16N7O4k53j50M01k43r9K22m20K68J83j92J9
7115e3K31n5k42L71l04j12K93k39J10J90j19m4P0l85L20j55K39k39L8J58Q7j64
7137do1J04O2j84k0K30k06J58j38J02j20L69l29n5J02K56l56L03r9k39L02j26
7159E1j3%M54n71L9QJ15q9J16k99L18j66l3J47J28k67j15J89K77j93p4J46l78
7182b10K1J12P6J4j09j24J15J26l7M5j15R1p4L7R0q1kJ12Q4k49k0n1J27J26l3
$$ y = [-3, -93, 293, -90, 15, -96, 83, -108, 62, -93, -140, 30, -142, -211, 180, 104, -301, 257, 98, -119, -146, 66, -183, 133, 258, -198, 103, 158, -221, 247, -151, 30, -6, -155, -58, 57, 92, -160, 142, -114, -92, -64, -276, -128, 242, -44, -236, 315, 64, -84, 66, 80, -117, 36, -134, -90, -54, -75, 83, -175, 47, -94, 283, -50, 0, 128, -176, 29, -2, 12, 112, -54, 62, -217, 206, 90, 147, 211, -42, -192, 209, -34, -133, 89, -331, -63, 120, -72, -53, 178, 123, -119, 252, -52, -164, 129, -110, 0, 190, 71, 27, 97, -288, 32, -123, 116, -123, -85, 73, 160, -4, -65, 39, 101, -83, -103, 127, -79, 79, -59, 43, -77, 292, -37, -92, 10, 266, -90, 213, 114, -125, 177, 51, 38, 38, 492, -79, -40, -32, 83, -6, 110, -189, 129, -37, -70, 77, 205, -62, -177, 12, 289, 96, 22, 168, -210, -189, -77, -1, 13, -96, -220, -105, 21, -16, 29, -86, 5, -69, -32, 58, -23, -25, 87, 171, -78, -98, -149, -22, 104, 71]
7207G1j85L72m25J28J20r7m1L6p3QK38J65l34j77K17k44O9Q8q7K11j69p0L02n6
7231F7l2o9J71j05rj49K89j15k39J44p2J86q4K95k81j58K78M5k82j94M84k41j21
7254a92K26J55k95K32k83Q6J54l5J24qj78J10j04k46k1L27%n4j54n1K52j10j61
7277b26L02P0l14K75O0l56L18R6k98J63k7k61K29J48K5k59J92m9j05K69l24QR0
7300B6L6Q4Nk22J23q9k61L99r6j29pK55J05j86k00j47L92J09l19O3pj97K41L36
7324C14m71J33N7q2n5J04o9J20Q1l42L93k75j26J19K21k65J82J55l39J90M6j38
7346d7J50p5l88M09J82k72j70L57j61K22k76K05j05m2j48R8J84j42m4pK2K67j30
7369H9j96K80l85O7J93j10N3n5%k98M59j13P9Lk20l6K96l39L07l15K5K99j01k46
$$ y = [71, -114, 258, -167, -39, 81, -16, -57, -21, -94, -86, 152, 317, -17, -194, 23, -221, -152, -64, -151, 60, -109, -179, 123, 67, 35, -34, 137, 32, 23, -126, 163, 48, -191, -47, -119, 67, -17, 278, -3, -161, 117, 162, -120, -314, 170, -71, -192, 34, 189, -106, 126, -157, -71, 83, 48, 172, 164, -14, 96, -8, -254, -275, 52, 52, -2, -156, -207, 45, -65, -226, 76, 146, -168, 107, 167, -189, 129, 225, -73, 90, 63, -198, 31, 179, 204, -55, 137, 88, -17, 252, -72, -64, 26, 62, 146, 151, -71, 52, -37, -298, 101, 5, -124, -131, 124, 229, 43, -157, -304, 88, 197, -122, -59, -66, -263, -22, 314, -157, -24, 33, -49, -104, 0, -69, 51, 132, -210, 183, -92, -218, -99, 122, -143, 39, 194, -145, 45, 91, -47, 103, 28, -360, 49, 231, -41, -211, 146, -15, 207, -69, 136, 31, -11, -159, -61, 123, -19, -63, -70, -48, 219, 89, -107, 173, -212, -145, 48, -62, -9, -64, -64, -362, 97, -16, 63, 66, -154, -190, 106, -233, 74, -241, -216, 83, -18, -264]
7393b64L46j89MJ00j53L89k78K00l63M14j30j06M4m4o5P8J11k0k03J0m0P5%j91
7417b75J61n6L83R7l68P5l25L17j72K7L54l3Q6k75J11k06K17j24K44j3k05q8Q
7440f0K28j34k30L97j25n9J48j57N4L6L4l62K59n1o7J66O3j65k9K9j19K23r6j05
7464a22O4K18k49J59m1j5J00k45m3L2J43j4J06rP5r4j2l66N52l64k0L56k72J62
7488A01K2P7k81l2K03k39K45j11M3J98k3o45N91j62j93O3N6O3J63j19j78K91p1
7511F2l12N77m37R4J98j32j58J88P0j40K3j01R6K6j04j40L20j93J58K46j87m0
7533A14M0j27j18P0j94J01L13j71j49J09j33L51m0l10J14m7J12j2P1o2j01K86
7555B17k44QJ38j81Nn0J20M9P7j27K18j89j7M9k42M6K65p6j29M4J15Q1k26OJ78
$$ y = [-264, 82, -107, -103, -3, -156, 233, -45, 155, -208, 206, 76, -30, 14, -30, -95, -17, 94, 74, -129, -119, -159, -84, -84, -275, -114, -170, 213, 310, -58, 17, -308, 9, -163, -136, 218, 185, 271, -4, 107, -99, 118, -6, 238, 225, 20, -68, -60, 168, 34, -196, 201, 76, 17, 165, 8, 62, 98, 132, -230, 29, -22, -89, 77, 140, -25, -54, -25, -144, 79, -17, -122, -58, 160, -89, 70, 29, 14, 114, -131, -174, -142, 1, -13, 93, 84, 159, 65, 53, -313, 239, -125, -145, 211, -61, 101, 123, 200, -81, -113, 90, -149, 96, -15, 28, 226, 203, -442, 149, -13, -206, -143, -87, -24, 139, 20, -158, 133, 62, -250, 327, -110, -16, 182, 50, -108, 80, 150, 10, 33, -68, 28, 54, -50, -190, 130, -63, 95, 341, 154, 114, 154, 27, -91, -21, -215, -114, 199, 28, -121, -12, -145, 206, 166, -144, -30, -77, 35, 23, 94, 32, -69, 217, -27, -19, 119, -62, -57, -107, 13, 62, 139, 12, 230, 41, 24, 73, -169, -123, 142, 66, -63, -19, 96, 177, -49, -43, 135]
7580A35k53K9LL15k14o0l0n4J91J12m78M21k07k59K84j05J98j47J07o6L09j31
7602A00p3m5n6L60j42k05K08k44k7K18k6r7j13jL22j82l86K26K31p9j51J39o8
7625i1L2N8L2M4j40J52l8k31K90j67M3L9j17Q9N2J12q0L3k38m3L26k57p8M89K5
7650C36m93L01l13K28o5j10k9P1Q2J3ro6J53j5O5k11q5J40j62K44j12J25pj68
7674h7Lo1K31m23M09k83R2K87l55J2N44k58j75L6O1r7L10k24l5J59m52K87K38
7697B19n53L39N3J8Rj19J22n2P6k86L00M4l92K98P9l48J60K35k92n2J41J13o9
7720D3j04J22r9N21o96P4K39j76J68J30K1n28K56J5kR8k81K33j80J23J34J14l65
7743a40j65J59R1JR5J05j89R4j32K21j07P2l23L20j50Q3o3L7pj22J91O5k3k24
$$ y = [135, -118, -89, -86, 229, 15, -45, -75, -129, 62, 174, -304, 117, -90, -349, -65, -170, 28, -119, -12, -78, 231, 100, 27, -18, -74, 286, 144, -61, 147, -97, -124, 94, 68, -29, -142, -143, 179, -3, -389, -163, 68, -11, -162, -23, -91, -59, -1, 31, 75, -65, 87, 49, -182, 108, -59, -16, 23, -94, -5, 47, 159, 79, 112, -126, -169, 157, -100, -178, 311, 336, -157, 144, -169, 59, -6, -116, -145, -74, 8, 21, 12, -54, 99, 84, 149, -62, -147, -7, -169, 75, -37, 88, 81, -87, -84, -145, 86, -337, 72, -211, -119, 168, -187, -175, 369, 111, -64, -28, 33, -64, 246, 22, -13, 146, -306, -19, 219, -334, 5, 58, 76, 85, -34, 88, 36, 112, -174, 126, 170, -222, 76, 155, -193, -33, 202, -90, -142, -1, 112, 43, -61, 61, -38, 483, -213, -139, 100, -76, 92, 222, 243, -285, -29, -14, -16, 82, -199, 34, -146, -23, 111, 225, -140, -305, -146, -55, -54, 41, 146, -43, 51, -81, 140, 33, 105, -218, 102, -48, 35, -28, 9, 2, -120, 71, 136, 113, -111]
7767a11O2O8k14J96j99Q9J17j03J25M2M0j23p7MQ4j20J93l15L92j25j0P1Rn8m3
7792fq8J19j78K56Q0k89J24M4P3J62j31m82K76R7R5j31J52j63j38J35j85K38L0
7815I0q7k70L27q1J28L5q5o4O0jj98O8K86k36k12J60p0N9K8k4J81k60n7N14k55
7840C6j01j04J29K38j67J43m11L15j40J6J29j43j70L13k66l3L68m24K26o4r5l8
7862b43L75k33m5L09k93O9K14j00j57J99l77L13P4k53J05j16K47p6Q1l3j7K78
7884C21l42K69j57l98K97M9O5l22j32J80j5J79J62j45j84l5K21j59J93Pr2j31
7906a69p7L91k46J85R7l50L64j92o9J75j02L2q3L01j75m54M37k11J81J83l07K71
7928A82j10J04m64L67j2n2j12P6k8K33k91J70jjK2J5K7k00K03l22M01k61O5mp
$$ y = [-111, -49, 19, -195, 1, -198, -109, 8, -95, 30, 72, 112, -11, -88, -84, 0, -120, 73, -242, 150, 25, 15, 86, 95, 37, -6, -94, 25, -153, 103, 183, -106, 18, 62, 135, 297, 166, -316, -40, 57, 152, 21, 173, 10, -128, 7, -178, 60, 90, 3, -267, 60, -21, 107, 142, 57, -7, 53, 52, -146, -78, 208, -28, -240, -80, -150, -91, -63, -87, 94, -166, -223, 291, 36, -65, -169, -40, 198, 31, 174, -237, 78, -62, -46, 83, -60, -230, 83, -183, -216, 152, -272, -46, -110, -205, -243, 132, -101, -146, 163, -130, -61, 153, 53, -104, 95, -282, 31, 105, -148, -43, -159, 88, 12, 93, 60, 43, 321, -21, 248, 91, -307, -10, 39, 104, -218, -350, -170, -185, -6, 156, 11, -173, -208, 13, -146, 47, 54, -38, -169, -246, 145, -101, 84, 181, -169, 195, 3, -66, 109, 7, 39, -44, 257, 82, -372, 65, -146, 35, 218, -89, 182, 72, 176, -288, 79, 67, 15, -97, -21, -49, 184, -107, 63, 62, 61, 83, 98, 125, -75, 128, -194, 207, -54, 11, 7, 0]
7953@n0J8o6J89j05j13K44Lj04K91k41j38RK1N0N7o0r4L4R6j0J23l9M6j38j20
7979i7N7R0MJ2Mj01j33K70l19M18Ll94J77J00RN6j77J35kj75k14M05k0k84L55
8004A79k00p0L16q3k85K66o0k01K11L3k19J67r4k58J97K41l12L56m0k38K23J25
8026B54l51J75J1j70J3J31j96J20K21n19M70j41l88N50j59m5R3j07k74J64J4J06
8048b8K86l43J14j60L11j94K72m91l8K85J84m91K77J93j59P1l5J11j76K3n3L09
8070B68k96k07K16l46J58K91j83o0N14n23k7J81J4j87NL76k15o4L9l8J66j05k
8093b5m8J07j78J30J53j04kj3J50j01k10j9J94j44J35J76k04n5O3lnK2J20k36
8117i7Q9o6K7k13J45J49J21J6k45r5L8J05N6j68J52N7m9m2M4J2K7j18J13J74m81
$$ y = [0, -50, -32, -98, 91, -14, -127, 117, 120, 16, 307, 66, -72, -63, -42, 8, 65, 5, -89, -55, 41, 31, 154, 115, 161, 23, -97, -40, 50, 54, 66, 70, -31, -164, 106, -213, 205, 208, -186, -9, 91, 100, 156, -21, 114, 112, -63, -277, 128, 108, -176, 179, -21, -91, 225, 142, -143, 123, 63, -138, 73, 106, -113, 54, -40, -298, -101, 140, -172, 184, 144, -94, 129, 254, -97, 78, 89, -81, -68, 63, -133, -13, 208, -311, 159, 18, -370, 180, 21, -24, 69, -38, -312, -148, -134, -28, 258, -85, 29, -131, 180, -14, 258, -233, -271, 14, 198, -293, -16, 177, 18, 89, 54, 165, -11, 12, -41, 268, -28, -235, -19, -365, -207, 84, -99, -159, 355, -168, -195, -14, 0, -187, -182, 194, -21, -85, -46, -84, 82, -23, -25, -73, 34, -144, -14, 139, 35, 33, 20, 170, 69, -141, -160, 34, -110, 25, 201, -3, -58, 5, 2, -3, 19, 139, -97, -8, -74, -47, -260, -115, 34, 155, 171, -74, -169, -131, -26, 30, -138, 14, 71, 22, -20, 24, 36, 63, -55, 58, 232, -249]
8142b49K21mK00l8l30o5M67l3m59K06J55j26m0K03j1jj31L50k48n3J04P9k10j5
8166b8N4P4R9l43K82j68j21J15M2M4J61k26J4j89O2M2O2K36k33K29j96j81J41
8189b8L48k30
$$ y = [-249, -28, -32, 168, 130, -200, -265, 202, 169, -290, -84, 71, -55, -95, 108, 97, 96, -35, 315, 67, 14, 118, 197, -13, -28, 26, 100, 199, -144, 138, -30, -151, -36, 6, 50, 211, -15, -1, -190, -128, -86, -24, 212, -21, 208, 12, -169, -28, 320, 90]
8191I0
$$ Imaginary data points
##PAGE= N=2
##DATA TABLE= (X++(I..I)), XYDATA
0@%%%%%%%%%%%Qj6J6j6J7k5L2l3M1m9N7o5P3q8J01j10J22j38J54j75J99k18K42
34A29k69K93l22L58l96M32m72N16n64O15o72P36q00Q73r57J048j149J262j391
53g30J541j714J915k152K437k785L214l758M463n398O684q527J1321j5905K4394
68A5000m4234J66486j15037k14490L62866j57156j93682L45836j55994j77741
78a68146L29107j61711j56099L15877j62168j50256L08852j61158j41037K97109
88A50370j54191j38332K87358j52196j28114K78406j56488j12225K62686j52017
98a4743j05179K56731j57379r3012K47642j58578q2118K38342j58852p4377K28863
109A27340j55199o7419K14033j43553o5162K03416j40972n1537J83868j33833
$$ y = [0, 0, 0, 0, 0, 0, 0, 0, 0, 0, 0, 0, 8, -8, 8, -8, 9, -16, 16, -17, 24, -25, 32, -33, 40, -48, 53, -57, 65, -73, 81, -94, 105, -113, 129, -140, 153, -169, 189, -207, 225, -247, 269, -295, 320, -352, 384, -416, 457, -500, 548, -601, 661, -730, 811, -903, 1012, -1140, 1297, -1488, 1726, -2032, 2431, -2967, 3717, -4810, 6511, -9394, 15000, -29234, 137252, 22215, -192275, 170591, 13435, -180247, 165589, 9595, -168146, 160961, -750, -156849, 159028, -3140, -153396, 155456, -5702, -146739, 150370, -3821, -142153, 145205, -6991, -135105, 143301, -13187, -125412, 137274, -14743, -119922, 136809, -20570, -113582, 134060, -24518, -106636, 131706, -27146, -101523, 127340, -27859, -95278, 118755, -24798, -89960, 113456, -27516, -79053, 104815, -29018]
119b9018m4030J74349j32079l8386J69560j33369l0695J58220j25971k7389J46026
130H7218j18671j8687J28739j08564j4577J17568j03882p930J05941r7369l255
141c3469R3816q6349o329Q8935q2114l201Q0305p5070k495P3232o8181k577O5354
154D1857o0064j975N5267m9786k284M8562m7661M535L7105l9102K606L3539l3347
167a0748M05K9441k6840m04K1064j7081k291J4974j1286j111R468o735k233Q293
181D916o422j233N567k619k283J922L524o447K073N089o271j983J0459p283n448
196f439J4448q611p753J7540j0286p738J8698j0828q594K0479j1082j1898K6110
209A4046j6369j0119K7640j7657j0657K8749j7493j1986K9934j9088j0474K9970
$$ y = [-29018, -73048, 101301, -30778, -69164, 100396, -32973, -63668, 94552, -31419, -58808, 87218, -31453, -50140, 78599, -29965, -44542, 73026, -30856, -38786, 67155, -30214, -33469, 60347, -26002, -32331, 56604, -25510, -28711, 51594, -23476, -25971, 47261, -20920, -23497, 41857, -18207, -20182, 35085, -14701, -16985, 31577, -16084, -11549, 25556, -13546, -10940, 22599, -10748, -10343, 19098, -7742, -8146, 12918, -4163, -6454, 8520, -2766, -3877, 5591, -1144, -3377, 4916, -1506, -2739, 2828, 209, -2074, -152, 3372, -3075, -1002, 4087, -2184, -4167, 6292, -991, -6439, 8009, -602, -8355, 9185, -1101, -8839, 9859, -969, -9563, 10916, -166, -12064, 14046, -2323, -12442, 15198, -2459, -13116, 15633, -1860, -13846, 16088, -3000, -13474, 16496]
221A6496k0207q631K9603k2120p169K8924k1729q089L0942k3375p316L1457k4812
234f026n891K9281k2492p174K9992k2759p200L0306k4255n473K9723k4897m642
247a1507K9958k5253m691K9984k5241n131L0794k6497k851K8162k5379j788K7087
260A7647k5364k042K7343k5936j000K6804k5498m60K5188k4864R2K4295k4304
273h099J93K4428k5781K191K3515k5645K706K1778k3960K121K2100k4491L216
286e728K1489k6127N161K0246k5243N242J9717k4209M521J9830k4891N294J9548
299A4850k5561O990J7982k4910O784J8582k4938N809J9206k5465P025J7589k4612
312a0669Q263J5489k3856Q360J5638k4291Q713J5942k5425J0337J4698k4736J0345
$$ y = [16496, -3711, -12342, 17261, -4859, -12028, 16896, -4833, -12922, 18020, -5355, -12671, 18786, -6026, -11917, 17364, -5128, -12302, 17690, -5069, -12269, 18037, -6218, -11691, 18032, -6865, -11507, 18451, -6802, -11493, 18491, -6750, -11881, 18913, -7584, -10435, 17727, -7652, -9440, 17647, -7717, -9759, 17584, -8352, -9352, 17452, -8046, -8506, 16682, -8182, -8090, 16205, -8099, -7906, 16522, -9259, -7068, 16447, -9198, -6492, 15286, -8674, -6553, 15547, -8944, -5728, 15761, -10366, -5205, 15041, -10202, -4960, 14757, -9452, -4931, 14899, -9992, -4698, 14850, -10711, -3721, 14261, -10649, -3865, 14717, -10221, -4412, 14794, -10671, -3646, 13943, -10669, -2406, 13083, -10773, -2413, 13225, -11066, -2353, 13589, -11836, -1499, 13199, -11537, -1192]
325a192J3385k3558J0132J3949k5066J1916J3285k5326J2379J2752k5031J2015
337c60J2756k4117J1260J2704k4315J2248J1559k4028J2868J0437k2319J1325
349A8J1011k2048J1251J0343k1535J2001Q140j9561J1774P732j9466J1623P621
362H904j9149J1696P095j8882J2867M801j6946J2453L761j6217J2058M485j6692
375i766J2940L157j5840J2585K701j4515J1258L014j3578J0313L870j4371J0860
388B628K469j2863J0390J755j0639Q048K789j1254R073J570j0325R084K69q531
402e537Q051M55q136P259N76p402O850K76p068P475j076n567N948j44o081N965
418A844M29o655O679n45n579N698L71o014N797j45n803N903m6o272O816j015n188
$$ y = [-1192, 12193, -11365, -1233, 12716, -12350, -434, 12851, -12475, -96, 12656, -12375, -360, 12396, -11721, -461, 12243, -12072, 176, 11735, -12293, 575, 11012, -11307, 18, 11029, -11019, 232, 10575, -10960, 1041, 9181, -10380, 1394, 9126, -10340, 1283, 8904, -10245, 1451, 8546, -10336, 2531, 7332, -9614, 2839, 6600, -9617, 2441, 6926, -9766, 3174, 6331, -9509, 3076, 5777, -8738, 2520, 5534, -8044, 2269, 6139, -8232, 2628, 5097, -7766, 2624, 4379, -6260, 1788, 4577, -6677, 2396, 3966, -6359, 2725, 2994, -5537, 2514, 2969, -5167, 2092, 2668, -4734, 2116, 2392, -4676, 2799, 1723, -3844, 2104, 1960, -4121, 1844, 2273, -4382, 2297, 1752, -3827, 1871, 2242, -3772, 2025, 1880, -3923, 1980, 1934, -4338, 2478, 1463, -3725]
435c725O326j380m655N438k20o190P214j561n304O824j631m863O237j088n336
450c914O866k063n274P993l195n265R648m931m454Q928l543o362J0423m156p004
465f303J2510o564n356J1498n760o220J2648o865o329J3910p673p144J6117r372
479i03o747J6500r896p082J7450j0008q868K0478j3577n762K0342j4926o067K2006
493A2940j6508o443K4493j8862o001K5766k0234n817K6809k2254l614K5918k2667
506f474m050K8277k5759k000K8443k7566n64K8551k7992j449L0803k9554j780
519a1114L1627l0262j601L3534l2785o29L3865l4279K43L5242l6521J121L7242
532B5683m0566M622L5716m0865N498L5489m1744P080L4926m3210R287L3924m4355
$$ y = [-3725, 2601, 1221, -3434, 2004, 1784, -4406, 2808, 1247, -4057, 2767, 1136, -3727, 2510, 1422, -3914, 2952, 889, -4385, 3608, 413, -4852, 4796, -135, -4589, 4339, 796, -5566, 4857, 701, -6303, 6207, -357, -5713, 5785, 25, -6195, 6453, -412, -6741, 7169, -504, -7648, 8469, -903, -7650, 8850, -1046, -8128, 9322, -686, -9554, 10924, -2653, -8415, 11927, -2999, -9066, 12940, -3568, -10011, 14482, -4380, -10381, 15385, -4849, -10666, 16143, -6111, -9725, 16193, -6474, -10524, 17753, -8006, -10006, 18437, -9129, -9693, 18858, -9134, -10583, 20220, -9334, -11114, 20513, -9749, -11350, 22184, -10601, -11230, 22635, -11644, -11401, 23841, -12680, -11559, 25683, -14883, -10261, 25455, -15410, -9912, 25577, -16167, -9087, 25839, -17371, -8084, 25840, -18515]
545a8515J1240L3373m5644J3191L2582m5954J2844L4352m8539J4574L4182m9180
557b1494J5398L3797m9738J6224L4575n2398J8731L3252n2826K0797L2026n3547
569b5203K3016K9492n2855K3808K8504n2135K4251K7900n3041K6440K5526n1324
581b5621K5605K6159n2594K6889K5507n2909K8521K4157n3460L0202K2655n3428
593b8317L1787K1165n2630L1744K0746n3128L3525J8243n1058L3540J6351m9531
605b7563L3789J5191m9633L5356J3952m9349L5593J3656m9056L5843J2549m8367
617b8039L6129J1762m8357L8302Q821m7430M0229N323m5129M0223M530m4262M0102
630A2204K714m1817L9509R93l8977L8003k60l7070L6907q9l5602L5077k37l4304
$$ y = [-18515, -7275, 26098, -19546, -6355, 26227, -19727, -6883, 27469, -21070, -6496, 27686, -21494, -6096, 27701, -22037, -5813, 28762, -23636, -4905, 28347, -24479, -3682, 28344, -25203, -2187, 27305, -25550, -1742, 26762, -25373, -1122, 26778, -26263, 177, 25703, -25621, -16, 26143, -26451, 438, 25945, -26964, 1557, 25714, -27746, 2456, 25111, -28317, 3470, 24635, -27995, 3749, 24495, -28633, 4892, 23135, -27923, 5617, 21968, -27563, 6226, 21417, -28216, 7140, 21092, -28257, 7336, 20992, -28064, 7779, 20328, -28039, 8090, 19852, -28505, 9797, 18618, -28812, 11417, 16740, -28389, 11834, 16364, -27898, 12204, 14918, -26899, 12610, 13603, -25374, 12629, 12369, -24701, 12206, 12117, -23485, 11592, 11355, -22949]
644b2949L5246k187l2444L4684k396l2107L4054k141l1291L3648l906k8524L2915
657A2602n706k5869L2125p421k3989L1336p850k3768L1900q218k2943L0480q208
670D471k0688K7687p248j9294K6930q637j7737K6149r069j6625K5301r012j4777
683a2549K2984q455j3217K0590q267j0917J8738q886q341J5971p450p349J3834
696F686o461o511J2590o705m547J0360o088l455Q802n153l194P345l651l305O041
711B754k671j707K953j419p02R20m5m34kN82L93j985K017P35m442M355J241o719
729d176N843J801q569O125L361j0363P291L601j1840R233L071j3191J0144L783
743F114j4694J0939M434j6538J3144L387j7195J4676K281j7963J6325K156j9374
$$ y = [-22949, 12297, 10110, -22334, 12350, 9954, -22153, 11901, 9760, -21531, 12117, 8211, -20313, 12602, 6896, -18973, 13152, 5731, -18258, 13078, 5228, -18540, 13360, 5142, -17801, 12679, 4471, -16217, 11470, 4222, -15072, 11858, 3221, -14516, 11633, 2564, -14061, 11240, 2228, -12549, 10435, 1980, -11237, 9353, 1086, -9831, 8907, 21, -8320, 7651, 201, -7148, 6686, 225, -6286, 6304, -401, -4948, 5412, -676, -4131, 4671, -482, -3676, 3669, 18, -3287, 2754, 83, -1624, 1329, -90, -792, 128, 83, -351, -353, 229, 622, -1363, 654, 1389, -3053, 1302, 2543, -4176, 1667, 3468, -5101, 1024, 4385, -5978, 1313, 4914, -6926, 2307, 5378, -7813, 2331, 6114, -8580, 2359, 6793, -9745, 3399, 6786, -10409, 4267, 6548, -11415, 4910, 7066, -12308]
756a2308J7729J895k0363J8773J711k1287K0832l34k0674K1711q83k1950K3871
769H723j907k3084K5770k740k3230K6605l632k3175K7101m272k3381K8377n184
782E971k3438K9671o707k3331L0730p673k3370L1364q367k3219L2154r578k2409
795a8202L2377j0540k1864L2782j1098k1585L3160j1894k1596L3995j3168k0683
807a8316L4181j3953j9822L4266j4436j9833L4451j5493j8590L4290j6051j7472
819a6778L3319j6556j6416L3018j7057j5531L2783j7686j4798L2435j8358j3338
831a4963L1275j8342j2281L0502j8331j1287K9726j8926j0314K8574j9024q852
843a2243K7527j8640q550K6853j8436p789K6070j9131o048K4741j8469n757K3939
$$ y = [-12308, 5421, 7316, -13047, 5726, 7437, -13850, 6982, 6648, -14026, 7685, 6802, -15148, 8723, 6816, -16268, 9502, 6762, -16468, 10137, 6505, -16670, 10431, 6159, -17222, 11155, 5971, -17467, 12204, 5497, -17834, 12896, 5223, -18147, 13217, 4850, -18369, 13785, 4207, -18202, 14175, 3635, -18229, 14553, 3455, -18130, 15030, 3136, -18460, 15535, 2367, -18316, 15865, 1912, -17910, 16356, 1920, -17913, 16538, 1045, -17545, 16745, 694, -16778, 16541, -15, -16431, 16587, -470, -16001, 16782, -904, -15702, 16733, -1625, -14963, 16312, -2030, -14311, 16191, -2140, -13427, 16299, -2627, -12941, 15633, -3391, -12243, 15284, -3356, -11906, 14947, -3489, -11278, 14792, -4339, -10387, 14354, -4115, -9872, 14067]
856A4067j8477m960K3125j8650l837K2001j8528k687K0671j7726k266J9261j7461
869e467j328J8756j7412q99J7587j6560j21J6010j5757j34J5501j5318M60J4494
883I812j4764R81J2989j4237J469J2354j3458J258J1725j2756J326J1068j2757
896d990K479R435j1512K465Q508j0697K283P909j0215K875O731q968K373N724
910D400p972K515N275p454K303N042p349K580M375o727K772L065n449K411L075
925B862n592L056K245n468L284J818m684K555J889l514J590J375k549J115J366
940A348l124K002R31k444J148J512j974M0J316j441P26M79r44M41K68p01L59L03
958B45j24m02M39J27J5j057J268m01j007J852j315j03J182n98r72K114j701k07
$$ y = [14067, -4410, -9370, 13755, -4895, -8732, 13269, -5259, -7946, 12725, -5001, -7267, 11994, -5467, -6795, 11961, -5451, -6350, 11237, -5323, -5444, 10566, -5191, -5325, 10176, -5142, -4682, 9812, -4952, -3971, 9018, -5219, -3750, 8604, -4854, -3596, 8129, -4627, -3301, 7767, -4990, -2511, 6924, -4588, -2123, 6385, -4312, -2029, 5880, -4335, -1460, 5271, -3697, -1324, 4400, -3572, -1057, 4218, -3236, -933, 4109, -3240, -660, 3715, -3012, -240, 2825, -2624, -213, 2862, -2730, 326, 2571, -2897, 387, 2205, -2479, 76, 1965, -1549, 41, 1416, -1133, -18, 1348, -1776, 226, 1157, -1287, -139, 1373, -601, -561, 755, -686, 40, 519, -425, 16, 284, -417, -58, 245, 121, -281, 158, 285, 300, -757, 511, 110, -897, 955, -360, -463, 719, 121, -851, 1263, -438, -645]
976f45K042k179l11K632k343J01K210k305M53J829k607J60K845l367J055K626
992B196l449O04K606k951j51L496l609L67K867l143O4L314l085n23L956l209q69
1009a519M105l538l61L761l898P60K859l522N81K824l687J288K159l243R37K296
1025A802l166J136J555k794J289J657k825J015K158l179J042J572j991N47J329
1040A147j802M67Q37j465J040K41j027P84Oo27O35m74L50J7m13O36K4j291J203
1059B88R2j403K271j246q20J799q46j191K322j140j775L411j384k421M043j842
1075A58k415M541k200k937N493k207l459O538l789l013P404n215k041P675n912
1090a379j948Q623p477j257R180p863j555R664q155j513R537q282j528J0466r266
$$ y = [-645, 1397, -782, -1093, 1539, -804, -703, 1507, -798, -345, 1484, -1123, -963, 1882, -1485, -430, 2196, -1253, -649, 1957, -994, -1145, 2351, -1258, -891, 1976, -1167, -1103, 2211, -874, -1397, 2559, -650, -1519, 2586, -952, -1313, 2448, -1450, -690, 2169, -1353, -772, 2052, -1635, -347, 1812, -1431, -494, 1802, -1364, -228, 1327, -1467, -178, 1479, -1346, -331, 1827, -1352, -310, 1262, -729, -182, 1147, -655, -188, 649, -816, 224, 465, -562, 222, 228, -399, 236, -238, 112, 129, -284, 352, 376, -915, 288, 380, -1023, 1248, 2, -818, 981, 135, -1056, 1266, 126, -1649, 1762, 378, -2043, 2000, 158, -2257, 2284, 84, -2853, 2640, 433, -3026, 3512, -277, -3290, 4114, -1101, -3142, 4533, -1379, -3327, 5296, -2181, -3438, 5742, -2121, -3676, 5988, -2167, -3680, 5857, -2425, -3953, 6513, -2753]
1105b753j570J1579j0389j123J2141j1255j182J2828j2069j008J3587j3039j32
1118d385J3084j3385M89J3370j4305J188J3114j4641J626J3352j5424K294J3250
1131I627j5234K019J2642j4700J659J3727j5898K421J3284j5362K301J3345j6057
1144f226L162J2641j6066L535J2790j7030M645J2188j6926N133J1654j6669M844
1157b325J1675j6616N353J0765j6365O234R694j6053O791Q882j5482O830Q592
1170G975j5308P031Q232j5423P633P071j4333P242O586j3559P121N880j2648P346
1184H46M692j1457O857M164j0795O386M063j0145N965L903r495N916K933q085
1198d252N090K332p092M525K225o358M262J863n833M077J337m977L459J133l783
$$ y = [-2753, -4323, 7256, -3133, -4256, 7885, -3370, -4552, 8276, -3793, -4801, 8786, -4253, -4385, 8699, -4686, -4197, 9173, -5132, -3944, 9170, -5471, -3845, 9507, -5917, -3623, 9627, -5607, -3588, 9054, -5646, -3987, 9740, -6158, -3737, 9547, -5815, -3514, 9831, -6226, -3064, 9577, -6489, -2954, 9836, -7194, -2549, 9639, -7287, -2154, 9500, -7169, -2325, 9350, -7266, -1913, 8852, -7513, -1279, 8415, -7638, -847, 8035, -7447, -617, 7975, -7333, -302, 7930, -7493, 140, 7211, -7122, 120, 6706, -6853, 268, 6148, -6500, 846, 5538, -5919, 938, 5102, -5693, 693, 4756, -5389, 576, 4479, -5016, 900, 3833, -4252, 838, 3170, -3922, 603, 2828, -3530, 732, 2595, -3238, 839, 2176, -2801, 658, 1791, -1992]
1213a992K437J171k924J544N84j813J346o1n75N26l41J73k00J70M61q95j09J502
1231A004j653k40K860l134R5L500l578p4M096m076m65M896m820j06N356n710K60
1248a789N746o554P06O469p437R87O855q177J149P103q327J279P244q580J391
1263a935P390r228K091P220r605K532P168j0228L279P296j0425L208P096j0501
1277d642L733O865j1174M402O602j0638M050O647j1170M551O506j0829M532O363
1291E798j1281N227O174j1355N121O249j1385N096O111j1482N848N314j1147O023
1305C11M910j0595N740M847j0618O069M389j0557O238L881r938O280L397r490
1319e136O137L203r405O411K627q910O737K203q842O524K155q616O172K100q219
$$ y = [-1992, 445, 1616, -1308, 236, 820, -993, 353, 292, -283, 243, -98, 75, -125, 45, 506, -389, -498, 1004, -649, -889, 1971, -1163, -1068, 2432, -1146, -1220, 2876, -1200, -1665, 3231, -1589, -1695, 3661, -2049, -1789, 3957, -2597, -1891, 4578, -2859, -1872, 4983, -3194, -2045, 5058, -3269, -1990, 5254, -3326, -1935, 5455, -3773, -1682, 5538, -4067, -1535, 5633, -4595, -1316, 5980, -4445, -1237, 5859, -4642, -909, 5956, -5218, -816, 5786, -4852, -802, 5845, -5325, -774, 5732, -5097, -565, 5798, -5483, -256, 5918, -5437, -316, 5933, -5452, -356, 5755, -5727, 121, 5435, -5712, 311, 5221, -5374, 366, 5213, -5405, 664, 5053, -5504, 734, 4615, -5323, 957, 4354, -5136, 1001, 4204, -5201, 1210, 3837, -5073, 1664, 3867, -4975, 1549, 3704, -4912, 1260, 3360, -4859]
1334d859O529J444p920O354J455p380N651J739p369N755J129o775N998O98o702
1349d253N864O95o221N610P56o390N708M70n990N621j53m975N039pn403N614m68
1366A517n054N418n83m579N265o63m512N131p01m465N192n60m858N605q86m456
1382c189N055n87m442M906o39m227N298j262l652M691j483l078M834j642l333
1397b750M768j311l370M932j855l066N059k336k383M581j954k956N202k257l094
1412b790N303k279k710M803k272k706N282k917k386N369k990k119N076l086j679
1427b101M748l028j688M944l241j731M582l040j521M429k821j735M823l141j511
1442b032M362k619j751M498l120j088L969k945o57L412k649j098L768k737m35
$$ y = [-4859, 1670, 3114, -4806, 1548, 3003, -4377, 1274, 3013, -4356, 1399, 2528, -4247, 1751, 2449, -4253, 1611, 2306, -3915, 1695, 2451, -3939, 1769, 2239, -3751, 1870, 1717, -3258, 1781, 1774, -3629, 1985, 1517, -3537, 1881, 1298, -3281, 1984, 1321, -3191, 1940, 1239, -3226, 1966, 1406, -3452, 2153, 1267, -3189, 1866, 1279, -3163, 1743, 1104, -3123, 2175, 913, -2739, 1952, 469, -2609, 2225, 583, -2750, 2018, 707, -2663, 2269, 414, -2652, 2407, 71, -2312, 2269, 315, -2641, 2561, 304, -2790, 2513, 234, -2476, 2327, 55, -2651, 2631, -286, -2672, 2697, -293, -2412, 2664, -422, -2101, 2647, -381, -2069, 2875, -366, -2097, 2485, -555, -2076, 2353, -468, -2203, 2620, -521, -2032, 2330, -289, -2040, 2458, -662, -1750, 2219, -726, -1383, 2029, -620, -1718, 2050, -687, -1122]
1457a122K874k331k73K094j784j30K030k194K12J875j693k96J825j847M03J192
1473H35j371j54J171j084L40O16q65Q36m59l43O84k97j21O77j197J149Pr95N99
1492B8N16j514J257J47j453J566j99j470J610o1j525J886l81j812K466n15k300
1509a754K954n47k596L345q90k922M130j085l303M821j791k845M451j463k962
1524b457M513j362l466N312k322l063N297j805l864N986k563l356O096k771l275
1539c100O232l269l082O483l345k971O073l064l093O432l447k789O133l611k624
1554c042O382l611k518O145l672k878O864m018k961O996m406j904N980l727k274
1569b644O000m167j666N910m383j244N525m257j167N196m322o21M721l794p87
$$ y = [-1122, 1752, -579, -852, 1242, -542, -672, 1358, -836, -624, 1251, -442, -738, 1087, -760, -357, 835, -536, -690, 481, -603, -263, 353, -512, 324, -135, -478, 206, -91, -212, 465, -732, 417, 424, -571, 28, 544, -970, 287, 434, -1019, 547, 348, -1122, 488, 427, -1098, 788, 407, -1405, 1061, 546, -1754, 1200, 653, -1943, 1402, 512, -2410, 1720, 635, -2668, 2153, 362, -2483, 1968, 505, -2457, 2056, 694, -2772, 2540, 218, -2845, 2452, 647, -3217, 2769, 206, -3150, 2946, 175, -3100, 3132, -137, -3219, 3264, -81, -3052, 3021, -43, -3136, 3296, -151, -2940, 3193, -418, -3042, 3340, -271, -2789, 3356, -316, -3194, 3670, -348, -3309, 3687, -719, -2623, 3357, -370, -2644, 3356, -811, -2477, 3433, -950, -2194, 3331, -926, -2093, 3103, -1219, -1840, 2881, -913, -1700]
1584a700M416l976k04M182l923k98M224l582p54L975l238j92L267l517L26K997
1600B003k808M4K691l095J59K899k764J15K075k115K26J411j095k14J473j350
1616c45j78J121p28O6J79k70j84K54K98l86MO12m36k88O27k62r01J497l06j390
1636a016J918r47j220K328p03j797K696j247j420K566j235j593L393j877j410
1651a564L311j673j894L967j959k396M420k129k291M263j884k680M956k617k326
1666b496N380l156k536N878l492k272N729l398k390N976l946k010O060l995j887
1681b555O106m261j546N581m240j608O336m859j514O189n000j061O012m522j687
1696b629O470n127j199O516n304j156O305n714l45N908n449n11O168n861l22O162
$$ y = [-1700, 2716, -1260, -1464, 2718, -1205, -1503, 2721, -861, -1615, 2360, -878, -1070, 2197, -1320, -994, 2003, -805, -761, 1930, -1165, -1006, 1893, -871, -756, 1319, -796, -570, 841, -254, -468, 1005, -345, -523, 598, -130, -64, 115, -155, -339, -85, 213, -173, -169, 443, 7, -281, 346, 84, -817, 680, 374, -1016, 902, -45, -1265, 1063, 360, -1437, 1259, 12, -1408, 1158, -77, -1670, 1723, -154, -1564, 1747, 74, -1820, 2147, 188, -2208, 2212, 83, -2208, 2055, 171, -2509, 2447, -170, -2496, 2884, -272, -2808, 3070, -422, -2694, 3035, -363, -2753, 3223, -723, -2733, 3327, -668, -2555, 3551, -710, -2256, 3325, -915, -2523, 3813, -1046, -2560, 3629, -1371, -2432, 3580, -942, -2629, 3841, -1286, -2485, 4031, -1273, -2429, 3876, -1838, -2183, 3725, -1724, -2235, 3933, -1928, -2250, 3912]
1712C912n744k57N998n997J37N910o111L49N956o259L45N516o084R89N221o286
1728b405R88N091o095J206M871n975R07M781n647J214M564n762J303M137n450
1743b272J485L767n405J730L889n523J487L631n158J689L553m833J028L716m949
1758b165J689K916m750J891K939m478J702K463m327J954K265m319J988K335m338
1773b235K086J970l531J509K017l576J896J369l332K106J032l033K008J210k946
1788a450J530J072k462J621P38k283J435O39j905J213M53j713J255N12j373J030
1804C12L27j237O13L04p76O20L31r21N02J16l43M3N9J76o3j0o4J7J68j37k20K36
1826E3J18n13K65J88n80K96M75o60K74P64q15J53L58r71M43R63j265M06J038j484
$$ y = [3912, -1832, -2089, 3909, -2088, -1951, 3959, -2152, -1803, 4153, -2106, -1761, 3755, -2329, -1340, 3881, -2405, -1417, 3674, -2421, -1215, 3656, -2319, -1412, 3369, -2278, -1064, 3500, -2262, -959, 3178, -2272, -787, 2980, -2425, -695, 3194, -2329, -842, 2789, -2369, -680, 2873, -1960, -932, 2784, -2165, -476, 2440, -2310, -419, 2520, -1958, -256, 2207, -2120, -166, 2099, -2220, -232, 2103, -2235, -149, 1821, -1710, -201, 1816, -1760, 136, 1505, -1827, 279, 1311, -1722, 286, 1496, -1450, 80, 1152, -1310, 311, 1049, -1234, 201, 840, -1065, 148, 601, -1112, 143, 655, -718, 312, 639, -598, 15, 319, -457, 163, 494, -427, 75, 191, -152, -109, -50, 126, 63, 53, -11, 6, 174, 37, -183, 53, 171, -342, -77, 111, -469, -173, 302, -358, -84, 680, -135, 18, 376, -595, -152, 811, -454, -48, 990, -494]
1846d94M45R62j378J59J645j977J05J921k479P24J755k418N44J981k704R39J849
1863A579k580O73J687k529J058J674k949J190J833l154J453J640k794J253J408
1878A442k887J350J564k861J540J584l281J548J687l435J964J340l182J741J415
1893A529l287J876J263l176J856J565l139J611J201k767J595J314k782J647J204
1908A510l151J976N56k490J997O15k487K006R33l013J947O01k527J968M50k280
1924a389J896L98k599K331K98k315J946J81k110J757K33j772J475L69k019J884
1940E64M1j846J707p1j483J518Pj249J139O2j173J080J64j308J352j77o83N69
1958B13J1n77L82L15j019Q26J53n32N23j27k61L20po56N90q1m10L97M0k71L65
$$ y = [-494, -49, 913, -465, -306, 1339, -638, -533, 1388, -1091, -367, 1388, -1030, -486, 1495, -1209, -270, 1579, -1001, -328, 1359, -1170, -112, 1562, -1387, -197, 1636, -1518, -65, 1575, -1219, 34, 1442, -1445, -95, 1469, -1392, 148, 1732, -1549, -1, 1686, -1749, 215, 1555, -1627, 114, 1529, -1758, 118, 1381, -1795, 61, 1626, -1513, 98, 1299, -1468, 127, 1441, -1341, 306, 1510, -1641, 335, 891, -1599, 398, 1013, -1474, 532, 1465, -1548, 399, 1000, -1527, 441, 891, -1389, 507, 905, -1694, 637, 935, -1380, 566, 747, -1363, 394, 627, -1145, 330, 699, -1320, 564, 605, -1241, 466, 395, -1088, 430, 437, -812, 327, 389, -784, 296, 460, -848, 504, 327, -356, 213, 224, -353, 29, 344, -675, 151, 304, -228, 295, 168, -93, 227, 220, -436, 154, 73, -337, 60, 100, -171, 194]
1979A94q8j21Q4Q2j85J69J13k02K1P6l2l40M70m51m6L13O3l56L80Q7m47L53J25
2002B62o92M99N6l21N99k23m36K24M54o35O70j86n70O16l00m26N88k00m95M99
2022a7K51o69O72L1q02R74n69k85O05j05n26P53p0o39O58j51m76N51j97k55N03
2043B37l1n22O05k16o53R41j86m40M45K7o45N89O7n83P42l36m09N18j25l84O15
2064B56j08n16O95k75n33O75K00q45P89m95k40O58j65n54O65j62l56M90m8n11
2084c80O87l22l15O00k55k06K75j51k45O52m63j86O12l06k37L92j01k10M79l62
2104d2J1J89j54k21J44k2j48M24j65l43M96l35m9O06m38J75n2j00KL41o27O4L64
2127A20j52PL7l7J28k30J44p4J30k29J07J11l6J29k11KJ11j87J48m3J94p0p0j43
$$ y = [194, 106, -15, 69, 151, -34, 135, 248, 46, 67, 143, 111, -229, 241, -210, -256, 57, 120, -236, 144, 231, -216, 137, 262, -430, 69, 125, -196, 403, 180, -256, -32, 422, -213, 457, 271, -299, 317, 17, -409, 179, -21, -516, -17, 234, -435, 237, 268, -534, 440, -129, -414, 191, 86, -440, 313, 243, -396, 262, 111, -365, 186, -11, -266, 237, 206, -316, 289, 73, -580, 361, 175, -265, 180, 207, -438, 151, 218, -365, 377, 41, -368, 150, 25, -359, 256, 148, -368, 327, 52, -481, 194, 394, -451, 338, -157, -397, 261, 96, -458, 207, 45, -311, 179, 131, -380, 307, -15, -330, 270, 15, -191, 84, -67, -312, 340, -123, -309, 303, -3, -240, 152, 51, -159, 320, -42, -31, 158, 4, -217, -73, -95, -243, 181, 16, -327, 169, -166, -215, 391, -47, 128, 76, -24, -22, 319, -308, -244, 120, -32, -25, 12, -25, 103, -127, 17, -57, 73, -156, -49, 62, 26, 155, -56, -54, 57, -130, 18, -25, 169, 99, 29, -114]
2151a14L22J21p76O75r9j76Q5j9j33K98L62r51P02M8p71O81K18j129Q66l34m92
2172f16R66l61n77J239l05j034R81J33j151J157r0j129J516n96j055J644o73j152
2190a103K046l10j981J955J42j921K193o20j877K568n77j861K354n84j808K471
2206A087n57k387L079r21k024L182j040j984L028r86k184L227j559j985L702j295
2222C83k182L488j671j901L569j572k235M101j909k155M408k197k030M048k596
2237d51j775M433k397j933M115k236j668L876k437j295M252l049j425M455k912
2252d47j582M538k943j393M384l121j447M460l185q41M338l422j275M283l264
2267i17r34M469l464q14M229l683o67M469l814o05M309l523m77L873l591l24L953
$$ y = [-114, 208, 329, -447, 228, 129, -47, 38, 19, -114, 184, 546, -405, 297, 345, -426, 255, 473, -656, 210, -124, -616, 350, -11, -588, 651, 346, -688, 293, 426, -725, 432, 342, -787, 729, 133, -922, 722, 49, -1103, 943, 633, -1348, 607, 749, -1172, 1021, 401, -1476, 1092, 515, -1346, 1008, 424, -1384, 1087, 530, -1857, 1222, 301, -1723, 1459, 419, -1565, 1463, 477, -1707, 1520, -39, -2024, 1678, 383, -1799, 1689, 18, -1883, 1686, 114, -2121, 1980, 71, -2084, 2324, 127, -1903, 2145, -451, -2226, 2207, -190, -2123, 1992, -244, -1912, 1964, -473, -1768, 2484, -565, -1990, 2465, -447, -2029, 2509, -434, -1827, 2557, -564, -2011, 2449, -736, -1577, 2761, -661, -1936, 2347, -917, -1851, 2618, -846, -1660, 2569, -1114, -1781, 2688, -1126, -1731, 2578, -945, -1422, 2451, -1140, -1464, 2489]
2284B489l610M9L714l590n9L345l616J20L366l380P4L170l260J28K968l042L32
2301h02L021l360L88K851l319J55L007k966K42K531k837L34K792l387Q35K126
2317A611k738O02K224k790M68K111k697P91J785k091M12J533k353J193J096k106
2333i49P47J263k022Q74J182j982Q20Q95j603J012R28k183R50P36j613J071O18
$$ y = [2489, -1121, -1072, 2642, -948, -1007, 2338, -1278, -1158, 2208, -1172, -1098, 2072, -1188, -1060, 1908, -1134, -802, 2219, -1141, -753, 2098, -1221, -1066, 1941, -1025, -783, 1748, -1089, -755, 2037, -1350, -515, 1611, -1127, -525, 1699, -1091, -623, 1488, -1209, -418, 1367, -724, -312, 1221, -1132, 61, 1157, -949, -202, 1061, -961, -87, 1095, -887, -67, 828, -775, 237, 1165, -1018, -68, 668, -945, 126, 744]
$$ [...]
8191D7
##END NTUPLES=NMR FID
##END=
