##TITLE=1H_Pr 4989-1
 , 8 sc, 
 25.9.2020
##JCAMPDX= 6.0         $$ Bruker NMR JCAMP-DX V2.0
##DATA TYPE= NMR FID
##DATA CLASS= NTUPLES
##ORIGIN= UXNMR, Bruker Analytische Messtechnik GmbH
##OWNER= root
$$ XWIN-NMR		Version 3.5
$$ Fri Sep 25 10:48:32 2020 Russian Standard Time (UT+4h)  she@DPX200
##.OBSERVE FREQUENCY= 200.1315066352
##.OBSERVE NUCLEUS= ^1H
##.DELAY= (6, 6)
##.ACQUISITION MODE= SIMULTANEOUS
##.ACQUISITION SCHEME= undefined
##.AVERAGES= 8
##.DIGITISER RES= 18
##SPECTROMETER/DATA SYSTEM= spect
##.PULSE SEQUENCE= zg30
##.SOLVENT NAME= DMSO
##.SHIFT REFERENCE= (INTERNAL, DMSO, 0, 15.7039)
##AUDIT TRAIL= $$ (NUMBER, WHEN, WHO, WHERE, WHAT)
$$ ##TITLE= Audit trail, XWIN-NMR		Version 3.5
$$ ##JCAMPDX= 5.01
$$ ##ORIGIN= Bruker BioSpin GmbH
$$ ##OWNER= she
$$ F:/spectra/data/she/nmr/H-F/1/audita.txt
$$ ##AUDIT TRAIL=  $$ (NUMBER, WHEN, WHO, WHERE, WHAT)
(   1,<2020-09-25 10:47:37.43 +0400>,<she>,<DPX200>,
      <created by zg, POWCHK disabled, PULCHK disabled
       configuration hash MD5:
       00 E9 B6 7A A2 85 ED C7 34 08 36 98 17 FE 4E 26
       data hash MD5: 16K
       4F 71 D2 27 BB F9 52 A4 1F 1C FE F5 4C 34 3D 9C>)
$$ ##END=
$$ 
$$ hash MD5
$$ 50 D6 8B D1 5B 41 41 31 F3 DC 94 6F B3 9D 92 24
##$RELAX= 
##$RELAX= 
##$RELAX= 
##$RELAX= 
##$RELAX= 
##$RELAX= 
$$ Bruker specific parameters
$$ --------------------------
##$DU= <F:/spectra>
##$EXPNO= 1
##$NAME= <H-F>
##$PROCNO= 1
##$TYPE= <nmr>
##$USER= <she>
##$AMP= (0..31)
100 100 100 100 100 100 100 100 100 100 100 100 100 100 100 100 100 100 
100 100 100 100 100 100 100 100 100 100 100 100 100 100 
##$AQSEQ= 0
##$AQ_mod= 1
##$AUNM= <au_zg>
##$AUTOPOS= <>
##$BF1= 200.13
##$BF2= 200.13
##$BF3= 200.13
##$BF4= 200.13
##$BF5= 200.13
##$BF6= 200.13
##$BF7= 200.13
##$BF8= 200.13
##$BYTORDA= 1
##$CFDGTYP= 0
##$CFRGTYP= 5
##$CHEMSTR= <none>
##$CNST= (0..31)
1 1 145 1 1 1 1 1 1 1 1 1 1 1 1 1 1 1 1 1 1 1 1 1 1 1 1 1 1 1 1 1 
##$CPDPRG= <>
##$CPDPRG1= <>
##$CPDPRG2= <>
##$CPDPRG3= <>
##$CPDPRG4= <mlev>
##$CPDPRG5= <mlev>
##$CPDPRG6= <mlev>
##$CPDPRG7= <mlev>
##$CPDPRG8= <mlev>
##$CPDPRGB= <>
##$CPDPRGT= <>
##$D= (0..31)
0 1.2 0 0 0 0 0 0 0 0.06 0 0.03 0 0 0 0 0.0002 0 0 0 0 0 0 0 0 0 0 0 0 
0 0 0 
##$DATE= 1601016456
##$DBL= (0..7)
120 120 120 120 120 120 120 120 
##$DBP= (0..7)
150 150 150 150 150 150 150 150 
##$DBP07= 0
##$DBPNAM0= <>
##$DBPNAM1= <>
##$DBPNAM2= <>
##$DBPNAM3= <>
##$DBPNAM4= <>
##$DBPNAM5= <>
##$DBPNAM6= <>
##$DBPNAM7= <>
##$DBPOAL= (0..7)
0.5 0.5 0.5 0.5 0.5 0.5 0.5 0.5 
##$DBPOFFS= (0..7)
0 0 0 0 0 0 0 0 
##$DE= 6
##$DECBNUC= <off>
##$DECIM= 32
##$DECNUC= <off>
##$DECSTAT= 4
##$DIGMOD= 1
##$DIGTYP= 9
##$DL= (0..7)
0 120 120 120 120 120 120 120 
##$DP= (0..7)
150 150 150 150 150 150 150 150 
##$DP07= 0
##$DPNAME0= <>
##$DPNAME1= <>
##$DPNAME2= <>
##$DPNAME3= <>
##$DPNAME4= <>
##$DPNAME5= <>
##$DPNAME6= <>
##$DPNAME7= <>
##$DPOAL= (0..7)
0.5 0.5 0.5 0.5 0.5 0.5 0.5 0.5 
##$DPOFFS= (0..7)
0 0 0 0 0 0 0 0 
##$DQDMODE= 0
##$DR= 18
##$DS= 0
##$DSLIST= <SSSSSSSSSSSSSSS>
$$ [...]
##$SUBNAM2= <"">
##$SUBNAM3= <"">
##$SUBNAM4= <"">
##$SUBNAM5= <"">
##$SUBNAM6= <"">
##$SUBNAM7= <"">
##$SUBNAM8= <"">
##$SUBNAM9= <"">
##$SW= 16.880792210976
##$SWIBOX= (0..15)
0 0 2 0 0 0 0 0 0 0 0 0 0 0 0 0 
##$SW_h= 3378.37837837838
##$TD= 16384
##$TD0= 1
##$TE= 0
##$TE2= 300
##$TE3= 300
##$TEG= 300
##$TL= (0..7)
0 120 120 120 120 120 120 120 
##$TP= (0..7)
150 150 150 150 150 150 150 150 
##$TP07= 0
##$TPNAME0= <>
##$TPNAME1= <>
##$TPNAME2= <>
##$TPNAME3= <>
##$TPNAME4= <>
##$TPNAME5= <>
##$TPNAME6= <>
##$TPNAME7= <>
##$TPOAL= (0..7)
0.5 0.5 0.5 0.5 0.5 0.5 0.5 0.5 
##$TPOFFS= (0..7)
0 0 0 0 0 0 0 0 
##$TUNHIN= 0
##$TUNHOUT= 0
##$TUNXOUT= 0
##$USERA1= <user>
##$USERA2= <user>
##$USERA3= <user>
##$USERA4= <user>
##$USERA5= <user>
##$V9= 5
##$VALIST= <valist>
##$VCLIST= <CCCCCCCCCCCCCCC>
##$VD= 0
##$VDLIST= <DDDDDDDDDDDDDDD>
##$VPLIST= <PPPPPPPPPPPPPPP>
##$VTLIST= <TTTTTTTTTTTTTTT>
##$WBST= 1024
##$WBSW= 4
##$XGAIN= (0..3)
0 0 0 0 
##$XL= 0
##$YL= 0
##$YMAX_a= 23483
##$YMIN_a= -84781
##$ZGOPTNS= <>
##$ZL1= 120
##$ZL2= 120
##$ZL3= 120
##$ZL4= 120
##$ABSF1= 10
##$ABSF2= 0
##$ABSG= 5
##$ABSL= 3
##$ALPHA= 0
##$AQORDER= 0
##$ASSFAC= 0
##$ASSFACI= 0
##$ASSFACX= 0
##$ASSWID= 0
##$AUNMP= <proc_1d>
##$AZFE= 0.1
##$AZFW= 0.1
##$BCFW= 1
##$BC_mod= 2
##$BYTORDP= 1
##$COROFFS= 0
##$CY= 11.3945322036743
##$DATMOD= 1
##$DC= 2
##$DFILT= <>
##$DTYPP= 0
##$F1P= 16.9975609425685
##$F2P= -3.02152046262296
##$FCOR= 0.5
##$FTSIZE= 0
##$FT_mod= 4
##$GAMMA= 1
##$GB= 0.15
##$INTBC= 1
##$INTSCL= 1
##$ISEN= 128
##$LB= 0.24
##$LEV0= 0
##$LPBIN= 0
##$MAXI= 10000
##$MC2= 0
##$MEAN= 0
##$ME_mod= 0
##$MI= 1.114404
##$NCOEF= 0
##$NC_proc= 0
##$NLEV= 6
##$NOISF1= 3.799351
##$NOISF2= 2.8
##$NSP= 1
##$NTH_PI= 0
##$NZP= 0
##$OFFSET= 15.70392
##$PC= 1
##$PHC0= -9973.836
##$PHC1= 16.8009
##$PH_mod= 1
##$PKNL= yes
##$PPARMOD= 0
##$PSCAL= 0
##$PSIGN= 0
##$REVERSE= no
##$SF= 200.130013532006
##$SI= 16384
##$SIGF1= 3
##$SIGF2= 2
##$SINO= 400
##$SIOLD= 16384
##$SREGLST= <1H.CDCl3>
##$SSB= 0
##$STSI= 0
##$STSR= 0
##$SW_p= 3612.71676300578
##$SYMM= 0
##$S_DEV= 0
##$TDeff= 0
##$TDoff= 0
##$TI= <>
##$TILT= no
##$TM1= 0
##$TM2= 0
##$TOPLEV= 0
##$USERP1= <user>
##$USERP2= <user>
##$USERP3= <user>
##$USERP4= <user>
##$USERP5= <user>
##$WDW= 1
##$XDIM= 8192
##$YMAX_p= 0
##$YMIN_p= 0
$$ End of Bruker specific parameters
$$ ---------------------------------
##NTUPLES= NMR FID
##VAR_NAME=  TIME,          FID/REAL,        FID/IMAG
##SYMBOL=    X,             R,               I
##VAR_TYPE=  INDEPENDENT,   DEPENDENT,       DEPENDENT
##VAR_FORM=  AFFN,          ASDF,            ASDF
##VAR_DIM=   8192,          8192,            8192
##UNITS=     SECONDS,       ARBITRARY UNITS, ARBITRARY UNITS
##FACTOR=    0.000296,      1,               1
##FIRST=     0,             0,               0
##LAST=      2.424536,      0,               0
##MIN=       0,             -84781,          0
##MAX=       2.424536,      23483,           0
$$ Real data points
##PAGE= N=1
##DATA TABLE= (X++(R..R)), XYDATA
$$ [...]
1677B62k55k3j20j14L83j74n2K1j23K98k12K80j9l51K84l50Q9M39k97K1J29m95
1699c79J14K32j68L79k19l2J09q9J02j56J9p7J14J05O4k27L3K85j64k66L97l96
1721b20K14j07M0J73j35j46K49j61J46l3j27K30o9J9r5o6K33j39r4K70l52J78
1743HQ3k91R5rj29K20p5K20j96M1J16q7n7J08J8ol49L26k02J13P0l7J61j03j28
1768i0J37k8k12J60O5k85O8J28lL5q2J0N5R0j46m5K1P6k00L39N5j47J05j21K3
1793HJm2j03L1K94N4j62p2K25j35j31J78j96j98L30Lq4l2m4J68l95L79Pk43J34
1818b5K43k26Mj3r9P9K5K68k69K3qJ83k00J21r3j9Q0l7l5j88K78j49J64k15m3
1843a51J46K35r6k70R1lJ19j96K2M8j89J37J62K2J56l76oL07l15J65J7j35j3J62
$$ y = [262, 7, -16, -136, -250, 133, -41, -93, -72, -195, 103, -109, 171, 152, -199, 85, -265, -176, 263, -34, -13, 116, -379, -265, -33, -201, 178, -41, -73, 36, -53, 49, -107, -88, -165, -51, 54, 118, -109, -76, 209, 45, -221, 176, -220, -6, -113, -73, 100, -35, -181, 68, -93, 53, 20, -107, 123, 54, 73, -22, -88, 145, 6, -88, 182, -170, 8, 91, -200, -105, -114, -243, -23, -98, 122, -74, -33, 83, -4, -61, 47, 65, 59, -290, 36, -166, -53, 17, -20, 141, 38, -90, 47, 19, -193, -33, 32, -253, -185, -57, -60, -25, -107, -97, -42, 48, -98, -143, -122, -46, -246, 93, 148, 1, 106, -15, 8, 9, -33, -136, -105, 189, 243, 81, 9, 234, 99, -32, 146, -50, -248, 82, 85, 1, -31, -75, 93, -302, 77, 84, -159, -25, 218, -8, -4, -17, -116, -37, -12, 256, -13, 10, 2, 185, -15, 106, 13, -6, 74, 37, 2, -186, 92, -57, 107, -108, -151, -5, 230, 134, -136, -45, -48, 71, -125, -103, -55, -244, -107, 55, 77, 233, -143, -149, 158, -157, 8, 25, -110, -123, 39]
1867C9J06l47R2J13L6n1j70K79Mk40L81l33J20r9O2J86j34J01j22j84K78p0j74
1890a27J56k38J20Kj18R0J20j99J70j03j04N45l63J27J3j01J68l2jn5n9J4p1j81
1914b27L34j0j25J22k06n3j9K61k37J15O2P6n9j7K35m26OR4K15l24J57J43J4j01
1938C0k58K29N3j5k08K46n7N5l02L97q8j6j34Q3J1q2Q8k87L59l0k8J21k3o9M0
1963A15k09lj13J43J98l02K43k07O7J88j7j91PJ22p2l0J87l44J38J47m2j6J49
1986A58J08l6j11k35J83J0n5j04J75J8j14Q3M9k30Q1J17k04J4K61L5j54j3Mn5
2010a5K0r7j4J5Q7N5m69M17J6j14J61r5m1kr7J08N2K76m45M17j67j04J5j31K51
2035I9j30Q8J07j44J36k58O9QJ52j89R9Q8l13Q8J16j63J09J40j64P1P3j62K42
$$ y = [39, 145, -202, -110, 3, 39, -12, -182, 97, 101, -139, 242, -91, 29, -70, -8, 178, 44, 145, 23, -161, 117, 47, -127, 29, -209, -89, -87, -205, -115, 5, -194, -24, -127, -231, 314, -49, 78, 91, -10, 158, 126, 125, 70, 11, 25, -46, -227, 107, 97, -28, 94, -112, -165, -184, 77, -160, -45, 17, 93, 34, 17, 252, -174, -168, -74, 141, -183, -26, 117, 131, 30, -228, 1, 54, 39, -169, 77, 20, 75, -227, 170, 82, 66, -68, 15, 26, -56, 32, -255, 104, 74, 46, 167, 144, 75, 115, -94, -97, -210, -67, 131, -171, 72, -135, -68, 120, 103, -88, -81, 41, -31, -61, 126, -218, -80, 67, 25, 9, 158, 266, 230, 119, -116, 67, 77, 22, -82, 93, 111, -3, 80, 129, -101, -20, 97, -107, -93, 168, 203, 49, 36, 40, -15, 5, -92, -106, -91, -4, 51, -418, -1, 15, -99, 62, -33, -74, -76, -173, -65, -13, 263, -182, 235, 68, -36, -21, -152, 99, -31, 57, 164, 20, 156, -102, -33, -25, 127, -62, 37, 125, -188, -100, 16, -147, -38, 102, -62, 9, 82, -80, 162]
2058A62j7m35J69K76M6l35J63j29J16k0L3j03j35J90M4J11l3P5j02j70K26L3j99
2081c4J60k8j62J13O5J52k83M22m05l3J44J7j8r8oP2j54J67k23J01J22j4p6O3
2105F4m6o2K22k22J45j34j56J76Pj32O7o3J59l7j9J0J07r7J14pl06K6J53J15R0
2130A74j79q0rp3L29q3M7r3J02j08r7O6k45M34n3j64o7Q7Q4R6k47J84j67K12k33
2155h3O3p6N0Q7J75k96J80Q9J09k50j45K26l18L24j15o0J43r7r6J15R0m36O2J30
2179a29J13j65J86K11k97Q7j4k08Q4J29l21L69O6p1l8K5M7L4j09J61k14o9J22
2202aK39j21o6r0J54r4%mk57L77j05l08K94r7K32m06J81jj58M09l08J58K3o0n4
2227f3J26j71K46k93L56j69P5n6j54J43j58K47j13p5m2J26r6j04K15j3m1N5q3
$$ y = [162, 145, -290, -121, 155, 201, -134, 29, -100, 16, -4, 29, -74, -209, -19, 25, 136, 103, 178, 76, -94, 132, 165, -34, 126, 98, -64, 49, 114, 266, -17, 405, 0, -33, 111, 128, 110, 12, 6, 78, -76, 91, -132, -31, 91, 77, 1, 64, 18, -44, 178, -44, 101, -33, -189, -13, -6, -138, -71, -134, 25, -12, -31, -21, 86, -11, 103, 96, -210, -184, -31, 84, 174, -5, -85, -94, -167, 162, 79, 126, 33, 135, 27, -70, -4, -249, 185, 132, -32, -99, -12, 72, 168, -79, 105, -62, 150, -83, -20, -96, -46, 41, 216, -80, 100, 189, 298, 48, -97, 129, -189, 135, 20, -40, 103, 6, -90, 25, 115, -321, -259, -129, -16, -181, 5, 216, -81, 6, -8, -216, -132, -3, -324, 45, 111, 40, 2, 27, 74, 108, -1, 160, -54, -123, -1, 238, 117, 51, -39, 115, 21, 21, 17, -240, 137, 32, -276, 18, -79, 153, -253, -72, -73, -231, 178, -130, 28, 51, -9, -63, 63, -108, 138, -155, 201, 32, 107, 51, -103, 40, -118, 129, 16, -59, -101, 25, -71, -175, 40, 27, -14, 41, -42]
2250d2P2k9qk2L7j41L36r9P4j62o2J39k06k01L71q2K2O0j34J26J6k03j22M47j26
2275F1k47K50o5K52l86J67R4k53K09j3m6J09r1k18OO2J32k8J40m09K42j59K17
2298B6j11J85N0k64K73k84J46rN1k40L7K9J79r3P8J56j08k2r3K33N9k20R9j81
2322b4j46K74j97P5qq6J37j90K44j95J45j07L8%J72j60R8l36L31lj3L2k15K11
2346G7M8j04k7q4q5PK60k2j69J92k5j40K07o0O9j27j07L49l06J82k60L21p8Nk02
2371g9R0p5Ro5N2J09J62l17j45J79J31p7Pl1K23j70p0J56j62m2K27k27J78N4N3
2396A70k96J70J30l54K73k86P3K23p4q0j17R3J84n4l02K84J16k67K61l83K99J9
2418H2k03J3J0K35J7o1L4j44oJ34k64K85n4j24J38M1r7J56P4l96j54L19J04j49
$$ y = [-42, 30, 1, -7, -29, 8, -133, 203, 104, 178, 16, -46, 93, -113, -314, 57, -25, -3, 57, -77, 49, 65, -138, -260, 187, 61, -186, 64, -1, 251, -135, 32, 126, -127, 82, 69, 23, 132, 41, -177, -171, -109, 23, -5, 135, -274, -32, -191, 26, -85, 100, 150, -114, 159, -125, 21, 12, 63, -177, -140, -111, 68, -25, 53, 209, 101, 79, -14, 219, 278, 58, 157, -24, -170, 104, -93, -18, -26, -112, 25, -165, 79, -116, 29, -78, -40, -40, 132, -28, 70, -266, 65, 62, 49, 81, -134, 77, 125, 21, -6, -90, -175, -168, 92, 70, -99, 93, 68, -72, 135, 75, 144, 17, -90, 259, -47, 135, -125, 196, 118, 123, -79, 11, -64, -55, -120, -68, 41, 203, -114, -259, -80, 51, -26, -19, -50, 173, 3, -67, 89, -73, -115, 112, -115, 63, 117, 170, -126, 44, 174, -180, 93, -193, -120, 103, 29, -51, -168, -75, 109, 55, -247, 37, 153, -114, 147, -236, 63, 82, -121, -108, -98, 137, 154, 93, 127, -17, -23, 111, -153, 132, 78, -46, 92, 133, 36, 192, 266, -130, -284, 35, 139, -10]
2442a0j61K99RK25n80J24J66R5k23j68K47m91L42QJ39J07k09K9N6J0k15q9K56
2465c4J31j27OO6k04J88j98J74K6L1j1j86M2J63m1o5m7J04j12K65q6K10q7p6J17
2490B49j40k81J68j8K1k7P7O7k36J54k83K20L5j08R8K49m09K28J77K6k17k5K15
2513B40l8k49r1M03j60p1l9o0P9j34J96m6J45l31J50k25R9K41r1Q6m6J4j28p4
2537a30J26J79j37L3j29L0p9O7j16J94LJ37j41j68J76N7n7J92k44O8P7j33P2n1
2561B6j55K44r7k59J50L34k28r7K42m13L91j38K5j2j35K48j23p6O9j1O7OKj61
2585a01K15j33J38j28O0j74Q2L1q2o4O4J45j39J51r9J08K79l22q4q8K18j79Q3
2608a9R2j19M0J72l4j31J25r7m4k05J64N7J76j5%p0q0K38j48r5J00j26P4Oj97
$$ y = [-10, -171, 128, 137, 362, -218, -94, 72, 167, -56, -224, 23, -468, -126, -118, 21, 128, -81, -52, 4, 14, -201, -290, -34, 97, -30, -24, 42, -162, 26, -172, 2, 28, 59, 48, -138, -96, 67, 26, -39, -86, 18, -94, 171, 85, 295, 208, 132, 249, 109, -172, -4, -22, -1, -28, 49, 116, -120, 34, -249, -29, 6, -102, -4, 245, -164, 64, 241, 267, 50, 25, 240, 202, -47, -138, 265, 105, 34, -5, -65, 14, -120, 76, 30, 175, -156, -6, -231, -132, 109, 18, 104, 58, 72, -56, -130, -4, 175, 38, 71, -58, -28, -107, -40, -156, 38, 41, 178, 37, -131, 45, 102, 45, 237, -7, 61, 138, 5, 77, 26, -129, 115, 18, -241, -91, 243, 15, -82, 160, -253, 138, 0, 25, 13, -122, 126, 3, -73, -4, -15, 52, 58, 60, -101, 114, -19, 119, -9, 51, -123, -41, -10, -92, -156, -92, 53, -86, 65, -34, 74, 353, 31, -53, -141, 77, -102, -19, 73, -46, -6, 166, 132, 1, 126, 29, -15, -220, -56, 1, 177, 162, 162, 92, 12, 250, 102, 7, 107, -19, 55, 61, -136]
2633a36J78J20j16Q7j95o7J94l47L96p1k03OJ34j31P0J82J07P7r9q1J70l66J63
2656G2o9J39k56L47j68j52N1p7R1J26l1p6q9oJ89j83M7k11J69J60N6k19M0L6J37
2681A23j25J23P2n1K6m5m20L89J7k08o1L09j46L34m35J35q4K1np3j35L16j77J55
2705E5j34J5L3M9r3LK40m7L6k82J26j58J81O5Q8P9k56j77O4R8O1q0r8j00R3K58
2731A19m5m22N35m30J27K52j62O7n9J11j55K24k16L59m39K0J39Q8l2j29J17j70
2753a01L7N0qJ15k9N1l26KJ86o4J57k85M11m54k4M03j63O7L19l42O7j30Lq8L07
2778A61j66R8P3j59q9o3N9N4M1q5J29O0j98R5n1j43J25p4J05J35j68R2j60L70
2802B41j74l2mJ13j38J60k29j84L92j98L57m07K21J08k78R1L8M4j24r1J45J17
$$ y = [-136, 42, 162, 46, 133, -62, -129, 65, -282, 114, 43, -160, -154, -20, -151, -81, 101, 208, 285, 186, 105, 275, -91, 72, 3, 142, -114, 233, 65, -87, -36, -113, -22, 104, 73, -3, -92, -98, 91, -92, -45, -256, -87, 73, 129, -90, -50, -14, 123, -2, 121, 193, 142, 168, 123, -297, 92, 109, -99, -160, 149, 3, 337, -98, 37, -47, -26, -31, -104, -239, 77, -100, 55, -79, -64, -31, 18, -75, -72, 168, 121, 157, -125, 1, -157, 24, 89, 177, 256, 0, -177, -113, -15, 46, -34, -132, -232, -139, 119, 74, -348, 187, -243, -116, 136, -26, 41, -18, 93, -62, 162, -54, 305, -134, -114, 25, 113, 81, -48, 69, -101, -64, -14, -22, 93, 64, 115, -211, -209, -23, -87, 70, -215, 196, -258, -282, 121, -42, 25, 344, 2, 69, -61, -58, -146, 161, -5, 93, 166, 7, -82, -145, -86, -32, 9, -76, 53, 113, -85, 10, -41, -184, -59, -133, -28, 107, -61, 31, -129, 241, 67, 35, 31, 144, 6, 166, -63, -247, 145, -53, 304, -103, 118, 226, -52, 39, 77, 121, -3, -94, 51, 168]
2824A68pj62n7K6n2Nj68K95n7M7L4j01KL1%J2Ql24K87K12j07j53R7n9p8J27l9
2851a3k02J42K87k25k6M5p2l1p9J85J60j40j78k5K13J39k43J82l3o2rL1J07l26
2875a73J45j0j48K24l04k7L25j34J30P3j66L5J04j9q9k6K9r7J39l7Q5J95j5l13
2899g4J02j9K0K4k38L40j19k06Q4K35k47J78K6J4k36j0Q7k34J27J59J11k81K64
2922A07J9j09j65m5K87K0o1o4k49L90n7j31K37%k97J87Q8n7j97R1K0J01N3k90
2946a22L3o1K65l0Q0o7k49K59j18J73L2O6j23J5j29J00l28J42K84k56j01L55K7
2969B47k00m8J89m52K95j2j8R5k23J72J38r1j71Mk16K72J31k7k02Q5q3J27q2j09
2993a79J33k0M60l31M25l87k09Pj95L59P7j97J53J27k44M4rjj55J78j38N16m67
$$ y = [168, 161, -1, -58, -32, -84, -79, -247, 48, -9, 38, 72, -29, -27, 4, 4, 16, 24, -300, -13, 199, 92, -61, 36, -23, -101, 26, -13, -215, -73, 214, -11, -37, 8, -64, -95, -174, 11, 171, 31, -147, -172, 41, 180, -63, 119, 86, 24, 15, 46, 153, -173, -28, -38, -186, 38, -266, -293, 32, -102, 28, 101, -65, -30, 74, 55, -34, -60, -31, -128, 11, -26, 59, 254, 239, -74, 28, 9, 29, 53, -185, 155, 36, -170, -86, 149, -98, 80, 106, 120, -116, -126, -39, -273, -146, 13, 124, -157, 107, 126, 17, -148, -193, 94, 114, 53, -11, -260, 130, 73, -58, 179, 179, -118, 69, 157, 100, -97, -6, 14, 115, 168, -122, -89, -150, 115, 85, 165, 98, -151, 108, -10, 163, 195, 261, 138, 153, 24, 124, -204, -62, 222, -34, -135, 220, 247, 47, -1, 188, -264, 31, 19, 1, 96, -127, 45, 183, 92, -79, -75, -291, -19, 112, 85, -117, -32, -115, 12, -70, -179, -46, -66, 394, 63, 488, 101, -108, -101, -296, 63, 140, -57, 96, 223, -21, 23, 14, 13, -142, 36, -102, 414, -53]
3016e3q4J92j68J59j84O0J32j34r8K70j82J28j03M10l51J40j07J41k14J33lm4
3038D0j10K9J20k1k00K73q5k31J01Q2K8k44J52kK27l68M23l31J72p4J2J0J76j94
3062a5K38l31K79k31R3m5o5L7q2m3J36j92J51J84l37K93J42p9r7pj68J89J41k47
3086e6J9l5N3J01O3j87j03J2O6J30j28k5R9j39N3l6J24k0j24J19o3K9MJ96o4j20
3112c2m5J40L1k3l8M1k20J32J12k26j1N9N7m7q0R8J07j08R4k50K10p5J59J08k13
3137b0K64l57J23O8j30K09j29j5j26J75n8p8J31j12k66L06m5j61J17J49J1n7N
3160DK16o5nl50J06K6J19j17K07j20l2J64j91j16R6J3N3N4j10O7K2nj1j37oL05
3186A87k28mJ23k5L3k83M41j01k57J29J91m07M44j71M1j1M9r3j4j45K51O9l83
$$ y = [-53, -137, 55, -113, 46, -138, -78, 54, -80, -178, 92, -90, 38, -65, 345, -6, 134, 27, 168, -46, 87, 84, 40, -70, -41, 79, 58, -142, 131, 46, -185, -84, -2, 26, -218, -66, -68, 159, -209, 214, -117, 55, -19, -7, 3, 179, -15, 223, -108, 171, -60, 33, -12, -77, -40, -122, -165, -29, -221, -70, 114, -223, 70, 212, 133, 36, 29, -139, 50, 191, -56, -37, -72, -19, 82, 145, -42, -145, -133, -67, 63, -65, -90, 9, -130, -77, -113, 11, -9, -133, -14, -77, -48, -44, 152, 88, -32, -77, 63, 94, 71, 33, 74, -146, -14, 98, -128, -139, -80, -23, -70, -150, -52, 55, -53, 41, -209, 1, -74, 85, 193, -20, 244, -113, 10, 78, -52, 157, 28, 13, -113, 62, 4, -74, 57, -55, -321, -15, -60, -221, -104, 45, 56, -1, 4, 220, 155, 150, -200, -94, -68, 51, -66, 141, 21, -11, 153, -38, -154, -58, -45, 8, 62, -48, 19, 41, 36, 25, -112, -118, 187, -41, -45, 78, 53, 86, -197, 244, 143, -114, 15, 206, -201, 243, 72, 113, 102, 151, 58, 44, -101, 150, 219, -164]
3209a64K43j43L2PJ83l58J7K91J07l42L36m66M22k58J53j04J91k36N7j90K61k5
3231A4mj79K28j46J52QN9L4l2j84m0l5L8J73q7j8o5Oj88K97j30rN5J53M2p6o8
3258bQ2k34K89j65K18j64k33P9k6O5L9K29J01j28l05P7j2J23Q5o04L45J51n4o7
3282a11M9J03l5q1M4N2J05m82K56N0j11K50j41K9O3p2J06j43J84r3k61P8l0K46
3306E5k74K63kK4J84j90j86M1L22j29O7j90R1o7K8j05j4K26k96r2J85j03j1K23
3330E0nJ06j61L9o0j4j89K83j08R9j91l1Q1O1J92NJ0j91R9j19j4m6K27k49J77
3355E1j46L10j12k35K72q1j47R2pJ54j37k08N1J49p9N6m7qK7n5J73j45P1k34L00
3380F5J24k80k9m1K45j53r0M62m34J88j15J54k12M2m0K3J81k26K98n9k0P8J06
$$ y = [-164, 79, -64, -32, -25, 158, -200, -183, 108, 215, -127, 209, -257, 165, -93, 60, -44, 147, -89, -32, -222, 39, 14, 10, -169, 59, -87, 65, 73, 132, 166, 134, -50, -90, -125, -87, 86, -1, -19, -84, -78, -266, 31, -99, -108, -53, 100, 142, 66, -2, 80, -154, 135, -30, 188, 24, -209, -130, -156, -91, -52, 177, 278, 150, -155, -78, -90, 33, 118, -486, -141, 10, -44, -111, -62, 41, 6, -75, -31, 21, 126, -356, -100, -50, -161, 89, -52, -23, 40, -32, 74, -69, 115, 22, -239, -161, -191, 55, -219, 44, 42, 66, 250, 60, -126, -85, 237, 108, 175, -15, 76, 9, 37, -68, -82, 144, -152, -244, -59, -162, -173, 50, 45, 151, -10, 29, -31, -45, -234, 49, -59, 40, -151, -182, -101, -40, 152, 157, 167, -24, 75, -44, -58, -104, 123, -126, 51, -95, 215, 103, -132, 140, 59, -88, 4, -3, 151, 14, -194, -143, 6, -73, -17, -64, -72, -45, -100, 73, -72, -1, -235, 65, 189, -91, -120, -161, 84, -69, -159, 303, -131, 57, -58, 96, -116, -74, -114, -91, 90, -136, 162, 103, 83, 161, 267]
3403B67m65K15P%j26J03p6K64j73J57j80Mj37L2J40P8j67N1K03l30k7K24j08J37
3427I3r8m2K0O5J43k34l4O8J05J04r9p7k86K85j47L16q0j29LJ62Q2j64q2j4nn0
3453i5L2n2J91n4M0j82J26k7q1l1K75j82K00k37K26r7k18K49j45j09K44k38K61
3476I6k06J24O4q8j42K5N4J22j4q0p5J01r4P6J48p5K51k57k51L69q6k38J45j1
3500d2p2K12k54M2J82P7m8O4k96P3o5N8J18j27J16Pj52J95J0k85J81j06L35l4
3524A89k65J35N4k93j6J55J38k3k67K62k6j6j6o6j26J20j69Q9K05j6j00l%N4j27
3549a28N1J92j01k4j3on3J58k10J07P8j41MO7q1J76K7N8MMj55o8J05o1J17p9P1
3576I9J23l55k03K41K4j49K72j03q8p4J71O7m9R3n2o6L21o4j72m27L51j21J52
$$ y = [267, -198, 17, 24, 24, -102, 1, -75, 189, 16, 173, -7, -3, -140, -108, 32, 110, -57, -6, 197, -133, -160, 64, -44, 93, -5, -47, -27, 38, 181, -53, -87, -19, 86, 190, 91, 14, -272, 13, -134, 182, 102, -27, -24, 138, 220, 56, -26, -40, -45, -95, -63, -115, 76, 22, 62, -120, 6, -21, -102, -133, 142, -40, 160, -77, 149, 52, -166, 83, -62, -171, 73, -165, 96, -110, 14, 78, -10, -152, -127, -73, 49, 35, -45, -120, -19, -113, -37, 111, 36, 287, 30, -221, 148, 62, -176, -31, -42, -114, 98, -156, -114, 68, 145, 97, 161, -135, -62, -127, -69, 49, -78, 38, 45, -107, 88, 98, -187, -6, -112, 223, 189, -76, 59, 113, -180, -196, -41, 97, 74, -193, 69, 43, 27, 11, -55, -181, -61, -230, -141, 64, 48, -52, -55, -55, -1, -128, -77, 115, 14, -10, -23, -29, -82, 76, -134, -27, 51, -90, -86, -19, -100, 76, 103, 161, 165, 169, 14, -54, 51, -10, 107, 28, 99, 222, -133, -336, -95, -71, -220, 52, -51, -139, -213, -42, 25, -24, 69, 17, -49, 272, 208, 36, -391, -40, -161, -9]
3599iJ33k38j01JM5J49J99k11J43k44j6J95o4R6k24K92N1m9q5J42j82J53k39J42
3623G9j76P8MJ47k10l6J02J46Mj34O5J90k03j58K09j11j6j19J30l7Q0k4k8K44
3647B26j06J0O0l62j81N46l30J52K54k06J08k63K52k8j88R4J9j33O3J16j38RK67
3670B41Mm05J53n4J53r6j94K34j44J83j88J83M5k72L56k21J16P1k71J5qM07k57
3693E1k10L05l13J82n0m9j11L05K3j07k4k32L02k97K20j84L18j03l71K17L44M9
3715B65j75k95K13J2j38J21L7J28j91L6J5O1k07L33l29J68mnN4J89l71k0r9L1
3739a71K41j92j22L98n14L63J44J6j43q2J22m4j02J52j84K7j32J56J99Q4j68p9
3761c1Q6Q1k26K69k79K31j91o3K64j03j4r1K23l17K20rk29j1J71J36r6j88J62
$$ y = [-9, 124, -114, -215, -214, -169, -20, 179, -32, 111, -133, -149, 46, -18, 78, -146, 146, 197, 148, 63, 205, 23, 176, -63, 79, -97, -19, -15, 132, -78, -114, -12, 134, 138, 4, 69, 259, 56, -102, 107, -4, -20, -139, -9, -46, 34, 10, -18, 226, 120, 130, 190, -172, -353, 193, -137, 15, 269, 63, 171, -92, 160, 132, -56, 38, 57, -76, -13, 103, -35, -26, 241, 245, -160, -7, -61, 92, -4, -198, 36, -108, 75, -113, 70, 115, -157, 199, -22, 94, 165, -106, -91, -99, 308, 51, -159, 146, -167, 15, -35, -84, -195, 110, 133, 26, 2, -230, 72, -225, -5, -189, 129, 26, -345, -128, 216, 265, 90, -205, 8, 20, -118, 3, 40, 168, -23, 13, 28, 89, -118, 215, -114, 54, 50, 45, 99, 288, -83, -103, -202, -171, 70, -122, -244, 154, -360, 3, 147, 163, 20, -62, 60, 16, -86, 66, -118, -91, -223, -67, 132, 216, 48, -31, 55, 136, -90, 179, -100, 131, -60, -123, 141, 38, 24, -67, 156, -161, 59, 50, -179, -190, -19, 117, 21, -167, -5]
3784eJ30kJ18j91j28j5K07k32K00N2r9J03r0N7j27N3LK7k06J11K5J2N6r3K3r9
3810a10K24P9j83q7J56j6K8K58m28N6j31l5R3N1K6L3J2K07j12j56l04L08J9L8
3834B6j21L2r5K79J17k58k92J90J65j57J14J35k97L32j28j70J61j02M7j76K05
3855Gl2J53P4j20J9O5j36j26l9J82j0n3J37l73K30j1k35K41j72J54K73k41J25
3878A12O9k54K70j32j53J58j22NJ62r6QK8j18K25j41j65L9J11pn6J51l11m3K20
3902d0q2J36R3M9l33J56K9Mj31J17J80k71R1J23j73J62j15R4k48J96l3J21j69
3925d4p6J47m4K66j57j32N6j03J24J75k49L8j40K79r4K49j88o3p1M2J3l27K05
3948i4r7N2J31M5o1Q7k69J14L15j43r5K35l20J04K83k12J97k10K24k59n7J21N6
$$ y = [-5, 125, 123, 241, 50, -78, -93, 114, -118, 82, 134, 35, 138, 48, 105, -22, 31, 34, 61, -145, -34, -9, 3, 59, -34, -11, -110, 114, 193, 10, -77, 79, 63, 91, 349, -79, -23, -154, -189, -96, -45, -19, 14, 26, 233, 121, -35, -339, -31, -12, 26, -95, -63, -158, 121, 238, -20, -312, -122, 43, -114, 0, 135, -162, 170, 42, -128, 33, -69, -22, -198, 7, -25, 128, 202, 82, 101, 166, 30, -96, -135, 47, 37, -16, 121, -252, -22, -33, -268, -27, -199, -45, 228, -13, 112, 181, -73, 197, 65, -88, 70, -52, -47, 115, 19, 27, 55, -63, 162, 21, -144, -105, 6, -1, -57, 94, -217, -260, -40, -122, 14, 107, 156, -177, -21, 8, 12, -119, -2, 178, -93, -2, 121, -52, 110, -5, 89, -159, 37, 4, 125, -44, -120, 27, -17, 249, 92, -40, 16, -87, 37, 212, -37, 1, -139, 140, 46, 295, 107, 44, -27, 15, 28, -299, -94, -191, -139, -8, 37, -24, 63, -206, -92, 223, 80, -15, 220, -100, 4, 287, 75, 272, 62, 286, 27, -30, 91, 147]
3971A47K0j25k16n5K60k3Op1J01P8N2o5k54K24k52j5M39l07j42J69j03J67P3j32
3995b4n3J06L1o7L9j72K36l30Q3J18rL5L20j35p5N8k25p3M6J06N5k70L79k40K24
4020A63r4r9M6o2J02n5K20l62J65n8j22K81j44j07l3lR2K40k38R4n8J13o1R6J8
4045A34k57L27k23M9l3p6J7R4J9j02J80l15m8J11R6qj94K52P5k56q6K37J73l75
4069b09K5J08J20j44K01k4k57L7N2K90j16P1l8r4r2K74j0q0j47M7m6n8j4J86Q0
4094A62p7j99O0K0L20m34K35J19j62pl8KJ3K22j99J52q4l49K39jJ7j33n5K75j83
4119h5j11m6M53j83L31o86J58K46k60K07K7p4J19p5N3j12m6j1K33j23j94L49j88
4142a8L0L7j35K05j57l4J92j25j6J9j25P5m1J92Q7l41K02j46R7j4K97m56J8K14
$$ y = [147, 167, 42, -174, -229, 31, 8, 14, -57, 44, 122, 174, 109, -145, 79, -173, -188, 251, -56, -198, -29, -132, 35, 108, -24, -77, 29, 60, -7, 32, -140, 96, -234, -151, -33, -42, -7, 313, 178, 103, 161, -64, -137, -91, 15, 70, -200, 179, -61, 163, 69, -30, 16, -46, 56, 1, 221, -141, 24, -34, -156, 125, -19, -126, -159, -162, -70, 170, -68, 26, -32, 81, 20, 116, 134, -123, 204, -19, 30, -3, -79, -62, 32, 51, -51, 129, -186, -234, -123, -27, -35, -229, 23, 98, -158, -244, -7, 166, -209, -184, -76, 44, -100, 101, 77, -180, -143, -91, 199, 83, 154, 116, 22, -70, 204, 194, 114, -33, 14, -32, -90, -104, 82, 162, 85, -114, -54, -34, 286, -148, 87, 206, 44, 37, -1, 1, 14, 236, 37, 189, 105, -244, -5, -6, 11, -122, -177, 98, -85, -196, -242, 211, 28, 359, -327, -169, 77, -183, 24, 51, -23, 96, 21, 74, -38, -84, -95, 138, 15, -179, 170, -18, 12, 49, -86, 119, -38, -72, 120, -5, -21, -2, -127, -52, -93, 99, 186, -155, 47, -99, -2, -16, 281, -175, -157, 57]
4166E7L4j9Jl84K63L02j54r8M2j02K51l83O5L0O1r3J56j00k1K43L8l54J60m2J04
4191E7O4l03K20p8j05J94l7O6r2p5l9N0O3L8o0P4j75k01M37N6k71j68O6K39J57
4216A77l1k20K87l11J89P7k9j83j68L69j68L3L3o8j92K39J03j31O2p4l3M40m19
4239a8k4j2J08K20k44l06K39j7K9k9L01j05P4n1j41k8q2j08M91k46j96l2K58r9
4263a8J9n5J88l18L7J30RR5RJ73l88q9M21k29K4n0O3k50M10n3L3K1k48QJ14jj40
4290h5N2m6J21J2n2j37J45m9J1K54n47M13Pn2J18j6k70N3l2J07R2j30M6l73L51
4315gN1q8P7n1k23R6O1J49j48j52J54L69k54J43r9J41l16%J42p1J06q6r4K4J34
4340E8j2J5j05LP1j3R3o9j9j30M7L11m35R2J7J08j56P4K4J02k37K28Q5q9k49J65
$$ y = [57, 91, 72, 73, -311, -48, 254, 100, 2, 44, -58, 193, -190, -125, -95, -34, -127, 29, -71, -92, 151, 189, -165, -5, -47, 57, 121, -182, 38, -40, -145, 49, 12, 78, -14, -89, -128, -78, -15, 23, -37, 37, -138, -339, 98, 154, -117, -285, -219, 20, 177, 146, -74, 213, -98, 91, 168, 139, -44, -212, 157, -11, 22, 55, -13, -205, 34, 137, 6, 68, -6, -39, 401, -18, -42, -54, 54, 274, 30, -276, -37, -54, -25, -54, 247, 142, 216, 165, 24, -4, -86, -194, 297, 51, -145, -177, 81, -18, 1, -54, 134, -184, -147, -17, -8, 87, 96, 269, -119, -208, 213, -16, 8, -42, 21, -229, 181, 128, 161, 182, -66, -58, 56, 55, -85, -33, -79, 42, 54, 2, -135, 10, -39, -28, 226, -321, 92, 99, 47, 165, 149, -121, -68, -100, 7, 99, -31, 15, -358, -7, 44, -44, 33, -18, -241, -145, -84, 65, -83, -235, -81, 288, 34, 177, 78, 219, -97, -97, 45, -26, 80, -6, -100, -76, 58, 46, 61, -44, -41, 30, 17, 110, 41, 22, -108, -61, 250, -185, -93, -76, 32, -124, -50, -26, 76, -161, 67, 152, 63, -186, -21]
4366b1K38j85j11J00j51J52k47L84n0K2QJ22l15j73J61J20J26nj18j5k03K18j93
4389a36k2L20p8jM3L7l39K54k45R4L14n8k12R5j87p8J01Q7k28K33k9r6L15k44
4413f0Q8k16J97J8m00L69j48P0J23p0j1J94l6R1k56qQ9K02k22O8o6N4j61K02l20
4438b09M87l19R0k51K31j40o5n9K05j09q4K89j56o8N8q1R5q7K48o2O9K27k61j67
4462a19j1K34k65J54q4O5rJ93l31L04j83J26k53M7J67r2J30P2j6j74M5j76L29
4485A53k66J7L6O1p7p4K23o3Q1j08J14l52M5J76J35L8j31r3p7q0J88J39k09J27
4509Cl5n4J02k5j16J42o3j7J06J56rl96K33j81m4P4KmM0l0J69J0J23j00j68P7
4535eK7k9KJ37K3p6r2j94L64p1j32j1K54l92J1R6M5K87J3n4l02R3K01j62m0n0
$$ y = [-21, 217, 32, -79, 21, -130, 22, -225, 159, 109, 131, 139, 261, -54, -227, -66, 54, 180, 175, 57, 42, -161, 57, -136, -158, 162, 84, 83, 126, 163, -176, 78, -167, -73, 241, 183, -29, 66, -121, -199, -98, -11, -239, -6, -35, -131, 184, -60, 28, -188, 9, 27, -373, -4, -152, -82, 41, -29, -40, 154, 118, 209, -47, -55, 34, 236, 14, 82, 16, 70, -91, 111, -209, 278, -41, 49, -202, 29, -111, -176, -235, -30, -139, -223, 66, -90, -158, -100, -181, -86, -173, 75, 13, 82, 309, 48, -119, -130, 104, -161, -7, -91, -26, -35, 158, -173, 131, -52, 74, -179, -132, 35, -57, 73, 145, 129, -45, 0, -176, 153, -113, -96, -60, 1, -76, -150, 73, 10, 91, -17, 97, -255, -210, -34, 101, 139, 8, -85, -162, -242, -54, 85, -124, 3, -32, -86, 16, -9, -125, 17, -46, -63, 43, 199, 190, -206, 27, -154, -198, -124, -122, -126, -86, -116, 53, 63, 186, 86, -82, -5, 22, -7, -5, 132, 155, 79, -13, -207, 157, 86, -46, -57, 197, -195, -184, -88, -43, 244, 257, 203, -99, -6, 195, 33, -7, -57]
4561e7k45N13j78p8K61k60J56j73O7L77l70o1K36k08K85k71k87K63m1J91j47j44
4583a71J10l8K79r2J4J75m29P0k12M60j37j81K46j6k03J80p6Ok87J92j0k6J17
4606b9j30K13ORp5m2R8L11l33p9J04o8J40j33j2R4j02MJ68k08K03p2J05l10MJ86
4632E2LP2q1Kl36M77M9j72k6Mk42L12l23K32o0R1j7O0o4j03J66m5J48q5j59j5
4658f0J24m8o5L52l35k81L45J75P9n44J50J25m3J32M9m68K04J30N8o8J52j12n9
4681hK80l31P5l28L87n9N9p6j51K63j26M9J43K6l08K71j49j13J71k02J59l03K32
4704c9op9j1K34qo6j70J66J78k55K50l31K43j79J12l99J67M6L46k95J17R9o7l26
4728b73L83j9k25Q7J1J26J9l48K85r1J41J38k30R2O5j44m8N7M9j2P1k29Q5L4K50
$$ y = [-57, -302, 211, 33, -45, 216, -44, 112, -61, 6, 383, 13, -48, 188, -20, 265, -6, -293, -30, -71, 120, -27, -171, -61, -99, 180, 88, 102, 277, -152, -82, -294, 166, 29, -152, 94, 78, -125, 55, -21, -15, -302, -110, -120, -146, -29, -159, 54, 60, 69, -6, -48, 50, 361, 28, -51, 53, -15, 125, -8, -20, 74, -28, -24, 144, -64, 139, 67, 172, -138, -134, 52, 55, 127, 46, 48, -288, 189, 238, 66, 40, 44, -198, 114, -209, 23, -37, 54, 37, 97, 33, -70, 96, 51, 199, 114, -45, -60, 64, 16, -49, 303, -32, -313, 32, 207, 286, -258, -108, 17, -26, 106, 155, -313, -109, 21, 79, 11, 163, 51, -8, 272, -59, 16, -312, 75, 16, 75, -1, -152, 111, -15, 34, 177, 203, -105, 166, 17, -96, 75, -127, 32, -271, -39, -45, -124, -135, 99, 91, 25, -145, 21, 199, -56, 194, -137, 106, -73, 39, -360, -193, -147, 199, -96, 21, 120, 53, -273, 110, 91, -134, -47, -36, 90, 109, -239, 46, -45, 96, 234, 4, 96, 161, 17, -31, 26, 75, 63, 134, -95, -10, 24, 274]
4753B74k71k42L12J1m9o8j67K23%P7j05J6J02n7J26k19J27k73J11L8j01J05n4
4776h4NjJ18p8M2J38J6j8j97J16QK5M8r3M2r4m8L1Q9Q0k17RLK38k57j49L32P3
4804A77k33J23Pl6r0r1J12J88l60J36OJ11M8K0j52Q3O6k30J41k46J26J7J81k16
4828a12M02k61J23k23p2RnR9K53k51k59M40j33m3L7k4j3n5K64k14m8K57j51m9
4852b9l6L3J2K7K25k73M98m49J78K4l83j8R2K5J82j70K9O1j30K30j43P6P7q0k24
4877a66R3L4j21K09r6J23k95J9n4K42j73J59j9N3P4K2j73q2K25j58K16q8J06j76
4901b6k34J71J15k40M90n10K2L58j53j05R0J13j19k01L13p6J57k98J79P3j71J7
4923c5M0n8j29K94j50J88j41K46L7K8l23L1j06mp5m2o5K15L85l96m5J64k39RK3
$$ y = [274, 3, -239, 73, 84, 35, -33, -200, 23, 23, 100, -5, 11, 113, 56, 182, -37, 90, -183, -72, -34, -135, -30, -84, -79, -80, 38, -40, 2, 140, 156, 138, -59, 57, 65, 90, 138, 45, 87, -7, -55, -24, 65, 145, -72, -63, -60, 178, -79, -228, 104, 177, -56, 67, 74, 38, -52, -143, -31, 157, -203, -67, -61, 50, 98, 118, -34, 49, 115, -115, 26, -220, -94, -77, 104, -112, 290, 29, 152, -71, -143, -134, -139, -40, 213, -38, -297, 143, 10, -33, 4, -20, -33, -88, 176, -38, -86, 171, 20, -29, -65, -32, -20, 7, 232, -41, 457, 8, 186, 210, -173, -191, -99, -74, 108, -62, -33, 28, -102, 128, -15, 61, 138, 58, -166, -73, -39, -160, 49, -47, 76, -219, -200, -254, -12, -185, -26, -45, 8, 82, 104, -69, -151, 74, -84, 132, 44, 150, -26, -260, -89, 26, -214, 276, -234, -212, 146, -7, -112, -22, 91, -28, -229, 84, 8, 165, -133, 46, 119, -52, -35, 5, -53, -182, 112, -38, 150, 9, 255, 292, 320, -3, 28, -78, -82, -157, -199, -264, -49, 336, -60, -105, 59, -180, -171, -148]
4948a48M10j68k25oM16l22Km1P2j09L16k09J82k63j7L2R6j96J29l6O7O9j19P7
4972IJk0R3l26M42k22j07N5J42j9j96j1L30r0L0P7l00j59K32J0o5J35l3k26J30
4997h8kK4K53k90n2K60j59K66j35n1r8n7K87j04l8m1N7K1L9j3j31j14K82RJ54
5022B79m09m0K50k58J92j76M08l94J29K28k77L20l87P5j96L16j72J8K17k56J71
5043C8J20k88p0L22j69K62k24J49R3n8k37j29L16m4k9j41j7K55j99j47K04p8J06
5066C5j07J48P3k57R2j53rJ91l6Q8p6QJ34m26M75j22k22K0J47K0m8Q5mj23r2K34
5092G5n7J3j9rq2K9O3R3n1k67K17J03k66R2J92q4j43K60j01k31K00k3q8J39L5
5117I0Q1j04%J97m05J48M6k74J29J52P5j99R8n0L51l26Q8k10L6J32j96J68J60
$$ y = [-148, 262, 94, -131, -137, 279, -43, -41, -82, -10, -119, 197, -12, 170, -93, -110, -78, 18, -178, -49, -85, -18, 51, -68, 9, 10, -10, 83, -243, 199, -23, -130, -75, 67, 48, -148, -159, 171, 81, 111, 188, -112, -271, -39, -29, -94, 41, 8, -218, -88, -90, -66, 187, -103, -155, 105, -54, 212, 77, 26, -72, -129, 158, 54, 16, -25, 32, 53, 92, 79, -52, -166, 116, 125, 279, -130, -170, 80, -178, 14, -162, 246, -148, -19, 209, -68, 252, -135, -60, -256, 60, -112, -94, 123, -133, 38, 158, -130, -200, 122, -47, 215, -9, 140, 233, 175, -62, -191, 125, 81, 52, -89, -106, 149, -50, -197, 7, -71, 35, -72, 76, 149, -108, -16, -169, -178, 13, -23, 65, -11, -3, 131, -295, 180, 58, -164, -144, 3, 23, -25, 60, 56, -67, -159, 75, 18, 31, 12, 3, -79, -50, 13, 106, 55, -212, 5, 108, -158, -66, 126, 42, -101, 159, 58, -173, 27, 4, -84, 55, 90, 171, 67, 67, 264, -141, 7, 53, -221, -92, 60, 135, -64, 34, -16, 335, 9, 97, -113, -77, 55, -141, 27, 187]
5140A87q8OJ34k50Pjk8k7R8K3lj98R2J27j79J67kj56L14m15L47k56K09l4k88J91
5166b3q6K47r5K85l14k56L68l5r2m4Q8J97k29mo7J65j8Q5o7m8l1k3q4L52k43j
5192B7j7k55K76j44J44l6p5R2J25j01j84L13k7k68J01K17k87J41J43l79Q2M0o4
5215a36K16r4K76l02O9M4j24p7P5o8J63j76J84m2J38j5k08N5L4J44lm10J09Q5
5239f3J57j1j75J21n2j45J26L1o1j5p1K42O9J18k04j11j30K35J42l12L06l11J20
5262Fo0k5K90l5k28J13n6k09O0O9q8PJ57P3K0j82R7J81n0P7j34j24j14R5K45p3
5288A12j93K39o3l42K65J28k69P7J74m3J1n0j62K78j74J2L8p3p3J00J55r7p1J3
5312hO7l3J24k35J44k5M4k45J02K65j52k8j7p5j04M4M3K29j4j28K86l96J68L0
$$ y = [187, 99, 105, 239, -11, -4, -5, -33, -60, 38, 61, 58, -140, -48, 79, -100, 67, 65, -91, 223, -192, 155, -101, 108, 74, -214, -23, -109, 138, 43, 328, 14, -242, 126, 91, -1, -45, 43, 240, 11, 7, -60, 105, 87, 172, 105, 57, 26, 3, -81, 271, 28, 27, 10, -245, 31, -113, 31, -5, -80, 12, 137, 36, -148, 165, 138, -130, -29, 188, -99, 42, 185, -194, -112, -72, -136, 80, -14, 262, -40, 29, 73, -51, -128, -53, -121, 42, -134, 50, 8, 146, 131, -77, -22, 12, 156, 153, -257, -148, -63, 94, 83, -92, 29, -23, -168, -42, -11, -72, -87, -158, 84, 153, 271, 67, -44, -174, 61, 203, -109, 197, -114, 6, -54, -79, 211, 176, -52, 61, 5, -204, -144, -75, -163, -156, 1, 74, 94, -88, 9, 190, 140, 217, 83, -41, -155, -60, 185, 112, -81, 158, 95, -247, 18, 146, -123, -46, 128, 85, 96, 46, -116, 162, -12, 0, 38, -35, -108, -8, 147, 50, -21, -8, 59, 26, 150, -85, 59, 34, 78, -167, -65, 200, 48, 20, 3, -72, -176, -132, -89, 140, 126, -2, 284, -112, 56, 86]
5336H6O5k59q4P3m0K32l16J94K00n6j37L6n1K5q8O4j9j1J71j80K0K14j66R7j85
5361a15K44j12k17L96j27J78k71LJ71j34j16L01k81J21J41j05l7j7j12M4R1n6
5383a0j57K10m5Ok97L95Rk20O4K18o8j89n6Q1J57j21k34L79j0l4p9P2j08Q0n4
5408a1j92P6P1JK58k92L65k72l75L84J68j75R0k18J26K96j95m3l18M20lk92o6
5431a97L3L38N8k43J11q6k13J46Q8J65o4j03j63K20k12K04l01nN2L79k12j03K84
5454A76k89O5q2K87m09J00K71k47Q5Q2k26J3J43O6j94L08k99O5J41j63mJ53j31
5477h9K89l0k48P1J12j55Pq8J93mL5j46o5J42q8J84lj84R6j62r6P0Q2L17k63R2
5503F9j17o1l7K83p1j01M2n1r2J71lK70n45Q8P2N2l7K8K13qj48K24k59N9j01J1
$$ y = [86, 151, -108, -192, -119, -159, 73, -243, -49, 151, 95, -42, -6, -57, -32, -120, -56, -75, -86, 85, -95, -75, 139, -27, 70, -115, 129, 17, -200, 196, 69, 247, -24, -21, 150, 16, -100, 201, -80, 41, 182, 77, 40, 23, -89, -45, 46, -10, -167, 43, -2, 4, -293, 102, 111, -109, -45, 173, 105, -84, -140, -59, 98, -23, -257, 122, 112, 78, -1, 71, -37, 43, -11, -203, -127, -56, -55, 203, -89, 276, 4, -371, 13, 181, 6, 96, -122, 4, 300, 105, 62, -256, 164, 161, -131, -197, -164, 174, 232, -11, 100, 14, -199, -53, 35, 200, 136, 33, -130, 90, -122, 82, -219, -224, -172, 207, -5, -108, 176, -113, -48, -130, 157, -252, -152, 119, -128, -43, 39, -187, -174, -31, 35, -159, 149, -150, -85, 56, -107, -111, 42, -89, 200, 170, -78, -7, 105, -50, -43, -131, 62, 58, 93, -53, -118, 24, -64, 120, 117, -67, 29, -133, -229, -159, -77, 240, -23, 69, -48, -109, -146, 137, 66, -35, 7, -44, -136, 35, 32, 302, -243, -155, -83, -31, -68, -40, 173, 165, 17, 241, -18, 41, -60, -49]
5529d9M8R3j09R4K12l40J19r2M2J50k33j74P5J17L2l9k06N93n24K50l51L16j86
5552a62M44k23j5O7l27J81NJ64j40Q1l42M22r5L5j42l2J51J62k00o0m7N0q8K13
5576A02l93M17j50l4K19j18J21M1k27q0j21L0oK64K59l3m08P9J78K2l40J55J46
5599A23l25L01j07L2op7J85j39pj47k5J96l8K09k1l03k8K75k8j61J44j64rK4O2
5624c4j48J85j90J37j16K16p1K2q3j40M08m21J64Q8M6p7m4J11k04J71j13J96L2
5647A35o9k0j05R8j36L5J66r4k10N5Q1nK21k82j59M43j86l6p2L16j50o3M1j13
5671a09m4J88N7J8J03k20J53k91Pj00K09o3J12k65M71j68k3MJ93k60O0j9j84L16
5695A45k04q2L24l49K23r9J59j69rj24J15Q1J02j10M5J12j73J03K7q9j37J26L08
$$ y = [-49, -1, 92, -17, 77, 289, -51, 68, -24, 18, 168, -65, -239, -164, -47, -15, -54, -260, 333, -191, 59, -292, 24, -162, 282, 59, 44, 111, -216, -35, -30, 134, -6, 75, -267, 155, 60, 95, -47, -79, 72, 234, 34, -26, -73, -23, -111, 102, -291, 126, -24, -58, 161, 43, 164, 205, -22, -102, -223, -193, -199, 65, 324, 291, -117, -38, 140, 162, -178, -23, 123, -202, 99, -8, 24, 18, -59, 126, -13, -20, -167, -192, 4, -34, 175, 154, -149, -177, 98, 70, -91, 53, -111, -120, -96, -34, -182, 3, -187, -50, -166, 50, -21, 1, -82, -222, 186, -235, -71, 17, 63, -14, -58, 53, -151, 20, -93, 103, 135, 66, 46, -59, 39, -97, -62, 104, 10, -200, -145, -64, -69, 152, -130, -289, 154, -32, -68, -140, 176, 26, -37, 4, -109, -153, 35, 92, 110, 213, -7, 146, -145, -138, -238, -29, -92, 20, -245, 226, 58, 35, 39, 232, -28, 32, 13, -171, 145, -59, -141, 183, -166, 57, -42, 117, -52, -61, -185, -70, 11, 113, 3, 48, 160, -13, 90, 117, 28, -109, 17, 325]
5718C25l07j55L32o2j28j41l3M91l21N4q3k06J64J80l6O0j02l18K05j55L58o5
5740E7q1J30k59K26M7Q3j86R5l32K98j32P0J71n0l9p6j21J66O3p2N0k00Q8k8K1
5765a1j90J93L07j01l47J50n1J8K37j79j54J12J63jj93J03N2j55KJ69j31J8j06
5788i5K3K3j87L23J07k17j87K38j06K99l4m11J83j3j32Q1k4K94J48j00l83K72
5810A02m5j31J33r9j05J62k32J86M0J5J53j55O6l24J34M4J5j98J65J1j21L74k57
5833f7J00J7n7p4l4J07K23j15q3M3p3j42J99r2L4p8j35K92J7l2m1r1R4p4J49J33
5859B20j02k27L8Q2j9k0n2qn0L42n0m9j88J51j96J05j51Q5J24j4j52O6L2jo1K6
5885f9K13j09k07M00m10O0K29k1k30J96K31j90p1o6J06j68J3L09j23j04J18J5
$$ y = [325, 18, -137, 195, 133, 5, -136, -169, 322, 1, 55, -28, -234, -70, 110, 74, 134, 32, -286, -81, -236, 122, 57, -24, 106, -153, 73, 120, 203, 17, 112, -220, 78, -54, 16, 187, 137, 98, 22, -99, 67, 130, 58, 108, -92, -4, -32, -11, -201, -8, 299, 198, -149, 1, -50, -32, 205, 26, -128, -16, 147, 146, -47, 56, 108, -47, -45, 124, -7, 11, -95, -72, -49, -236, 87, 194, -23, -210, 28, -78, 221, 187, -224, -41, -54, -186, -105, -129, 165, 313, 213, -170, 102, 57, -74, 59, -40, -145, 17, -215, -29, 11, 26, 179, 24, 90, -234, -100, -56, -41, -239, -74, -63, -184, 190, -67, 33, 50, -7, -81, -115, -8, 215, 100, 17, 60, -13, -155, 44, -48, -14, -92, -227, 65, 82, 50, 9, -82, 12, -62, 87, 220, 118, -109, -71, 11, -8, -28, -80, -88, -138, 204, 154, 105, -83, 68, -128, -23, -174, -89, 35, 21, -131, -65, -33, -34, -95, -69, 144, 35, -172, 228, -182, -122, 107, 86, -144, 52, 283, 93, 22, -44, 62, -106, -93, 216, 93, -11, 107, 122]
5907A22j61p9J92q9O6M0k05K2K0N6J16k71P2j60K23L4L26n85N1L99k26k8J96l23
5931a92L60j72j23J28j73K82k72O0J28k7p9K72l8j07J59p1k23J99q7j09M7J99
5953A61j86J55n7j77J25j6M0J20l91L08j79J81m7m2K0J84J5k82K30j84J26r0J5
5976B9j78J63j24lK80q2k42J29R1k8j10K4L4n6K02l7j42R3p0K17k42O1K63j01
6000A71q9j88o2Q8J23qq0J39p6l9j45J8K24j41qR9j51K07o0Jk56J90l9J80j01
6025cL6J5R6l14n2NK49K99l61LL28j33j79J39r3N2k03K87j58m8J67k35J01J03
6049A01J6k41K11k21J07N7J01m0j19J90k91J45k0K77j55m06L80L9j47J6KP8P0
6072A50nk54J38MRQ5k29J3O4O2j28j03J85n9k%P3q3J3RJ85q0o7j03K92k81NJ08
$$ y = [122, -39, -118, 74, -15, 51, 91, -114, -92, -72, -16, 100, -171, -99, -259, -36, -2, 324, -261, -210, 189, -37, -65, 131, -192, 168, -4, -127, 1, -172, 110, -162, -102, 26, -1, -80, 192, 154, 47, 206, 135, -88, 111, 24, -85, -38, 161, -25, 130, 73, -104, 21, 5, 45, 165, -226, 82, -97, 84, 37, -5, 15, 199, 214, -68, 162, -22, 104, 14, 29, -149, 14, -110, -113, 167, 85, -157, -28, 63, 35, -75, -51, -17, -73, 129, 92, -50, 43, -27, 190, -52, 9, 272, 171, 82, -106, -168, -80, 43, 35, -45, 94, 18, -21, -166, -148, 76, -65, -73, 26, -125, 82, 22, 23, -233, -43, -82, 98, -3, 33, 48, 144, -170, -222, -217, 32, 331, -30, -27, 301, 168, -11, 128, 35, 87, -116, 171, 13, -35, 132, -103, -2, 101, 117, -124, 87, -134, -27, 30, 131, 91, -28, 162, -129, 16, -4, 273, 118, -288, 92, 131, -16, 0, 2, 80, 150, 145, -109, 29, 33, 42, 127, -102, -89, -25, 37, -91, -194, -9, -68, -70, -70, 3, -80, -67, -58, 127, 47, -20, -123, 169, -112, -107, 1]
6100AJ51k98P3Q7o6q4K86j20j24R0P8n6n2K08P8j52k77J11Q8k6J41p4j01K53N9
6125B74l63n6m0L42k13J60k28J37n1j75K53O7O9n3J0j39J95j62l1R1Q4j73K14
6148B12k49J27j26j13K90p0k35K18j97K58k69J50n0j66M3K03n0o5J24K1q5p8K24
6171A17j35NJ86J1m87L90j92J5k9J59q0K35m64K83J21j88LN5j32P7K26j11Rn1
6195B3Kp5r0K61j93J04q7l6P5m3K37n13L30R2K69k60J53o1p5O4k43J97k08n8J76
6220D1j24M9k01L21j99L4K29l82K45j90K89l59K76N5p5J7J64j76l1q0P7l3J06
6243E3l5pj16J4K1M0O7j92j73K11L50k96j18K5K82k05K90n9j12j20mJ60J23Rk07
6268AO7k29J98j62L19L3l15O9J34J51k89Q3j66L1J28k92M23k90J43q1m9K98p2
$$ y = [1, 152, -146, -73, 14, -52, -136, 150, 30, -94, -4, 74, 18, -34, 174, 252, 100, -177, -66, 22, -4, 137, 63, -38, 215, 274, -89, -145, -185, 157, -56, 104, -124, 13, -38, -213, 40, 107, 176, 123, 133, -6, 189, 27, -4, 87, 171, -2, 212, -37, 90, -36, -149, 141, 71, -164, 54, -143, 115, -154, -4, -54, -220, -177, 26, -24, -89, 35, 56, -29, -107, 117, -18, -13, 173, 184, -303, 87, -105, -90, -119, 40, -40, 195, -269, 14, 135, -53, -50, 5, -127, -50, 176, 65, 74, 23, 25, -50, -140, 121, -72, 32, -55, -91, -16, -59, 178, -335, -5, 87, 356, 96, 249, 188, 113, 177, -66, 131, -77, -135, 41, -83, -34, -235, 86, -113, -79, 150, -232, 13, -177, 112, -247, 29, 84, 9, 26, 190, 14, -17, -97, -20, -53, 53, 18, 11, -105, -91, -70, -30, 37, -155, -328, -117, 233, -63, -181, -156, 126, -79, 211, 152, 40, -80, -84, 76, 199, 208, 1, 68, -161, 37, -125, 194, 227, -88, -19, 115, 266, -23, 60, -106, -75, 53, -239, 184, -106, 37, -44, -93, 205, 133]
6291A33k06R1j92j1L15k01j6K78k05mj27n9K34o0K14l04K69M0j53nK5n2m7o3P1
6316c5M9n2K34m02K44k88K47j21Q4Q3q3P3M8l23J70R0k58J84J28q2m2J39K7k58
6340a44N36l30J06j16k4o7J63j78pl3O1j8o2j05qL02j07J03k66J34j02K5K37k9
6364G1j57L9O1n2O2J09n51L91j13J0j03J50J44N4k57K08j19M5K44l74J92k90J23
6387a13K73k5j04j27j22J43J00n4Q6Mj56K38k95M7K09j26R4k17l4M1K11n6j4K30
6411B33l91J09n1O8M8J47m11L07L3J01k62R8o7O5J56m93K05L37j14k56L68n11
6433b81M75k97K60k22PL2k35J9J65K78q1k13Q2J67j38j05L07l20q4L35j48J35
6455A38k3k41L47k63M0r5J18M3J42k09J14k83L63k03Q4Q0k63J15J69j93J31j4
$$ y = [133, -73, 18, -174, -185, 130, -71, -87, 191, -14, -18, -145, -204, 30, -30, 184, -120, 149, 189, 36, 31, 56, 4, -43, -106, -35, 14, -38, 196, -206, 38, -250, -3, -124, -40, 43, -40, 33, 81, -242, -72, 18, -240, -56, 72, -10, -52, 87, 114, -144, 392, 62, 168, 52, 28, -39, 124, -54, -61, -94, -33, -51, -113, -218, -226, 76, -31, 72, -194, -60, -162, -137, 100, 71, -86, -47, 14, -38, 24, 133, -418, -27, -140, -130, -233, -83, 61, 115, -142, 66, -53, -8, 236, -138, 54, -236, -113, 160, 135, 31, -96, -218, -75, 25, -29, 57, 61, -95, 143, -152, -105, 104, -22, 72, -145, -179, -138, 73, 17, 3, 233, -158, -49, -100, -32, 16, 163, -248, 59, 92, 193, -69, 29, -38, 27, 183, -310, -105, 232, 118, -138, 230, -281, 194, -103, 157, -65, -58, -26, -261, -242, -77, 201, 120, -93, -11, 156, 18, -87, 220, -100, -184, 151, 3, 138, 115, -126, 221, -42, -2, -97, 21, 64, 206, -3, 111, -172, 191, -12, 72, 152, -111, 4, 173, -20, 111, 97]
6477I7J73l30J54O5n46K89K43m8m8Q4j70J28j38N2J64j00j4j15K0J87q4o3J29
6500A29k67R0K22k33M5J24n2m6N7r4l01J56L27j10Q3o2L7o3qq7j36J08j3K32k73
6525a35K66k02N7j65K77j40j09J02L1k1P0n3J79Mn06L58J24l59L53J04j6j99m4
6548b4K15p6l15J75m5j9O3r1J32j43k4K32N2k91N87k79k32j16K08L11m74r6J31
6571a19k40K17L90l42K26k30J03RO0j12K49k94j31M02k26N9j35rK14L7k37K22
6593A13j66nk15J98p1K13M9Kj88L72j96j67R8j79J34Oj74Q2k7j19L15p8J3J26
6617A36p5J84l19m9J89J09n7R0j44r9J23m2k0Q6kol6q9J65q3L0pJ89k40j1K10
6643B32k84L6j56Q9N1k26J83K08j37O6K08m38K34J33k97N1l0j38M10j5p6j03j7
$$ y = [97, 270, -60, 94, 159, -387, -98, 145, 97, 49, 133, -37, 91, -47, 5, 169, 69, 55, -60, -40, 147, 63, 0, 129, -138, -48, 174, -59, -14, 110, 58, 12, 69, -25, -326, -170, 157, 47, 130, 68, 105, 42, 34, -53, -189, -81, -94, 138, -135, 131, -71, -14, -179, 98, -42, -151, -49, -18, -39, 31, -22, 157, 161, -345, 13, 137, -222, 131, 235, 219, 20, -24, 191, 115, -200, -25, -70, -89, -26, -117, 15, -128, -152, 80, 132, -159, 428, 149, -83, -199, 9, 320, -154, -250, -119, -359, -142, 248, -94, 132, -98, 5, 14, 74, -38, 211, -83, -214, 188, -38, 21, -114, -123, 91, 128, -109, 113, -53, -58, -273, -75, -146, 67, 116, 118, -70, 302, 106, -61, 37, -142, -8, -2, -176, -94, -121, -240, 75, -3, 10, 136, 61, 245, -74, -123, 66, 175, 118, 208, 64, -35, 88, 46, 26, 112, 110, 104, 68, -21, 144, 61, 91, 84, 273, 33, 22, 232, -52, -16, -172, -83, -32, -258, -75, 133, -4, 62, 270, -168, 66, 199, -98, -47, -77, -215, 195, 180, 104, 1, -16]
6666a6O4j01N1l9j60K79O3n18K89J33k03J43J52k92K41l40M14j14j97L31k44R5
6688C1O6l6k61O1J02o1m3Q6o7j21M93j32N1j73l7L3R0o8J5O7J41k93J91l16J69
6713a2ql5kM7J16k77K40M4J3j89O8M0k46K73j45q0K11J1j16M0J92m50L40j11k5
6738f1o8J28P5q8P5J02j54Qj16K98k15o9J07N7j21J69l26K33j21o2K16J60j54
6761G3J03j93m6J98J37n69L49J28j00j76rJ1K53r2J47k66p6K89k7J41k61J15k73
6784a44K05j0J4N9m5n0L1J4l3j63R6j3k33J82m6J76j50o5p1L42k36j41L43j23
6808f1mL6n5O7K00j02j41j83M70j63k29K09M0M5k8j22J19k84J43l8J30j65O5J66
6832A15k9j03P1Q7l08K69k19K96j39j64J45L0j66J80l25L30J56k31L6J11k1k5
$$ y = [-16, 48, -53, -2, -41, -201, 78, 141, -377, -88, 45, -158, -15, 137, -155, 86, -254, 160, 46, -151, 180, -64, 31, 97, 61, -200, -139, -37, -98, -141, -55, -122, -243, 250, 118, 169, -4, -41, -8, 82, 14, 29, 96, 237, -56, 135, -181, -12, -20, -55, -57, -10, 106, -171, 69, 113, 126, -63, 5, 45, -201, 72, -73, -153, 58, 69, -47, -7, 185, -265, 75, -36, -61, -129, -1, 74, -14, 61, 163, 9, 17, -99, 199, -16, -85, 22, 79, -42, 127, -199, 34, -87, -149, 67, 227, 73, 176, -17, -63, 135, 272, -297, 52, 180, 80, -96, -105, -94, 159, 67, 214, -52, -128, 161, 134, 275, 14, 129, -144, 61, 51, 65, 124, 79, 29, 60, 74, 41, -122, -26, -39, -272, -90, -136, 40, -110, -175, -246, 96, -140, -281, 62, -61, -65, -29, -84, -17, 183, 81, -60, -243, 227, 64, -165, 44, 84, 129, 101, -21, 98, -186, -43, -81, 49, -116, -51, 115, 86, -17, 54, 141, -167, 102, -117, 179, 40, -124, 21, 51, -115, 65, -260, 70, 226, -5, 31, 142, 121, 96]
6854I6j07q3K37k87L68k69l1M5L0n4j09K21m4N7j82J16J21l44M44j98K91l18j2
6877a2p3K6j83J13J84J1k4J20k66k5K88l07R6LK1m1P6J61l9k06p9J23J8J65L1
6902A81k1k93LJ18P4J79k36k26J85J21p6p4n3N9l4K0J92j97K23j04L6j8j39P2
6926hk75O3L05j38J20j35M2p8Q7Q9o5r9p2J53j6M2Q6j6j01q7j78K01L0j3K79k30
6952a4K0J56p3K5j65r2K82r3k8K8n7L1j4J41l40M20j1l31O9J13m5O6k48L87k28
6977aj33K82k82J34J33j13r1P6j68n9J92p4K00L9j93L3l7J59k22K01o1rnl2P7
7002D6m4J39k26k3J69M5j96K09j12j31j14Kj7R0mm3J12K37o1J02p6j04j28K28
7026A00j29J65r0m74M58M3r0J41k00O9%J39p7l5j56J96k25l6M96k46l11Q9K82
$$ y = [96, -11, -94, 143, -144, 224, -45, -76, -31, -1, -55, -164, 57, 13, 70, -112, 4, 125, -219, 225, 27, 318, 0, -12, -85, -59, -242, -129, 55, 66, 42, 162, -104, -129, 159, -148, -52, -49, -28, -69, 7, 168, 129, -77, -156, -33, -15, 150, 181, 160, -133, -130, -12, 62, 241, 5, -221, -36, 85, 9, -65, -118, -59, -93, -73, 119, -78, 145, 41, 77, 59, -80, -8, -283, -220, 85, -53, 67, -68, -26, -104, -17, 72, 7, -92, -164, -11, -27, 15, 101, 85, -16, -103, -281, -80, -50, -63, 216, -14, 6, 162, 89, 114, -51, -143, 139, 46, 18, 46, -11, 20, 6, 147, -193, 227, 216, -115, -46, 67, 22, 88, -160, 227, -1, -134, 148, -134, 0, 133, 20, -71, 5, -163, -222, -30, -104, 96, 135, -58, -25, -62, 97, -125, 76, 15, 6, 1, -31, 46, 2, 141, -85, -108, 61, 106, -90, 119, 7, -124, -238, -236, -253, -163, -167, -210, -98, 139, 78, 180, 104, 0, -128, 100, -29, 136, 46, -428, 30, 73, -17, 124, -76, -7, -7, 132, 55, 20, -136, 60, -165, -201, 295, 49, -262, -173, 109]
7049A09j35K2j93L86k01Lk34J30n9R0J91j76m2JM1J37K19n79J54J34L1r8K95j98
7073B8q5K55q1k00O3K10k68J76k73L77j10m1L4J53l47J92r3p5j4K69R4k37j44
7096a17J60N2j07L5r2k5K18k55M5M24n79L04M8k42P2J66l51J54p6K01O1j48J0
7119d2j42L28O4j34j5n7L5o3M0j23O3J1J1l1q4J36%p5N0Ok21J55m4M6J48QO8k09
7147g1J99j12J78l92K95j57L5J74q2R1J16j60j75J96k55J89k40K08N6j80J3P1
7169ck7K5r0J74M6n9j5k19J31J25K96l40J24p7k27L12l45J38K29j46J28K41k99
7192A22k53K64j45p7N8j85K14k35K53j30qK34l06P4J97M7k33k6K94K6j89kQR1
7216I3j37o7l1l5L08j73J01k8r7J62L0l16J73j56J22J32j20j47K0K25qk99L53
$$ y = [109, -26, -4, -197, 189, -12, -9, -243, -113, -172, -82, 109, -67, -109, -108, -67, 70, 289, -290, -136, -2, 29, -69, 226, 28, -57, 198, 117, -83, -20, 190, -78, 98, -175, 202, 92, 51, 85, 238, -109, 83, -10, -85, -99, 170, 264, 27, -117, 43, 95, -12, 23, -69, -94, 124, -131, -86, 338, -241, 63, 111, -131, -59, 107, -244, -90, -166, 35, 96, -52, -42, -184, 144, 208, 74, 59, 2, 37, -26, 14, -109, -46, -35, -24, -55, -139, -3, -3, -78, -28, -22, -243, -88, -132, -86, 62, 70, 138, -71, 128, 16, 194, -198, 97, -60, -25, 149, 67, 158, 274, 114, -61, 135, -120, 69, -171, 37, 93, -87, -74, -3, -30, -5, -95, 79, 125, 66, 51, -168, -37, 88, 384, 44, 168, 91, -136, 176, -169, -31, 198, 52, 180, 421, 122, -131, 133, -12, -89, -31, -216, -2, -237, 16, -114, -122, 112, -194, -120, 77, 124, -109, -135, 159, 185, -4, -6, 2, 93, -44, -111, -142, -177, 131, -42, 59, 31, -66, 96, 126, -190, -17, -173, -51, 81, -39, -186, -166, 59, 51, -248, 105]
7239A05k33K09l00L56k28R7j9q8K0J35J3K4M7J52l89R8J17k63J05j19Q6j5Q2O1
7263E3J09k17j07K39j85R7J78n6r8k39J41q5K20o4j50R5J49J39m36OJ81Pj5R4
7287E6r1Q1k88J51O0M0j06L64l53J25m0J01j42N2j01P2Q7J34k43k0L16l11L35
7310B79k54O8Q9J81n34J32m5J40k23J87k58L43J14jj15k39lJ04p9J60j51K18o7
7333D6q1J24p5r7J09J96j37j92O2K30l03J88j86j46L11l74K97Q0j52K40l46R1
7355a15j5N6l2K41k91J2O6L13k55j0j11J23J83q8Mk6Nm8%j2O4N5l6k96K65P1n5
7382F8n0J9Mj12O5q5Q8M3j48K08j07J12j74K34N5j19j6L1J03j60j63R1L3j99J81
7407Bk6J86k31k79M10l3N8N6K5p6k4n9Q2j23j6l39N27k0k62J12K1K17j64O6L0
$$ y = [105, -128, 81, -219, 137, -91, 6, -13, -101, -81, 54, 67, 91, 138, 290, -99, -1, 116, -147, -42, -161, -75, -90, -8, 53, 162, -55, -162, 77, -108, -11, 167, 111, 13, -226, -85, -170, 50, -14, -164, -69, 80, 219, -217, -211, -30, -23, -38, 56, -35, 46, -242, -91, -31, 9, -97, 267, -86, 39, -1, 100, -42, 10, -91, -19, 68, 202, -41, -61, 255, -56, 279, 25, 93, 182, 363, -171, -39, -84, 56, -167, 20, -238, 105, 219, 218, 103, -136, -139, -35, -114, 46, -105, 113, 46, -35, 89, 14, -83, 26, 222, 85, -107, -45, 185, -118, 70, -116, -262, 49, -325, -28, 52, -100, 140, -206, -115, -130, -74, -106, 135, -156, -144, -78, 235, -20, -30, -141, -18, 165, 77, 81, 55, 60, 12, 12, 0, 64, 119, 83, -213, 52, 123, 68, 18, 37, 41, -71, -6, -91, -3, 40, -108, 100, -7, 105, -69, 165, 220, 101, 85, 116, 219, 59, -104, -13, 20, -179, 2, -24, 162, -69, -348, 62, 29, 87, 143, 168, 92, 68, 9, 91, -32, -48, -387, 140, 120, -142, -30, -9, 208, 44, 110, 140]
7432A40j2j90J09m18K41J04K15j39qr3K43k09K96q4r8j06n5q0l8J22J0J88r1R4
7456A41l72J18J58q3r4J43lo8Q6n4J08q6o8K4Q2nj86M19j96j34K0l7R1j9K59k22
7482B2o0J31M1j20j29J74k0m9q5n9oJ31n0K56l6j61j74L70k24j5MJ37k22K27J29
7507B12p3l25J44L8M3j6Q2K23k71M0O8j63p9J14J12o6P7K3l54K13J3Q0j53J54
7531A36o6j54O1P4q9q4J05j34K01jo1j74L24j23j37L8K62l56J19J9L7q8J46j20
7555f5N9P0j57J51l50L12q0Q4R5J79j20r0j51J27j54P7j00K75k56J89l0l37M13
7578A41j91L4K7N5R4k33j29J31J68j44M2k32R9J08P5q6k7j7M67k28j30p2K98k23
7602B7o4N3L4P2j66K65r2k95K07LlO5k42k7J55j11K53l53R8K19N8k90O8j86K77
$$ y = [140, 128, -62, 47, -371, -130, -26, 189, 50, 42, -51, 192, -17, 279, 195, 97, -9, -64, -144, -182, -60, -50, 138, 47, 141, -231, -113, 45, -38, -132, 11, 8, -60, 26, -28, 80, -6, -74, -50, 32, 27, -159, 260, 64, -70, -50, -87, 4, -15, 244, 22, -38, 93, 134, 14, -115, 59, 39, -10, -95, -154, -160, -29, -79, 177, 141, -20, -194, 176, -48, -63, -59, 78, -144, 83, 212, 139, -186, -42, -4, 39, 23, 105, 328, 57, 97, 165, 2, -77, 37, 149, 83, 160, 183, -171, 42, 55, 135, -18, 136, 70, -84, -23, 51, -38, -122, -17, -151, 50, 49, -12, -186, 138, 15, -122, -84, 178, -178, -59, -40, -3, -91, 55, -65, -6, 64, -93, 58, -292, 20, -60, 24, 119, 298, 178, 88, -63, 64, -90, -13, -113, 162, -94, 95, 65, -272, 141, -50, -16, 11, 66, 160, -73, -202, -71, 97, -47, -5, -237, -138, -30, 45, -41, -68, -85, 382, 154, 24, -48, 250, 27, -37, 16, 50, 122, -44, 221, 129, -166, 41, 44, 41, 106, -136, -163, -8, -119, 134, -219, -121, 98, 156, -134, -66, -252, 25]
7627B5J56R1m42L85P7l24P8k07J67Q5j17q4P2M3n0j34J74J57j61J95j77m4K02
7650A67k02J49o7J48q3m4k22L5J80j47l5M8j19L71k19Q6j4N9P2j10lQ9k19J36
7674E6j20P8P6q6k69N17k86j48K76k7n6o4P6n3K7J59q9j88J89k24L9M4K28K10
7698C65l06Q0j42j44q5q4K14j06K08q2m8J35J4R7k81K64j13O7k73m0N05r0L3r5
7722I3m2j19K2j85J70k9O7q6Oj08j05M08k23n7K27K2L9Q4j57R7k1K1j05O9l5j21
7748f8L32k00k51J19lJ6N7J56k10J06j35J5K63j10o5j50J68J51r2q4j25j43J81
7771g2J80j26K57j29k65J60j21J95r6q5j21J33K12J63l20R8K20k20J48m93K41
7792d1j05o9K19J58j16nK26l4j99J5j13%J54j75K8J89q9j47Q9N1L7k31J75nO5
$$ y = [25, 181, 272, -170, 215, 292, -32, 46, -161, 6, 91, -26, -110, -38, 5, -45, -179, -5, 152, -9, 186, 9, -35, 167, -35, 114, 47, 195, 112, 68, -154, -119, 61, -86, -121, -73, -192, 179, -40, 46, 32, 91, 163, 53, 50, 139, -80, 56, -64, 14, 90, 4, -265, 252, -34, -182, 94, 67, 11, -53, 23, -30, -3, 156, 67, -121, 68, -156, -117, -73, 155, 365, 59, 139, -3, -147, -232, -316, -102, -208, 0, -82, -130, 5, 19, 116, -165, 99, -14, 53, -220, -260, 245, 155, 188, 93, 51, -68, -46, -231, -61, -90, -23, -109, -103, -211, -316, 92, -131, -188, 39, 61, 100, 184, 27, 124, 103, 124, 19, 88, 53, -68, 264, 64, -187, -68, -71, -55, 2, 158, -52, 54, -81, -66, 197, 87, 22, -128, 40, 191, 99, 15, -110, -253, -72, 108, -18, 239, 110, -155, 5, -116, 79, -17, -102, -223, -90, 122, 285, -35, 63, 283, 63, 211, -282, -41, -146, -215, 4, 162, 46, 41, 267, 233, 34, 49, -64, -64, 90, -85, -57, 132, 43, -104, -15, 36, 73, -158, 17, 12, 77]
7817G7J13l69L63k03p7J18J40k21qL42m19K87m2K17k13Mr2m1l2L7L27m33J15l15
7841c25K47J6M5n0l3J16k02N8k9K63j77p4N9K05j3j64K08k71l5m3J04K11l32J80
7865c6O2L5m00P6L49J2Jk03O5j4L00k08J2K71j40l72J03J70j79l5K06j42J30l4
7889B9j34J19r1k4J07J62j31j43K80l69J78Q1j02k0K29j95j68K50K08k90K9OO
7912A7O2lJ83k41J1rJ72l81N6Q4Q3k11J58J00j22J23j21P1k9O8j69R3Q7K91k80
7937I3J14k64j3J81j27O6j53J4pJ51k91K20j7q3R9l4k7J95j84M5J54n4q2K89m86
7962b01MK12k05J15q0P7jk02J58J57n2JP5k68J52Q0q1j0L7L3L8j51M4J57qJ12
7988A93l31j39L78Ok70J66J77m25K66J19k47P4K64j49j88j2m2K50M8k52J36J69
$$ y = [77, 190, -179, 184, -19, -96, 22, 162, -59, -67, 275, -144, 143, 101, 318, 105, 109, 17, -24, -56, -19, 308, -125, -10, -325, -78, -62, -17, -67, -100, 16, -186, -128, -157, 106, -71, -145, -86, 119, 106, -58, 150, -121, -156, -199, -95, 116, -216, -36, 26, 61, -339, -263, 86, 98, 99, -104, -39, -53, 247, 39, 51, 322, 182, -190, -87, 83, -96, -131, 75, -67, 63, 29, -105, 14, -77, -101, 6, 168, 37, -106, 174, -195, -17, 64, -38, -58, 171, -24, -192, 58, 266, -24, 5, 11, 17, 79, 76, 259, 18, 29, 20, 192, -189, -133, -49, 34, -177, -19, 81, -41, 82, -39, 32, 3, 71, -98, -5, 82, 373, 93, 207, -57, -70, 111, -16, 50, -103, -89, -96, 55, -236, -16, -33, -116, -17, -51, -78, 117, -67, -22, 132, 78, -4, 285, -201, -197, 15, -190, -75, -155, -78, -79, -281, -123, 34, -18, -17, 58, -210, -58, 22, -59, -69, -32, 1, 39, -112, -68, 89, 81, 193, -138, -277, 101, 107, -163, 3, 180, -245, 21, 140, -107, -33, 231, 82, -106, -118, -160, 90, 138, -114, 22, 191]
8010A91n2k22J5K09k90Q1J15O2j81J39k67J65j26L07k86q5K54m16K40L23n4k08
8032h6K33k88K80j37J5k1j5J93j19O2m3l2K34k17j60k8R9m2j0J43lK1k27K2J12
8057a4k24Q0L40l88LQ2j88K60K02q3J6j06O1J41j54j35j87M64M5l25j40M55k57
8080e2K52k58K13j8k72k6l4K52P4J4j70K15k15j4M4O1oj13Oj23P8Q1k6q4L1j23
8106b13P5M8m3J46l3o3J58k45J66pp4R2K37m02K38q4J85k59K22J15q6n5KJ02j70
8131E2P6k43P1KJ0%K57k30n8m2RQ8k83K40j14J51Q7j98M18k57j92R8m4N6K67j41
8157H0O5l11K57k55L2K75k40Q4j14K78l0p9K0m15J30M62k5k55L8n9K69k19K8k07
8181a91Q5q5O4K40J21k89J44p4k88K71
$$ y = [191, 139, -83, -68, 141, -149, -68, 47, 109, -72, 67, -200, -35, -161, 146, -140, -225, 29, -387, -147, 176, 122, -86, 147, -141, 139, 2, 17, -4, -19, 174, 55, 117, 74, 42, 276, 59, -101, -129, -30, -72, -82, 61, 58, 79, -148, -126, -14, -238, -158, 182, -206, -203, -121, -309, -49, 153, 70, 86, -20, 41, 182, 28, -107, -294, 170, 215, -110, -250, 205, -52, 200, -58, 155, 137, -135, -161, -195, 57, 131, 145, -25, 190, -25, -39, 5, 66, 60, -53, -47, -170, -92, -11, -37, -121, -90, -213, -138, -90, -133, 13, -20, -83, 75, -170, -4, -11, -85, 7, 244, -158, 80, -4, 181, -78, 144, 259, 173, 118, 120, 222, 52, 128, -115, -44, -42, -32, -32, 225, -5, -63, -105, -96, -8, -291, -51, -165, -14, 73, -125, 293, 36, -156, -58, -102, -46, 221, 80, 145, -166, 91, -164, -132, 143, -97, -13, -127, 151, 121, 42, 62, -353, -223, 239, 214, -41, -3, -62, 207, -12, 16, -191, -106, -191, -127, 113, 234, -55, 89, 15, -273, -2]
8191b
$$ Imaginary data points
##PAGE= N=2
##DATA TABLE= (X++(I..I)), XYDATA
0@%%%%%%%%%%%%Qj6J6j6K4l2L2m0N6o4P2q8J04j20J38j62J86k12K45k79L18l63
34a93M10m60N17n80O47p23Q07q95R93j102J217j345J486j637J802j986K188k409
52a263K656k929L232l572L959m402M913n513O226p089Q160r530J1350j3899J7741
67A0040k4228L7671p1544L2436K6504j9089J4847j1817R786q563P296o357N778
80B760m997M611m257L797l399K957k817K475k191K139k057J879j672J391j511
95h92J421o42O41q98O83o26M09m21L98l62P85o98L89n18O31k37L1j26K07j48J3
116D0k0k61K33j1R2J54j96K7o4j47J50n1J30j24K70l12J83j13Rq4J30j04K13j29
140A5q4L26j7p2j67q6J66j05K31l54J98J16P1l03J99j27j08J70q6K0Ljj35K28
$$ y = [0, 0, 0, 0, 0, 0, 0, 0, 0, 0, 0, 0, 0, 8, -8, 8, -8, 16, -16, 16, -24, 32, -32, 40, -48, 56, -64, 74, -88, 98, -114, 131, -148, 170, -193, 217, -243, 274, -306, 341, -382, 425, -470, 523, -579, 638, -707, 779, -858, 944, -1042, 1146, -1263, 1393, -1536, 1696, -1876, 2083, -2319, 2594, -2919, 3307, -3782, 4378, -5152, 6198, -7701, 10040, -14188, 23483, -48061, -15625, 10879, -8210, 6637, -5180, 4606, -3957, 3339, -3018, 2760, -2237, 2374, -1883, 1914, -1485, 1472, -1345, 1130, -1061, 1078, -979, 900, -772, 619, -892, 529, -113, 528, -370, 313, -313, 96, -325, 73, -289, 496, -202, 187, -331, 300, 63, 94, -32, 175, 27, 40, 20, -241, -8, -19, 73, 227, 31, 58, -6, -153, -3, -54, 76, -48, 222, -90, 93, -20, -11, -95, 35, -69, 144, 15, -69, 257, 240, 168, 1, -85, 81, -24, 207, -147, 51, 167, 238, -65, 134, 7, -101, 69, -17, 3, 6, 5, -130, 98]
164I8%Q3j44R1j36j33J78k06K13j04K2K13j62J32K6l43K28j67N8n5L26j66J59
187B11r4n93K79K82q5M5Q2k30J5J23p0m5J48j3K58l55K49l8o3n6Q8k76R0mJ73
212A21j33M8j00k46N34j36j26J11j20O5K01k12R3k33J39o4j7J4j45L9K89j95K52
235A79j70m1P7k03J51j02J72j9k96K1K9K35Q1Jk0k41M05j9k89j2J34J6J1q1k9
260a0J25m22M49k10n0P5j43L43l19Q5J90k16J39Lo6R8j71M3Q1L03j74j17j67J6
284a15l2K31k05R0O7j45K61m82L09p4n0P5J9j53J02p5P6J46r3L14j15l79K48j18
308i8o6K47m3j07J9q7L27j13l36O72m25P8r5K52m43K84j62J43J28k31m6K58k35
331g9k7K98j71k23J98P8p4N4J03l99PQ8J21M9q0R3j74J04r6K70j01r7j39j7L86
$$ y = [98, 98, 181, 37, 128, -8, -141, 37, -169, 44, -60, -38, 175, 13, 145, 171, -172, 56, -111, -53, -108, 218, 52, 211, 117, -476, -197, 85, 0, 45, 127, -103, -88, 35, -35, -80, 68, 55, 313, -42, 207, 169, 106, 50, 138, -138, -48, -52, 121, -12, 36, -64, -310, 224, 88, -38, 73, -47, 18, 219, 7, 100, -133, 6, -58, -75, -61, -206, -167, 122, -73, 179, 9, -32, 45, -158, -7, -109, 63, 44, -252, -231, -202, 33, 114, 115, 95, -146, 259, 240, -49, -61, 73, 89, 100, 19, -10, 115, -307, 142, -68, -118, -43, -186, 157, -162, -77, 113, -103, 36, 39, -27, 71, -100, -57, 24, 327, 153, 36, -131, -115, -147, 84, -121, -31, 36, -109, 152, -330, -21, -95, -145, -70, -51, -204, -102, -177, -101, 45, -48, 266, 151, -228, 20, -98, -164, 83, 40, -67, -48, -135, 192, 79, -257, 415, -10, 68, -27, 225, -218, 66, -96, 47, 175, -56, -102, 156, -79, -106, 192, 21, -202, -4, 74, 0, 54, 157, -242, -235, -147, -26, 23, -57, 36, -138, -34, -130, 140, 39, -58, -197, -214, 172]
356A72j86R0J02k14j79K6J00J98J17r1l28K7J25q3L1R4R1J29J12k83l8m6K37n2
380A51J72l55l8J84n5q2M7J48j64l3J2k7q4K54j08K05k94K44O6k05j36R1p9j50
404b36K19k39K67J06K9j94M1m9j02J34P1o8J41j15l4J08m02L95J40k58L2j08M3
427g9P0p8J89j55k4J23Q1P7j87k5P1k05J96O4o8l3L9M2j37q6J37L16l97oj14M42
453B53kl39P0k44K83o8n4J59oJ08k29qK31l08R5j26J54p8J57q3m2K40k17K0j47
478a81K61k74l9L23r3O1N5k59J68k3J39j16K29j99q6J01j05R1k45P2l0K15J39
501B04k00j62O0L6j24J96J17k25Q8J35k64K7J08J64R5n1l82K45J16k03q0J29k29
524b00K16lk23J97Q4%L9O1l73K04p3j30J92o7n1kP3R7m7J05k54K86j1j96K60k95
$$ y = [172, -14, 76, 178, -36, -215, -189, -89, 109, 226, 135, -193, -166, -41, -124, -93, 1, 92, 221, 333, 50, 12, -34, 203, 151, 323, -32, -70, 114, 59, -23, 24, 172, 8, -25, -13, -40, -124, 130, 22, 227, -67, 177, 243, 38, -98, -7, -86, -236, -17, -256, 11, 117, 146, -48, -7, -56, -158, -24, 47, -21, 120, 5, -29, 79, -323, 72, 212, -46, -14, -122, -79, -9, -87, 102, -53, -77, 46, 127, 204, 17, -8, 63, -142, 54, 118, 50, 17, 56, 98, -39, -125, 12, 328, -69, -75, -189, 253, 251, -88, -18, -262, 21, -47, -101, 58, 52, 160, -69, -77, 154, -154, -59, -185, -31, -109, 48, -35, -77, 163, -54, -34, -181, 80, -194, -233, 90, -3, 58, 113, -146, 22, -1, 138, 22, 251, 52, -34, 67, -38, 53, -192, -120, -150, 65, 204, 4, -158, -98, -62, -186, 10, 127, -98, -10, 125, -139, -112, -4, 160, 255, 204, -178, 67, 183, -20, -100, 29, -200, 16, 13, -210, -13, 71, 71, 110, 171, -202, 2, -71, -201, -9, -76, -127, -129, -56, 41, -6, 99, -155, 131, 120, -76, 184, -111]
550a11j31J96k02J43L93k08k06J12K06k71K41m26J46J03J05p6q3q6P2J79l04R3
572a15MJ57n8J96k68J15k1m6O1j12Q7j10K37q7M2P9l49K05j37K06k1k5M1J00j04
597G7j28j9j0l1j5J86o6j29Q9J60l9p0J24k62K34rj75R9n6K3L9K2j14J04l38K57
623d7K49l83M3L31l33K22n1j02R0N1l8j06N0R6j17j63l4L36k54L01L0q3R8Pj94
648aJ38N9R9l04r4J22p9J90k50M6J43m0m3lJ49j65J13k23P7N4P4j67J17l01M00
673A11L0l9o7on6k1q3J41P6o2j81Q6P6m5K64l1k04j5J4Oo8N6n1J89N2m4r2k01
701a65L9L5P5m5J95o6J16N3j47K03nl17J9r9J60j19L3p7J11j05J72j10Q2n9lr2
727a16J95l08K17j57L36j46j67j9J92l9J56J6j55J6j31lJ58n7J01k48J59J99k90
$$ y = [-111, -242, -46, -248, -105, 288, 80, -126, -14, 192, -79, 162, -264, -118, -15, 90, 14, -69, -155, -83, 96, -208, -115, -111, 46, -12, 184, -84, 31, 10, -36, 25, -87, 0, -110, 127, 40, 82, 161, -188, 17, -120, 86, 65, 40, 81, 181, 77, -51, -70, -80, -111, -126, 60, -6, -135, -46, 114, 75, 5, 129, -133, 101, 92, -83, 16, -40, -17, 22, 44, -70, 34, -304, -47, 202, -181, -138, 193, -140, 82, 31, -71, 19, 70, 32, -74, -24, 72, -45, -208, -242, 94, -160, 141, 171, 88, 186, 193, -1, 137, 196, 295, -9, -103, 19, -60, 130, -120, -74, 69, 29, -14, -17, 132, -33, 80, -143, -66, -12, 62, -105, 12, -289, 111, 141, 102, 35, 29, -27, -48, -131, 10, 86, 24, -157, -71, 5, -40, 224, 193, -11, -26, -12, -6, -74, -18, -69, 120, 172, 128, 36, -165, -126, -91, -16, -61, 134, 68, 184, 237, 90, 293, 288, -29, -10, -109, 51, -68, -35, -112, -1, -106, 66, -44, 38, -21, -24, -116, 79, -229, -12, -169, 167, 21, -146, -165, 27, -12, 144, 160, 5, 21, -110, -113, 45, -12, 89, -159, 0, 199, -91]
750i1K15k14J70p1j79K93j73J53j53J02O9l07K24J43m18L29M0O9k27j08K62j15
772A3J31k34R0j5k2KJ65j71N8J32k18J24Q7%pk6M6p3P8m1l26K25L7r5Q5R7j36
799Fj9K78k46J01n3k56k3K64Q7j60r9m7n0K80k02K30lj32J39p3R1k2j66R6J26
824A47k3P7K1m05K06Kk53K99J9j70N4M2q7m3J68Rp2J35J43k75J35Q3M8k83j10
849a33J37N3J61l96J21J52N6k75J94k96K41j00%M5o9Q4J45J06k79M9j53L57k5
872A75k18K07m26L67j19J93k28J9J07J7l1l9R6q9j69l4J70L0o6q0J28J99j8o8
896A23j81K66k03L9j41K48j69j36K20J35j95j27J87j39J60j98J03M9J73k03L6
917D7j49K08J5k82N0j17K12M8o7N5O0L9j66o2L52Kk41P8j25J04l7j43K8kJ83q2
$$ y = [-91, 124, -90, 80, 9, -170, 123, -50, 103, -50, 52, 121, -186, 38, 181, -237, 92, 132, 201, -26, -134, 128, 13, 144, -90, 0, -15, -37, -35, 130, -41, 17, 149, -69, 55, 142, 142, 135, 109, 155, 82, 160, 119, -207, 18, 55, -40, 45, 142, 6, -13, 265, 19, 120, 67, -189, -212, 52, 139, -21, -120, -167, -217, 63, -139, 91, 88, -44, 95, 22, 113, 91, -75, 21, 147, 124, 201, 222, -183, 23, 25, -228, 71, 90, -80, -26, 16, -71, -114, 54, 63, -9, 126, 269, -6, 129, 212, 260, -23, -133, 4, 57, 218, -178, -57, 95, 151, -124, 70, -226, 15, -85, -85, -40, -109, -25, 120, 226, -53, -4, -157, 200, 175, -43, 164, -262, 105, -14, 179, -49, -30, 77, 94, 63, 24, 120, 31, -138, -172, -2, 28, -38, -118, 10, 209, 191, 123, -58, 208, 5, 44, -97, 151, -18, -154, 66, 201, 6, -121, 66, -73, 87, -111, -8, 41, 214, 11, 47, -102, 106, 121, -161, -111, -228, -16, 32, -35, 20, 80, 119, -47, -109, 243, 245, 4, 82, -43, 61, 24, -119, -91, -93, 90, 8]
943Hk9l4K1K00J31l58K52j93j05J56o9N4J58k92k5K33j87Q6J23J26k38q1J49j38
967e2n3L37l61OJ96j05Q6j99J80J92n5k07k04K22k29K26K3j5J9J14l05R1p5K87
991A19M1l91Q9M18j29j30Q9q0L1J43j87J9K0j87J84k0J76j20J05j23P3j8j02n
1015A5o0j39L29k07j01K70J39J0l60O4j56J53j80l4K81n8J54k67j4J69J63j04
1037F7m0J09l46K64j3j83K41k70K25j8K03k30p6K73qj78J2j57J33PJ62q7P9o5
1061A04l05L3K23j43L26k40l5j8J53r8j17L00j04j14R8J54M7l5k35J38k24q7J30
1084d9J99j08P9j90n2Q7L34l60j5J72qM4j77l6J84k80L56k73J76m4j47J79j49
1107g8J47J9N6J06j74j95M5L60n37K21j8O9j18M0J26j04K75l50O2R3K20n10J58
$$ y = [8, -21, -55, -34, 166, 297, -61, 191, -2, -107, 49, -20, 34, 192, -100, -125, 108, -79, 7, 130, 256, 18, -63, 86, -52, -105, 232, -129, -123, 73, -32, 54, -145, 35, 227, 172, -35, -239, -17, -246, -20, 3, -12, 7, 121, -184, -93, -168, 119, 160, -231, -142, 276, 147, 17, 106, 26, 57, 200, 13, 32, 52, -135, 49, 29, 205, 85, 190, 67, 140, 122, 20, 15, -45, -184, 145, -62, -163, 107, 246, 256, -104, -40, -196, -43, -223, -257, 24, -34, 120, -147, -161, 8, 171, 67, 27, 136, -210, 54, 41, -142, 99, -171, 54, 36, 239, 9, -67, 206, 198, 20, 32, -125, 8, 15, 177, 90, 169, 104, -201, -168, 55, -88, 238, -2, -37, -55, 98, 0, -117, 183, 79, -35, 63, 217, 264, 229, -6, 132, -92, -179, -49, 150, 42, 121, -69, -121, -34, 300, -60, -75, 97, 89, 133, -44, -80, 104, -176, 180, -93, 83, 39, -108, 71, -78, 69, 88, 144, 250, 76, -119, -74, 286, -251, -30, -48, 21, -97, -57, 69, -35, 240, -110, -48, 45, 265, -245, -87]
1130h7K8K57O9j70k48J30l6K42m8j35J72k85J20J0o6J04j26M2m7K28l09R6N1r4
1154a02J40o6R9j03M2N0O2j60k00M97k52m3J79j58j01P4l3O7j98L43l00L80k60
1177d3k08L02j83J89l9j32K8J2N3K57m74L04Lk1L5J30j03k8o9j41K25N6j40n4
1201d1j15K00N7m97M92j6J66l12J79M0q2j92K73k31j7J73q8K1k5k3q3N5J51j38
1225e3J52r9J49j84LoJ79p4Jl9j54K05l51K90j1l71J64J69O1L3j04l8K42j29k18
1250a83J19J52k4l38J3K94j27OJ71J09l28Q3J63n1j39O6k0J1k7J95k36M9k5J8
1274d9P5J7K4l3K1j36J47J9o8p9k9J03l5rp0M0j7n8P5J68J8L5k08N4j65N6L08
1301B04k91L6J57k36jn2L36p2k60K65j27J20L1l15J74j10R0J24j70J12P8k8j53
$$ y = [-87, -59, 198, 267, 97, -151, -21, -57, 185, 137, 2, 174, -111, 9, 19, -47, 57, -69, -27, -74, 154, -155, -59, -8, -102, 38, -28, 71, -32, 10, 60, 122, -38, -238, 259, 7, -36, 143, -15, -116, -42, -75, -8, -206, 137, -163, 217, -43, -251, 51, -132, 57, 18, -114, -86, -74, -21, 236, -238, 66, 69, 48, 83, 213, 110, 82, 13, -128, 97, 153, 13, -41, -156, 44, 101, -396, 96, 80, 246, -66, 113, 153, 71, -121, 152, -79, -96, 77, -11, 10, -15, -38, -121, -66, 85, -53, 99, 0, 149, -35, -32, -38, 141, 67, 68, 29, -125, 80, -271, 19, 8, -363, -199, -30, 31, 64, -40, -78, 164, 35, -183, -64, 88, 64, -274, -261, 33, -94, -88, 83, 192, -136, -53, 110, 59, -80, -14, -34, -23, -50, 145, -91, -42, -67, -49, 26, 43, 67, 34, 55, -81, 66, 85, 17, -62, -91, 12, -23, -32, -102, -62, -79, -137, -62, 106, 124, 159, -49, 5, -160, -104, 204, -87, -51, 106, -130, -131, -183, 153, 81, -179, 86, -41, 79, 110, -205, -31, -141, -51, 73, -97, 15, 93, 65, -88]
1324h8K27q9N7k44K89j55q1j6j9J92nk45K14n6K77j73J40k76J92j37o5K6n8J00
1348GPr3L83k68L1j7j81J40O2%qk50q6M71m03K03j89J91j40J02p9K36j57j84J90
1373c2k0j33Q7R1J4K87j50k93J77n1J37o8k28K60j37K62m50K46J86j42j57K82
1395A68l83J37K03J57n14K82J4p2K4qP7k10r8K53M8J4j46J28M8k21J08J3Mr7o2
1420a33K60J32l34R8j80J62n1k0J00Pm5LM9k36L12j84J54j36p8K01r6l9j48K8
1444a74L16j5O6o8j61q3K06k42J62J70j90k4J57k33K86k57O1K34k61r1r1K75j64
1467a21J57j72R3j37K0K11j48j35L41P7j9k42N0q0K76j56LLJ9m1j01J64J04k61
1491i5k1J84M9p0j75J64q7K1j16M0J5P6j50L30j88n4J92j0P8l75J80J40l06M2
$$ y = [-88, 139, 50, 107, -137, 152, -3, -84, -100, -119, 73, 68, -177, 37, -19, 258, 85, 225, -51, 141, 4, -61, -35, -93, 7, 14, -79, 304, 36, 67, 50, -131, 9, 71, 71, 63, -187, -273, 198, -205, -2, -191, 0, -140, -38, -117, 119, -38, -222, -32, -52, -185, -98, -7, 7, 294, 144, -149, 28, -23, 114, 46, -182, 78, -59, 203, -247, -1, 185, 43, -114, 168, -215, -78, 125, 282, -232, 50, 64, -8, 16, 8, 85, -125, -223, 30, 78, 92, -54, 74, 122, -99, 9, 22, 26, -71, -133, 127, 259, -75, 23, -157, 5, -46, -66, 34, 41, -4, -1, 48, -188, 124, -60, 94, -42, -120, 81, -15, -54, -202, -174, 142, 127, 193, 125, -36, -119, 87, -155, 7, 177, -13, -37, 120, -113, 173, -84, -23, 211, -50, -141, -232, 43, -121, 36, -136, -43, -180, -160, 51, -97, -232, 109, 186, 167, -75, -25, -105, 171, 15, 18, 21, 40, -1, -102, 62, 166, -95, -116, 68, 117, 47, -128, 36, -51, -30, -146, -106, -91, -15, -165, 165, -23, -77, 115, 105, 183, -192, -12, 128, -178, -136]
1515a36l0K37q7j29J1J91J08j38j13J68Oj50K82k16Oj01L6J2K86k07l7M3q4L03
1539B61N3l27J11K9j90J42M2k3o5N2k01J53L3j9m3j2K68m71LK86Jk00K79l03J27
1564a4k41K81l1r9P6J7J47k81J27k8J11P0N0p6k07M9J99j03K5l9j39Q1oM9P1M7
1590A36r6n7K90k99J38m3K4j32J71k02j1P4m7K51J62l34j22J72l36K03Q2j8L0
1613C6j94J37j70lL18k11J90On2K6l13K38Q1J67k63j03K95l64M15m74K69K07l26
1636h8L19n72L85J16j44M1k39J46K8J0O2o0j7k48M43k19o4OJ36m8O3K00n0l3j66
1661Gr8K62l25K03m3J78o9j51kn8N1m3J49M3j44j25J10J35j80j2O7K71j62j09
1685d5J79k52L33l68K9L1J39M3J3k08J54o5O8k26QJ44Q9r6J55k95L20k25L68n73
$$ y = [-136, -166, 71, -16, -145, -134, 57, 165, 27, -86, 82, 88, -62, 220, 4, 10, -91, -55, -43, 243, 36, -1, 42, -42, 261, 314, -13, 98, 127, -63, 79, 121, 98, 33, 85, -116, 37, 70, 51, 8, -4, 264, -207, -204, 82, 83, -117, 162, -141, -14, -255, 26, -5, -104, -28, -11, 136, -145, -18, -46, 65, 135, 185, 109, -98, -49, 150, 47, 72, 33, -106, -25, -31, 18, 89, 136, 40, -17, 273, -26, 112, 69, 93, -39, 132, -70, -81, -7, -54, 197, 359, 25, -97, 75, -261, -58, 24, 6, 36, -158, -21, -191, -194, 124, -87, 103, 109, 57, 83, -230, 8, 89, 256, -7, -110, 185, -179, 236, -238, 31, 238, -88, 231, -341, 44, 160, 16, 57, -182, -36, -8, 2, 64, 4, -13, -261, 182, -37, -101, -95, 41, -7, 56, 256, 206, 173, 7, -91, 171, -154, 49, 6, 184, 115, -36, -38, -96, -45, -88, 61, 104, -40, -165, -55, 80, -100, -112, -45, 226, 64, -45, 134, -118, 215, -153, -124, -93, 46, 89, 102, -106, 48, -17, 51, -175, -167, -23, 66, -30, 125, -170, 150, -75, 293, -280]
1709b80J92O5j00K68k19J59K16l23Q9l74K14R1K75m9l03J45J23l98J67n8R9Q0
1731G9j73oK55k85K12R4k87J58m0K5K9L6J16j20j64l0j51J92O8j22K26q1M4j91
1755a16J43k6q6J79l85M79k48Q1K41k91L42k36j76j70L18jj10J25R3m3n7P7m0
1778I3k17o3J63o4L3n9J36Rj4j8M1L10l23j85K15P4j34n7l0o3J80J66k93J65j60
1803i5K80N4j05k35pj8R7L5J79j18j69pJ69M4l9k86L65j95K06j46P8J7j41Jn1
1828h7J88k1oJ80j38N5q2o9j40K25o0l4Q6p0M1r9Jj4N9j49J15l2q7P8K12p3R1
1855A70J0j80J08k32K3O7n7J05j77K65n7P3q2J50r1J23k49l0P0j85l0J58M2k2
1879b8j40L20n6O2m81M07j23J01p2L55j65m2l40N2L18l31J07p0J46m6pm7j27K24
$$ y = [-280, -88, -23, -123, 145, -74, 85, 301, -22, 67, -307, -93, -2, 273, 224, -79, 66, 189, -209, -42, -100, -1, 79, -94, -100, 155, -130, 82, 176, -111, 47, 7, 32, 61, 97, 213, 93, -71, -101, -252, -60, 8, -114, 112, 31, 75, -116, 27, 1, -85, 94, -291, 188, -60, 21, 262, -29, 313, 77, -99, -269, 49, 48, -62, 63, 156, 113, 56, 133, 93, -124, -187, -24, -88, -55, -114, 22, 31, 17, -1, 40, 350, 27, -158, 57, 131, -3, -60, -90, -153, 27, 193, -100, 65, -95, 185, 239, 134, -101, -108, -126, -29, 6, 185, 67, -102, -109, 60, 104, 65, -221, 144, -51, 155, 9, 87, 104, -37, -36, -87, 101, 80, 74, 254, 116, 171, 89, 20, -120, 105, 45, 11, 97, 27, 68, -31, -30, -44, 15, -134, -19, -51, -138, -60, 152, 79, 170, 180, 0, 108, -124, -101, -34, -91, 14, -163, 102, 45, 118, 36, 186, 95, 218, -31, -61, 9, -176, -206, -48, -6, -28, -168, 152, 96, 158, -323, 84, -39, 62, -10, 345, 180, 138, -202, -150, 168, -163, -56, -126, 20, -26, -33, -80, -207, 17]
1903A7J30j60J65k28K5K2J49j64o5J17R3J88l09l3K52k1l83K16K83m03N9K9j03
1926a24M8J16nr7p7P8J51k8j84m1J85k41K54Pl9mO1J26j71q4j18J36Q5K9m1N5
1952G7j62J93J57m07J73J9j28J38n1P4j95J24Q4j61J70k16R9J57Q1k41j78K64
1974G1J9n1K0l0%J10m1k91K21m6K74k31J2k60L70k56K01k4m3j16J17L7o2K04o
1999A99l26L39j76M0j6J90k77j96J22K24j48j45O9o2K31j99K24j42M6n6K24k55
2021i0K43m03K74j8m6J2Q9M1o5p1j57J95k34J02J20j3R0j53j41K83l6k83L60N0
2045A49k57o9P1K69j78J37l10Q1m5J89r9O2n8N8j06J49O5k5J6j38J94k85J09J82
2069A61j28oM4j67R3J38k10l3p0P6O4R9J5rJ0L65o10J88Q3R8j09j37J96k10K81
$$ y = [17, 147, -13, 152, -76, -51, -29, 120, -44, -109, 8, 101, 289, -20, -53, 199, 178, -205, 11, 294, -109, -50, -21, -124, -76, 40, 35, -62, -139, -61, 90, 62, -122, -163, 22, -219, 35, 42, 3, -1, 60, 186, 15, -69, -187, -51, 34, 63, 22, 77, -85, 108, 265, -142, 31, 50, -78, 60, 9, 83, -112, 12, 96, -65, 105, -111, -12, 145, 226, -15, -193, 71, 90, 39, 59, 29, 29, 139, 98, -193, 28, -18, 256, 25, 37, -223, 147, -109, 92, 68, 25, -91, 26, 63, 1, 205, 199, -127, 212, 36, 76, 60, 250, -27, -223, -101, 123, -25, -170, -101, -163, 68, -131, 93, -49, -3, -59, 165, -90, 153, -250, 24, 6, -40, -28, 61, 102, 37, -34, -191, 4, -230, -128, -8, -21, 69, -84, -225, 58, 22, -261, 99, 149, -108, -177, -106, 163, -15, 122, -188, -107, -152, 37, -62, 0, -58, 0, -106, 43, 108, 83, 99, -39, 155, -130, -21, 161, 33, 27, 71, -96, -3, 135, -75, -108, -178, -102, -38, 61, 76, 67, 77, 442, -168, 20, 103, 201, 92, -45, 151, -59, 222]
2094B22N2j33k82K50j04j0N8j30J1O1j4j31K93l34J96j2P5j36J55P1j69J22j09
2117Bk41P0N1K37k27q5L08k20L24k51L6N5m8K84j73j58j3j29N65l56P8n9ll14
2141b67L55j12m6N3j25j7j23K57J16j02m2K15O4k68R5j71J17n7n4L58j63l8j14
2164f9J03k16J15Q4k3j59J57K4j54J90k01K43j60J03l41J87J56n9j54R2R8q9j72
2187b45K44J45l19J49l6M2O4j03K37j61kJ80k55k7J0O0q0K20k8J7m53M86l79J22
2211a12J14O3N5K4nj77k9K57j14Q2n9qj22R4j62r6K69J51o0k72J98j16j15K94
2235A54j61l56J30L67k10R5R2l7J5j6j30k55N38k21j53K76k82Q2j45J60l9K34
2257A38P5j67J55k98J11j23J16Q1l6O5l02J45J81O0j90R7j74P3n1Q1k18M9J0k2
$$ y = [222, 274, 141, -141, 109, 5, -5, 53, -77, -66, -5, -19, -150, 143, -191, 5, -7, 68, -68, 87, 158, -11, 111, 2, -239, -169, -118, 119, -108, -193, 115, -105, 219, -32, 4, 59, 11, 295, 122, -36, -49, -178, 387, 31, 109, 50, 47, -267, 88, -24, -70, -17, -142, -159, -282, -25, 91, -11, -53, 162, 226, -42, 53, -118, -1, -58, -112, 246, 83, 45, -69, 34, -182, -67, 17, -6, -165, -8, 16, -138, 52, -149, 94, -66, 37, -304, -117, 39, -20, -174, -82, 16, -73, -245, -1, 144, -175, -26, -62, -20, 44, -59, 178, 17, 15, 195, -60, -87, -77, -17, -97, 123, 95, 112, -341, 145, -234, -112, 2, 65, 120, 144, 139, -38, -67, 190, 76, 158, 99, 91, -31, 63, -99, -195, 74, 225, 165, -107, 91, -25, -140, 154, -7, -363, -233, 134, -76, 19, 111, 74, 89, 73, -57, -312, 226, 5, -148, 128, -154, -72, -217, -57, -96, 138, 213, 46, 201, -97, 14, -109, 7, 88, 52, 117, -185, -40, 141, 201, 11, 108, -66, 7, -44, 37, -181, -132, -122, -144]
2281a44P2J33j30j90K10J22j70K74k0M9j92j8N5J16k84J43M6j22j5r9J84l0j16
2304a26J93j5l7N5J94J08m06J79j58j7k59L29J00M4m60L46j16rm2R0j74M0J15
2327b6J45j96J66r8n9P6R0k40M7M6K00k52K5NK33l90k0K98m3o8k41L60j47K1N0
2352a8q8K5K69n7Q5k01n0K4o7J8J1n4J4J41M8J23j84j79K68m4l1k0p3Q3P3J98
2378C14o24N20k02J29l23L9K08o0r9M55n4n59J66L27k14j34L6P8N7l4m7j16K94
2401A57k11m5J64rK0j43P6PJ92k75N4j14K1m6L4N0J59j66n6J3L22l32L14k52k5
2426i1J79j30%j64K87J25l88j6J52r1L17m80M90k87J49l20L27k05J93N0k7J60
2448B30k88J62j54m8j18J85p7Q7j16J32M6J57n4j63J7J18j63l6K50m56K78j40
$$ y = [-144, -72, 61, -69, -259, -49, 73, -97, 177, 157, 206, 14, -4, 51, 167, -117, 26, 72, -50, -65, -164, 20, -10, -126, 67, 52, 15, 70, 264, 372, -34, 145, -13, -30, -289, 40, 140, 184, -276, 70, -46, -55, -97, -7, -181, -141, -26, 119, -77, 89, -9, -68, 8, 98, -142, -95, -49, 151, -101, -76, -71, 162, -228, -248, 50, 7, -61, -302, 58, -89, -68, -18, -106, -81, 188, 131, 216, 15, -35, -11, -78, -60, -49, -103, -89, 52, 100, 223, 39, -140, 128, 84, 53, 33, -40, 43, 116, 314, -310, 210, 8, 137, -186, -147, 61, 1, -98, 357, 303, -256, -90, 237, 23, -111, -75, 3, 60, 26, -21, -137, 157, -54, -99, 65, 56, 76, -67, 9, 16, 208, -67, -13, -127, -106, -152, -118, -68, 91, -75, -131, -118, 204, -128, 186, -66, -91, 88, -42, -42, -206, 81, 206, -182, -198, -46, -137, 180, -300, 190, -97, 52, -268, 59, -146, 47, 97, 70, 230, -58, 104, -50, -98, -216, -31, -108, -21, -137, -5, 41, 198, 144, -19, -2, 116, -47, -83, 167, -289, -11, -151]
2470a51K10n3q8J04J58l72L97q3j19n1j66K87J00j36j70L15r8l47RL58j25r8K55
2493A36J53r3l68K91k38J55J03n30L42p2J11M4j8j7J21r1J49l15J15K10k09J08
2515H7K8k34k9N3K04j25o2qL41l38K63k46J38O6p2L0J59m35J73K9j75J12M6q3
2539g8j00L12q1j7q5J7J86j37p5m6q5K87N6k37J51l2k2Jj76L37l03J06N6j74K43
2564A04j7j1j11j07K21j2%n9j37k0J54K16k69J15j82k0K19n2K18j51n6j43J84
2587H4k61k1J25L16l44P9Q6m6n0j28J73j65J10J87j37m5Q4j25J57n1j94K34J04
2610A72q6rk39J66k98L27J84j91n4k48K39PK6M5J61l19j35K37k9J87N8k02j97
2633a98K54l95L01K96l66J00L7n2J49j54p3j7J57q9R3p0j31L45k18J76q1k97k67
$$ y = [-151, 59, 6, -82, 22, 180, -192, 205, 122, 3, -48, -214, 73, 173, 37, -133, 182, 84, -263, -254, 104, -21, -119, 136, 289, 196, -172, 119, -119, 36, 139, -391, -49, -121, -10, 34, 16, -1, 120, 29, 178, -137, -22, 188, -21, 87, 115, -119, -148, -95, 109, -16, -78, -86, 255, -83, 180, -66, 72, 138, 66, 96, 255, -180, -7, 22, -153, -41, 5, -78, -178, 134, 53, 36, -49, -32, 154, 17, -58, -104, -189, 98, 154, -83, 68, 36, 14, 15, -161, 176, -127, -21, 35, -139, 104, 87, 76, -35, -142, 79, 67, 67, 8, -129, -149, 5, 221, -48, 67, -115, -135, 84, 32, 250, 99, 43, -100, 84, -177, -198, -73, 243, -101, -22, 64, 18, -32, -160, 13, -152, -42, 145, 8, -37, 47, -78, 79, 28, -166, 68, 172, 86, 77, -162, 4, -294, 33, 217, 26, -28, -276, -37, -30, -4, 41, 202, -117, -252, -15, -44, 143, 201, -1, -198, 56, -339, -38, 258, -108, -8, 29, -23, 126, -28, -101, -118, 39, -50, 43, -27, -158, 187, -31, 145, 64, -233, -500]
2656e00M38J63Mk12OK82k94J48N0J4k93L28m60L17J24k13k08L42RoJ3l9K9o5K10
2681A87j53J20l09N6j27L47k11J45k46J70o2K92k66J17Q5m0k03J86k03P0M4p3
2703g4nJ85K7k45L42r8j73L12l99K67m33J68L09Q0k20l3j63L30k88J71q5Rq9m7
2727a52L11j27j81R1K1O9Ok17L77j40j74P8K15j13l9O9M1j60J20k10Q6K59j68
2750F2J0r7J86o5K9o6q7J44k52J5J35r6J47L0Kk75J69o8J14k23K45K06l63J97
2774I9k%J09l45K55j81n16P22J12k03l2j34M14m85J42J5q5J15l15K44K30j34j3
2797A2K36l36K13j92J42j48K11j87no1J21K5j16J97m34K00J88q7Q5j57J19P7j42
2820c9m7J57j56qN0l9Nj00J79J6M7k30L05p7k78L63r2Rj43J63p2k40j24N14q8
$$ y = [-500, -62, 101, 105, -107, -101, 181, -113, 35, 85, 99, -194, 134, -326, -9, 115, -98, -306, 36, 45, 39, 52, 13, 42, -23, 187, 34, 154, -155, -99, -226, 121, -90, 55, -191, -21, -83, 209, -57, 60, 145, 105, -98, 88, -115, -45, -1, -74, -79, 106, 133, -112, 230, 132, -41, 271, -128, 139, -294, -126, 183, 263, 43, 10, -153, 177, -111, 60, -25, -16, -105, -152, 159, 32, -149, -58, -37, 32, 38, -179, 198, 58, -116, -38, 177, 64, 25, 94, 135, -25, 95, -115, -29, 230, 62, 72, -25, 161, 96, 125, 59, -28, 116, -136, -121, 14, -82, 65, 95, 97, -178, -9, -77, 37, -186, 59, 265, -98, 99, 97, 97, 206, -139, 116, -65, -581, 141, 253, 50, 18, -116, 298, -187, -45, -30, -115, 0, -315, -71, 159, 25, 12, 248, -88, 125, -67, 75, -73, 138, -49, -54, -115, 6, 31, -85, 112, -322, -122, 66, -21, 64, -93, 26, 103, -39, -86, 71, -85, -93, -43, -82, -77, -177, 2, 18, 65, -165, 140, 63, -215, 148, 56, 65, -78, 85, 13, -227, -351, 163, 75]
2845G5j24L52m09m4m8J74O7k04J51P5j75J4J04J25k52J78p9K9l06L27N1p0L5O8
2869A14J6k54J18J0Q9j05J01N5j23r6PJ31J4k16L10l95K51Rj42O7N7k6J37j86
2893e7J53J13k67k72M08J08k18j63o9L46o6o3q3K64r2P0j41q0k0J40m1j24J14
2916d0n5Q8mqq2m7N5M1N3m6j58J12K2J74k3m9LQ0j24k34J50k9K07j29o0K25n9
2943F3j23M6K20j88j67r3OJ34J73j46J3J25j2j8J32l39K54r0N8qJQ2k34j09K76
2968E6r8J1j9J70k72R1o0J10O4k10J67L1K27k87j45K06K15l06J60J09l48J85k55
2991a98M9L78j58k38J06p1N4j48L17k28J03Q4j30Q5N7k11J10J69k88K37j72L3
3013f0J17J26l69L83P9l35k91K27q9J23j1J22J38p6n4j23p7K17k31K26p1J47j72
$$ y = [75, -49, 303, -106, -150, -198, -24, 43, -161, -10, 65, -110, -96, 8, 133, -119, 59, -20, 9, -297, 30, 81, 11, 46, 114, 130, -124, -6, 4, 93, -12, 89, 144, 21, -75, -68, 63, 77, -139, 171, -224, 27, 36, -106, -39, 18, -8, 129, -57, 96, 209, -58, -330, 78, 186, -32, -195, -264, 82, 16, -47, -130, 134, 42, 112, -29, -109, -129, 11, -30, -154, -40, -95, -7, -11, -19, -101, -148, -93, -52, 1, -45, -203, -91, -69, 105, 82, 33, 36, 116, -8, -242, -92, -121, 86, -43, -103, 122, 63, -60, -14, 206, 18, -149, -242, -236, -102, 71, -75, -62, 63, 51, 33, 165, -174, 80, -10, 48, 40, 41, 123, -111, -220, 56, -42, -31, -50, 120, -152, -61, -121, -11, 53, -157, 10, 41, 268, -19, -164, 42, 257, -49, 111, 220, -128, 57, -198, -149, 229, 71, -167, -61, -132, -78, -226, 91, -137, -34, 50, -80, 5, 62, -149, -39, 130, -158, 79, -93, -60, 57, 183, -186, 197, 276, -59, -350, -123, -212, -89, -100, 22, 160, 84, 30, -93, -170, 47, -184, 42, -29, 118, -54]
3036e4J39j69j90K64k07J24J88J35j63oj16M25l46K24m30K24j09J97Kj68j15L02
3058A51j23j14J13j65J54J5P4p8j98PL27j87K56j4m3j28n1L5J69j79k16J97K02
3081B04k38J54k56J19J93k88K86jk45K53j04J1j0k26L6J97j28R2j73J16o3o3K69
3104A35k13N0r6R6K1l7O7P3k22j22J78J10l8j6j70o7M09k92p9J57LM5k40L93k86
3129a41nK21j50j94L07J26j89M6L6j6R4r0j01K15k08L62n14J53J49r1o1LJ05J06
3153A63p6l02L41l81L04J46l16K15k70J72lk9R6K03l52J85j4j44k3K8j9K46j6
3176A54k99m8K11j91L07k8k24J93k0N6m61J80K86j82o1J15j27K01j90J31J20p6
3198D7j98J75p7n2k22L46k6M3O1k61J94k31M86l29j3K31J2k46q6m3K57Om1O3O3
$$ y = [-54, 85, -84, -274, -10, -217, -93, 95, 230, 67, 61, -55, 370, 24, 248, -182, 42, -67, 130, 132, -36, -151, 151, 28, -86, 27, -138, 16, 31, 105, 27, -171, -164, 163, -24, 232, 218, 175, 47, -4, 31, 200, 21, -195, 2, 204, -34, 120, -136, -17, 176, -112, 174, 173, -72, 181, 77, 88, 78, -148, -112, 85, -43, 49, -124, -8, -71, -134, 135, -78, -28, -124, -28, -7, -44, 23, 96, -126, -248, -70, 40, 2, -14, -184, -251, 158, -134, -213, -56, -53, -8, -248, 145, -141, -146, 75, -75, -269, 38, 164, -25, 21, 57, 41, 135, 45, -56, 159, -49, 313, -201, -48, 101, 10, -51, -48, 57, 163, 87, -215, 126, -255, 49, 195, -121, 94, -176, -4, -7, -36, 60, 263, -89, 96, 82, -62, -85, -57, -76, 170, 154, -145, -193, 18, -173, 134, 106, -118, 75, 55, 111, -350, -170, 116, -66, -127, -12, -139, 62, -128, 3, 123, 47, -151, 24, -53, -105, -327, 19, -7, 36, 97, -164, 30, -201, 285, -44, -57, 174, 186, -60, -146, -189, 68, 74, 33, 96, 159]
3223A59n4n9j91J96J68l95K16o0J34k23K20%j98J40l11K47J4Q6j63r7J08L19m27
3246a71J26j57j01K98r2P2Q2p6R7Q2kj24N1p5o7Q5m2J03qj85l52N47k30j22L24
3271F3j04o5J86l81o0L58M1K4L7j32n6K69o3m51N00j8Ln8L3k08K1n4j10J0J21
3296i4m5J91j53NJ58o3L7J47l13l1R1P7Qj21J00P6p2R1r4q7q4P7n5k5J06O9N8
3323E4j51J15j99N8J34m0m2L8J13Qj42J60j52Q0j4j46J84j61p8J55J59r8J17j12
3347D0j10r9K39J11k29O1J8p7j69J56M6NJ0q1Q6M8k00j44K13K21k40J24l25M43
3371A47k16M1j11K40j71n2J99n5J49j22M2r3n0om9Q8J53j83L6P3j30M3P4p9P7
3396D5j88M4K55%j3N6k08R3k20J25r5J03J4j71L0L6L41l70K29j02j2N0J40J75
$$ y = [159, 105, 46, -145, 51, 219, -176, 40, -20, 114, -109, 111, 111, -87, 53, -258, -11, 3, 89, -74, -171, -63, 256, -171, -45, -202, -303, -5, -97, -25, 57, -19, 78, 160, 158, 34, 85, 10, -57, 28, -14, 89, 81, -104, -456, 91, -139, -261, 63, -41, -106, 80, -301, -361, -3, 38, 62, 99, -33, -89, 180, 117, -334, 166, 148, 151, 93, 126, -82, -61, -115, -225, -215, -94, -139, 52, -101, -96, 62, -1, 36, 183, -130, -161, -70, 7, 15, -106, -6, 70, -2, 89, -5, -92, -176, -99, -154, -179, -73, -4, 54, -97, 18, -181, -123, 11, -29, -71, -33, 80, 88, -54, 106, -46, 34, 20, -126, 58, -103, -181, -26, 133, 35, 152, 40, -70, -169, 70, 181, -48, 13, 31, -46, -215, -59, -13, -8, 2, -79, 7, 55, -145, -289, -76, 145, -95, 29, -296, 147, -69, -28, -139, 101, -70, -122, 77, 22, 171, 49, 91, -2, -52, -58, -107, -19, 134, -49, -13, 60, -70, -27, 47, -32, 45, -143, -99, 156, 156, 143, 199, -9, 84, -136, -11, -106, -3, 11, -160, -130, -94, 247, -123, 106, 4, -8, 42, 182, 357]
3420C57n61J60j48K56k96K80J8m4M6N1k59J78k7j6J23J14k46q7p0J61PK16k87
3443g4N6L4o7P9k23L11j20n2J03m1j13K03J22k6l62L94k25L1J12k17J23N2k66
3466a66J22L39l31j56K78r1R7k6K57k63j23O0k50K96K5P1j1J03m04K26j43L75
3488B85k92r7M05o3m80K19r0J48r1J44k54K94K0oR3l52j07j22M47j27O7j15R1
3511A7Q4J23k71M5k7p0K07k84J71O7lJ04k45r3L14j40J54l76N1J80N8R9j28l4
3535COL6j06R2l97L70j49K50J42l10J08m8Pk2J8j31k8K31k58K27J56l60N69n74
3559a68j51K99J73o4Jj21R5J15k85P5J28N2k09m2L45j83k44L50R4l76Q8j57O0
3582a25J45N6k8P1j7k03K14j03j5j31P7NM3J20o6j71K34o0pl5j11J61n4Mk31J81
$$ y = [357, -204, -44, -192, 64, -232, 48, 66, 22, 68, 119, -140, 38, 11, -5, 118, 232, -14, -101, -171, -10, -3, 213, -74, -18, 16, -51, 28, -195, 116, -4, -56, 47, 6, -107, 96, 218, 192, -170, 224, -1, 30, 142, -75, 48, 100, -166, -44, 295, -36, -192, 86, -5, 92, 66, 323, 60, -63, -3, -253, 43, 68, 139, 128, 231, -173, 53, -90, 285, -7, -104, 301, 238, -242, -23, -113, 35, -56, 88, -166, 128, 148, 142, 235, -117, -224, -346, 101, -26, 41, -74, 17, 101, 224, -47, -2, -29, -99, 108, -176, -5, 62, 59, 163, -82, -175, 139, -1, 153, -223, -172, 8, 66, 165, 37, 3, 9, 45, -61, 31, -366, 4, -145, 105, 247, -63, 45, -3, 4, -18, 0, -131, -159, 72, -186, 41, 197, -163, 406, -168, -319, -20, 153, 89, 90, -31, 64, 179, -106, -31, 97, 149, -60, -102, 243, 60, -184, 166, 260, -116, -28, -185, -125, 20, 76, 48, 119, 102, -101, 113, 10, -5, -136, -59, -54, -11, 109, 43, -128, 106, 46, 39, 4, -107, 54, 0, 4, -227, -46]
3608d6N5k00N7J68o3J02M9n7J49m29J20P4K42k10k8k6K30j07Rk36J89P5j19J12
3632A10r2J5Mm2J7j59P8K50j29k06M08m15K40k81R7L24k27J68Q5p3j86k6k38K63
3656a5R7n1j82L66k07k2K37m7k91K66j85Rj08K03O0k01KJ47j17q3K25k1r7O8k88
3681b35K40R5j44jr7Q6R1OJ44k70lJ96k47K49k01J78n7n9J31K02j00j46Q5j87
3705d4K27k15J77k33K06k28q0L43q8r2QQ8J7k13J21o3L09l68l9J34lO6n4O8k56
3730b12K25K31j03k27j2J34r4J63Q6j42k59N5J50m0K4l5J03k25K8O9qL25k74Q2
3754D4j61m1Q0rl9K76j15O7r0K10l41J25j11N8j33J12k60K03k76L70j79K60L1
3777H1k26Q2J96q4q3N3j8L11m46J64k6R4l09K79Q9L1j88p9J82m1k35J53j36P0
$$ y = [-46, 9, -191, -134, 34, -29, 73, 122, 65, 214, -215, -95, -21, 221, 11, -17, -43, 187, 80, 89, -147, 42, 117, -2, 110, 18, 33, 37, -5, 12, -147, -69, 181, 52, -154, 254, -161, 79, -202, -105, 219, -8, 160, 245, 172, -14, -40, -278, -15, 82, 31, -151, 215, 8, -14, 223, 176, -115, 151, -34, -25, -133, 70, 130, -71, -69, 78, -39, -122, 103, 82, -15, 53, -235, 5, 100, -44, -45, -142, -56, 35, 41, 185, -85, -88, 108, -139, 110, -91, 87, 30, -29, 102, 304, 204, 58, 143, -44, 183, -32, 145, -88, 118, -110, -190, 153, 65, -27, -19, 69, 86, -127, -6, -69, 240, -128, -167, -33, -36, 30, -24, 44, -212, 13, 244, 141, -86, -98, 36, -58, 105, 191, 49, -210, -155, -5, -45, -21, -56, 47, -178, -150, -81, -89, 236, -38, 44, -117, -158, -78, -87, -126, 150, 35, 102, 12, 222, -119, 6, -105, -47, -180, -68, -328, -125, -401, -31, -210, 50, 81, -145, -63, 133, 49, -34, 19, 1, 312, -134, 30, 4, 98, -211, 68, 157, 188, 0, -79, 103, 62, -173, -20, -156, -86]
3801h6J06J15J5j11J06j9o6j37j28J08K35L2l30K80Q4n4J3j20n7J50R4k49J25
3824A06r2K81l48pJ49lj39R5o8L2J11m4j12m5j78K49J86j37r7O0L5l50M09j46
3848e3L30r9l1j39m62N35J79k97j5p0K00P6L7k6l60p1K34J0k60K71j04P5M09m31
3872f2%r5L46q3n0l14J66O1l7L9N6r3J29j26J36j61J1O2J17O1l00J14n2K13m30
3897b92J45K74j06R9N0l16K88j75J03k08J63j02Mm3j6K30l4j61m9L2J41j45QL64
3921B54k85j80o4K67KK88l57j06K50k47J6K47j21L9k29K16J76j26n1M9l4M2j22
3944g6J80Qk61J11J5o7j44J28j4O0M3J02j64J23KP7l5K9n9p4j69K56k4j07J98
3969A38j72J85J04m15q7k3K72J36k3k44K42l8k6J06l01Pq5K96j15P1j25O5Q7O8
$$ y = [-86, 20, 135, 150, 39, 145, 126, 60, -77, -205, -97, 138, 170, -160, 120, 204, 150, 163, 43, -14, 136, 230, -19, 106, 14, 295, -53, -60, 89, 86, -53, 42, -26, 6, 117, 73, -39, -84, -262, -13, 173, 36, -61, -1, 34, -316, 93, -53, 277, 178, 147, 8, -454, 81, 260, -37, -52, -122, 78, 154, 191, 165, -195, -266, -32, -22, -282, -11, -115, -40, 369, -62, -62, -157, 189, 106, 56, -258, -92, -31, -68, -29, 27, -66, 63, -63, 73, -88, -77, -15, 102, 163, -137, -23, -75, 138, -292, -147, 127, 21, 120, 170, -146, 142, -33, 70, -138, 25, -77, -73, -116, -132, 98, 64, -97, -146, -114, 27, -118, -110, 254, -31, -211, -275, -8, -6, 282, -75, -181, 69, -178, -162, 85, -36, 3, -226, -10, 166, 40, -11, 38, 4, 46, -76, 104, 112, -149, -38, -23, -90, -234, -106, -120, -60, -17, 85, -79, 44, 46, 123, 88, 117, 58, -16, -185, 71, 47, -60, 138, -34, 151, 255, -160, -247, -270, 2, 138, 115, -129, 113, 75, 49, 155, -146, -139, -224, 72, -43, 28, -97, -32, 55, 123]
3993A23Q1k41j28J77L19m56j67L17K8l7M9O7j66j36J95j57K30N3j32Q4n0J00k45
4016i2K05P2jj12p4R4k12N4L30m20N8K02l19K69J98l15L86k97j73K45j08J13j17
4039a4J10j88o5J54J09k52K41j47Q0J09l29l9K28J39k94J61r7J41j06l2R9j00
4061i2oN2J75k45k8L45l65R6K19k65K17j0q9l1J96j04l60Q3j2J36Q1M0l8k80L56
4086G1p4N9jj20P1k27M29k98J25j7k27L29j66l7q4J90R4J13m54K05J56j97oj31
4110a97L46l67K87jl5k4j97J62J25j94p2N43j40r2o4n8O9p3L7j85K92K2k03m3
4134f2k7R4j62J22O2o9j7k53L04p3P7p8J64l3rJ14j89M7N5J1r7K0k4n8j10PK28
4161D4j56L69O5m63J23j4L7j49J90q7M2o7O1L14j80k11K20k89kO3J14o4m8L26
$$ y = [123, 204, -37, -165, 12, 331, -125, -292, 25, 53, 16, 65, 132, -34, -170, 25, -132, 98, 151, 19, 103, 53, 153, -92, 113, 185, 184, 72, -2, 92, -120, -66, 264, -156, -98, 104, -215, 54, 252, -63, 323, 26, -147, 98, -10, 103, -14, 96, -92, -157, -3, 106, -146, 95, -52, 28, 137, -192, -231, -3, 136, -158, 3, -94, 47, -59, -91, 8, -92, -98, -46, 129, -116, -144, 201, -164, -68, 151, -114, 103, 93, 4, -27, 169, 65, -295, -212, -224, -88, -7, 33, -5, -285, 71, -3, 56, 55, -65, 6, -221, 208, -90, 35, 18, -209, 120, -46, -83, -167, 23, 117, 230, -224, -19, 137, -60, -66, -197, 149, -218, 69, 68, 33, 9, -188, -26, 99, -95, -167, 376, 236, 144, 80, 22, 91, 18, 55, -130, 162, 184, -19, -62, -89, 5, -157, -35, 27, -42, -59, -312, -8, -81, -4, -82, 82, 49, 40, 154, -35, 12, 67, 78, -19, 1, -23, -81, -191, -184, 44, -112, 257, 322, -141, -18, -32, 5, -144, 46, -41, 1, -66, -5, 309, 129, -82, 138, -151, -153, -90, 24, -40, -88, 238]
4185B38k70j06j23K51j69L36j36k04Q4J5J03P0R0j95J73j18j00N6N5mk8K20j92
4208D6j18N8n7O3n8j20k9K35mo7j16J09j44J26Q0L7r7K8J8m4J53k66R1J45k1P
4234E5L2J41l00J68J7k0p8n4M2k48o1P4J48P6RQ1j91M11l12J03j15k3l5J54j93
4259a19Q9K4j29J42M3R4l65K80o5M8j05K65k59n9l4J26R3j47R4j17P2P8q0J32
4283A01j98J9J94K21m11j93K70Jj97N2J36k79K71k13J40J33Q5n1j37K01n1j33
4305c9L2r7J04K73k34n7q5J67k0J33j05p9K0n7P8o0j19M7p6J31l4j45J86l3KO8
4331Aj05L13j52J4rj57J56J0k95J05q1L19Q5j65k38J51K33j07k7J47j55j06J70
4354A07l4J8p5M8m46L82j49K27j75K80l84J94n8J92j24p6R2k43L78j24j3K58l17
$$ y = [238, -32, -138, -261, -10, -179, 157, 21, -183, -99, -84, 19, 89, 179, -16, 157, 39, -61, -5, 50, 46, 18, 238, 46, -72, -14, -71, -8, -66, -186, -215, 20, 16, -51, -167, -58, -202, -76, 4, 41, -56, -28, -10, -54, 99, -167, -76, 69, 48, 55, 87, 228, -72, 96, 113, 93, 15, -39, 3, -245, -306, -232, -84, -8, 1, 82, -109, 302, -10, 93, -22, -45, -80, 74, -119, -30, -6, -135, 7, 50, 144, -221, 59, -6, 42, -63, 202, -57, -116, -150, -24, 69, -78, 16, -101, -29, 49, -31, 101, -97, -78, 116, 337, -74, -267, 3, 4, -193, -141, -5, -284, -13, -226, -86, 47, 132, 81, -56, 145, 94, -39, -7, -104, 0, 273, 39, -18, -103, 64, 44, 177, 72, -7, 13, -44, 34, -26, -145, -98, -174, -43, -77, -222, -36, -69, -67, 1, -104, 209, 57, 71, 62, -95, 61, 71, -224, -119, -200, 119, 204, 39, -199, -48, 185, 78, 51, 198, 43, -63, 107, 73, 91, 16, 64, -382, 0, -149, 78, -97, 183, -201, -7, -65, 127, 3, -73, 19, -224, 154, 30, 17, 275, -42]
4377d2J80r9m1o9P1q8J92m3J2q4P4j90J54r5M0l6Q6P2O8j49j04L33k40K15k21
4402dJ72j77r0M2J83k30M7kK35k58J37j21J65k19J28K53l90J68j11O6l09N30m02
4425a87K45j49L21k78k40M39j98l5K78o7p0no2N0k88M0J31J80J16l09Q3k7M9J50
4449A67k29l7M4P3p1p7o8L48k61P0J41j38O9j5r7R7n9M9o4J55j74K53j01r3o7
4474h5Qj20J30K34q5j99O6J55j81Qp4K30L4j99P9p8J43j28L67k29J7m4M0j93O2
4499d2K06k41R1j74M03k23K50l85K53l08K23n6J02n7n0J49j60P9j9Q1k51K21j41
4522d9K02m39K23j27K76p0m32M73k3j5j39K88k08K8J40q5Q4l7k80J46j06M3q3
4545a90N4M4N7r1L6J46j10k4J06n2K15k37L1P8r5L8j49R2J56l8k72L13k11n4L02
$$ y = [-42, 138, 39, -2, -71, 0, -88, 104, 61, 73, -11, 63, -127, 27, -68, -28, -64, 22, 94, 162, 13, -91, 242, 2, 217, -4, 168, -9, -99, -57, 126, -104, -57, -59, 176, -82, 55, -66, 99, -120, 8, 261, -129, 39, -72, -6, -315, 215, -187, 58, -91, 230, -48, -288, 151, -47, -82, 196, 129, 59, 54, -8, 42, -246, -206, -75, 105, 221, -88, -5, -32, 17, 167, -62, -99, -55, 18, -53, -130, -198, 150, -111, -41, 100, -38, 31, 16, -81, 16, -43, 6, -58, 97, -77, 176, 75, -18, -85, -77, -197, -67, 167, 82, -117, -51, 104, -77, -69, -143, 87, 121, -78, 1, -77, 66, -62, 305, 76, 93, 49, 89, -104, -42, 164, -77, 14, -160, 243, 20, 270, -115, 138, -170, 53, -3, 99, 42, -8, 141, -19, 60, 41, 122, -129, 92, -49, 153, -286, -63, -190, 86, 16, -416, 57, 34, 19, -120, 168, -40, -12, 128, 43, 127, 90, -190, -44, -150, -107, -190, -136, -92, -35, -126, -90, 56, -54, -78, 28, -24, 191, -46, -15, 63, -32, 6, -143, -51, 105, 67, -205, 108, -103, -157, 145]
4570A45k48J61M0k29q1J64o6KjK27j33q0K29j56q8J20J46n7J39l68J12k82K43
4593f1J80r8P3L5j33K25j8k53L2J37j78O8p0R0N1j50oj7P8L5J9k41L83j46j39
4618a04J02q3o3K06K4j50O5J45q3M0l47J52K9r7K51J19j09M2Q9k49J46l0j33J96
4642A58k34M0P0j19K11k8j41r1K27jl2N7q0m2k69K91J30Ko3M0j05j18O8k05J48
4667h6J33j1Rj61K01k73K93l61J1K75q1J07L9J04r2j90J4J26l24K11p4J12m3j
4691f2KJ88l13K89M7m4k67R4K58k76l0O8j25J51nj48M54j61o6o7J99o0J91l04
4715A3O5J12N1r8k83K30K60m81K05n7j85J13j65J85o2J14p9J01N0L8k40J93k79
4738a99O7l2k08K30K10k92J38j29K95j2j01Q1j57J85J03k95j79K51J10j38P0k58
$$ y = [145, -103, 58, 98, -131, -212, -48, -114, -112, -113, 114, -19, -99, 130, -26, -114, 6, 152, 95, 234, -134, -22, -304, -61, 119, 21, 94, 129, -4, 221, 203, -50, -18, 119, -59, 9, -61, 29, 80, -70, -76, -93, -15, 20, 39, -202, 181, 35, -104, -2, -85, -148, 58, 82, -68, -3, 142, 59, 99, -248, -96, -67, -164, 87, 206, 97, 139, 228, -21, 125, 95, -38, 158, -76, -36, 34, -85, 126, 98, -43, -134, 93, 92, 60, 117, 37, -5, -274, 17, 147, 149, 86, 126, 21, -97, -29, -234, -86, 47, 36, 45, -116, 85, -188, 105, -256, -245, 30, -51, 56, 95, 199, 107, -83, -69, 57, -267, -56, -130, -18, -61, -62, -60, 128, -185, 104, 151, 107, -160, -66, 192, -84, -114, -46, -171, -20, -25, -173, 281, 120, 54, -13, 186, 126, 317, 13, 78, 190, 241, 143, -140, 90, 350, -131, 74, 17, -168, -55, -220, -35, -97, 17, -62, 39, 89, 127, -113, 80, -199, -132, -164, -372, -142, 68, -224, -86, -215, 80, 68, -33, 48, -109, 76, 179, -116, -295, -44, 66, -72, -2, -260]
4760b60M04q9J7j30J31k50Q9j77L18q7j23K57j79OM9Qj62K91k20J95n1j4j3p3
4784f3kK4J42J38k50P6L0j04J33r2j20K50k18j81J38J50jJ18j63R1K2j24p7J11
4808B8M9M5N6j16k6J74j79k8R0N8l13K68k3o8Nk14J98q9K56j05K12k02O2k16K3
4833e5K6J01K2k24Q3l0J49n2J07L5j37JO5k45P0N7M4m7j4q6j48L24J79j33q6o6
4859f0J46M0j14N0j78l4J50J4k41K67m4j27J0K6L25j89l61J92J78q1N4j4K6J19
4883A54J42m60J4K00l4kNJ1n6m1O0j26K34n7J16j89P5j38%M3J18j58M6l6k3K86
4909A84p5L6l26K14N2r5J15l34L50j63N3R0k70J15N7J30q0j15L71j99j26R6NN2
4933A37k06L1m6Q6Q3N5j25R8k64J10m8J39J15l19J95j77j19M94j39k68Q5m1J07
$$ y = [-260, 144, 55, 72, -58, 73, -177, -88, -265, 53, -34, -157, 100, -79, -73, -24, -16, -178, 113, -107, 88, 37, 23, 10, -63, -65, -41, 101, 239, -11, 65, 95, -9, 124, 32, -88, 162, -56, -237, -99, 51, 50, 168, 5, 96, 118, -6, -83, 28, 77, 122, 178, 62, 36, 210, 31, 3, 93, 151, -162, 106, 83, 15, 20, -194, 4, -85, 171, 66, 278, 76, 138, -78, -55, -29, 72, 94, -130, -47, -77, 72, 20, 127, 162, 25, 26, 91, -154, -84, -27, 17, -30, -44, -130, -278, 46, 225, 92, 6, -60, 86, 126, 12, 62, -116, -150, 0, 14, -227, 40, -4, -131, -121, -95, 230, 41, -320, -128, 50, -31, 23, 9, 35, 154, 296, -164, -150, 50, 16, 14, 19, 30, -26, -67, -7, -133, 101, 44, 160, -29, 46, -92, -92, -49, 69, -89, -43, -79, -102, 184, 109, 145, -181, 33, 85, -10, 105, -229, 121, -42, 11, 101, -169, -54, 3, 133, 53, -62, 309, 110, -16, 80, 85, 137, -69, -38, -84, 2, 85, 140, 15, 113, -151, -41, -89, 50, 165, -154, 41, -136, -255, 239, 100, -168, -83, -124, -17]
4956a7O9L34j76k43j23P1K29j56Q5p9J12j22j2L1L4J47k09Q9K6o8l12L55j59J53
4980E9k75J23J01K45l69K05L5k24Q7p4j0K11j53L3k1K18j58J12l69K55q4L1j28
5003a50J35K2n7Q6j36K4M0j01K61O1r7K2J11j04r5J6Kmj53m5K68Q0k81J37o2r0
5029a10PJ07j62L9l4J28j8qJ64j47O3j69J71j03J8O5j38K48j09P0J3j93q4K04
5053B2j66J85l40J37J24K38j01k9j5J1L7q2J3j56K91j40J15k61O5p0M4k9J21l3
5077a9J1J58k02Q4l14L26l7J10j59p5J65M8j11J64k09R7m6Q4q7r2J13j15K55l81
5101b32M09j25j47r9L56k41K4J0J27k9J81k04j48N5J2P6Q8J25j08j76N8L2j08
5124f4L16j59p2L3k36L07l49L89k0j53j52R8o4m7J30L21k30J60j31k69L1Q7L7
$$ y = [-17, 52, 386, 210, -33, -156, -85, 144, -12, 73, -6, 106, -16, -28, 3, 37, 184, -25, 64, 90, 22, -290, 65, -94, 59, -216, -93, 8, 253, -116, 89, 124, -100, -13, -87, -97, 114, -39, -6, -27, 191, 33, 145, -224, 31, -53, -22, -150, -15, 7, -50, 36, -100, -76, -36, -137, 124, 185, 88, 110, 221, 117, 22, 38, 40, 36, -117, -162, 106, 186, -95, 42, -20, -110, -103, 4, -158, -119, -153, -25, -43, -51, 113, -34, 29, -140, 31, -72, -54, 11, -127, 121, 12, 82, 95, -98, -182, 22, -144, 41, -299, -162, -38, 200, 99, 70, 55, 66, 103, 21, 34, -122, 169, 29, 144, -117, -52, -122, -78, -107, 14, -19, -8, 150, -52, 32, -282, 44, 7, 117, -42, -117, 48, 96, -15, 149, -60, 37, -9, 75, -12, -104, 9, -106, 149, -232, 177, 52, -95, -194, 162, -79, -55, -45, 82, 53, 234, 30, -118, -63, -51, 25, 113, 238, 130, -46, 12, 44, -64, 252, 93, 21, 54, -182, 125, -224, 165, 145, -8, -160, -62, -126, -173, -43, 278, 48, 208, 77, -192, -161, -74, -37]
5147c7k1J7L8R4n5K12l55J71J6n7J14k80L26m08J91P5J39l60M58m38J26J04k64
5170a94Q5J96m8P7j37j55L25k71K3K17o2p8k15K13K59m69J90jj06K52j38J23m21
5193c35L31J50o4j19L20l34K65j6o7j46J30Mj56j33K31K3k1j0J9K50k07J60l43
5216f8J03j10K61k35J06j66m8Q6K14j33r9J85k15J79o8J88k56J47l07p2L66j38
5238h0J88j66J09k16J70j39J20J42k95J74J36l57R0J05J29P6l50j8K89j82J75
5259A00j27j61K19o0o4L49j53j19L0J23J5j97k6j0K08m19K55M6j40R3nJ28k09
5282a24J57o8j41K23j11K46k72P0J04l78L67o2O5j81L94j54o4J00J9l61K80j0
5304I9l11L88l92M91k00j75N3n5J30j04M7L0l1o2m4K35k55P6j91K45J63k22N8
$$ y = [-37, -58, -41, -3, 91, 36, 248, -107, 64, 80, 23, 137, -143, 183, -225, -34, 41, 180, -180, 278, -160, -34, 70, -194, -109, 87, 39, 116, -21, -176, 149, -122, -99, 118, 56, -22, -237, -24, 235, -234, -44, -45, -151, 101, -37, 86, -335, -4, 146, 82, -37, 283, -51, 214, 198, 131, -15, 115, 119, -37, -170, 61, 84, 63, 53, 72, 322, 115, 275, -68, 35, -75, 186, -49, 57, -109, -157, -71, 143, 10, -89, 96, -119, 60, -8, 180, -76, 71, -236, -308, 58, -80, 108, -58, 51, -165, 5, -134, -14, 128, -167, 7, 143, -214, -124, -19, 110, 186, -164, -182, 107, -75, 100, -27, -188, 31, -29, -93, 256, 103, -16, 14, 137, 152, -45, -71, -81, 127, -292, -37, 9, -131, -38, -43, 85, -124, 33, -35, -176, 47, -64, 182, -90, -20, 84, -294, 73, 11, 76, -105, 289, 135, 71, 171, 190, -171, 109, 99, -212, 176, -216, 275, 75, -100, -47, -102, 28, -76, -29, 1, -30, -92, -136, 99, -156, -80, -271, -26, 137, -85, -27]
5327b7k9k67L39J13k28q3O4K5M9l7j38K87k90J86k43J75K09j40J02LJ49l48Q2
5350d7K93l70J61j80J68O1R9l1j05P7p8ML9k39Q9J6pk8K0K24q7J18k48K55k52
5375d8j18K04L28r4m27K32qj46J29J72k75J96j69l4K13n7k9m1k48K81m6k33K23
5398Ej25K34j49p6K48m3j51K58k15rR3r7q3K25j55j7J45J30k94q6J88p4O0n5k40
5423b83M20k49N8k9J59n1j11J13l2o2j96PN5L04r1O9K3j71j29P9J0o4J21J1K85
5448B46l84J00Q2%p7K0l4L00j06k38l2L29l64NJ09R7j29O4J34k15J11n0k92K88
5472c6J67j23k21J32K75P0k43M0j0R5k85j20L12j18J05J80j16Q6j83n6p4J05J31
5495A13j24N8p2K21l14K66k80P2m5J75m6m1pj39J60qJ97j78r3M0K44r3k63J9K98
$$ y = [-27, -56, -323, 16, 129, -99, -182, -118, -93, -44, -81, -219, 68, -222, -36, -279, -104, 105, -35, 67, 70, 219, -129, -47, 246, -124, 37, -143, 25, 86, 185, 154, 49, 126, 48, 52, 91, -148, -59, -43, -50, -78, -58, 166, 79, 197, -51, 204, -48, -166, 38, 366, 272, -155, 77, 69, -77, 52, 224, -51, 145, -24, -58, 155, 98, 69, 28, -220, 61, 15, -218, 5, -120, 114, -35, -111, 137, 94, -57, 201, -14, -23, 70, -27, -110, 115, -40, -57, 88, 218, -76, -162, 26, -48, 12, -43, -283, 137, -112, -54, -83, 76, 25, -86, 27, -5, -67, -263, -256, -201, 103, 12, 81, 104, -67, -196, -117, -107, -171, -50, -39, 246, -138, -38, 44, 44, -33, -13, -47, 253, 147, -91, -123, 206, -158, -153, -44, 53, -76, -12, 122, -93, 18, -32, -324, -36, 131, 8, -213, -81, 194, 264, 21, 61, 51, 146, -139, -259, 53, -65, 40, 220, 104, 190, 7, -49, -123, -18, 113, -11, 47, -25, 196, -118, 148, -132, -60, -105, 70, 24, -17, -24, -163, -3, -11, 186, 8, -85, -45, 199, 106, -157, -138, 160]
5520A60j97K34l40m5K64pj32j46L54j42m4o6R5K4n2P3p0j06P3M8RJ23l17K68J14
5545A75J18k93o6p8j1K18%j36L15k08m3O1J66l46K14k27K57N6j24p1m2K26o7m0
5569E4m8K5j04PN0o2J28p7J86j40J72k39J02K9J07l98J72P6j35r1O1K41r2Po2
5594c1R7n0P0k92J54M8j5mQ3k19J55P7K43n8k50n9p7J38j58J10n7k8J9K27j05
5619A8p7M40k88k03J32J70l19O3R9j7j53J12K5jJ18j62Q4j2L2p6K43k41R5M9j69
5644c8P9K3j54L07l82M29k67k1J03p1N4J77j78k8j17P1p3R5J68j52j25M6r3J26
5668b1M5L0j52L94N4l79R3k35K36O8N0l21M50j80k81L92k81%J95l69LJ74J27N7
5692A49n6K5k10K9J9j4Km8K02M5j34J01j16LJ77k08J71J7k09J79k40J18R7P2j14
$$ y = [160, -37, 197, -143, -188, 76, 69, -63, -209, 145, 3, -41, -107, -12, 12, -40, 33, -37, -143, -70, -22, -13, 110, -207, 61, 175, 293, 0, -66, -144, -155, 63, 63, -73, 242, 34, -9, 52, 218, -128, 86, -141, 116, 172, 48, -23, -65, 161, 94, 54, 6, 31, -73, -66, -16, -78, 50, -27, 159, 19, 191, -48, 54, 83, 190, -208, -36, 40, -95, -186, -125, 116, 24, 31, -31, 66, 16, 86, -206, -52, -4, -19, -23, 60, -159, -4, 73, 316, 258, 8, -51, -128, 10, -148, -38, -95, -123, -104, 123, 18, -59, 381, 93, -110, 22, 192, -127, -64, 35, 18, -135, -23, 2, 1, 119, -43, 41, 29, 61, -15, 228, -13, 82, 131, -38, 41, 64, -90, 217, -165, 264, -3, -24, 79, 8, 62, 239, 61, 33, -84, -13, -86, 9, 177, 25, -100, -54, -147, -21, 24, 54, -98, 296, 350, -29, 64, -171, 65, 133, 183, -138, 312, 132, -149, 243, -38, -38, 157, -212, -209, -35, 92, 149, 93, 118, -92, -63, -44, -58, -56, -104, 98, 143, 9, 110, -6, -3, 174, -34, 137, 154, -55, 124, -116, 2, 99, 171, 57]
5717E7Oj40K81Lk22m3O1l7N4l4j23K25j53Q6o5j06J43OQ4m9o6J76k29J99lk66
5743a55L1J00o2k13J50K75p6j0J4m8j07J64Q7m43K56l17O17k86j40J63J08j79
5765g1r3Q7J63q7M2K4j46rJ87j4J25k10J33n8j71J14k64L26j81J13NQ3J06k81
5789g7K93k90O5p4l0J84l6J3q9Q1l04J17k9J99K6j85n1Q6m8j07L12l35K72N2L5
5814H0j68K7M2l4K08j56L34k99n6J38M2Pj83K13k72J54k6J14q0q5j07J15j73L62
5838A97j31JJ3o1j14j01L05j31Kj32K25j90K19n9O5J12j04k9j05q5j4J17P1j5
5862E6o4p8J64j28L48j89j79j26K65K7j29J64m1j65J46J41k36K39Nj68M1O9q2
5885H0O5j57J54p9j06o3N8K06j21j24J34r6o3K09k66M35l24J64r8j36L01k49J84
$$ y = [57, 63, -77, 204, 207, -15, -58, 3, -34, 20, -14, -137, 88, -65, 21, -44, -150, -7, -1, 83, 34, -32, 144, -85, 114, 111, -155, -124, -24, -86, -299, -149, 126, 50, 40, 54, 6, -101, 63, 150, -293, -37, -354, 263, -23, -163, 0, 108, -71, -164, -77, 86, -1, 41, 65, -81, -90, 97, 83, 208, -2, 131, 73, -98, 16, -248, 78, -103, 10, 15, 98, 204, -77, 216, -74, -9, -83, -113, 71, 35, 48, -41, 40, -264, -147, -176, 23, 49, -136, -187, -101, -149, -256, 56, -279, -7, 45, 80, -88, -61, -19, -53, 155, -1, 333, 34, -22, 116, 158, 165, -18, 195, -77, 77, 51, 165, 85, 0, -107, 8, -165, 197, 66, 67, 80, 19, -95, -196, 109, -22, -20, -152, 73, -117, 102, 43, 108, 220, 116, 87, -18, -103, -117, 0, 71, 56, -8, -86, 78, -50, 298, 109, -70, -196, 69, 96, -33, 131, 90, -75, 71, 212, -24, 215, 220, 52, 93, 162, 80, 145, -12, 142, 63, -43, -106, -48, 158, 37, -87, 47, -49, -112, 97, -169, 266, -58, 106, 8, -128, 173, -76, 108]
5908A08k93J96j85J82K17k36J73k22j13%L15l03N9M3oK29j54q6r2Q2m7J65jp5
5932d4K70k91J30j3l0p2p5K31j48m5P2r7J69L1k95j50M19k47R2r0K71j77kL11
5956B20r9R8j25k72Q9K54l22K28j37J64m85L44K02j08l1J35j41J21j80J31k2j17
5978e3L2J32j89QJ03N7j62o6K78K4k22K09k68R8Q9k74J32K4kp8J61j84K82k38
6002a07J71k57K29J28n3j99LK7O9j95K98j03N7m2m9J43K9j08J09L3l32J91K4j27
6026f1l9J91j71j8J24j41l0K36q7r5J13l21L79J76m30J65M3M5r0J1J39j04L3O0
6050A28j28J17P4m16L19n8o6q3K24K2j15K0J40k6m5k33J46l9l9r7J69qj20M01
6074B87l01jm7NJ89j79J46J99k70M8Kk11J67l7j11K38k41K87j48P1j53J01L7l6
$$ y = [108, -185, 11, -174, 8, 225, -11, 162, -60, -173, -173, 142, -161, -102, -59, -65, 164, 10, -76, -168, -86, -133, 32, 31, -44, 226, -65, 65, 52, 22, -50, -125, 106, -42, -87, -15, -112, 57, 88, -207, -357, 62, -185, -93, -183, 88, -89, -91, 220, 121, 219, 94, -178, -89, 165, -157, 71, -66, 98, -387, -43, 159, 51, 20, 155, 14, 135, -45, 86, 64, -53, -21, 111, -78, -70, 33, 90, -72, -138, 140, 164, -58, 151, -117, -19, 70, -204, -72, -48, -50, -128, 33, -151, 131, -107, 64, -193, 36, 164, 111, -88, -85, -58, 11, -184, 114, 11, 68, 26, -23, 120, 149, 41, 150, 183, -149, 42, 66, -61, -100, 91, -80, -98, 26, -115, -145, 91, 4, -91, 22, -299, 80, 256, -174, -9, 34, 79, -11, 0, 139, 35, 68, 128, 0, 117, 191, -225, 94, 36, -30, -113, 111, 133, 18, 38, 178, 152, 107, -126, 20, -19, -58, -155, 14, 6, -114, 287, -14, -15, -62, -57, 132, -47, 99, 298, 28, 76, 78, -133, 34, -3, -114, 124, -117, 170, 22, 93, -60, 41, 78, 42]
6098D2K72j74l68L24qk94K96J03m2M5k95n1J80j34N5l0J29k44J81j91K36rJ68
6121A91k44K57j88j03J82J00l35O0J00k41K89l6j41M02j47j65K01k31J04M2o0
6142C7p5J28j10l7J15J69p6k33L47l74J70l44L71k89M4L31k13j71m9K57j59J87
6164B6j06q5J27Q4j30L9j37K6J30m4J10j21OJ98j63J68m1Rj36P2p7j21KQ4m6K45
6190A19j38o7l2n2m8N30j97K1j87P4lJ0N3k0J31r7k02j6k48M68k00J00J39j00
6214C8n1P5o1R1j2m33L12J55j11m7L7j38K80j91j9N0J77k61J43j44K36j31PL2
6238C4p6O8k65J95R2k39J72J73J07l17m1L86l44K17k09O8l7K09l07Q5R2q6Jm7
6262f9k3j7J32M9n8j41R4k4Q7O1J61j04M9k80R5K2p5j0j05J71J10j05Q0P3j12
$$ y = [42, 314, 140, -228, 96, 88, -206, 90, 193, 151, 196, -99, -150, 30, -104, -49, -79, 50, -194, -13, -204, 32, 23, 191, -53, 204, 16, -87, 95, 195, -140, -80, 20, -221, 68, 32, -109, 293, 146, -19, 182, -49, 55, 97, 37, -38, 90, -20, -57, 58, 227, 151, -82, 265, -109, 61, -283, 88, -201, -157, 174, -39, -210, -259, -2, -161, 26, -80, -165, -38, 46, -84, -45, -182, -156, -26, -70, 40, -81, -75, 123, -40, 128, 87, 96, -40, 32, -45, -166, -164, -80, -126, 119, -19, -86, -118, -170, -218, 312, 115, 136, -51, 23, 20, 30, 83, 63, 194, 97, -105, -121, -369, 99, -101, -1, 138, 38, -13, 62, 1, 92, 80, -353, -41, 114, 3, -44, -7, -145, 135, -56, -75, -25, 152, -109, 34, -110, 126, -5, 2, 34, -42, 26, -239, -44, 48, -191, -19, 154, 261, -56, -97, 289, -55, 162, -47, 21, -16, 193, -114, -29, 63, -23, -22, -69, -92, -109, 23, 72, 14, -127, -33, -57, 30, 91, 252, 148, 197, -83, 12, 34, -41, -51, -156, 15, 125, 20, 100, 173, 61]
6287F1l88J61K4J21j16Q4Q4J9k2l65N06q9J47j82r6Q5j36K24p8n0J83l76J92k77
6311b84L25p8r6M6l8K1J4j28K13K2q0J2j21J86j3J5N1j23p2J50PN1J0j70J67j51
6337f4K06l74K32M1rp0J28j31j4J5M5O0P3k55k4J12J31J2n0p6m8K12k35R1k55
6362b47K63p3n9J12J86j8kJ2o9p4k4j7P6r9n9L2o7M7P3J76j21k5j29J46j89J00
6388d9J57j26Lj46Q9R7R5l99M52j08M3k9j96J80j48k8j00J76R6j31R4j27j9j16
6412b40J01K26k7O9k02K25j36J1J94j94J25k19P2Q0j5j61M1J1j14K10j94J74l9
6435bL6K1jM9j55J20N1j45j54K96k05K36j08J5Q2k15J09j04J06J62k56K3K60k26
6459eJ5n6R4j85O8q8K63M1j87k4K41j01J40j52l5j26N7J33r8Q2k63P4m3K26j43
$$ y = [61, -327, -166, -142, -21, -137, -53, 31, 50, 28, -337, 169, 80, 227, 45, -51, 34, -102, 122, 44, -6, 177, -199, -7, -284, 41, -37, -133, -87, -125, -104, -90, -218, -5, 17, -63, -51, -172, 14, 1, 16, 67, -56, -128, 22, 29, 80, 90, -80, 87, -64, 142, -232, 0, 41, 32, -38, 90, -41, -55, -40, 5, 65, 138, -117, -141, -29, 102, 114, 64, -12, -60, 152, -83, 8, -247, 16, -57, -116, -4, 182, 164, 162, 174, 105, 31, 7, -10, 66, -33, -92, -60, -127, -80, -7, 169, 48, 23, -106, 40, -149, -49, 108, -18, -15, -161, -72, 25, 120, -279, 173, 65, 108, 79, -117, 63, -85, -113, -213, -37, 59, -72, 22, -105, -124, -240, -139, 87, 60, 129, -73, 152, 16, 27, 221, 27, 152, -67, 5, 85, 70, -91, -50, -39, -153, 57, -137, 37, -2, 34, 55, 54, 103, -52, 68, 119, -26, -180, 116, -89, 147, 39, 54, 136, -79, 30, -74, 32, 194, -62, -39, 221, -5, 10, -46, 48, -137, -69, -157, 106, 147, -40, -64, 177, 76, 216, 64, 29, -97, -40, 93, -5, 77, -186, -112, -155, 71, -72]
6484g2Q3Q8L3j48J32j44k17K39j48L18p9p6k7L2j38J39j24kJ90K1m40M46p1j40
6508a05J54k56j2K48Q0Rk58K56l25K79j78J06J12k30L5O1K14n0j44j75J9O4LJ41
6532D8j00r7L2O6J31j68J3J63q7L12j34n7j60o5j8R7K2Q0l08NJ69L12k82j12J69
6557C1o3k52K09J09k48L91k86J41o8m5O3j11L09Q8l37J21Q8j81L0OJ06l8j86J42
6581A9j9l97M79o9m7j40L7K70k42K6J60k7r9q6J07j19L1K87j03q1J83l37K14j74
6605a27J82K61m84J09p5L46q1L4k19LK1L05r7L6n3j58p8J83K5j54J55m42K56j17
6629a69L14l39M2R8RO6n8K49l04O5l1M8p1K16j59K9k12Q7j92M00k04K17R1p9j60
6654d7o1K46j68J5J52k52O3j44J53L6mj36K23j79l7J70j34L06m33J02k2j32L64
$$ y = [-72, 11, 99, 132, -16, 116, -28, -245, -6, -154, 164, 85, 9, -18, 14, -124, 15, -109, -111, 79, 100, -340, 106, 35, -105, 49, -207, -219, 29, 109, 118, -140, 116, -209, 70, -108, -2, 110, -120, -85, -24, 190, 140, -4, -179, -160, -96, -93, 48, -52, -149, -117, -51, 80, -88, -75, 88, 1, 313, 179, 122, -38, -103, -121, -24, -2, 78, -230, -225, -56, 256, -26, -138, 31, -32, -284, -75, 34, -214, 177, -109, 32, -36, -81, -18, -129, 180, 268, -69, 52, 140, -41, -11, -5, 101, 63, -123, 19, 0, -397, 82, 13, -34, -174, -137, 133, -109, -83, 77, 50, -49, -135, -28, -147, -116, 171, 68, -13, 170, -167, 47, -127, 55, 316, -168, -59, -134, 212, 131, 165, -54, -51, -30, 275, 178, 214, 161, 3, -75, 108, 133, -21, 134, -308, -52, -169, 145, -194, -152, -54, -45, 21, -37, 212, -92, -27, -58, -10, -81, 135, -24, 5, -207, -120, -312, 88, -116, 101, 192, 113, -47, -108, 138, -30, -15, 137, -115, -52, -196, -43, -7, -11, -147, 76, -103, -140, 30, -104, 202, -231, -129, -151, -283, 81]
6677H1j46j48J60K72j71Mo6l9l8J04l3L7n6R7k5P1o4O2Kk86K58k87K25l1k34L76
6703A25k76J09K77m63K97k4q6J31J06l56K12K1k2k6J25n23J02L64k16L42l54O4
6725g1J93j43J97n1l26J86j8jj32M7J39O6j77P9N4j52J36J7P5j09j54L1M9k4J15
6750B6l9k14J70J53l0n4J19j80j66K17J88j60p6K45k53n2l0L1J18k2L5J73k15
$$ y = [81, -65, -213, -53, 219, 48, 52, -14, -53, -91, 13, -20, 17, -39, 58, 33, 104, 40, 102, 104, -182, 76, -211, 14, -17, -251, 125, -151, -42, 235, -228, 69, 45, -41, 90, 196, -160, 52, 73, 51, 25, 150, -373, -271, 93, -123, 219, -135, -71, 122, -21, 176, 125, -201, -15, -33, -34, -166, -119, 20, 86, -91, -12, 42, -110, 26, 43, 118, 9, -145, -114, -65, -89, 26, -13, -227, -57, 96, 66, 12, 131, -49, -215, 2, 190, 30, -46, 199, -54, -106, -136, -105, 13, -9, 26, 199, -16]
$$ [...]
8191E5
##END NTUPLES=NMR FID
##END=
