##TITLE=1H_Pr 4968
 CDCl3, 8 sc, 
 14.05.2021
##JCAMPDX= 6.0         $$ Bruker NMR JCAMP-DX V2.0
##DATA TYPE= NMR FID
##DATA CLASS= NTUPLES
##ORIGIN= UXNMR, Bruker Analytische Messtechnik GmbH
##OWNER= root
$$ XWIN-NMR		Version 3.5
$$ Fri May 14 10:27:37 2021 Russian Standard Time (UT+4h)  she@DPX200
##.OBSERVE FREQUENCY= 200.131506
##.OBSERVE NUCLEUS= ^1H
##.DELAY= (6, 6)
##.ACQUISITION MODE= SIMULTANEOUS
##.ACQUISITION SCHEME= undefined
##.AVERAGES= 8
##.DIGITISER RES= 18
##SPECTROMETER/DATA SYSTEM= spect
##.PULSE SEQUENCE= zg30
##.SOLVENT NAME= CDCl3
##.SHIFT REFERENCE= (INTERNAL, CDCl3, 0, 15.7039)
##AUDIT TRAIL= $$ (NUMBER, WHEN, WHO, WHERE, WHAT)
$$ ##TITLE= Audit trail, XWIN-NMR		Version 3.5
$$ ##JCAMPDX= 5.01
$$ ##ORIGIN= Bruker BioSpin GmbH
$$ ##OWNER= she
$$ F:/spectra/data/she/nmr/H-F/1/audita.txt
$$ ##AUDIT TRAIL=  $$ (NUMBER, WHEN, WHO, WHERE, WHAT)
(   1,<2021-05-14 10:26:34.70 +0400>,<she>,<DPX200>,
      <created by zg, POWCHK disabled, PULCHK disabled
       configuration hash MD5:
       00 E9 B6 7A A2 85 ED C7 34 08 36 98 17 FE 4E 26
       data hash MD5: 16K
       FC DC C0 40 53 4F E3 2C F5 17 FC 1D 40 9D 64 F1>)
$$ ##END=
$$ 
$$ hash MD5
$$ D0 B9 9C 69 4D 80 2A E7 37 AA 76 E1 BF 4B 8C 62
##$RELAX= 
##$RELAX= 
##$RELAX= 
##$RELAX= 
##$RELAX= 
##$RELAX= 
$$ Bruker specific parameters
$$ --------------------------
##$DU= <F:/spectra>
##$EXPNO= 1
##$NAME= <H-F>
##$PROCNO= 1
##$TYPE= <nmr>
##$USER= <she>
##$AMP= (0..31)
100 100 100 100 100 100 100 100 100 100 100 100 100 100 100 100 100 100 
100 100 100 100 100 100 100 100 100 100 100 100 100 100 
##$AQSEQ= 0
##$AQ_mod= 1
##$AUNM= <au_zg>
##$AUTOPOS= <>
##$BF1= 200.13
##$BF2= 200.13
##$BF3= 200.13
##$BF4= 200.13
##$BF5= 200.13
##$BF6= 200.13
##$BF7= 200.13
##$BF8= 200.13
##$BYTORDA= 1
##$CFDGTYP= 0
##$CFRGTYP= 5
##$CHEMSTR= <none>
##$CNST= (0..31)
1 1 145 1 1 1 1 1 1 1 1 1 1 1 1 1 1 1 1 1 1 1 1 1 1 1 1 1 1 1 1 1 
##$CPDPRG= <>
##$CPDPRG1= <>
##$CPDPRG2= <>
##$CPDPRG3= <>
##$CPDPRG4= <mlev>
##$CPDPRG5= <mlev>
##$CPDPRG6= <mlev>
##$CPDPRG7= <mlev>
##$CPDPRG8= <mlev>
##$CPDPRGB= <>
##$CPDPRGT= <>
##$D= (0..31)
0 1.2 0 0 0 0 0 0 0 0.06 0 0.03 0 0 0 0 0.0002 0 0 0 0 0 0 0 0 0 0 0 0 
0 0 0 
##$DATE= 1620973594
##$DBL= (0..7)
120 120 120 120 120 120 120 120 
##$DBP= (0..7)
150 150 150 150 150 150 150 150 
##$DBP07= 0
##$DBPNAM0= <>
##$DBPNAM1= <>
##$DBPNAM2= <>
##$DBPNAM3= <>
##$DBPNAM4= <>
##$DBPNAM5= <>
##$DBPNAM6= <>
##$DBPNAM7= <>
##$DBPOAL= (0..7)
0.5 0.5 0.5 0.5 0.5 0.5 0.5 0.5 
##$DBPOFFS= (0..7)
0 0 0 0 0 0 0 0 
##$DE= 6
##$DECBNUC= <off>
##$DECIM= 32
##$DECNUC= <off>
##$DECSTAT= 4
##$DIGMOD= 1
##$DIGTYP= 9
##$DL= (0..7)
0 120 120 120 120 120 120 120 
##$DP= (0..7)
150 150 150 150 150 150 150 150 
##$DP07= 0
##$DPNAME0= <>
##$DPNAME1= <>
##$DPNAME2= <>
##$DPNAME3= <>
##$DPNAME4= <>
##$DPNAME5= <>
##$DPNAME6= <>
##$DPNAME7= <>
##$DPOAL= (0..7)
0.5 0.5 0.5 0.5 0.5 0.5 0.5 0.5 
##$DPOFFS= (0..7)
0 0 0 0 0 0 0 0 
##$DQDMODE= 0
##$DR= 18
##$DS= 0
##$DSLIST= <SSSSSSSSSSSSSSS>
$$ [...]
##$SUBNAM2= <"">
##$SUBNAM3= <"">
##$SUBNAM4= <"">
##$SUBNAM5= <"">
##$SUBNAM6= <"">
##$SUBNAM7= <"">
##$SUBNAM8= <"">
##$SUBNAM9= <"">
##$SW= 16.9725357007746
##$SWIBOX= (0..15)
0 0 2 0 0 0 0 0 0 0 0 0 0 0 0 0 
##$SW_h= 3396.73913043478
##$TD= 16384
##$TD0= 1
##$TE= 0
##$TE2= 300
##$TE3= 300
##$TEG= 300
##$TL= (0..7)
0 120 120 120 120 120 120 120 
##$TP= (0..7)
150 150 150 150 150 150 150 150 
##$TP07= 0
##$TPNAME0= <>
##$TPNAME1= <>
##$TPNAME2= <>
##$TPNAME3= <>
##$TPNAME4= <>
##$TPNAME5= <>
##$TPNAME6= <>
##$TPNAME7= <>
##$TPOAL= (0..7)
0.5 0.5 0.5 0.5 0.5 0.5 0.5 0.5 
##$TPOFFS= (0..7)
0 0 0 0 0 0 0 0 
##$TUNHIN= 0
##$TUNHOUT= 0
##$TUNXOUT= 0
##$USERA1= <user>
##$USERA2= <user>
##$USERA3= <user>
##$USERA4= <user>
##$USERA5= <user>
##$V9= 5
##$VALIST= <valist>
##$VCLIST= <CCCCCCCCCCCCCCC>
##$VD= 0
##$VDLIST= <DDDDDDDDDDDDDDD>
##$VPLIST= <PPPPPPPPPPPPPPP>
##$VTLIST= <TTTTTTTTTTTTTTT>
##$WBST= 1024
##$WBSW= 4
##$XGAIN= (0..3)
0 0 0 0 
##$XL= 0
##$YL= 0
##$YMAX_a= 797294
##$YMIN_a= -911243
##$ZGOPTNS= <>
##$ZL1= 120
##$ZL2= 120
##$ZL3= 120
##$ZL4= 120
##$ABSF1= 10
##$ABSF2= 0
##$ABSG= 5
##$ABSL= 3
##$ALPHA= 0
##$AQORDER= 0
##$ASSFAC= 0
##$ASSFACI= 0
##$ASSFACX= 0
##$ASSWID= 0
##$AUNMP= <proc_1d>
##$AZFE= 0.1
##$AZFW= 0.1
##$BCFW= 1
##$BC_mod= 2
##$BYTORDP= 1
##$COROFFS= 0
##$CY= 11.3945322036743
##$DATMOD= 1
##$DC= 2
##$DFILT= <>
##$DTYPP= 0
##$F1P= 15.9154993809931
##$F2P= -4.1035820241983
##$FCOR= 0.5
##$FTSIZE= 0
##$FT_mod= 4
##$GAMMA= 1
##$GB= 0.15
##$INTBC= 1
##$INTSCL= 1
##$ISEN= 128
##$LB= 0.24
##$LEV0= 0
##$LPBIN= 0
##$MAXI= 10000
##$MC2= 0
##$MEAN= 0
##$ME_mod= 0
##$MI= 1.114404
##$NCOEF= 0
##$NC_proc= 0
##$NLEV= 6
##$NOISF1= 3.799351
##$NOISF2= 2.8
##$NSP= 1
##$NTH_PI= 0
##$NZP= 0
##$OFFSET= 15.70392
##$PC= 1
##$PHC0= -11127.97
##$PHC1= 9.801
##$PH_mod= 1
##$PKNL= yes
##$PPARMOD= 0
##$PSCAL= 0
##$PSIGN= 0
##$REVERSE= no
##$SF= 200.130013532006
##$SI= 16384
##$SIGF1= 3
##$SIGF2= 2
##$SINO= 400
##$SIOLD= 16384
##$SREGLST= <1H.CDCl3>
##$SSB= 0
##$STSI= 0
##$STSR= 0
##$SW_p= 3612.71676300578
##$SYMM= 0
##$S_DEV= 0
##$TDeff= 0
##$TDoff= 0
##$TI= <>
##$TILT= no
##$TM1= 0
##$TM2= 0
##$TOPLEV= 0
##$USERP1= <user>
##$USERP2= <user>
##$USERP3= <user>
##$USERP4= <user>
##$USERP5= <user>
##$WDW= 1
##$XDIM= 8192
##$YMAX_p= 0
##$YMIN_p= 0
$$ End of Bruker specific parameters
$$ ---------------------------------
##NTUPLES= NMR FID
##VAR_NAME=  TIME,          FID/REAL,        FID/IMAG
##SYMBOL=    X,             R,               I
##VAR_TYPE=  INDEPENDENT,   DEPENDENT,       DEPENDENT
##VAR_FORM=  AFFN,          ASDF,            ASDF
##VAR_DIM=   8192,          8192,            8192
##UNITS=     SECONDS,       ARBITRARY UNITS, ARBITRARY UNITS
##FACTOR=    0.0002944,     1,               1
##FIRST=     0,             0,               0
##LAST=      2.4114304,     0,               0
##MIN=       0,             -911243,         0
##MAX=       2.4114304,     797294,          0
$$ Real data points
##PAGE= N=1
##DATA TABLE= (X++(R..R)), XYDATA
$$ plain form
0 0 0 0 0 0 0 0 -8 8 -8 8 -16 16 -24 32 -40 48 -56 72 -84 104 -120 144 -171 200 -236 276 -320 370 -421
29 -421 484 -556 630 -716 807 -911 1023 -1147 1283 -1435 1597 -1777 1970 -2184 2414 -2671
45 -2671 2947 -3249 3581 -3944 4342 -4780 5267 -5809 6410 -7084 7851 -8727 9734 -10911
59 -10911 12309 -13996 16085 -18734 22231 -27057 34164 -45649 67171 -120809 516917 592395
71 592395 -911243 -1899 472162 -87463 -288789 50795 124616 -53072 -165296 263954
81 263954 31425 -239166 139945 132531 -149554 -141497 204455 -93735 -330100 279877 131614
92 131614 -358620 26428 241872 -20454 40417 -212041 40948 268356 -180321 -95050
102 -95050 -5176 22494 125771 -92406 -80080 193861 -38587 17830 142009 -178761 66992
$$ packed form
0@%%%%%%qJ6j6J6k4L2m0N6p2Q8j04J28j56J88k24K64l15L71m36N12n96O90p91
29d21R05j040J186j346J523j718J934k170K430k718L032l374L747m154M598n085
45b671N618o196O830p525Q286r122J0047j1076J2219j3494J4935j6578J8461k0645
59a0911K3220k6305L0081l4819M0965m9288O1221p9813J12820j87980O37726P5478
71E92395j503638R09344M74061n59625k01326L39584P3821j77688j12224M29250
81B63954k32529k70591L79111p414k82085Q057L45952k98190k36365O09977j48263
92A31614m90234L85048K15444k62326O0871k52458K52989K27408m48677Q5271
102i5050Q9874K7670J03277k18177J2326K73941k32448N6417J24179l20770K45753
$$ plain form
113 66992 116754 -127978 -87364 138851 35019 -245656 81136 284286 -132067 -232234
123 -232234 196676 168472 -85277 -254928 46457 269644 -288275 -79343 212311 -187062
133 -187062 -13765 232322 -170233 -70180 186058 -59557 -38042 -32541 15976 -7120 -70398
144 -70398 38917 13527 -13190 -8349 53260 49759 11088 -14607 13066 -34662 89472 54773
156 54773 -267414 99565 211052 -143432 -70311 101919 78917 5848 -69272 13681 97595
167 97595 -103004 2997 17076 -76345 48082 -21836 -32956 40112 38917 -55684 -15275 58420
179 58420 16006 -90611 -41199 56653 -39857 -5447 -59222 7383 67293 -39468 24462 6174
191 6174 -29510 62780 21487 -114721 43953 26945 -42224 22313 -47505 47522 55191 -29931
$$ packed form
113F6992M9762k44732M0614K26215j03832k80675L26792K03150m16353j00167
123b32234M28910k8204k53749j69651L01385K23187n57919K08932K91654l99373
133a87062J73297K46087m02555J00053K56238k45615K1515N501M8517k3096o3278
144g0398J09315k5390k6717M841O1609l501l8671k5695K7673m7728J24134l4699
156E4773l22187L66979J11487l54484P3121J72230k3002p3069p5120Q2953Q3914
167I7595k00599J06001J4079r3421J24427o9918j1120P3068j195r4601M0409P3695
179E8420m2414j06617M9412R7852r6510L4410n3775O6605N9910j06761O3930j8288
191F174l5684R2290m1293j36208J58674j7008o9169O4537o9818R5027P669q5122
$$ plain form
203 -29931 -15997 80103 29510 -68232 -13984 62948 21544 -116677 -1644 77952 26626 -90670
215 -90670 -21270 147936 -31019 -86017 47040 38313 -66463 -9892 -5093 -18693 -6250 -27216
227 -27216 51031 -37137 -10178 62437 -7906 -47061 29533 33855 -66589 -10231 19186 15551
239 15551 -40101 8296 38399 6533 24027 -10486 30180 3104 13063 -2060 -33522 3325
251 3325 45093 -20183 -63747 77180 29135 -27541 -17225 40256 40561 -55682 -36047 32977
263 32977 27878 -92865 -15148 52556 -5790 -51826 1542 62040 -29311 -28632 4343 33773
275 33773 -46952 -42737 42908 -12162 -51992 9848 64314 -46887 -8749 52369 17336 -28235
287 -28235 -12319 51120 -17392 -30846 3032 40493 -21866 -8532 41637 -1002 12843 14082
$$ packed form
203b9931J3934R6100n0593r7742N4248P6932m1404j38221J15033P9596n1326j17296
215i0670O9400J69206j78955n4998J33057q727j04776N6571M799j3600J2443k0966
227b7216P8247q8168K6959P2615p0343l9155P6594M322j00444N6358K9417l635
239A5551n5652M8397L0103l1866J7494l4513M0666k7076R959j5123l1462L6847
251C325M1768o5276m3564J40927m8045n6676J0316N7481L05r6243J9635O9024
263C2977n099j20743P7717O7704n8346m6036N3368O0498r1351O79L2975K9430
275C3773q0725M215Q5645n5070l9830O1840N4466j11201L8138O1118l5033m5571
287b8235J5916O3439o8512j3454L3878L7461o2359J3334N0169m2639J3845J239
$$ plain form
299 14082 11651 -22726 28244 199 -39425 2679 14904 715 -42965 24024 29576 -9726
311 -9726 -32192 31124 28141 -56039 -6796 15380 -2297 -47409 1969 19899 -8075 -14666 5788
324 5788 41397 -23273 -8484 17486 16985 -32127 -15443 30736 -9152 -14304 -4834 40285 -109
337 -109 -11610 15096 29644 -2713 -29838 28173 -1350 -12900 -18301 10575 12226 -11643 -6280
350 -6280 9646 26904 -24351 17 4159 3577 -21738 -23129 17433 -12257 -19022 -11378 29140
363 29140 -5740 -18845 7698 23551 -6082 -35118 23014 -3074 -11817 -15588 7582 14462 -14103
376 -14103 5674 20218 14784 -14483 19076 2331 7048 -2253 -15962 17836 -6159 6880 -4076
389 -4076 5078 16431 12340 -9819 6619 19525 -18049 1287 -7240 11424 -27038 -13981 36730
$$ packed form
299A4082k431l4377N0970k8045l9624M2104J2225j4189m3680O6989N552l9302
311i726k2466O3316k983q4180M9243K2176j7677m5112M9378J7930k7974o591K0454
324E788L5609o4670J4789K5970n01m9112J6684M6179l9888n152R470M5119m0394
337a09j1501K6706J4548l2357k7125N8011k9523j1550n401K8876J651k3869N363
350f280J5926J7258n1255K4368M142n82k5315j391M0562k9690o765P644M0518
363B9140l4880j3105K6543J5853k9633k9036N8132k6088q743l771K3170O880k8565
376a4103J9777J4544n434k9267L3559j6745M717r301j3709L3798k3995J3039j0956
389d076R154J1353m091k2159J6438J2906l7574J9336q527J8664l8462J3057N0711
$$ plain form
402 36730 -14667 -25612 11711 31120 -19150 -19837 5208 27780 -39304 -34387 54488 -24313 -40353
415 -40353 13906 40602 -18337 -37152 32771 37170 -32519 -27418 42086 -13150 -10745 -4069 10284
428 10284 7849 -27974 35571 17172 -23916 6714 28925 -16237 3340 1043 -13972 6830
440 6830 -10669 24515 -27124 -9845 40121 -7626 -14503 7719 2532 -6860 -815 -14183 15250
453 15250 -40572 -2746 53649 -40371 -23665 25207 32148 -20891 -26431 26928 17165 -43700 8381
466 8381 36497 -43652 2903 13730 29843 -6870 -43465 52604 31604 -41499 -1097 28082
478 28082 -20679 10425 460 -2326 -7386 -7718 47929 -23162 -12804 19461 -8175 7463 3879
491 3879 -29593 -2428 4698 -6709 19884 -54092 9202 46218 -34453 -5599 7672 -578 -11888
$$ packed form
402C6730n1397j0945L7323J9409n0270o87K5045K2572o7084M917Q8875p8801j6040
415d0353N4259K6696n8939j8815O9923M399o9689N101O9504n5236K405O676J4353
428A0284k435l5823O3545j8399m1088L0630K2211m5162J9577k297j5015K0802
440F830j7499L5184n1639J7279M9966m7747o877K2222n187r392O045j3368K9433
453A5250n5822L7826N6395r4020J6706M8872O941n3039n540N3359r763o0865N2081
466H381K8116q0149M6555J0827J6113l6713l6595R6069k1000p3103M0402K9179
478B8082m8761L1104r965k786n060l32N5647p1091J0358L2265k7636J5638l584
491C879l3472K7165P126j1407K6593p3976O3294L7016q0671K8854J3271q250j1310
$$ plain form
504 -11888 190 12683 -19552 -42281 48589 20193 -53277 14379 6534 28806 -3247 -32335
516 -32335 30966 3531 -24109 26776 3400 -36371 20326 13214 19881 -22030 -18033 48672 -6170
529 -6170 -1299 -6120 -18273 23670 7533 -29711 12774 -8751 -8833 38982 -26800 2097 -487
542 -487 -11003 31172 -13532 -27802 -1639 12878 11838 -17826 -30008 40531 -2705 -13736 28918
555 28918 -31741 8514 15019 -4904 5271 -24863 -6081 40844 -7634 -24465 15681 -1055
567 -1055 26258 -11290 -7701 14599 -21245 21680 3116 -25436 4819 1990 -2507 27472 -28890
580 -28890 -14669 34386 -8665 8865 -27871 -11659 31787 -9996 -19820 -4015 3258 9198 -5214
593 -5214 -10189 26004 -29649 -308 36526 -23979 -11784 -8554 21696 13525 -35064 -748 36883
$$ packed form
504a1888J2078J2493l2235k2729R0870k8396p3470O7656p845K2272l2053k9088
516c2335O3301k7435k7640N0885k3376l9771N6697p112O667m1911L997O6705n4842
529f170M871m821j2153M1943j6137l7244M2485k1525q2M7815o5782K8897k584
542d87j0516M2175m4704j4270K6163J4517j040k9664j2182P0539m3236j1031M2654
555B8918o0659M0255O505j9923J0175l0134J8782M6925m8478j6831M0146j6736
567a055K7313l7548L589K2300l5844M2925j8564k8552L0255k829m497K9979n6362
580b8890J4221M9055m3051J7530l6736J6212M3446m1783r824J5805P273N940j4412
593e214m975L6193n5653K9341L6834o0505J2195L230L0250q171m8589L4316L7631
$$ plain form
606 36883 -15731 -2967 24342 -15099 2314 -2460 29397 -7495 -46423 36091 26842 -27863
618 -27863 -8873 18772 6141 6369 -15869 14634 3317 -24861 25216 -6897 -11137 -3314 -395
631 -395 11518 -3552 -11855 5731 716 -1970 17138 -33388 763 16012 -8649 -1433 -22335
644 -22335 12001 17803 -16822 -9132 23536 -10184 -5943 10985 1026 -3698 -24359 31462 5321
657 5321 -32513 10824 23805 -8236 -14555 18927 10804 -17108 -15508 43995 -11718 -44522 29211
670 29211 20562 -15767 -26402 21137 21409 -19924 -14300 24961 -3548 -22044 16148 -6510 -2702
683 -2702 -7714 4730 4822 -9637 6963 498 -2080 2124 9116 -13198 2559 2569 2407 1100 -14327
698 -14327 16121 482 112 2826 1609 2551 5115 -26 -2719 4203 -9321 14718 -6154 -9368
$$ packed form
606C6883n2614J2764K7309l9441J7413m774L1857l6892l8928Q2514r249n4705
618b7863J8990K7645j2631K28k2238L0503j1317k8178N0077l2113m240P823K919
631c95J1913j5070q303J7586n015k686J9108n0526L4151J5249k4661P216k0902
644b2335L4336N802l4625P690L2668l3720M241J6928r959m724k0661N5821k6141
657E321l7834M3337J2981l2041o319L3482q123k7912J600N9503n5713l2804P3733
670B9211q649l6329j0635M7539K72m1333N624L9261k8509j8496L8192k2658L808
683b702n012J2444R2j4459J6600o465k578M204O992k2314J5757J0j62j307j5427
698a4327L0448j5639l70K714j217R42K564n141k693O922j3524K4039k0872l214
$$ plain form
712 -9368 9063 6670 -2563 -13461 15570 6136 -14333 -11389 20871 -2352 -25035 3631 12433
725 12433 515 -26265 11276 13163 -11351 -7184 4937 3467 -8398 1045 -6469 5273 -4438
738 -4438 -223 716 -1101 8531 -6654 4194 3204 2259 -6935 6625 3242 -9656 5323 5438 454
753 454 -12885 17366 7644 -13644 -624 14568 4520 -20736 6002 10763 -2399 -16140 8072
766 8072 10446 -10640 359 1182 6561 -5974 1439 -3245 -482 3154 -5093 -2533 -3167 11377 -7225
781 -7225 -3755 4068 7442 -3178 -9480 11100 314 -4479 -7104 10418 -231 -7938 3193 6286
795 6286 2287 -12152 12738 4019 -8825 -4594 12810 830 -20390 8069 12758 -6062 -20881
808 -20881 18696 13107 -20516 -7017 17557 7266 -28656 4909 16612 -8207 -19108 11800
$$ packed form
712i368J8431k393r233j0898K9031r434k0469K944L2260k3223k2683K8666Q802
725A2433j1918k6780L7541J887k4514M167J2121j470j1865R443p514J1742r711
738d438M215R39j817R632j5185J0848r90r45r194J3560l383j2898J4979J15m984
753D54j3339L0251r722k1288J3020J5192j0048k5256K6738M761j3162j3741K4212
766H072K374k1086J0999Q23N379j2535P413m684K763L636q247K560o34J4544j8602
781g225L470P823L374j0620o302K0580j0786m793k625J7522j0649p707J1131L093
795F286l999j4439K4890q719j2844M231J7404j1980k1220K8459M689j8820j4819
808b0881L9577n589l3623J3499K4574j0291l5922L3565J1703k4819j0901L0908
$$ plain form
820 11800 12108 -17531 -225 8589 4605 -15558 7503 7780 -12565 85 7703 -37 -13452 11549
834 11549 5525 -4984 -5239 12383 5283 -15093 10949 4412 -4250 -6639 11060 3129 -11131 3878
848 3878 11538 -1628 -14365 18152 1655 -10675 -1419 9934 2879 -21064 6697 13965 -7401
861 -7401 -18383 15426 9830 -13264 -8012 9006 11566 -24413 3611 12079 -9048 -9650 5845
874 5845 9003 -9342 -5703 6636 11811 -17977 3378 9346 -7772 833 -1598 6387 -7412 211
888 211 7995 441 -7806 6641 2815 -3804 7790 -11520 5810 620 -1778 3366 -9037 4025
902 4025 6695 -4201 -4941 8018 -5386 3305 -2779 -174 4266 -14941 12192 2290 -8832 59
916 59 2624 4296 3079 -9724 622 12880 -11161 5482 -2896 -320 4465 -6509 11386 -3192
$$ packed form
820A1800L08k9639J7306Q814l984k0163K3061K77k0345J2650P618p740j3415K5001
834A1549o024j0509k55J7622p100k0376K6042o537q662k389J7699p931j4260J5009
848C878P660j3166j2737L2517j6497j2330R256J1353p055k3943K7761P268k1366
861g401j0982L3809n596k3094N252J7018K560l5979K8024Q468k1127o02J5495
874E845L158j8345L639J2339N175k9788K1355N968j7118Q605k431P985j3799P623
888B11P784p554q247J4447l826o619J1594j9310J7330n190k398N144j2403J3062
902D025K670j0896p40J2959j3404Q691o084K605M440j9207K7133r902j1122Q891
916E9K565J672j217j2803J0346J2258k4041J6643q378K576M785j0974J7895j4578
$$ plain form
930 -3192 -8186 8303 8347 -6072 -557 -6674 12067 6491 -23079 13319 2228 -6300 4405 -257
944 -257 739 -4740 -1733 11803 -2107 -19982 11843 2876 -1420 -7383 -8606 18376 -10237 -5123
958 -5123 11690 -9218 -6557 13299 -3336 -4222 -4889 -3316 19932 -15290 -4585 8923 -4813
971 -4813 7890 -2116 -4277 2616 -1062 4723 6467 -19276 9684 8407 -11511 12096 -8060
984 -8060 -328 5225 1110 6870 -10575 -8530 20679 762 -17995 6703 -791 11010 -8520
997 -8520 -6990 18468 -16335 -604 19529 -9866 -14847 9334 6743 3459 -17627 -1294 23302
1010 23302 -17066 1134 7412 -5943 -511 -322 10806 -4195 -19681 13401 17782 -22988 2839
1023 2839 3017 129 9002 -13378 7089 -1748 -6056 13313 -3069 -15031 9320 2244 -1611 1526
$$ packed form
930c192m994J6489M4j4419N515o117J8741n576k9570L6398j1091q528J0705m662
944b57R96n479L007J3536j3910j7875L1825q967m296n963j223K6982k8613N114
958e123J6813k0908K661J9856j6635q86o67J573K3248l5222J0705J3508j3736
971d813J2703j0006k161O893l678N785J744k5743K8960j277j9918K3607k0156
984h060P732N553m115N760j7445K045K9209j9917j8757K4698p494J1801j9530
997h520J530K5458l4803J5731K0133k9395m981K4181k591l284k1086J6333K4596
1010B3302m0368J8200O278j3355N432J89J1128j5001j5486L3082M381m0770K5827
1023B839J78k888Q873k2380K0467q837m308J9369j6382j1962K4351p076l855L137
$$ plain form
1037 1526 -11502 12732 -6519 551 11109 -18135 588 12586 -2516 -7466 -3776 2034 13310
1050 13310 -14910 399 11073 -15868 10733 3412 -4544 -4998 -3045 15093 647 -21023 9418
1063 9418 14632 -14356 5985 -1276 3150 -238 -5942 16829 -8315 -11983 12716 7575 -9125
1076 -9125 -1736 -1163 11544 -915 -10801 12768 -9457 3296 7446 -9287 433 425 -162 5154 -4951
1091 -4951 -6102 9893 -7481 6075 -430 -11709 9809 -1990 -119 -2653 -4166 4249 2027
1104 2027 -6233 4923 -2657 -5520 11606 -6468 1375 -4473 -1020 11409 -7542 -5220 4978
1117 4978 2030 -923 1312 -6278 8341 -2287 -4638 9143 -7723 1100 251 1387 3142 -6182
1131 -6182 -2228 9111 -479 -6527 3386 -2255 6882 -6283 -1719 7306 -7164 1507 3234 167
$$ packed form
1037A526j3028K4234j9251P070J0558k9244J8723J1998j5102m950L690N810J1276
1050A3310k8220J5309J0674k6941K6601p321p956m54J953J8138j4446k1670L0441
1063I418N214k8988K0341p261M426l388n704K2771k5144l668K4699n141j6700
1076i125P389N73J2707j2459r886K3569k2225J2753M150j6733R720qn87N316j0105
1091d951j151J5995j7374J3556o505j1279K1518j1799J871k534j513Q415k222
1104B027q260J1156p580k863J7126j8074P843n848L453J2429j8951K322J0198
1117D978k948k953K235p590J4619j0628k351J3781j6866Q823q49J136J755r324
1131f182L954J1339r590o048R913n641R137j3165M564R025j4470Q671J727l067
$$ plain form
1145 167 -3830 -92 3849 5475 -10030 -380 11997 -7828 37 407 3620 -1337 -4470 6823
1159 6823 1896 -7172 1084 9437 -6209 -1135 48 4020 -470 -6327 6780 -3321 -1330 2726
1173 2726 498 -4263 1397 1912 -1459 -1800 -2279 6638 -8252 234 5751 -4834 -3253 2487 5079
1188 5079 -6505 -2464 4385 4398 -10099 586 8874 -6284 -3329 2357 7785 -8482 -3570 10173
1202 10173 1444 -9342 921 11156 -6047 -4516 2661 8380 -7043 -5188 11244 -704 -6023
1215 -6023 246 9300 -4285 -4434 3444 4713 -4091 -4662 8867 -2949 -2583 853 4560 -3085 -2598
1230 -2598 5324 -1500 -2240 -481 5120 -5403 -80 3446 -837 -2447 -831 6943 -5610 -1925 4070
1245 4070 2649 -6938 -89 7298 -4503 -3320 1078 7175 -6950 -2870 6585 957 -5559 -1822
$$ packed form
1145A67l997L738L941J626j5505R650J2377j9825P865L70L213m957l133J1293
1159F823m927r068Q256Q353j5646N074J183L972m490n857J3107j0101J991M056
1173B726k228m761N660N15l371l41m79Q917j4890Q486N517j0585J581N740K592
1188E079j1584M041O849J3j4497J0685Q288j5158K955N686N428j6267M912J3743
1202A0173q729j0786J0263J0235j7203J531P177N719j5423J855J6432j1948n319
1215f023O269R054j3585j49P878J269q804n71J3529j1816L66L436L707p645M87
1230b598P922o824p40J759N601j0523N323L526m283j610J616P774j2553L685N995
1245D070j421r587O849P387j1801J183M398O097j4125M080R455n628o516L737
$$ plain form
1259 -1822 8996 -4789 -4763 2290 5830 -5966 -4072 7645 -1014 -3381 -2420 7171 -2528 -4405 2302
1274 2302 2691 -2157 -4469 5363 -1273 -342 -2271 2964 804 -2676 1788 -772 1920 -2310 1923
1289 1923 -1093 1238 -87 -854 1821 -1122 2867 -3141 2930 527 -748 -49 640 1931 -2227 1079
1305 1079 -456 3539 -3502 922 2468 -1511 676 -1455 3237 -2421 -946 232 2181 -2213 -1939
1320 -1939 2430 -530 1352 -4804 3365 934 -2530 -471 -78 2137 -2901 -767 1038 2794 -5704
1335 -5704 947 3699 -1685 -1426 -2810 6478 -2210 -4373 2431 3251 -3750 -1327 4292 -961 -1676 -1892
1351 -1892 7621 -3569 -5240 5887 1139 -2146 -3010 3789 930 -2638 -971 5601 -3346 -3352 6622
1366 6622 -2272 -388 -2113 2614 1702 -3291 1370 1058 -1769 1335 3859 -5721 1804 1539 1668 -1247
$$ packed form
1259a822J0818j3785K6P053L540j1796J894J1717q659k367R61R591r699j877O707
1274B302L89m848k312R832o636R31j929N235k160l480M464k560K692m230M233
1289A923l016K331j325p67K675k943L989o008O071k403j275O99O89J291m158L306
1305A079j535L995p041M424J546l979K187k131M692n658J475J178J949m394K74
1320a939M369k960J882o156Q169k431l464K059L93K215n038K134J805J756q498
1335e704O651K752n384K59j384R288q688k163O804Q20p001K423N619n253p15k16
1351a892R513j1190j671J1127m748l285q64O799k859l568J667O572q947oR974
1366F622q894J884j725M727r12m993M661l12k827L104K524r580P525k65J29k915
$$ plain form
1382 -1247 -5159 7401 -989 -4120 3295 2366 -4704 781 3864 846 -4383 -3771 11252 -4339 -6047
1397 -6047 4032 1703 -858 -3772 3306 1688 -5824 -391 10181 -7814 -5719 7047 1344 -1140
1411 -1140 -7971 5274 4054 -6889 973 4409 -5121 -1215 5013 -1087 -1072 -6378 7249 2584 -8311
1426 -8311 3749 -146 -900 2531 302 -2945 168 404 5791 -4002 -6180 9052 -2595 135 570
1441 570 -1711 1828 -822 2683 2347 -6997 -420 11122 -6132 -2468 1084 1461 3974 -6297 3441
1456 3441 1147 -4783 3813 4613 -6158 -1954 2157 4565 735 -11447 7350 2878 -4476 2558
1470 2558 -2498 -52 1344 -191 1801 -1807 -6671 8552 208 -4809 1110 -3755 6591 -809
1484 -809 -4210 1257 -947 1175 3645 -5157 -1601 3386 -2768 5820 -4820 -2950 4330 -1142 3504
$$ packed form
1382a247l912J2560q390l131P415r29p070N485L083l018n229O12J5023j5591j708
1397f047J0079k329k561k914P078j618p512N433J0572j7995K095J2766n703k484
1411a140o831J3245j220j0943P862L436r530L906O228o100J5n306J3627m665j0895
1426h311J2060l895p54L431k229l247L113K36N387r793k178J5232j1647K730M35
1441E70k281L539k650L505l36r344O577J1542j7254L664L552L77K513j0271R738
1456C441k294n930Q596Q00j0771M204M111K408l830j2182J8797m472p354P034
1470B558n056K446J396j535J992l608m864J5223q344n017N919m865J0346p400
1484h09l401N467k204K122K470q802L556M987o154Q588j0640J870P280n472M646
$$ plain form
1499 3504 -3607 -4138 5123 2103 -3890 1422 -4207 2968 4033 -5961 3547 -3568 812 5379 -3257
1514 -3257 -1429 428 -588 4372 -232 -6427 4393 -73 3318 -925 -6308 6585 -175 -885 1772
1529 1772 -2320 -564 3181 -708 2200 -3950 -3671 10944 -3490 -4089 1134 1049 3378 -3717 -1109
1544 -1109 3297 -3018 -1098 6550 -5396 -2526 2065 2409 2408 -8926 2470 5045 -3629 -559 919
1559 919 -2480 1123 652 -8 276 -6473 6716 1826 -6207 1902 -450 1126 407 -1522 23 -291
1575 -291 -1387 5544 -2927 -5064 5831 -735 265 -2159 512 2103 -2976 1948 2779 -5059 -1173
1590 -1173 7135 -2080 -2305 -2060 4469 3002 -7704 3539 2880 -3527 -170 3998 -1317 -2585 -153
1605 -153 4805 650 -7924 5304 2514 -2849 -703 1028 1870 -2883 384 2938 -1631 -4247 5376
$$ packed form
1499C504p111n31R261l020n993N312n629P175J065r994R508p115M380M567q636
1514c257J828J857j016M960m604o195J0820m466L391m243n383J2893o760p10K657
1529A772m092J756L745l889K908o150K79J4615j4434n99N223q5K329p095K608
1544a109M406o315J920P648j1946K870M591L44jj1334J1396K575q674L070J478
1559I19l399L603m71o60K84o749J3189m890q033Q109k352J576p19j929J545l14
1575b91j096O931q471k137J0895o566J000k424K671J591n079M924Q31p838L886
1590a173Q308r215k25K45O529j467j0706J1243o59o407L357M168n315j268K432
1605a53M958m155q574J3228k790n363K146J731Q42m753L267K554m569k616R623
$$ plain form
1620 5376 146 -3044 99 -171 3468 -3670 89 1622 -2188 -64 2326 -1877 -1832 2423 -778 852
1636 852 -3286 2057 907 -3593 2460 109 -1635 -1254 2822 -204 -1720 -1889 3507 530 -4622 3041
1652 3041 -35 -272 -1389 1462 1186 -2769 71 2927 -83 -4234 3318 581 -399 -1619 577 3019
1668 3019 -3176 420 1561 515 -2315 1451 1288 -328 -1007 -542 3192 -2180 553 -278 680 570
1684 570 -1250 824 15 572 -1394 1656 -900 631 -562 -150 1573 -2188 974 -301 624 -1087
1700 -1087 282 199 -431 -3 -687 1348 -2108 1170 -514 -93 50 -723 807 -1019 867 -1009 455
1717 455 -516 1019 -1080 -957 1838 -1135 -106 -1148 2393 -704 -1822 919 1579 -786 -2575 2739
1733 2739 330 -942 -1722 2819 833 -3243 1307 1674 163 -2945 2446 1418 -1619 -1147 2226 1392
$$ packed form
1620E376n230l190L143k70L639p138L759J533l810K124K390m203M5M255l201J630
1636H52m138N343j150m500O053k351j744L81M076l026j516j69N396k977n152P663
1652C041l076k37j117K851k76l955K840K856l010m151P552k737r80j220K196K442
1668C019o195L596J141j046k830L766j63j616o79M65L734n372K733q31R58j10
1684E70j820K074q09N57j966L050k556J531j193M12J723l761L162j275R25j711
1700a087J369q3o30M28o84K035l456L278j684M21J43p73J530j826J886j876J464
1717D55r71J535k099J23K795k973J029j042L541l097j118K741O60k365j789N314
1733B739k409j272p80M541j986m076M550L67j511l108N391j028l037M72L373q34
$$ plain form
1749 1392 -3682 1838 1452 -226 -2375 1769 2193 -2658 -252 1864 1244 -3267 1710 1316 -851 -1003
1765 -1003 951 1754 -2922 1097 978 -579 -1415 1427 589 -2137 732 482 238 -2747 2514 600
1781 600 -2849 307 1558 25 -3202 1644 1466 -1407 -2481 2812 754 -3790 1379 1528 148 -3448
1797 -3448 1720 2442 -2673 -1549 2347 1160 -3757 1373 1358 243 -3003 1346 3198 -3479 -243 2038
1813 2038 1011 -2539 256 1568 164 -1636 610 2503 -3141 1572 814 -182 -582 -8 1788 -1050
1829 -1050 -395 790 774 -2163 2582 -185 -1272 924 -99 1898 -2666 333 1798 -927 -1047 1565
1845 1565 -319 -1244 1200 -413 1283 -3404 1698 2478 -2952 -26 678 778 -1213 -351 21 1199
1861 1199 -2660 1236 1651 -3270 1056 -780 1856 -974 -2498 1760 1042 -1622 109 406 -1199 1995
$$ packed form
1749A392n074N520l86j678k149M144M24m851K406K116o20m511M977l94k167j52
1765a003J954Q03m676M019j19j557q36K842q38k726K869k50k44k985N261j914
1781F00l449L156J251j533l227M846j78k873j074N293k058m544N169J49j380l596
1797c448N168P22n115J124L896j187m917N130j5j115l246M349J852o677L236K281
1813B038j027l550K795J312j404j800K246J893n644M713p58r96m00N74J796k838
1829a050O55J185j6k937M745k767j087K196j023J997m564K999J465k725j20K612
1845A565j884r25K444j613J696m687N102P80n430K926P04J00j991Q62L72J178
1861A199l859L896M15m921M326j836K636k830j524M258p18k664J731K97j605L194
$$ plain form
1877 1995 -2022 1499 -381 -1999 2948 -739 -378 -651 -97 1395 820 -2778 1753 591 -950 2452
1893 2452 -2842 1515 10 -537 2255 -1632 -943 2031 270 -845 835 -2176 2972 -264 -1261 1755
1909 1755 -2823 2417 790 -1790 141 165 -147 1763 -1683 -629 1701 -2649 3621 -1133 -2809 1774
1925 1774 232 1231 -1906 -1868 2727 391 -2970 2771 -1446 -1186 2070 -1024 1666 -3856 261 4610
1941 4610 -2535 -2643 2015 305 -137 -283 -1358 2588 -3297 1474 2969 -4703 449 1483 772 -319
1957 -319 -2403 768 2796 -2786 1262 977 -3603 3393 -177 -228 -918 -1386 3702 -302 -2666 1789
1973 1789 70 -1004 3292 -2287 -53 247 176 3716 -4334 -652 3613 -993 -832 740 -894 890
1989 890 -457 333 2061 -5256 2388 3374 -2736 -534 -555 2342 407 -2605 976 1516 -3476 2847
$$ packed form
1877A995m017L521j880j618M947l687L61k73N54J492n75l598M531j162j541L402
1893B452n294M357j505n47K792l887O89K974j761j115J680l011N148l236r97L016
1909A755m578N240j627k580J931K4l12J910l446J054K330m350O270m754j676M583
1925A774j542R99l137L8M595k336l361N741m217K60L256l094K690n522M117M349
1941D610p145j08M658j710m42j46j075L946n885M771J495p672N152J034p11j091
1957c19k084L171K028n582M048k85m580O996l570n1o90m68N088m004k364M455
1973A789j719j074M296n579K234L00p1L540q050L682M265m606J61J572j634J784
1989H90j347P90J728p317P644R86o110K202k1K897j935l012L581N40m992O323
$$ plain form
2005 2847 915 -3063 990 -652 3362 -1892 -3315 3189 565 -1851 958 -1010 -647 1769 -1753
2020 -1753 2188 -2415 -1099 3866 -1999 -548 -16 -272 1277 254 -1483 1178 -1161 1019 2122
2035 2122 -4025 1779 488 48 701 -1785 1080 843 -994 1280 225 -2935 2953 142 -436 -126
2051 -126 -1887 3513 -834 -1354 1199 -171 -320 1256 -773 14 -176 -974 3617 -2484 -966 1594
2067 1594 -123 875 -1629 -380 1621 -224 -1127 1609 -1740 284 850 -1017 1513 -2528 796 1506
2083 1506 -1205 -822 235 -2 592 -739 -1255 1818 -1898 1149 424 -1468 867 -326 956 -389
2099 -389 -1301 296 1168 -1393 694 -53 -1017 1602 -1102 748 -784 -441 1352 -632 -521 651 88
2116 88 -647 1345 -924 474 -880 642 1532 -2249 446 1187 121 -853 310 788 162 -1229 652
$$ packed form
2005B847j932l978M053j642M014n254j423O504k624k416K809j968L63K416l522
2020a753L941m603J316M965n865J451N32k56J549j023j737K661k339K180J103
2035B122o147N804j291m40O53k486K865k37j837K274j055l160N888k811n78L10
2051a26j761N400m347n20K553j370j49J576k029P87j90p98M591o101J518K560
2067A594j717R98k504J249K001j845r03K736l349K024N66j867K530m041L324P10
2083A506k711L83J057k37N94j331n16L073l716L047p25j892K335j193J282j345
2099c89r12J597Q72k561K087p47r64K619k704J850j532L43J793j984J11J172n63
2116H8p35J992k269J398j354J522Q90l781K695P41j066r74J163M78o26j391J881
$$ plain form
2133 652 1605 -2621 902 1171 -93 -1003 -276 1966 -683 -1275 882 1371 -1969 345 926 -244 -757
2150 -757 -638 2143 -1487 -993 939 545 -1269 -241 976 -389 -427 -441 1435 -1486 -226 1191 -831
2167 -831 -238 -71 862 -816 -344 338 480 -1220 168 1315 -1498 25 277 937 -1416 -199 1378
2184 1378 -470 -971 403 1235 -1440 57 650 588 -1226 -485 2162 -1130 -656 668 1274 -1170 -363
2201 -363 1295 119 -912 -487 2171 -1093 -670 576 811 -403 -887 1469 -75 -450 -510 1294 -612
2218 -612 -405 464 126 275 -946 1057 -556 -266 16 181 -358 -268 799 -682 273 -597 789 -559
2236 -559 -331 706 -726 -134 -309 673 -843 49 26 436 -650 -523 1208 -776 50 -511 860 -316
2254 -316 -731 708 340 -354 -796 1171 -415 134 -496 692 361 -1169 1005 81 101 -719 673 420
$$ packed form
2133F52R53m226L523K69j264r10P27K242k649n92K157M89l340K314N81j170n13
2150g57J19K781l630M94J932l94j814J028J217j365l8j4J876k921J260J417k022
2167h31N93J67R33j678M72O82J42j700J388J147k813J523K52O60k353J217J577
2184A378j848n01J374Q32k675J497N93o2j814P41K647l292M74J324O06k444Q07
2201c63J658j176j031M25K658l264M23J246K35j214m84K356j544l75o0J804j906
2218f12K07Q69l38J49j221K003j613K90K82J65n39R0J067j481R55q70J386j348
2236e59K28J037j432N92j75R82j516Q92k3M10j086J27J731j984Q26n61J371j176
2254c16m15J439l68o94m42J967j586N49o30J188l31j530K174r24K0q20J392k53
$$ plain form
2272 420 -139 -527 564 963 -1452 755 -21 411 -504 -91 1055 -429 -202 298 826 -1071 333 -1
2290 -1 679 -363 -838 1460 -676 206 120 10 -330 91 205 -171 -222 -636 1270 -1229 205 112 -482 400
2310 400 -552 316 -723 -428 454 580 -1518 625 574 -936 516 -828 744 -711 -341 1346 -633
2327 -633 -1226 818 908 -807 -257 -289 1764 -1105 -760 1843 -1118 -310 426 540 -563 -756 700 1480
2345 1480 -1488 -818 1900 -861 261 -373 226 277 -1023 1260 213 -1451 423 1521 -865 176
2361 176 -541 585 822 -1424 1294 -897 -561 1429 -97 -774 141 186 646 -236 -1437 1664 -1098
2378 -1098 23 1362 -1634 -54 17 656 2 -1637 -106 2051 -1364 -385 672 -1063 987 -795
2394 -795 758 -230 -1813 1754 903 -1870 -270 839 24 571 -1788 820 366 -1401 1772 -884
$$ packed form
2272D20n59l88J091L99k415K207p76M32r15M13J146j484K27N00N28j897J404l34
2290aO80j042m75K298k136Q82q6j10l40M21J14l76n1m14J906k499J434r3n94Q82
2310D00r52Q68j039K95Q82J26k098K143n1j510J452j344J572j455L70J687j979
2327f33n93K044R0j715N50l2K053k869L45K603k961Q08P36J14j103j93J456P80
2345A480k968O70K718k761J122o34N99N1j300K283j047j664J874J098k386J041
2361A76p17J126K37k246K718k191L36J990j526o77R15M5M60q82j201L101k762
2378a098J121J339k996J580P1O39o54j639J531K157l415R79J057j735K050j782
2394g95J553r88j583L567q51k773J600J109q15N47k359K608m54j767L173k656
$$ plain form
2410 -884 -709 494 579 503 -555 -1300 1927 464 -1432 1175 -1450 1093 703 -902 713 -1018 447
2427 447 1325 -914 -813 1159 -781 1482 -489 -1150 1358 -944 1392 -280 -1598 1023 808 -439
2443 -439 294 -905 86 1514 -1628 1198 -788 -958 1806 -687 -201 -457 -206 1415 -103 -2102 1181
2460 1181 -195 -341 868 -1739 995 -686 -38 1223 -1466 -846 1168 164 -326 -470 -991 2273
2476 2273 -1133 -548 892 -1431 1021 66 -160 -100 -859 560 1545 -1650 -364 1191 -802 1244 -1250
2493 -1250 143 712 -715 1002 -145 -952 907 704 -699 573 -1302 1017 709 -1242 1117 -1112
2509 -1112 320 1281 -440 -551 125 -36 1037 -642 -1139 1725 -1250 509 605 -1002 272 -335 815
2526 815 118 -1514 286 1711 -1428 -36 8 -382 832 -1336 1001 -271 -1341 995 544 -1188
$$ packed form
2410h84J75J203Q5p6j058p45L227j463j896K607k625K543l90j605J615j731J465
2427D47Q78k239J01J972j940K263j971o61K508k302K336j672j318K621k15j247
2443d39P33j199R91J428l142K826j986j70K764k493M86k56K51J621j518j999L283
2460A181j376j46J209k607K734j681O48J261k689O20K014j004m90j44n21L264
2476B273l406N85J440k323K452r55k26O0p59J419R85l195J286J555j993K046k494
2493a250J393N69j427J717j147q07J859k03j403J272j875K319l08j951K359k229
2509a112J432R61j721j11O76j61J073j679m97K864k975J759R6j607J274o07J150
2526H15o97j632J800J425l139J392M4l90J214k168K337j272j070K336m51j732
$$ plain form
2542 -1188 -390 376 349 239 -1793 1233 111 -785 1046 -871 105 -56 190 407 -565 -916 1258 -200
2560 -200 -852 812 -868 896 -194 -31 240 -895 537 711 -561 -284 831 -522 484 -282 109
2577 109 534 -744 1272 -372 -740 302 620 -97 -222 -129 591 429 -974 1207 -393 -411 582 78
2595 78 317 -853 232 703 -194 -1017 1112 -62 -353 202 -409 686 -1052 222 469 -713 -242 370
2613 370 221 -447 -58 -242 639 -1031 98 324 -918 317 -290 286 -385 -22 27 382 -583 -15 436
2632 436 -519 645 -593 362 -271 6 304 -434 152 200 289 -654 605 -326 231 -108 32 731 -921
2651 -921 388 231 209 -472 328 574 -45 -201 -3 899 -891 360 417 114 -344 -273 768 -367 -147
2670 -147 -74 803 -703 -32 367 4 -110 -567 945 -512 -448 -65 446 -226 -383 478 -209 67 -718 721
$$ packed form
2542a188P98P66k7j10k032L026j122q96J831j917R76j61K46K17r72l51K174j458
2560b00o52J664j680J764j090J63K71j135J432J74j272K77J115j353J006p66L91
2577A09M25j278K016j644l68J042L18p17j25R3P20j62j403K181j600j8R93n04
2595G8K39j170J085M71q97q23K129j174k91N55o11J095j738J274K47j182M71O12
2613C70j49o68L89j84Q81j670J129K26j242J235o07N76o71L63M9L55r65N68M51
2632D36r55J164j238R55o33K77K98p38N86M8Q9r43J259r31N57l39J40O99j652
2651i21J309j57k2o81Q00K46o19j56J98R02j790J251N7l03m58P1J041j135K20
2670a47P3Q77j506O71L99l63j14m57J512j457O4L83N11o72j57Q61o87K76p85J439
$$ plain form
2690 721 -268 -253 34 -124 112 -589 405 -235 74 -306 357 -226 -311 556 -478 308 -471 330 -215 -250 284
2711 284 -102 -285 -212 658 -651 81 -27 547 -36 -549 1001 -269 -201 -212 601 -229 -297 144 535 -164
2731 -164 -830 1022 -225 -25 -6 317 266 -784 344 357 -87 -675 731 -128 -267 -58 68 582 -961
2750 -961 184 232 -262 -168 16 73 -195 13 -160 331 -1082 500 72 -529 185 -501 320 -215 -24 -82
2770 -82 82 -512 594 -192 -666 645 -457 543 -452 -64 463 -493 115 267 -238 -498 668 -285 244
2789 244 -693 150 892 -1035 347 71 105 -88 16 203 53 -567 482 974 -1472 571 164 333 57
2808 57 -827 827 -6 -279 433 329 -830 798 -27 289 -86 -1081 1475 -489 -496 282 -227 180 253 -304
2828 -304 58 -63 -425 1351 -1265 -38 482 -568 671 -675 -229 25 -40 59 396 -1376 697 660
$$ packed form
2690G21r89J5K87j58K36p01R94o40L09l80O63n83q5Q67j034P86p79Q01n45l5N34
2711B84l86j83P3Q70j309P32j08N74n83n13J550j270O8j1Q13q30o8M41L91o99
2731a64o66J852j247K00J9L23n1j050J128J3m44n88J406q59j39K09J26N14j543
2750i61J145M8m94R4J84N7k68K08j73M91j413J582m28o01P14o86Q21n35J91n8
2770h2J64n94J106p86m74J311j102J000r95L88N27r56O08J52n05k60J166r53N29
2789B44r37Q43P42j927J382k76L4j93J04J87j50o20J049M92k446K043m07J69k76
2808E7q84J654q33k73P12j04j159J628q25L16l75r95K556j964pP78n09M07P3n57
2828c04L62j21l62J776k616J227N20j050J239j346M46K54o5R9L37j772K073l7
$$ plain form
2846 660 -856 612 -991 756 396 -874 615 -292 -482 966 157 -1006 190 -610 1436 -583
2862 -583 -1348 1220 -505 249 81 -565 28 184 -97 894 -962 -686 1948 -801 344 -631 -78 1279
2880 1279 -706 -29 306 -594 591 887 -1162 473 -280 262 1148 -1682 694 263 -215 711 -722
2897 -722 -517 838 -288 96 71 -1589 1685 -397 -320 520 -1211 820 211 -521 96 -551 -274 1443
2915 1443 -1304 -519 715 -630 1278 -1162 -301 761 -563 616 230 -1229 315 640 -531 492
2931 492 -1685 751 1283 -1355 596 -585 2 865 -453 -247 339 -864 1323 358 -1539 812 -661
2948 -661 836 190 -1524 823 206 -84 513 -741 -284 1185 -541 757 -447 -775 1907 -679 10
2965 10 2 -396 992 133 -926 408 -431 207 1096 -1598 495 113 -255 1077 -1141 -102 430 -180
$$ packed form
2846F60j516J468j603J747l60j270J489r07j90J448q09j163J196q00K046k019
2862e83p65K568j725P54j68o46N93J56k81R91j856K76K634k749J145r75N53J357
2880A279j985O77L35r00J185K96k049J635p53N42Q86k830K376m31m78R26j433
2897g22K05J355j126L84k5j660L274k082P7Q40j731K031o09p32O17o47K77J717
2915A443k747P85J234j345J908k440Q61J062j324J179l86j459J544L25j171J023
2931D92k177K436N32k638J951j181N87Q63j318K06N86j203K187r65j897K351j473
2948f61J497o46j714K347o17k90N97j254M57J469j726J298j204l28K682k586O89
2965A0ql98J388q59j059J334q39O38Q89k694K093l82l68J332k218J039N32o10
$$ plain form
2983 -180 624 -96 -1170 1042 204 -586 167 -1173 1217 -70 -979 611 -587 -182 720 -349 -358 130
3001 130 -620 1495 -1008 -893 1157 -511 609 -460 -187 433 -328 -38 594 -972 -153 1195 -625
3018 -625 393 -866 396 1036 -927 287 89 -406 531 328 -586 389 -477 567 436 -1135 966
3035 966 -238 75 409 -481 31 260 171 240 -211 -633 1366 -617 -133 305 -436 543 -282 185 98 -457
3055 -457 8 805 -862 -264 512 -237 452 -1065 597 162 -641 482 149 -471 -133 315 -324 13 -933
3074 -933 714 42 -651 520 -380 187 -102 -143 -53 -82 -415 534 53 -583 480 -502 412 -209 -125 361
3094 361 -168 258 85 -45 -24 485 -357 346 -9 -134 469 -378 593 -200 -245 288 320 -92 28 174 87
3115 87 343 -549 532 -185 -155 295 -135 247 -259 144 73 176 -393 437 15 -162 99 -355 460 -384 56
$$ packed form
2983a80Q04p20j074K212q38p90P53j340K390j287r09J590j198M05R02j069rM88
3001A30p50K115k503J15K050j668J120j069K73O20p61K90O32j566Q19J348j820
3018f25J018j259J262O40j963J214j98m95R37k03r14R75q66J044j31j571K101
3035I66j204L13L34q90N12K29q9O9m51m22J999j983M84M38p41R79q25M67q7n55
3055d57M65P97j667N98P76p49O89j517J662m35q03J123l33o20L38M48o39L37r46
3074i33J647o72o93J171r00N67k89m1R0k9l33R49m81o36J063r82R14o21Q4M86
3094C61n29M26j73j30K1N09q42P03l55j25O03q47R71p93m5N33L2m12J20J46q7
3115H7K56q92J081p17L0M50m30L82n06M03p1J03n69Q30m22j77K61m54Q15q44M40
$$ plain form
3136 56 161 65 -168 -200 187 -233 108 -362 523 -273 -162 59 -268 195 -399 275 -63 -173 -334 261 -192
3157 -192 -368 168 -147 116 -578 212 216 -339 221 -81 5 -173 281 14 292 -238 144 84 -294 438 -309
3178 -309 93 -92 157 -18 -102 113 217 -156 -413 601 -390 -7 41 -9 105 -591 405 114 -184 -412 552
3199 552 -75 -160 205 31 144 -707 603 -31 -349 -167 192 10 -376 141 129 121 -548 494 -26 -458 175
3220 175 -93 139 -479 65 177 -151 -272 368 -75 -367 379 -465 177 -399 273 314 -446 120 134 -68 -210
3241 -210 453 -379 67 -8 306 153 -718 837 -15 -110 -24 306 23 -169 63 298 1 -378 901 -430
3261 -430 -298 105 16 528 -541 209 416 77 -319 457 -345 -79 166 -247 376 -850 291 295 -277 159
3281 159 -99 -336 175 -75 -280 284 -643 558 -28 -562 481 -278 161 283 -49 -65 65 -142 416 -395
$$ packed form
3136E6J05r6k33l2L87m20L41m70Q85p96J11K21l27M63n94O74l38j10j61N95m53
3157a92j76N36l15K63o94P90Mn55N60l02Q6j78M54k67K78n30L82o0l78P32p47
3178c09M02j85K49j75q4K15J04l73k57J014r91L83M8n0J14o96R96k91k98k28R64
3199E52o27q5L65j74J13q51J310o34l18J82L59j82l86N17j2qo69J042n20m32O33
3220A75k68K32o18N44J12l28j21O40m43k92P46q44O42n76O72M1p60N66J4k02j42
3241b10O63q32M46p5L14j53q71J555q52r5Q6L30k83j92K32K35k97l79J279j331
3261d30J32M03q9N12j069P50K07l39l96P76q02K66K45m13O23j226J141Mn72M36
3281A59k58k37N11k50k05N64r27J201n86n34J043p59M39J22l32j6J30k07N58q11
$$ plain form
3301 -395 -369 751 -410 79 -184 -121 338 -406 79 82 -418 139 745 -686 113 -110 63 424 -696 440
3321 440 42 -57 294 -245 -309 372 -34 77 273 -727 752 16 23 319 -636 551 302 -241 -11 73 -45
3342 -45 787 -547 -64 347 -628 845 -165 -394 71 -151 475 -38 -646 327 365 -688 422 -484 -24
3361 -24 216 -553 649 -632 -180 811 -235 -456 121 -388 546 176 -767 458 -682 395 459 -1059
3379 -1059 180 155 42 223 -435 -184 438 -569 524 -67 -891 748 -105 -25 -268 -509 799 104 -608
3398 -608 279 -171 -317 984 -351 -11 -162 35 1007 -961 -331 719 -101 11 294 -539 446 118 -4
3417 -4 697 -1216 541 711 -287 74 -189 84 336 -318 -100 260 -796 1030 -117 -874 673 -326 461
3436 461 -236 -496 457 28 -209 680 -544 -389 796 -352 350 -662 -6 797 -493 -12 139 -475
$$ packed form
3301c95K6J120j161M89k63O3M59p44M85Ln00N57O06j431P99k23J73L61j120J136
3321D40l98r9L51n39o4O81m06J11J96j000J479p36PK96r55J187k49n43K30Q4j18
3342d5Q32j334M83M11r75J473j010k29M65k22O26n13o08R73L8j053J110r06M60
3361b4K40p69J202j281M52R91j046k21N77n09R34l70r43J225j140J077O4j518
3379a059J239k5j13J81o58K51O22j007J093n91q24J639q53Q0k43k41J308o95p12
3398f08Q87m50j46J301j335L40j51J97R72j968O30J050q20J12K83q33R85l28j22
3417dP01j913J757J70r98L61k63K73K52o54K18L60j056J826j147p57J547r99P87
3436D61o97k60R53m29k37Q89j224J55J185j148P02j012O56Q03j290M81J51o14
$$ plain form
3454 -475 56 316 -335 197 -450 404 647 -1040 484 67 -15 206 -339 -157 198 -253 349 82 -1036
3473 -1036 876 -160 -17 -11 -411 445 -66 -76 246 -189 -123 687 -507 -179 272 -257 631 -395 94 161
3493 161 -232 488 118 -585 143 392 -68 196 -660 492 203 -599 504 -299 -153 269 122 -114 -157 -308
3513 -308 557 -161 -680 481 -416 147 39 -419 204 -162 72 293 -375 -137 534 -269 237 -80 -210 419
3533 419 -180 253 -15 -320 352 295 -468 45 171 -89 229 -237 377 -359 -68 726 -211 -279 0 158 -41
3554 -41 -10 59 350 -294 -122 581 -425 39 108 179 52 -189 378 165 -267 -59 381 -430 359 -36 46 115
3576 115 -47 429 -103 -198 93 82 -215 230 120 -133 94 -156 257 -536 -12 280 -154 -189 96 174 -291
3597 -291 -146 -38 329 -363 188 293 -310 5 51 255 -372 -168 121 9 -266 15 281 -444 164 119 184
$$ packed form
3454d75N31K60o51N32o47Q54K43j687J524m17q2K21n45J82L55m51O02k67j118
3473a036J912j036J43Om00Q56n11j0L22m35O6Q10j194L28M51n29Q88j026M89O7
3493A61l93P20l70p03P28K49m60K64q56J152k89q02J103q03J46M22j47k36m3j51
3513c08Q65p18n19J161q97N63j08m58O23l66K34K21o68K38O71q03N06l17j30O29
3533D19n99M33k68l05O72n7p63N13J26k60L18m66O14p36K91P94r37o8K79J58j99
3554d1L1O9K91o44J72P03j006M64O9P1j27k41N67k13m32K08M40q11P89l95Q2O9
3576A15j62M76n32r5K91j1k97M45j10k53K27k50M13p93N24K92m34l5K85P8m65
3597b91J45J08L67o92N51J05o03L15M6K04o27K04K89j12k75K81K66p25O08m5O5
$$ plain form
3618 184 -123 -86 284 -175 -59 132 132 -331 184 -22 23 24 100 350 -413 194 191 12 -106 190 120 -173 35
3641 35 51 351 -332 306 182 -168 26 53 199 -230 270 285 -111 -442 251 260 -476 25 -35 201 -313 9
3663 9 231 -296 -216 201 21 -321 216 -198 49 -105 182 247 -437 324 -36 -30 -141 104 -21 -179 -5 95
3685 95 143 -470 506 47 -246 120 177 -89 -237 291 121 177 -156 523 -101 -208 245 32 139 -369 373
3706 373 201 -269 -87 174 -18 -69 291 19 213 -399 315 24 -427 207 11 -98 -45 112 12 41 -58
3727 -58 226 15 -342 589 -134 -34 -81 33 98 -237 167 -11 -317 -255 485 -373 -106 265 61 74 -339 179
3749 179 31 -449 77 286 -381 -99 135 -66 -8 -605 493 -59 -364 375 -137 -233 101 108 38 -77 -104 560
3771 560 -246 -379 431 -349 192 -38 -17 -32 -163 210 299 -501 -56 498 -401 262 5 -69 373 -227 441
$$ packed form
3618A84l07L7L70m59J16J91%m63N15k06M5JP6K50p63O07lj79j18K96p0k93K08
3641C5J6L00o83O38j24l50J94K7J46m29N00J5l96l31O93Rp36N01o0K36n14L22
3663IK22n27Q0M17j80l42N37m14K47j54K87O5o84P61l60Oj11K45j25j58J74J00
3685I5M8o13R76m59k93L66N7k66j48N28j70N6l33O79o24j07M53k13J07n08P42
3706C73j72m70J82K61j92n1L60k72J94o12P14k91m51O34j96j09N3J57j00K9r9
3727e8K84k11l57R31p23J00m7J14O5l35M04j78l06O2P40q58K67L71k04J3m13N18
3749A79j48m80N26K09o67K82K34k01N8n97J098n52l05P39n12r6L34Pp0j15k7O64
3771E60q06j33Q10p80N41k30K1j5j31L73Q9q00M45N54q99O63k57p4M42o00O68
$$ plain form
3792 441 -189 -354 407 150 -393 193 -147 182 55 -517 524 -372 28 566 -289 -48 207 128 78 -213
3812 -213 -287 513 -332 11 172 -561 406 -139 80 -73 -373 141 306 -505 85 148 -587 636 -376 -96
3832 -96 -171 -233 537 -221 -303 527 30 -240 301 -240 275 -8 -91 586 -813 64 516 -282 -246 79 51 408
3854 408 -213 -18 414 -788 670 315 -584 326 -169 404 -59 -524 282 210 -283 511 -274 -388 546 -194
3874 -194 346 -426 -255 672 -461 -220 299 -471 21 486 -407 192 -412 289 432 -801 49 160 -121
3893 -121 150 -11 -258 191 -260 430 223 -882 550 133 -284 63 -312 324 -47 -281 335 -143 -462
3912 -462 616 -318 -300 11 -125 525 -482 -52 316 -288 58 335 -502 37 190 -138 302 -747 289
3931 289 476 -440 247 -30 -211 333 -7 9 -76 -313 709 112 -486 577 -91 72 11 -218 204 -227
$$ packed form
3792D41o30j65P61k57n43N86l40L29j27n72J041q96M00N38q55K41K55p9n0k91
3812b13p4Q00q45L43J61p33R67n45K19j53l00N14J65q11N90O3p35J223j012K80
3832i6p5o2P70p58q2Q30m97k70N41n41N15k83q3O77j399Q77M52p98L6L25k8L57
3854D08o21J95M32j202J458l55q99R10m95N73m63m65Q06p2m93P94p85j14R34p40
3874a94N40p72J71R27j133K41N19p70M92M65q93N99o04P01J43j233Q50J11k81
3893a21K71j61k47M49m51O90k07j105J432m17m17L47l75O36l71k34O16m78l19
3912d62J078r34J8L11j36O50j007M30L68o04L46K77q37N39J53l28M40j049J036
3931B89J87r16O87k77j81N44l40J6q5k37J022n97n98J063o68J63o1k29M22m31
$$ plain form
3951 -227 3 468 -394 -307 625 -346 71 -28 -133 286 -351 36 154 -362 196 393 -249 62 -191 98 338
3972 338 -539 139 -45 -497 507 -212 -137 41 9 149 46 -362 342 -37 -306 359 -385 -33 45 47 86 -331
3994 -331 10 338 -305 -80 420 -269 206 -74 -56 52 -262 532 115 -251 147 93 -219 144 -150 -18 72
4015 72 -315 551 -291 -96 404 -141 -53 -76 204 -13 9 -57 361 -391 48 346 -487 -143 84 122 -151 -204
4037 -204 -5 47 -180 210 225 -581 80 81 109 -256 -162 460 -68 -257 99 233 -300 11 71 61 -208 -164 333
4060 333 -350 -86 166 37 -283 90 46 -37 -166 -40 306 -548 116 199 -75 -95 30 195 -219 1 206
4081 206 61 -326 326 79 -290 93 136 216 -396 38 383 -37 -192 235 256 -350 35 188 190 -396 124 325
4103 325 -389 -32 279 91 -226 19 136 -28 -140 59 212 -303 25 212 -83 -105 85 169 -323 42 82
$$ packed form
3951b27K30M65q62Q7R32r71M17r9j05M19o37L87J18n16N58J97o42L11k53K89K40
3972C38q77O78j84m52J004p19P5J78l2J40j03m08P04l79k69O65p44L52P8KL9m17
3994c31L41L28o43K25N00o89M75k80J8J08l14P94m17l66L98n4l12L63k94J32R0
4015G2l87Q66q42J95N00n45Q8k3K80k17K2o6M18p52M39K98q33L44K27L8k73n3
4037b04J99N2k27L90J5q06O61JK8l65R4O22n28j89L56J34n33L11O0j0k69M4M97
4060C33o83K64K52j29l20L73m4q3j29J26L46q54O64Q3k74k0J25J65m14K20K05
4081B06j45l87O52k47l69L83M3Q0o12M34L45m20j55M27K1o06L85J53Kn86N20K01
4103C25p14L57L11j88l17K45J17j64j12J99J53n15L28J87k95k2J90Q4m92L65M0
$$ plain form
4124 82 24 -342 213 96 -193 -99 42 226 -373 123 182 -8 -71 129 44 -182 141 160 72 -461 113 229 -259
4147 -259 -22 295 73 -227 93 151 -5 -187 166 68 -308 182 32 28 -120 64 -11 -250 -107 125 35 -256
4169 -256 340 -109 -4 99 50 71 -249 72 141 -190 -15 230 -116 -211 98 85 -25 -159 208 -3 -250 70
4191 70 81 -101 -88 249 -77 -66 -203 165 -72 -275 355 -76 32 6 138 14 44 46 169 -70 -212 241 -283
4214 -283 -2 -98 48 -6 -250 181 -128 -224 135 275 -298 -63 8 -7 66 -270 345 -199 -123 288 -60 -154 74
4237 74 394 38 -246 -348 527 -261 -47 405 -73 44 -35 196 -135 -281 179 317 -459 18 229 -252 80
4258 80 -77 210 11 -187 392 -94 -305 12 199 -174 -62 -126 108 -187 -222 386 -383 -162 297 -67 -301
4279 -301 -189 10 127 -273 -97 398 -387 77 256 -146 -89 -94 271 -58 -400 198 238 -448 158 64 -187 25
$$ packed form
4124H2n8l66N55j17k89R4J41J84n99M96N9j90o3K00q5k26L23J9q8n33N74J16m88
4147b59K37L17k22l00L20N8j56j82L53r8l76M90j50mj48J84p5k39J43K32r0k91
4169b56N96m49J05J03m9K1l20L21O9l31J75K45l46r5L09j3j10j34L67k11k47L20
4191G0J1j82J3L37l26J1j37L68k37k03O30m31J08k6J32j24L0KJ23k39j42M53n24
4214b83K81r6J46n4k44M31l09r6L59J40n73K35P1j5P3l36O15n44P6M11l48r4K28
4237G4L20l56k84j02Q75p88K14M52m78J17p9K31l31j46M60J38p76M77K11m81L32
4258H0j57K87j99j98N79m86k11L17J87l73J12o4K34k95l5O08p69K21M59l64k34
4279c01J12J99J17m00J76M95p85M64J79m02N7nL65l29l42N98M0o86O06r4k51K12
$$ plain form
4301 25 -124 330 -261 -186 432 -72 -519 269 -50 -118 26 9 86 -385 -36 460 -436 -52 202 -23 -61 9
4323 9 12 204 -224 268 280 -534 299 151 10 9 -217 198 34 -169 261 -50 -333 330 -48 -243 19 -325
4345 -325 290 -215 -186 273 -191 -2 216 -362 -124 41 -52 233 -474 62 248 -259 129 -202 -202 248 31
4366 31 -180 42 -402 386 109 -453 250 -137 -53 134 -170 131 -50 -73 340 -285 -213 453 -153 120 74 -124
4388 -124 314 -163 177 132 -312 11 418 -226 112 54 93 234 -492 250 147 -100 350 53 -249 93 93 74
4410 74 -22 -320 220 -71 -293 275 -314 74 -13 126 5 -392 88 459 -232 -320 390 -246 121 89 -62 -103
4432 -103 -334 377 -10 -409 -23 211 -101 -25 -98 102 18 -376 410 -295 -404 153 206 -175 85 13 189 -164
4454 -164 -277 215 140 470 20 -103 19 -161 187 59 -355 -6 340 -335 36 301 -180 66 -16 363 -101
$$ packed form
4301B5j49M54n91P5O18n04m47P88l19o8J44j7P7m71L49M96q96L84K54k25l8P0
4323ILJ92m28M92J2q14Q33j48j41jk26M15j64k03M30l11k83O63l78j95K62l44
4345c25O15n05K9M59m64J89K18n78K38J65r3K85p07N36J86n07L88l31%M50k17
4366C1k11K22m44P88k77n62P03l87Q4J87l04L01j81k3M13o25P2O66o06K73m6j98
4388a24M38m77L40m5m44L23M07o44L38n8L9J41p26P42j03k47M50k97l02L42%j9
4410G4r6k98N40k91k22N68n89L88q7J39j21l97M80L71o91q8P10o36L67l2j51m1
4432a03k31P11l87l99L86K34l12P6p3K00q4l94P86p05j09N57N3l81K60p2J76l53
4454a64j13M92p5L30m50j23J22j80L48j28m14L49L46o75L71K65m81K46q2L79m64
$$ plain form
4475 -101 -338 323 155 -418 -33 201 -62 -7 -114 230 -198 -217 312 -158 -223 97 208 -150 -125 28 23 -190
4497 -190 -170 267 -310 -92 158 13 -133 -53 68 40 -116 -42 101 -358 -14 187 -191 -15 -137 92 -94
4518 -94 -146 137 -62 -142 136 52 -238 15 -136 240 -236 -94 368 -140 -4 232 97 82 -33 98 159 -210
4540 -210 -24 286 -356 51 -47 39 -60 -77 50 -22 -82 -36 127 -161 146 109 -11 -81 -14 255 -109 -90 77 -123
4564 -123 -118 176 26 -193 56 -30 145 -250 87 125 -90 -158 67 -113 -138 64 0 -33 -58 202 52 -225 156
4587 156 -62 43 -92 135 -22 -219 4 -2 -70 -217 117 -172 -157 84 96 -33 -229 147 187 -116 -31 362
4609 362 -82 -98 97 9 35 -129 295 65 -177 19 137 -89 -213 119 70 122 -103 400 -63 -355 206 13
4631 13 -61 -165 124 -5 -231 190 273 -206 -242 260 8 -46 -77 241 69 -214 110 73 -84 65 429 -34
$$ packed form
4475a01k37O61j68n73L85K34k63N5j07L44m28j9N29m70o5L20J11l58K5J53nk13
4497a90K0M37n77K18K50j45j46Q0J21k8j56P4J43m59L44K01l78J76j22K29j86
4518i4n2K83j99q0K78q4k90K53j51L76m76J42M62n08J36K36j35j5j15J31O1l69
4540b10J86L10o42M07r8Q6r9j7J27p2o0M6J63k88L07l7j20p0O7K69l64J9J67k00
4564a23NK94j50k19K49q6J75l95L37L8k15o8K25j80k5K02o4l3k5K60j50k77L81
4587A56k18J05j35K27j57j97K23oo8j47L34k89J5K41J2j29j96L76M0l03Q5L93
4609C62m44j6J95q8K6j64M24k30k42J96J18k26j24L32m9N2k25N03m63k92N61j93
4631A3p4j04K89j29k26M21Q3m79l6N02k52n4l1L18j72k83L24l7j57J49L64m63
$$ plain form
4653 -34 -60 -71 171 -75 -327 218 -8 -206 -62 235 -138 -127 114 105 -238 -176 256 -113 -261 113 57 -100 -144
4676 -144 229 -33 -250 -39 344 -195 -156 312 -15 55 -127 213 -63 -242 243 242 -268 -70 222 -85 -185
4697 -185 -135 340 47 -145 231 34 -114 150 179 -135 6 -105 231 -111 8 328 -103 -162 85 11 -139
4718 -139 -146 130 -6 -294 -73 380 -268 84 80 -197 16 -221 97 -52 -250 184 35 -175 154 135 -86 89
4740 89 -71 152 -113 -60 229 -137 -33 54 -38 13 -65 -152 134 -196 62 215 -231 247 148 -88 36 -125 -6
4763 -6 -25 -66 155 86 -154 255 59 -191 213 19 195 -93 33 141 -85 -42 425 -257 -123 98 -18 182
4785 182 -319 52 239 -309 39 7 -371 55 114 -35 -3 -241 331 209 -627 85 42 -96 -116 -79 42 -217
4807 -217 -143 435 22 -362 227 118 113 92 -32 92 -151 -38 284 -326 -59 427 -221 -24 -78 49 148 -483
$$ packed form
4653c4k6j1K42k46k52N45k26j98J44K97l73J1K41rl43O2M32l69j48L74n6j57m4
4676a44L73k62k17K11L83n39L9M68l27P0j82L40k76j79M85jn10J98K92l07j00
4697a85N0M75k93j92L76j97j48K64K9l14J41j11L36l42J19L20m31n9K47p4j50
4718a39pK76j36k88K21M53o48L52mk77K13k37L18j49j98M34j49k10L29j9k21J75
4740H9j60K23k65N3K89l66J04Q7r2N1p8q7K86l30K58J53m46M78r9k36J24j61J19
4763fj9m1K21o9k40M09j96k50M04j94J76k88J26J08k26M3M67o82J34K21j16K00
4785A82n01L71J87n48L48l2l78M26N9j49L2k38N72j22q36P12m3j38k0L7J21k59
4807b17P4N78m13l84N89j09nk1j24J24k43J13L22o10K67M86o48J97n4J27R9o31
$$ plain form
4829 -483 203 26 -270 144 196 -87 -37 -16 236 -66 -464 427 28 -276 248 29 -76 -74 135 352 -224 -269
4851 -269 430 -113 -141 281 -200 308 -230 92 96 -200 189 330 -353 -46 408 -71 7 -254 202 138 -282 207
4873 207 97 -201 105 342 -25 -219 -78 271 117 -357 375 -57 -167 97 -67 -43 -341 -39 234 -175
4893 -175 -311 344 -79 -97 44 -81 80 -79 142 150 -258 12 352 -159 -13 58 -61 204 -228 92 13 -138
4915 -138 263 -75 -198 27 146 129 86 -136 158 -56 74 403 -224 -49 89 35 73 -75 20 129 -111 -19
4937 -19 281 -310 210 77 37 -9 -86 172 115 -239 6 72 -198 96 114 -78 104 -160 230 -133 -29 88
4959 88 -67 -93 -91 -14 -118 151 -157 136 -129 148 133 -385 165 173 -85 -81 30 28 -53 -224 312 151 -265 301
4983 301 54 -5 25 -68 173 -206 -92 290 -33 -169 118 148 -210 -72 65 115 -289 -48 338 -116 -14 36
$$ packed form
4829d83O86j77k96M14N2k83N0K1K52l02l98Q91l99l04N24k19j05KK09K17n76m5
4851b69O99n43k8M22m81N08n38L22Mk96L89J41o83L07M54m79P8k61M56o4m20M89
4873B07j10k98L06K37l67j94J41L49j54m74P32m32j10K64j64K4k98L02K73m09
4893a75j36O55m23j8J41j25J61j59K21Qm08K70L40n11J46P1j19K65m32L20p9j51
4915a38M01l38j23K25J19j7m3k22K94k14J30L29o27J75J38n4L8j48R5J09k40R2
4937a9L00n91N20j33m0m6p7K58n7l54K45O6k70K94J8j92J82k64L90l63J04J17
4959H8j55k6KP7j04K69l08K93k65K77j5n18N50Qk58MJ11kq1j71N36j61m16N66
4983C01k47n9L0r3K41l79J14L82l23j36K87L0l58J38J37N0m04K41L86m54J02N0
$$ plain form
5005 36 -48 -75 135 219 -46 -320 162 281 -176 18 90 -14 -85 -20 120 -295 -156 169 150 -336 170 57 25
5028 25 -169 -20 140 -292 -108 311 -103 -254 111 39 -159 -164 85 225 -263 -62 177 -227 -76 223 -39
5049 -39 -144 124 295 111 -320 170 180 -295 -20 86 74 -170 -39 201 -112 -181 283 50 -193 99 11 -13
5071 -13 -145 141 50 -173 -75 188 -37 -236 115 92 -5 -116 96 178 -283 -14 138 36 -133 271 25 -40
5093 -40 -136 75 172 -313 237 -32 -134 -87 10 -40 -111 31 112 35 -179 87 -94 -93 -4 -49 37 -363 11 130 39
5118 39 -47 218 -107 62 -45 -125 68 -120 76 1 -55 22 110 -121 42 172 -18 4 -3 91 -79 -71 85 -29
5142 -29 -207 -60 36 -27 34 91 112 -298 52 207 -174 -26 75 -97 19 59 110 -58 -55 257 92 -92 54
5165 54 47 -194 -24 90 168 -161 -30 288 -159 3 146 130 -56 8 135 160 -104 51 240 -449 1 136
$$ packed form
5005C6q4k7K10Q4k65k74M82J19m57J94P2j04p1O5J40m15J39L25j9m86N06j13l2
5028B5j94J49J60m32J84M19m14j51L65p2j98nK49J40m88K01K39m04J51K99k62
5049c9j05K68J71j84m31M90J0m75K75J06j2k44J31K40l13o9M64k33k43K92q8k4
5071a3j32K86r1k23R8K63k25j99L51k3r7j11K12Q2m61K69J52j02j69M04k46o5
5093d0r6K11R7m85N50k69j02M7R7n0p1J42Q1p7k14K66j81JQ9m5Q6m00L74J19r1
5118C9q6K65l25J69j07q0J93j88J96p5n6P7Q8k31J63J30j90K2pR4j70QJ56j14
5142b9j78J47R6o3O1N7K1m10L50J55l81J48J01j72J16M0N1j68LL12j65j84J46
5165E4pk41J70J14P8l29J31L18m47J62J43j6j86O4J27K5k64J55J89o89M50J35
$$ plain form
5187 136 -54 -167 -123 113 -37 -167 116 75 -290 18 148 36 -116 -30 261 -64 -233 168 50 -193 147
5208 147 25 -106 11 56 199 -209 19 224 -42 -151 117 125 7 51 -69 147 -304 -1 307 -300 -14
5229 -14 60 197 -134 -162 185 45 -262 137 103 -319 -11 2 75 -318 -46 379 -137 -179 145 50 -208 136 -146
5252 -146 24 -167 -164 233 -301 -105 138 -177 5 -2 21 6 -179 139 104 -491 60 168 -21 -58 -62 252 -233
5275 -233 -192 217 53 -299 165 -14 -172 31 -48 242 -173 -157 226 59 40 276 73 -122 175 -19 103
5296 103 -183 137 218 -137 32 82 -66 107 90 64 80 -230 -2 53 -238 228 -60 -44 78 -118 50 40 -21
5319 -21 197 -155 -129 220 -172 -17 210 -95 161 -97 34 137 -316 -86 -68 -185 70 42 -105 22 -186
5340 -186 3 144 -156 189 -48 -385 165 -1 30 70 -277 46 -85 -113 239 -144 -311 250 -23 -67 23 -3
$$ packed form
5187A36j90j13M4K36j50j30K83m1l65L08J30j12j52Q6K91l25j69M01j18k43L40
5208A47j22j31J17M5J43m08K28K05k66j09K68Qj18M4j20K16m51L03L08o07K86
5229a4P4J37l31k8L47j40l07L99l4m22L08J3P3l93K72M25n16m2L24r5k58L44k82
5252a46J70j91LL97n34J96K43l15J82pK3j5j85L18l5n95N51J08j89l7mL14m85
5275b33M1M09j64l52M64j79j58K03p9K90m15J6L83j67j9K36k03j95K97j94J22
5296A03k86L20Q1l55J69N0j48J73j7k6J6l10K28N5k91M66k88J6J22j96J68j0o1
5319b1K18l52K6L49l92J55K27l05K56k58J31J03m53K30J8j17K55k8j47J27k08
5340a86J89J41l00L45k37l37N50j66L1M0l47L23j31k8L52l83j67N61k73m4R0k6
$$ plain form
5362 -3 135 -92 -64 217 -225 158 223 28 -65 71 184 -58 -215 13 177 -204 72 150 -65 -13 109 181 -132
5385 -132 -157 211 55 -255 -59 29 -66 37 85 140 -286 -80 313 -203 -112 61 -3 83 -170 246 142 -198 10
5408 10 96 -199 -152 262 -7 -219 -109 166 -75 -153 140 205 -163 90 204 151 -89 -64 220 -186 -168 197 10
5431 10 -32 59 127 9 -162 63 250 -189 -125 215 -13 -93 20 192 -67 -38 149 112 -344 -14 151 -71 -71
5454 -71 -52 164 38 -96 233 -88 -240 5 306 -83 -82 20 36 -156 -94 164 0 -71 99 9 -29 -50 83
5477 83 -29 -23 -92 252 -25 -31 108 52 30 -31 60 15 -179 134 56 -100 8 107 -151 -81 -85 3 46 -22 99 11 -48
5504 -48 89 86 -48 123 -180 -25 -24 15 198 -108 -38 53 -9 -90 50 -61 173 -143 -13 -63 -112 167 -73 -92
5528 -92 -10 46 -47 23 23 -76 -43 -22 232 -37 46 38 4 -1 -54 102 11 -164 39 204 -94 -73 79 34 10 -57 128
$$ packed form
5362cJ38k27K8K81m42L83O5j95r3J36J13k42j57K28J64l81K76P8k15N2J22P2l13
5385a32k5L68j56l10J96Q8r5J03M8N5m26K06L93n16R1J73o4Q6k53M16j04l40K08
5408A0Q6k95M7M14k69k12J10K75k41p8K93O5l68K53J14n3k40K5K84m06J8L65j87
5431A0m2R1O8j18j71K25J87m39O4L40k28q0J13J72k59K9J87l7m56L30J65k22%
5454g1J9K16j26j34L29l21j52K45L01l89JJ02J6j92O2K58j64p1J70r0l8k1J33
5477H3j12Oo9L44k77oJ39n6k2o1R1m5j94L13p8j56J08R9k58P0mQ8M3o8J21q8n9
5504d8J37lj34J71l03J55JL9J83l06P0R1o2q1J40j11K34l16J30n0m9K79k40j9
5528i2Q2N6r3P0%r9L3K1K54k69Q3ql4nn3J56r1j75K03J65k98K1J52m5k4o7J85
$$ plain form
5555 128 68 -202 106 -47 -140 -13 28 6 -150 111 196 -138 -124 245 -43 -183 -123 93 -30 -43 31 123 -66
5578 -66 -137 194 62 -138 75 111 -58 -72 171 198 -119 9 191 10 -221 -46 -4 -159 -55 197 16 -183
5600 -183 299 54 -25 -183 90 -87 46 -82 78 -159 -339 322 60 19 15 113 -139 -211 -73 101 -248 -69
5622 -69 241 -141 -241 57 106 -79 -187 173 127 -87 -160 143 -99 -130 85 5 -173 -131 250 -52 -98 -3 73
5645 73 -79 24 25 43 -85 -38 265 -35 -208 87 -33 26 -159 293 101 -74 27 255 -165 127 198 9
5667 9 -64 -68 242 46 24 14 177 -164 7 240 -82 73 70 125 18 -108 183 28 -107 152 156 -106 42 -47
5691 -47 253 47 -49 130 -3 26 120 60 194 72 26 -63 -90 60 -44 -212 -81 -58 -18 118 -65 215 -136
5714 -136 -14 17 -7 -109 10 13 -143 158 12 20 -95 -73 -14 -94 -14 92 -114 -101 -30 31 49 -82 -47 35 -216
$$ packed form
5555A28o0k70L08j53r3J27M1k2j56K61Q5l34J4L69k88j40O0K16j23j3P4R2j89
5578f6p1L31j32k00K13L6j69j4K43K7l17J28J82j81k31J75M2j55J04K52j81j99
5600a83M82k45p9j58K73j77J33j28J60k37j80O61k62m1mR8k52p2J38J74l49J79
5622f9L10l82j00K98M9j85j08L60m6k14p3L03k42l1K15q0j78M2L81l02m6R5P6
5645G3j52J03JJ8j28M7L03l00j73K95j20N9j85M52j92j75J01K28m20K92P1j89
5667Ip3mL10j96k2j0J63l41J71K33l22J55lN5j07j26K91j55j35K59Mk62J48q9
5691d7L00k06r6J79j33K9R4o0J34j22m6q9k7J50j04j68J31K3M0J36j83K80l51
5714a36J22L1k4j02J19Lj56L01j46Qj15K2N9q0Q0J06k06J3P1O1J8j31L5Q2k51
$$ plain form
5739 -216 -2 -18 -140 173 122 -78 -144 162 98 -58 -133 111 6 9 137 -61 -31 -68 10 146 -58 79 224
5762 224 -110 -140 128 -113 24 -175 139 213 -182 229 189 -239 -100 86 46 -85 -235 145 80 -284 289 13
5784 13 -106 163 93 127 -169 -137 262 38 -212 189 -74 -78 70 32 61 -89 -30 87 -244 -87 267 -123 -32
5807 -32 90 36 79 -313 251 81 -219 104 196 -71 -97 -33 -7 -32 -87 230 -37 -109 303 85 -41 -72 95 202
5831 202 -149 -86 216 -97 -129 181 52 -5 -40 42 78 -184 35 113 -104 -34 8 -17 153 -2 -28 148 -215 215
5855 215 92 -275 -92 78 54 17 -18 89 48 -41 237 7 -101 47 4 67 -61 -145 81 -55 -194 83 -185
5878 -185 34 85 -66 33 -132 77 118 -110 21 48 -110 -16 102 -47 -67 -82 39 53 -114 247 0 -13 93
5901 93 7 -220 -9 -15 216 84 113 142 -147 87 -28 -129 39 -38 41 -89 -121 190 181 -222 126 -1 -34 157
$$ packed form
5739b16K14j6j22L13n1k00o6L06o4j56p5K44j05LJ28j98L0l7P8J36k04J37J45
5762B24l34l0K68k41J37j99L14P4l95M11m0m28J39J86m0j31j50L80o5l64N73k76
5784A3j19K69p0L4k96L2L99k24k50M01k63mJ48l8K9j50N9J17l31J57L54l90R1
5807c2J22n4M3l92N64j70l00L23R2k67k6O4K6k5n5L17k67p2M12k18j26l1J67J07
5831B02l51O3L02l13l2L10j29n7l5Q2L6k62K19P8k17P0M2k5J70j55k6J76l63M30
5855B15j23l67J83J70k4l7l5J07m1q9K78k30j08J48m3O3j28q4K26j36j39K77k68
5878a85K19N1j51R9j65K09M1k28J31K7j58R4J18j49k0j5J21J4j67L61k47j3J06
5901I3q6k27K11oK31j32K9K9k89K34j15j01J68p7P9j30l2L11rm03L48j27l3J91
$$ plain form
5925 157 1 -32 13 -13 -41 -198 4 112 -34 -90 55 10 79 -77 -5 46 -165 -127 49 -62 -182 197 200 43
5949 43 -140 88 141 -155 -150 76 -158 -44 51 108 -114 11 -51 60 -220 93 142 -62 78 134 -75 -89 -1 100
5973 100 19 -188 128 179 37 29 138 145 -88 81 123 -239 72 102 129 -124 67 56 31 -27 36 7 -253 19 164
5998 164 -124 -100 -54 101 -168 -114 110 -76 -247 103 222 -88 -45 58 47 -125 1 85 -186 -28 78 197
6020 197 -51 -1 110 -91 -245 36 20 -124 29 55 91 -134 -9 70 -2 -143 165 118 -87 -34 50 92 -3 23
6044 23 198 3 -192 113 223 -51 95 26 19 -83 -168 212 -179 96 120 -13 -43 5 -5 62 -95 31 -30 -91
6068 -91 -6 -113 19 -74 64 -73 47 -38 -60 -47 -295 48 -152 -106 -163 43 16 -50 -33 -133 68 -34 -78 127
6092 127 -12 35 14 -67 105 130 -12 6 74 58 20 38 14 64 44 28 35 3 -111 30 -18 -8 63 -71 76 49 38
$$ packed form
5925A57j56l3M5k6k8j57K02J08j46n6J45m5O9j56P2N1k11L8J76j11j20L79Lj57
5949D3j83K28N3k96NK26k34J14R5N7k22J25o2J11k80L13M9k04J40N6k09j4Q8J01
5973A00q1k07L16N1j42qJ09Pk33J69M2l62L11L0K7k53J91j1k5n8O3k9k60K72J45
5998A64k88K4M6J55k69N4K24j86j71L50J19l10M3J03j1j72J26Q4k71J58J06J19
6020A97k48N0J11k01j54K81j6j44J53K6L6k25J25P9p2j41L08m7k05N3Q4M2r5K6
6044B3J75j95j95L05J10k74J46o9pj02q5L80l91K75K4j33l0M8j0O7j57J26o1o1
6068i1Q5j07J32r3J38j37J20q5k2J3k48L43k00M6n7K06k7o6J7j00K01j02m4K05
6092A27j39M7k1q1J72K5j42J8O8j6l8J8k4N0k0j6Pl2j14J41m8J0P1j34J47k7j1
$$ plain form
6119 38 -48 -42 55 205 -145 -15 2 38 45 20 -16 -150 4 47 4 -151 158 42 -53 27 28 100 -122 -100 111 3
6145 3 -104 164 -28 -111 -56 -4 -25 -44 -24 22 -163 20 41 47 -28 -60 71 -119 -87 -45 108 -234 -61 42 10 41
6171 41 -45 65 -41 -55 223 107 -288 94 54 -51 70 -3 205 -54 -124 97 -15 48 13 75 -99 -163 64
6194 64 187 -145 -76 164 -120 -64 7 -82 -9 6 43 45 -218 -34 193 -106 27 123 27 14 -64 210 4 -39 74
6219 74 60 -105 213 -9 -120 31 -28 9 -184 23 20 32 33 188 79 -11 20 -5 174 -92 77 80 -111 66 109
6244 109 -97 -2 -49 68 73 -86 51 -26 -282 36 -46 75 57 -77 77 139 -20 235 -27 29 80 26 -35 -104
6268 -104 127 134 -98 -106 62 28 -12 1 -59 25 30 133 53 -100 -29 63 -50 164 -127 -39 11 -66 -6 25 -1 149 -76
6295 -76 -139 157 3 3 -42 20 44 19 5 57 -61 143 27 -162 -57 -141 -84 -56 -8 9 18 -104 101 39 -132 -3
$$ packed form
6119C8q6OR7J50l50J30J7L6Pk5l6j34J54M3m3j55L09j16r5Q0JP2k22K2K11j08
6145Cj07K68j92q3N5N2k1j9K0M6j85J83K1Op5l2J31j90L2M2J53l42J73J03l2L1
6171D1q6J10j06j4K78j16l95L82m0j05J21p3K08k59p0K21j12O3l5O2j74o4K27
6194F4J23l32O9K40k84N6P1q9P3J5L7Kk63J84K27k99J33R6r6j3p8K74k06m3J13
6219G4j4j65L18k22j11J51n9L7j93K07lJ2JJ55j09r0L1k5J79k66J69Lj91J77M3
6244A09k06R5m7J17Nj59J37p7k56L18q2J21j8j34J54O2j59K55k62N6N1n4o1o9
6268a04K31Pk32qJ68l4m0J3o0Q4NJ03q0j53P1R2j13K14k91Q8N0p7O0L1k6J50k25
6295g6o3K96j54%m5O2K4k5j4N2j18K04j16j89J05q4N7K8M8J7Rj22K05o2j71J29
$$ plain form
6321 -3 43 -9 56 -34 30 -27 -42 130 -56 -172 41 46 49 -46 -67 110 -37 -51 -16 12 70 -90 -80 150 -25 -67 317
6348 317 22 -86 17 40 -32 79 129 -25 69 -71 154 -190 31 56 -240 -82 -3 8 3 -103 124 -52 -125
6371 -125 175 -6 -35 -58 87 -49 -119 33 162 -45 -98 210 -103 -41 -173 204 46 -71 66 202 1 27
6393 27 -33 -31 -101 -145 -37 -149 -193 55 75 -82 98 68 127 -84 76 -3 -227 -50 75 -84 -61 47 159 -61
6417 -61 -17 -3 167 45 -51 44 -85 -80 96 -1 -84 -142 105 116 -92 -63 57 -4 173 -52 -32 -40 -152 9 -22 -121
6443 -121 57 42 -61 -110 -162 -24 -96 -82 222 -16 -38 87 53 -127 -46 -69 -37 -15 13 79 7 -13 -131 63 82
6468 82 -9 2 -46 -15 43 90 87 88 -46 -79 95 -100 -16 29 104 -174 75 -32 53 -64 -123 20 -112 -25 -3 3 73
6495 73 38 108 -10 97 47 117 -33 12 0 -86 -57 1 152 -88 12 117 -66 -92 -141 -8 -54 72 -23 114 -76
$$ packed form
6321cM6n2O5r0O4n7j5J72j86j16K13NLr5k1J77j47j4L5K8N8j60J0K30j75m2L84
6348C17k95j08J03K3p2J11N0j54R4j40K25l44K21K5k96J58P9J1nj06K27j76p3
6371a25L00j81k9k3J45j36p0J52J29k07n3L08l13O2j32L77j58j17J37J36k01K6
6393B7o0Kp0m4J08j12m4K48K0j57J80l0N9k11J60p9k24J77J25j59K3J08J12k20
6417f1M4J4J70j22r6R5j29NJ76r7q3n8K47J1k08K9J20o1J77k25K0qj12J61l1r9
6443a21J78j5j03m9n2J38p2J4L04k38k2J25l4j80Q1k3L2K2K8O6p2k0j18J94J9
6468H2r1J1m8L1N8M7lJj34l3J74j95Q4M5P5k78K49j07Q5j17n9J43j32Q7K2OP0
6495G3l5P0j18J07n0P0j50M5j2q6K9N8J51k40J00J05j83k6m9J33m6J26r5J37j90
$$ plain form
6520 -76 -157 139 -79 -61 -52 -76 -140 -118 137 69 -67 -28 75 98 -23 -34 164 103 -97 105 54 -203 -50 75 -206
6545 -206 17 -70 96 32 -101 183 -101 -165 -7 26 -169 -84 2 -35 -42 -104 86 -124 -38 168 24 -139 -49 102
6569 102 43 -111 122 111 -49 68 9 -43 -20 -6 109 -23 -125 79 82 -18 49 38 48 -82 22 154 -137 -84
6593 -84 50 62 -34 -36 -133 -152 86 27 8 -96 24 80 -59 -50 -24 -47 -58 -188 -3 -144 -11 -32 62 54 17 30 -43
6620 -43 -45 7 66 28 -142 -103 83 22 -64 -18 33 -132 -84 39 -124 -1 15 41 27 -122 -32 14 -28 28 127 -138 -3
6647 -3 -11 -60 98 10 -107 78 -9 -57 9 -93 82 -6 -55 73 44 39 97 -102 97 21 -11 43 -68 -38 92 -75
6673 -75 -26 50 -10 -65 -78 -7 37 1 -59 -84 -31 16 -76 -53 -107 -160 112 -25 -33 107 -78 24 -48 -4 -30 -117 -42 -7
6701 -7 42 -38 34 -73 49 87 85 -31 -32 -106 3 -94 0 7 6 2 -83 73 21 -58 130 -90 -6 124 0 -38 33 134
$$ packed form
6520g6q1K96k18J8Rk4o4K2K55o8j36L9J03K3j21j1J98o1k00K02n1k57J53J25k81
6545b06K23q7J66o4j33K84k84o4J58L3j95Q5Q6l7po2J90k10Q6K06j44j63R0J51
6569A02n9j54K33j1j60J17n9n2K3J4J15j32j02K04Lj00O7j1J0j30J04J32k91N3
6593h4J34J2r6kr7j9K38n9j9j04J20N6j39RK6k3j1j30J85j41J33k1R4ql7J3p3
6620d3kN2N9l8j70L9J86o1q6M6N1j65M8J23j63J23J6K6j4j49R0M6m2N6R9k65J35
6647cqm9J58q8j17J85q7m8O6j02J75q8m9J28k9nN8j99J99p6l2N4j11L0J30j67
6673g5M9P6o0n5j3P1M4l6o0k5N3M7r2K3n4n3K72j37qJ40j85J02p2M4k6q7P5L5
6701gM9q0P2j07J22L8kj16jp4J09r7R4Pjmq5J56n2p9J88k20Q4J30j24l8P1J01
$$ plain form
6729 134 46 31 13 159 -98 -64 135 75 -93 -170 95 36 -104 7 198 -39 22 80 -18 4 46 -14 84 -150 -88
6754 -88 105 -38 1 95 -172 86 -17 24 -4 -99 119 -36 -232 170 -7 -95 -4 58 116 -39 45 228 -152 -123
6778 -123 126 60 22 -40 -76 -21 -100 -69 80 31 -103 -55 45 -48 -142 39 -4 -110 -3 -115 -38 -98 79 -42 54
6803 54 -138 -21 0 69 14 -44 36 86 70 97 10 -94 -5 -55 -116 -46 -125 -18 18 6 -82 -19 66 16 -50 -14 -42 -123
6831 -123 -38 25 151 133 -133 156 -57 -147 61 -31 -68 -57 6 24 79 -59 -45 -36 -48 15 -88 68 36 41 4 -14 -97
6858 -97 86 33 81 132 -59 137 18 -77 106 80 33 -142 -68 -65 100 20 184 3 -61 60 -55 -53 -122 59 118
6883 118 -76 -98 -55 49 44 48 169 39 -59 19 5 -199 86 45 40 59 32 -58 48 108 83 -48 39 9 56 -25 -29 77
6911 77 92 59 -52 11 -45 3 40 8 5 23 -87 38 -190 -82 -3 -2 -90 59 13 -125 -7 -13 -11 -51 69 -16 -116
$$ packed form
6729A34q8j5j8J46k57L4J99o0j68p7K65n9j40J11J91k37O1N8r8K2M2o0R8k34O2
6754h8J93j43L9R4k67K58j03M1k8r5K18j55j96M02j77q8R1O2N8j55Q4J83l80K9
6778a23K49o6l8o2l6N5p9L1J49m9j34M8J00r3r4J81m3j06J07j12P7o0J77j21R6
6803E4j92J17K1O9n5n8Q0N0j6K7q7j04Q9n0o1P0p9J07L6j2q8O3Q5n0o6L6k8q1
6831a23Q5O3J26j8k66K89k13r0K08r2l7J1O3J8N5j38J4Rj2O3j03J56l2Nl7j8q3
6858i7J83n3M8N1j91J96j19r5J83k6m7j75P4LJ65q0J64j81o4J21j15Ko9J81N9
6883A18j94k2M3J04nMJ21j30r8P8j4k04K85m1nJ9k7r0J06O0k5j31Q7l0M7q1mJ06
6911G7J5l3j11O3n6M8L7l2lJ8j10J25k28J08P9Jq8J49m6j38J18oKm0J20q5j00
$$ plain form
6938 -116 -71 111 -35 -4 -146 92 -29 -62 172 65 -57 -34 109 94 -80 -29 -45 -15 -124 6 56 61 -22 20
6962 20 93 44 -43 -48 -48 48 -12 19 -47 59 -101 -35 -56 -39 34 -15 198 -18 -79 -52 -3 -51 26 -40 -38 82 -30 -62 16
6991 16 18 1 -24 127 -80 186 -6 3 -23 -47 -3 77 51 0 83 5 -78 75 38 -114 84 42 -81 74 35 -131
7017 -131 3 -95 106 59 63 131 12 148 145 -29 -151 -26 -45 5 -15 51 -57 -136 5 16 -9 -122 -43 -7 149
7042 149 75 -8 13 -23 26 2 54 -104 -69 80 84 28 -62 74 5 -48 -53 22 46 -122 93 72 -8 -47 89 -20 -70
7069 -70 34 -65 -19 52 26 59 0 -66 96 -149 -1 -72 -57 0 21 -74 75 -51 -99 86 -69 -19 79 -31 64 -95
7095 -95 77 18 43 -257 39 17 163 7 5 26 -123 99 -22 -93 -55 -46 60 33 -83 -83 80 103 -67 17 -47 39
7121 39 -15 -151 -31 -68 -25 60 -128 -81 -150 -56 52 31 -102 -58 -19 52 15 90 153 -6 -47 134 -46 -2 62 -12
$$ packed form
6938a16M5J82j46L1j42K38j21l3K34j07j22K3J43j5j74N1j6L0j09J30N0Nq3M2
6962B0P3m9q7n%R6o0L1o6J06j60O6k1J7P3m9K13k16o1K7M9m8P7o6KJ20j12l2P8
6991A6Kj7k5J51k07K66j92Rk6k4M4Q0k6n1Q3p8q3J53l7j52J98m2j23J55l9j66
7017a31J34r8K01m7MO8j19J36lj74j22J25j9N0k0O6j08p9J41J1k5j13P9L6J56
7042A49p4q3K1l6M9k4N2j58L5J49Mn6r0J36o9n3nP5K4j68K15k1q0l9J36j09n0
7069g0J04r9M6P1k6L3n9o6J62k45J48p1J5N7K1r5J49j26m8J85j55N0R8j10R5j59
7095i5J72n9K5l00K96k2J46j56kK1j49K22j21p1L8RJ06k7j16%J63K3j70Q4o4Q6
7121C9n4j36J20l7M3Q5j88M7o9R4J08k1j33M4L9P1l7P5O3j59m1J81j80M4O4p4
$$ plain form
7147 -12 97 30 52 5 65 -31 -71 -19 -3 -157 -69 -59 -81 87 26 -65 14 -107 123 6 -61 141 -133 -14 62 81
7173 81 -10 37 -57 -107 144 88 -16 81 34 -14 -31 12 -38 -35 -22 -49 -10 -99 100 26 -72 -21 33 23 -7 114 8 17 -2
7202 -2 -27 -25 -96 -10 -97 5 0 17 -41 -26 54 -6 36 -9 -91 109 48 183 -178 -47 -68 35 43 -83 -6 123 -98 113
7230 113 -68 -120 0 71 26 -14 -93 39 -98 27 -51 -46 -41 -42 -120 -43 187 -94 -116 -174 34 -40 -70 84 113 11
7256 11 56 -18 -88 32 -63 -61 5 53 -48 93 52 -16 -19 27 112 14 1 19 -112 -82 68 -82 77 -28 -32 4 -51 -55
7284 -55 -30 18 47 -242 -24 -72 84 -44 76 43 120 -65 2 -57 -121 -15 -15 -31 84 26 140 -1 -68 -46 -126 86
7310 86 -8 77 37 57 -13 4 49 15 50 -103 33 2 -149 -22 -82 1 57 14 65 158 -32 54 -86 -146 -206 5 -159
7337 -159 45 68 32 46 -47 1 9 27 13 -31 -43 80 -147 -12 0 -99 86 -56 -52 21 -13 -159 62 6 -143 -115
$$ packed form
7147a2J09o7K2m7O0r6m0N2J6j54Q8J0k2J68o1r1P9j21K30j17o7K02k74J19P6J9
7173H1r1M7r4n0K51n6j04R7m7m8j7M3n0LJ3k7L9q9J99p4r8N1N4j0l0J21j06Rj9
7202bk5Kp1Q6q7J02nJ7n8J5Q0o0M2m5q2K00o1J35l61J31k1J03Qj26P7J29k21K11
7230A13j81n2J20P1m5m0p9J32j37J25p8NNjp8P7K30k81k2n8K08p4l0J54K9j02
7256A1M5p4p0J20r5KO6M8j01J41m1o8lM6Q5r8j3J8j31L0J50j50J59j05mL6n5m
7284e5K5M8K9k89K18m8J56j28J20l3P7j85O7n9o4J06%j6J15n8J14j41o7K2q0K12
7310H6r4Q5m0K0p0J7M5l4L5j53J36l1j51J27o0Q3N6m3N1R3j90Q6j40o0o0K11j64
7337a59K04K3l6J4r3M8QJ8j4m4j2J23k27J35J2r9J85j42MP3l4j46K21n6j49K8
$$ plain form
7363 -115 45 77 -26 5 -2 -25 -43 102 11 60 26 58 39 35 -117 -96 96 -61 -15 67 -43 -86 37 24 -41 79
7389 79 -38 157 -152 101 -107 81 -68 56 -131 -75 -31 -17 46 -42 93 162 126 -115 103 -193 72 21 -20
7412 -20 43 149 -78 86 -66 0 -1 126 7 -24 -71 14 44 -16 -35 17 148 48 -25 -13 -23 -59 -93 -81 -41 -41 -75
7439 -75 -72 -105 -20 54 -126 13 0 -79 -63 32 -135 -124 42 71 6 -37 75 42 29 -105 -31 52 -85 -88 104 131 9
7466 9 136 -58 92 80 43 -51 -46 -25 -33 -65 -38 69 100 42 -66 -15 50 31 -53 -41 70 -105 1 26 130 -61 -115
7493 -115 -14 0 60 -132 146 3 59 27 -16 108 161 -9 -21 -76 -3 -86 -27 117 21 17 -136 -22 -146 -92 -67
7518 -67 -76 74 -41 -8 18 -47 72 -98 17 -45 -131 -35 40 -144 13 12 11 113 6 43 106 115 -55 -199 -20 118
7544 118 -203 -114 172 -32 38 4 79 -7 6 77 40 35 -149 5 -112 -95 -5 123 30 -27 -35 -102 -45 82 96 -55
$$ packed form
7363a15J60L2j03L1pk3j8J45r1M9l4L2j9mj52K1J92j57M6Q2j10m3J23j3o5J20
7389G9j17J95l09K53k08J88j49J24j87N6M4J4O3q8J35O9l6k41K18k96K65n1m1
7412b0O3J06k27J64j52O6jJ27j19l1m7Q5L0o0j9N2J31j00p3J2j0l6l4J2M0%l4
7439g5Ll3Q5P4j80J39j3p9J6R5j67J1J66K9o5m3J12l3j3j34P4Q3j37lJ92K7j22
7466IJ27j94J50j2l7r4NK1ql2K7J07L1n8j08N1O5j9q4J2J11j75J06K5J04j91n4
7493a15J01J4O0j92K78j43N6l2m3J24N3j70j2n5P3q3N9J44r6mj53J14j24N4K5
7518f7rJ50j15L3K6o5J19j70J15o2q6R6P5j84J57jjJ02j07L7O3Rj70j44J79J38
7544A18l21Q9K86k04P0l4P5q6J3P1l7nj84J54j17J7R0J28r3n7qo7N7J27J4j51
$$ plain form
7570 -55 79 -38 124 96 -48 2 -68 -68 -56 -106 -85 -45 -93 77 -97 101 -36 -26 193 -94 -36 -52 -1 -94 -40 -125
7596 -125 -215 -74 -65 16 -1 0 -82 -66 35 -19 -39 154 -73 -59 -108 -100 17 -74 52 81 1 29 -4 32 -110 36 -103
7623 -103 25 26 -67 38 -65 -28 -33 54 106 -47 19 -1 26 89 -5 103 -16 -167 106 29 -62 -114 -11 1 43 -52
7649 -52 49 235 -25 -71 41 -95 60 138 -155 -8 -125 17 30 -43 -37 -42 -25 244 -66 -31 62 -35 -17 -74 -72 70
7675 70 -166 -27 12 -76 -7 -35 37 -43 74 71 5 -172 17 -73 3 73 30 -82 -38 -134 -14 13 13 35 143 192 -119
7702 -119 43 37 -62 22 12 -65 51 171 42 -15 -75 12 -69 -118 -84 80 -3 113 117 -15 47 54 -57 -45 -25 71 31
7729 31 29 116 -9 20 15 -55 -11 24 -88 104 -17 16 -93 -61 46 -96 23 -13 -28 -76 89 81 131 33 -9 1 20
7756 20 6 -29 -99 26 -72 40 116 -42 7 -3 -67 -35 -64 -118 -2 -66 97 115 58 -21 5 -120 -73 33 64 38 -73
$$ packed form
7570e5J34j17J62k8j44N0p0%J2n0K1M0m8J70j74J98j37J0K19k87N8j6N1r3N4q5
7596a25r0J41RQ1j7Jq2J6J01n4k0J93k27J4m9QJ17r1J26K9q0K8l3L6j42J46j39
7623a03J28Jr3J05j03L7nQ7N2j53O6k0K7O3r4J08j19j51K73p7r1n2J03J2M2r5
7649e2J01J86k60m6J12j36J55P8k93J47j17J42J3p3OnJ7K69l10L5R3r7J8n7KJ42
7675G0k36J39L9q8O9k8P2q0J17lo6j77J89r0P6P0m3j12M4r6J20K7%K2J08M9l11
7702a19J62or9Q4j0p7J16J20j29n7o0Q7q1m9L4J64q3J16Mj32O2Pj11J2K0R6m0
7729C1kQ7j25K9np0M4L5j12J92j21L3j09L2J07j42J19l6j5m8J65qN0r8m2J0J9
7756B0j4l5p0J25r8J12P6j58M9j0o4L2k9n4J16o4J63J8n7p9K6j25M7J06L1k6j11
$$ plain form
7783 -73 0 74 -91 40 -30 -66 -93 -23 -94 -188 14 -101 -121 -90 124 25 -55 -41 25 -4 18 -41 -74 50 -7 -62 95
7810 95 -97 -24 -95 38 0 -17 -68 -17 -72 105 -127 -13 10 34 -18 52 45 -13 -65 -24 -20 163 -38 77 116 42 -104
7837 -104 92 -65 8 -6 -155 -46 -35 -119 -105 81 -32 40 -59 61 57 -112 -59 13 52 -64 68 -117 -10 34
7861 34 -154 54 19 53 -148 -33 -10 10 5 -19 120 20 -65 -111 -40 43 -68 9 -220 80 164 -8 -121 -49 156
7886 156 11 8 95 11 42 -68 -83 -109 -115 59 -2 -125 -48 -19 13 17 54 59 -57 91 83 35 -36 -42 104 153 62 -69 63
7915 63 -51 65 8 -49 24 -38 65 -4 88 71 -7 -110 -32 -55 55 4 -7 52 111 34 -47 58 43 81 -10 27 -12
7942 -12 64 53 236 4 59 121 -4 -3 63 -43 -28 95 -55 -125 -30 -1 -7 -66 52 0 8 -73 33 150 -78 -179
7968 -179 -23 -70 37 5 -11 -112 -80 -26 92 -171 58 -16 -77 4 -41 -35 46 -29 -137 159 -110 78 96 10 -106
$$ packed form
7783g3P3P4j65J31p0l6k7P0p1r4K02j15k0L1K14r9q0J4O6k9K2n9l3J24n7n5J57
7810I5j92P3p1J33l8j7n1N1n5J77k32J14K3K4n2P0pn8n2M1MJ83k01J15L9p4j46
7837a04J96j57P3j4j49J09J1q4J4J86j13P2r9J20mj69N3P2L9j16J32j85J07M4
7861C4j88K08l5L4k01J15K3K0nk4J39j00q5m6P1Q3j11P7k29L00Q4j72j13P2K05
7886A56j45lQ7q4L1j10j5k6oJ74o1j23P7K9L2ML7Nj16J48qm8p1oJ46M9r1j31J32
7915F3j14J16n7n7P3o2J03o9R2j7p8j03P8k3J10n1j1N9N9p7q1J05j5L8r1L7l9
7942a2P6j1J83k32N5O2j25JO6j06J5J23j50p0R5K9on9J18n2Qq1J06J17k28j01
7968a79J56m7J07l2j6j01L2N4J18k63K29p4o1Q1m5OQ1p5j08K96k69J88J8q6j16
$$ plain form
7993 -106 -25 22 -64 -44 -156 103 -140 -29 -42 -69 -6 12 34 72 -9 30 32 8 -9 -25 110 -11 163 -24 -76 -28
8019 -28 119 -54 -45 -57 -52 48 29 -64 -51 -102 94 58 45 -117 -45 40 -197 46 27 152 -188 -74 -11 63 51 6
8045 6 -83 -45 -59 -51 -69 -19 -32 -78 -70 -39 -7 -130 89 -3 -44 -131 51 73 -120 108 108 0 63 90 -22 -67 62 -50
8073 -50 30 -7 0 -38 -100 -7 -48 -21 11 -63 -55 155 -10 19 -100 61 26 -34 223 122 -48 -111 70 1 73 40 -52
8100 -52 -14 -35 93 -1 -5 -126 -20 44 76 37 -16 82 -46 52 40 -34 -50 15 -2 -69 -167 0 51 -134 -20 128 -9
8127 -9 104 47 -21 -110 -19 -30 124 7 -3 -16 120 -37 -34 -99 55 58 146 22 82 -59 -5 -21 -19 -53 58 43 30 -85
8155 -85 81 -169 -126 66 -12 -49 -120 -13 -12 70 -38 -18 51 7 29 -70 -7 16 -25 19 5 111 -22 -42 -106 71 -108
8182 -108 -101 23 28 25 17 31 -45 -8 -53
$$ packed form
7993a06Q1M7q6K0j12K59k43J11j3k7O3J8K2L8q1L9Kk4j7j6J35j21J74j87n2M8
8019b8J47j73Rj2NJ00j9r3J3n1J96l6j3j62P2Q5k37K43j9J25l40J14O3P4j2m5
8045Fq9L8j4Qj8N0j3m6QL1L2j23K19r2m1q7J82K2j93K28%j08O3K7j12m5J29j12
8073e0Q0l7Pl8o2R3m1K7L2p4QK10j65K9j19J61l5o0K57j01j70o3J81o9P2l3r2
8100e2L8k1J28r4mj21J06O4L2l9n3R8j28R8j2p4j6O5j7o7r8J67N1j85J14J48j37
8127iJ13n7o8q9R1j1J54j17j0j3J36j57Lo5J54LQ8j24O0j41N4j6Kl4J11j5j3j15
8155h5J66k50M3J92p8l7p1J07JQ2j08K0O9m4K2r9O3K3m1M4j4J06j33k0o4J77j79
8182a08PJ24NlqJ4p6L7m5
8191e3
$$ Imaginary data points
##PAGE= N=2
##DATA TABLE= (X++(I..I)), XYDATA
$$ plain form
0 0 0 0 0 0 0 0 0 2 -8 8 -8 10 -16 23 -24 32 -40 54 -64 80 -96 115 -136 162 -189 223 -261 305 -351 404
30 404 -464 532 -605 689 -781 879 -990 1112 -1246 1392 -1553 1731 -1921 2132 -2359 2608
46 2608 -2882 3179 -3506 3863 -4257 4687 -5163 5691 -6280 6936 -7679 8524 -9492 10619
60 10619 -11945 13540 -15493 17950 -21161 25538 -31914 42143 -61939 183662 -769839 -252428
72 -252428 797294 -67175 -309650 56117 187208 -74976 -159778 115688 130851 -291078
82 -291078 117499 208804 -93594 -99305 193451 61810 -303110 171855 203121 -393643 -92838
93 -92838 289577 -80920 -95480 -70638 -30669 315279 -131169 -177776 95689 6527 44998
104 44998 -95581 -166097 123017 12926 -122886 145762 -96924 -6807 206083 -92748
$$ packed form
0@%%%%%%%Kj0J6j6J8k6L9m7N6p2R4j18J44j76K11k51K98l51M12m84N66o56P55
30D04q68R96j137J294j470J660j869K102k358K638k945L284l652M053m491M967
46B608n490O061o685P369q120Q944r850J0854j1971J3216j4615J6203j8016K0111
60A0619k2564K5485k9033L3443l9111M6699n7452P4057j04082K45601r53501N17411
72b52428J049722q64469k42475L65767J31091k62184q4802K75466J5163m21929
82b91078M08577R1305l02398n711K92756j31641l64920M74965L1266n96764L00805
93i2838L82415l70497j4560K4842L9969L45948m46448m6607K73465q9162L8471
104D4998j40579p0516K89114j10091j35812K68648k42686R0117K12890k98831
$$ plain form
114 -92748 -67607 120379 66126 -215682 3639 256328 -115166 -259002 199029 231997 -114948
125 -114948 -144339 62123 318315 -162107 -207750 270782 -101927 -145810 211760 -101379
135 -101379 -172675 223382 -2342 -86413 44473 14551 34248 -73137 9010 4192 -62699
146 -62699 -39360 8104 19806 -23544 -20964 17582 23463 32504 81130 -191521 5282 252426
158 252426 -168206 -147687 113546 64760 -37891 -47522 14067 126538 -32572 -36363 97247
169 97247 -62793 24923 12264 -62127 22001 22467 -46314 -23222 77629 26813 -48240 -26156
181 -26156 92287 -12095 -46115 -21906 -39261 56586 -59958 -34882 20446 -30384 36254
192 36254 44769 -84904 15181 86467 -73474 1295 -30876 -10930 42950 -56847 -31378 57857
$$ packed form
114i2748K5141J87986n4253k81808K19321K52689l71494j43836M58031L2968l46945
125a14948k9391K06462K56192m80422m5643M78532l72709m3883L57570l13139
135a01379p1296L96057k25724q4071J30886k9922J9697j07385Q2147m818o6891
146f2699K3339M7464J1702m3350K580L8546N881R041M8626k72651J96803K47144
158B52426m20632K0519K61233m8786j02651r631O1589J12471j59110l791J33610
169I7247j60040Q7716j2659p4391Q4128M66o8781K3092J00851n0816p5053K2084
181b6156J18443j04382l4020K4209j7355R5847j16544K5076N5328n0830O6638
192C6254Q515j29673J00085P1286j59941P4769l2171J9946N3880r9797K5469Q9235
$$ plain form
204 57857 45234 -59518 10112 79637 39437 -83993 -11383 99148 -4645 -78036 -43489
215 -43489 132001 2718 -106271 66109 82198 -36307 -10766 45634 -19263 4512 -29526
226 -29526 14270 -16855 -53843 54681 -6627 -44043 21821 56237 -50075 -18907 36134 -6050
238 -6050 -43305 -34802 29000 -29435 -8884 -16683 7713 21010 -2813 17871 -20498 12691 31373
251 31373 -9974 -73329 43262 40821 -62801 -8606 34108 53605 -34273 -13830 57210 46346
263 46346 -57750 -28118 73557 -15066 -54204 -12399 59591 -18232 -37948 28345 35854 -9289
275 -9289 -43980 51576 1044 -57319 -9823 43113 -44270 -53692 52703 2973 -26824 -13909
287 -13909 53242 1824 -38275 11155 25979 -15077 -43239 33404 -8166 -9180 12846 11888 -1308
$$ packed form
204E7857j2623j04752O9630O9525m0200j23430P2610J10531j03793p3391L4547
215d3489J75490j29283j08989J72380J6089j18505K5541N6400o4897K3775l4038
226b9526M3796l1125l6988J08524o1308l7416O5864L4416j06312L1168N5041m2184
238f050l7255Q503O3802n8435K0551p799K4396J3297k3823K0684l8369L3189J8682
251C1373m1347o3355J16591k441j03622N4195M2714J9497q7878K0443P1040j0864
263D6346j04096K9632J01675q8623l9138M1805P1990p7823j9716O6293P509m5143
275i289l4691R5556n0532n8363M7496N2936q7383r422J06395m9730k9797J2915
287a3909O7151n1418m0099M9430J4824m1056k8162P6643m1570j014K2026r58j3196
$$ plain form
300 -1308 21086 35457 -30455 17216 23211 1113 -36066 5083 34603 -22406 -22077 19876 48995
313 48995 -40074 -2730 41857 2691 -31890 -11204 26906 -26943 -24590 -12018 23930 -20179
325 -20179 -26261 26854 11679 -16018 -23256 34984 -10257 -29769 -11182 13655 -4228 -36685
337 -36685 12264 18175 5846 -25670 30399 22733 -16341 -941 5661 17679 -20811 -6958 4848
350 4848 23222 -11877 -4695 30433 8116 5062 -12508 28479 898 -21097 -6547 14386 -706
363 -706 -33011 11088 17342 3650 -29235 22933 18996 -21296 -5214 -4450 10633 -26611 -11333
376 -11333 6686 2249 -19107 5012 17213 -5476 11499 -15070 16944 434 -10198 -2193
388 -2193 -9763 9822 -149 -6632 -2038 29365 -7086 3928 13512 6928 -1334 -22236 35192 -9918
$$ packed form
300a308K2394J4371o5912M7671N995k2098l7179M1149K9520n7009L29M1953K9119
313D8995q9069L7344M4587l9166l4581K0686L8110n3849K353J2572L5948m4109
325b0179o082N3115j5175k7697p238N8240m5241j9512J8587K4837j7883l2457
337c6685M8949N911j2329l1516N6069p666l9074J5400O602J2018l8490J3853J1806
350D848J8374l5099P182L5128k2317l054j7570M0987k7581k1995J4550K0933j5092
363g06l2305M4099O254j3692l2885N2168l937m0292J6082P64J5083l7244J5278
376a1333J8019m437k1356K4119J2201k2689J6975k6569L2014j6510j0632Q005
388b193p570J9585r971o483M594L1403l6451J1014R584o584q262k0902N7428m5110
$$ plain form
402 -9918 -34516 9422 27702 -14171 -21903 19164 24809 -10478 -39020 52277 -3250 -57482 13967
415 13967 25338 -20428 -49621 25256 34084 -27800 -34085 44690 7679 -29855 8782 -4207
427 -4207 7961 -31196 10078 21533 -33080 -265 33560 -2415 -7081 23437 -10052 14765
439 14765 -988 8314 -5222 -26834 41482 -2344 -21940 13630 17328 -1260 9876 -1367
451 -1367 9805 -7211 -22316 52442 -32591 -44021 30414 20972 -20326 -31698 26994 23020 -31768
464 -31768 -11188 44284 -38900 -21874 24646 -3354 -6791 -49056 31804 40378 -46542 -12292
476 -12292 42353 -9192 -6418 14751 -16467 2798 -13413 30903 -7560 -34460 33300 3171
488 3171 3413 13643 -13047 -1482 25613 -10002 9307 -26356 -17317 58818 -33040 -22318 22768
$$ packed form
402i918k4598M3938J8280m1873p732M1067N645l5287k8542R1297n5527n4232P1449
415A3967J1371m5766k9193P4877Q828o1884o285P8775l7011l7534L8637j2989
427d207J2168l9157M1274J1455n4613L2815L3825l5975m666L0518l3489K4817
439A4765j5753R302j3536k1612O8316m3826j9596L5570L698j8588J1136j1243
451a367J1172j7016j5105P4758q5033j1430P4435r442m1298j1372N8692l974n4788
464c1768K0580N5472q3184J7026M6520k8000l437m2265Q0860Q574q6920L4250
476a2292N4645n1545K774K1169l1218J9265j6211M4316l8463k6900O7760l0129
488C171K42J0230k6690J1565K7095l5615J9309l5663R039P6135r1858J0722M5086
$$ plain form
501 22768 2791 -3712 1383 12030 -9900 -30648 25473 33011 -68500 -2190 24709 -252
513 -252 3891 -37848 24035 21947 -26336 13699 16986 -38696 11026 22591 -7331 -10479 -27677
526 -27677 46759 8137 -21374 12111 -7500 22891 18450 -27598 1227 14906 -20757 30715
538 30715 -13167 -22063 23952 -12065 25892 -550 -29137 8584 18165 1991 -17756 -30155
550 -30155 22912 14741 -40845 22831 -15402 -11231 31114 -13584 -1058 -12635 -10064 30144 -3468
563 -3468 -43174 13895 5990 4499 1467 -23135 25216 -7897 8880 18147 -26815 3502 14371
576 14371 -7263 12728 -10530 -27577 43415 879 -7600 -572 -13070 40585 -959 -25038
588 -25038 2056 8717 3086 -3232 -15784 16197 -6289 -18618 44340 -17807 -20479 9515 10939
$$ packed form
501B2768j9977o503N095J0647k1930k0748N6121P538j01511O6310K6899k4961
513b52M143m1739O1883k088m8283M0035L287n5682M9722J1565k9922l148j7198
526b7677P4436l8622k9511L3485j9611L0391m441m6048K8825J3679l5663N1472
538C0715m3882q896M6015l6017L7957k6442k8587L7721R581j6174j9747j2399
550c0155N3067q171n5586O3676l8233M171M2345m4698J2526j1577K571M0208l3612
563c468l9706N7069p905j491l032k4602M8351l3113J6777R267m4962L0317J0869
576A4371k1634J9991k3258j7047P0992m2536q479P028j2498N3655m1544k4079
588b5038K7094O661n631o318j2552L1981k2486j2329O2958o2147k672K9994J424
$$ plain form
601 10939 12922 -34856 -11820 33207 -9537 -26224 25750 -11306 -6106 10641 10157 6545 -44584
614 -44584 25337 35958 -36268 -19090 23345 4996 -3648 -7201 2316 20641 -23149 19183 10879
627 10879 -21111 6362 -189 8188 -4711 -12961 2559 10109 -7017 12918 -14489 -10790 32379
640 32379 -13070 -5742 -12270 1707 18333 -19570 -16908 18511 -226 -18007 16946 -1591 -2193
653 -2193 -14740 15286 17912 -39913 4698 24030 -9159 -20335 16374 13238 -12608 -9904 32533
666 32533 10042 -48967 28386 30274 -22174 -22184 16555 27225 -20583 -14070 23678 12124 -25173
679 -25173 16969 6997 -10299 1690 -2600 8296 -13605 1422 2075 -4843 47 6480 -7284
692 -7284 -4946 10888 -6218 2110 -15286 5865 4654 -13144 2077 -3174 2203 672 2502 -5386
$$ packed form
601A0939J983m7778K3036M5027m2744j6687N1974l7056N200J6747m84l612n1129
614d4584O9921J0621p2226J7178M2435j8349q644l553R517J8325m3790M2332q304
627A0879l1990K7473o551Q377j2899q250J5520P550j7126J9935k7407L699M3169
640C2379m5449P328o528J3977J6626l7903K662L5419j8737j7781L4953j8537o02
653b193j2547L0026K626n7825M4611J9332l3189j1176L6709l136k5846K704M2437
666C2533k2491n9009P7353J888n2448j0L8739J0670m7808O513L7748j1554l7297
679b5173M2142r972j7296J1989m290J0896k1901J5027O53o918M890O433j3764
692g284K338J5834j7106Q328j7396K1151j211j7798J5221n251N377j531J830p888
$$ plain form
706 -5386 6630 -4133 5314 3701 -16880 11088 3574 -3177 -11422 11206 12238 -12943 -4917 18191
720 18191 9182 -25973 6832 15139 -1395 -21313 2593 21731 -15084 -6927 6374 8170 -7779
733 -7779 964 -217 310 1213 -8082 3649 -6331 5024 -5461 -2040 5865 -867 -1866 948 9253
748 9253 -10672 3851 5124 -1776 -9930 6962 13298 -17564 842 13763 7659 -16696 3991
761 3991 17900 -4286 -11526 2335 16226 -13604 -3018 4415 3767 -2274 -2812 4509 -3160 6286
775 6286 -5586 -1955 -2698 5217 -4218 -11700 6093 1531 -1456 -11643 9325 3569 -7780 -3547
789 -3547 4834 4067 -13713 2911 2860 739 -11144 5531 10106 -11267 -250 9673 6857 -18459
803 -18459 5682 15434 -7028 -16535 10733 20324 -21974 -5659 18429 11223 -22225 87 25155
$$ packed form
706e386J2016j0763R447j613k0581K7968p514o751q245K2628J032k5181Q026K3108
720A8191r009l5155L2805Q307j6534j9918K3906J9138l6815Q157J3301J796j5949
733g779Q743j181N27R03r295J1731r980J1355j0485L421P905o732r99K814Q305
748I253j9925J4523J273o900q154J6892O336l0862J8406J2921o104k4355K0687
761C991J3909k2186p240J3861J3891k9830J0586P433o48o041n38P321p669R446
775F286j1872L631p43P915r435p482J7793m562k987j0187K0968n756j1349M233
789c547Q381p67j7780J6624n1k121j1883J6675M575k1373J1017R923k816k5316
803a8459K4141R752k2462r507K7268R591m2298J6315K4088p206l3448K2312K5068
$$ plain form
816 25155 -7881 -15715 7011 17718 -18632 -4548 11829 2688 -10505 49 15696 -12767
828 -12767 -1002 7989 510 -12897 4484 8745 -11362 -3978 5287 8799 -16298 5452 10097
841 10097 -7878 -3413 5382 6736 -14256 2036 8820 -954 -14396 11000 10344 -15760 3263
854 3263 8165 5955 -16986 2563 17153 -8204 -16432 9478 15898 -17425 -5414 8395 12480
867 12480 -17144 -4903 20464 -10347 -9569 3970 9070 -10967 -7155 5639 9085 -12048 -6538
880 -6538 17762 -9608 -965 1191 2663 -2843 -5117 8543 -1499 -6766 1977 9148 -7047 7195
894 7195 -3421 -99 10401 -6582 5387 -5645 1538 8086 -3225 -6003 7972 966 -2350
907 -2350 5493 -4812 8249 -9890 4524 9382 -14261 463 3381 1839 -924 -5847 -4145 14237
$$ packed form
816B5155l3036p834K2726J0707l6350J4084J6377r141j3193J0554J5647k8463
828a2767J1765Q991p479j3407J7381M261k0107P384R265L512k5097K1750M645
841A0097j7975M465Q795J354k0992J6292O784r774j3442K5396o56k6104J9023
854C263M902k210k2941J9549J4590k5357q228K5910O420l3323J2011J3809M085
867A2480k9624J2241K5367l0811P78J3539N100k0037L812J2794L446k1133N510
880f538K4300k7370Q643K156J472n506k274J3660j0042n267Q743P171j6195J4242
894G195j0616L322J0500j6983J1969j1032P183O548j1311k778J3975p006l316
907b350P843j0305J3061j8139J4414M858k3643J4724K918j542k763m923J702J8382
$$ plain form
921 14237 -7976 -4291 5796 -7917 6909 -7587 3460 658 -11915 6097 8103 -7832 -3954
934 -3954 1872 3501 11657 -21408 4395 13930 -13520 4382 365 -854 -1933 -253 8007 2619
948 2619 -17234 8582 13111 -9734 -979 -8564 14981 -1189 -14529 13299 -3466 -8981 12548
961 12548 2091 -10867 2927 -3363 14448 -6470 -16286 15912 -4570 1474 996 -7068 3689
974 3689 2594 624 5917 -11926 -355 18706 -15591 5020 1037 -7958 10528 -1645 3334
987 3334 -4876 -7114 16603 7232 -22090 5834 7511 458 275 -14708 17176 -5877 -10510 20723
1001 20723 -6103 -17359 10988 9974 -4436 -10149 -7956 23704 -10597 -13106 14557 -8253 -838
1014 -838 1469 5281 -1562 -15931 7164 20892 -21397 -8568 15723 -6838 7591 -9884 -872
$$ packed form
921A4237k2213L685J0087j3713J4826j4496J1047k802j2573J8012K006j5935L878
934c954N826J629Q156l3065K5803R535k7450J7902m017j219j079J680Q260n388
948B619j9853K5816M529k2845Q755p585K3545j6170j3340K7828j6765n515K1529
961A2548j0457j2958J3794o290J7811k0918r816L2198k0482O044m78q064J0757
974C689j095j970N293j7843J1571J9061l4297K0611l983q995J8486j2173M979
987C334q210k238K3717r371k9322K7924J677p053j83j4983L1884k3053m633L1233
1001B0723k6826j1256K8347j014j4410n713K193L1660l4301k509K7663k2810P415
1014h38K307L812o843j4369K3095J3728m2289J2829K4291k2561J4429j7475R012
$$ plain form
1027 -872 8645 -8590 10134 1662 -14804 6695 10439 -8515 3342 -7958 6450 5431 -9698
1040 -9698 13989 -11728 -3650 17505 -1990 -9665 447 3345 9201 -7274 -10442 17777 -11894
1053 -11894 1768 11085 -10345 -1113 -964 10707 2186 -18861 2294 20550 -15321 -3405 7272
1066 7272 -4971 5169 -8323 10956 -1120 -15669 12281 9340 -11950 -4533 4230 4403 3512
1079 3512 -14993 9613 698 -6218 12584 -9497 -1745 4635 -625 2119 -1778 -8175 8872 -767
1093 -767 -3902 7229 -13076 8110 4000 -5922 909 -4136 3675 2397 -6004 -104 3518 -8415
1107 -8415 9609 -1475 -6031 3769 -4388 10777 -4866 -8551 6510 3631 -3761 782 -2778 3159
1121 3159 5209 -9120 9663 -2496 -3239 5897 -1421 3334 -4342 -2063 7562 2244 -9219 4262
$$ packed form
1027h72R517j7235J8724q472j6466K1499L744j8954J1857j1300J4408j019j5129
1040i698K3687k5717Q078K1155j9495p675J0112K898N856j6475l168K8219k9671
1053a1894J3662R317k1430R232J49J1671q521k1047K1155J8256l5871J1916J0677
1066G272j2243J0140j3492J9279j2076j4549K7950k941k1290P417Q763J73q91
1079C512j8505K4606q915o916J8802k2081P752O380n260K744l897o397J7047r639
1093g67l135J1131k0305K1186m110r922O831n045P811j278q401N900L622j1933
1107h415J8024j1084m556R800q157J5165j5643l685J5061k879p392M543l560N937
1121C159K050j4329J8783j2159p43R136p318M755p676K279R625n318j1463J3481
$$ plain form
1135 4262 1568 2228 224 -6916 9794 -4759 -2127 4962 -1716 -3590 -584 3617 2055 -5844 -5480
1150 -5480 13491 -5797 -5683 4391 -355 762 -6410 4476 2030 -6784 -1394 9464 -4280 -5441
1164 -5441 4631 743 2122 -7549 4913 928 -4880 3949 -94 -2868 -122 4547 -2685 87
1178 87 -1655 5184 -2290 -4757 8780 -4733 -3182 2613 4496 -4879 -3482 5773 3376 -5918 -3485
1193 -3485 11623 -5334 -4984 3866 5051 -4783 -7086 10764 1579 -8476 -1131 11894 -3868 -7205
1207 -7205 4965 5576 -3136 -8829 11036 1107 -8059 698 7866 -1483 -7422 5534 3286 -1945
1221 -1945 -6224 7775 216 -6142 2648 2139 -713 -5253 5927 -442 -3068 -60 3422 -2145 -4153
1236 -4153 5545 -2540 -1703 -1868 5235 -2910 -5206 5428 1218 -4329 -3224 8622 -3751 -4872 2108
$$ packed form
1135D262k694O60k004p140J6710j4553K632P089o678j874L006M201j562p899L64
1150e480J8971j9288J14J0074m746J117p172J0886k446q814N390J0858j3744j161
1164e441J0072l888J379r671J2462l985n808Q829m043k774K746M669p232K772
1178H7j742O839p474k467J3537j3513J551N795J883r375J397R255k397r294K433
1193c485J5108j6957L50Q850J185r834k303J7850r185j0055P345J3025j5762l337
1207g205J2170O11q712n693J9865r929r166Q757P168r349n939J2956k248n231
1221a945m279J3999p559o358Q790n09k852m540J1180o369k626L008L482n567k008
1236d153R698q085Q37j65P103q145k296J0634m210n547J105J1846j2373j121O980
$$ plain form
1251 2108 4826 -3580 -6587 8263 465 -4551 -2445 8362 -1471 -7048 4507 4392 -2673 -6585
1265 -6585 8643 523 -4533 -674 5233 1297 -6528 4318 2766 -540 -4534 4884 1183 -2980
1279 -2980 564 570 3088 -4284 2194 146 884 -837 -267 1250 -1272 1833 -2833 2152 -1511 1040
1295 1040 -1277 -540 2691 -3077 1108 -651 1959 -2508 -11 353 890 -849 -2617 4298 -2791 551
1311 551 -767 1741 -232 -2457 2049 619 -346 -3762 3377 -615 -71 -2590 568 3868 -4236 706
1327 706 -108 1934 -2207 -1364 1610 1369 -3035 -1931 6064 -3035 -1151 -1293 4366 878 -6307 3165
1343 3165 3071 -2294 -2982 5160 -723 -2017 -355 4520 680 -7503 6798 2406 -3141 -1883 3185
1358 3185 2343 -3324 -738 3585 226 -5710 6956 -274 -3244 874 407 3214 -4253 424 1653
$$ packed form
1251B108K718q406l007J4850p798n016K106J0807r833n577J1555j15p065l912
1265f585J5228q120n056L859N907l936p825J0846j552l306l994R418l701m163
1279b980L544OK518p372O478k048P38j721N70J517k522L105m666M985l663K551
1295A040k317P37L231n768M185j759K610m467K497L64N37j739j768O915p089L342
1311E51j318K508j973k225M506j430r65l416P139l992N44k519L158L300q104M942
1327G06q14K042m141Q43K974k41m404J104P995r099J884j42N659l488p185R472
1343C165r4n365o88Q142n883j294J662M875l840q183J4301m392n547J258N068
1358C185q42n667K586M323l359n936J2666p230k970M118m67K807p467M677J229
$$ plain form
1373 1653 -1386 -572 3232 -4292 -1171 4559 -1790 375 -5101 4954 1989 -6801 2687 2398 -4180
1388 -4180 -1378 4912 -1484 -2850 -3508 8296 165 -10184 5843 2246 -1707 -3076 2034 2551 -4354
1403 -4354 -1433 8217 -3198 -9518 9579 1834 -3041 -4802 2334 7182 -7121 -970 5397 -2782
1417 -2782 -3406 6339 -916 -2040 -2511 3099 6606 -9851 1989 3946 -2678 1989 468 -2674 439
1432 439 2121 2151 -435 -7996 8334 1532 -5047 3228 -2729 2062 271 584 1600 -4296 -2135 10389
1448 10389 -3150 -7519 5365 -352 3354 -4888 -499 4459 -5093 1989 4503 -5270 -3456 5076
1462 5076 1604 805 -9409 2890 8571 -8153 1390 -376 -1412 2249 -304 -343 -54 -4996 5030
1477 5030 4612 -8977 2415 -1086 2804 2175 -6747 2185 1149 83 2569 -2710 -3574 5951 -1831
$$ packed form
1373A653l039Q14L804p524L121N730o349K165n476J0055k965q790R488k89o578
1388d180K802O290o396j366o58J1804q131j0349J6027l597l953j369N110N17o905
1403d354K921R650j1415o320J9097p745m875j761P136M848j4303O151O367q179
1417b782o24R745p255j124m71N610L507j6457J1840J957o624M667j521l142L113
1432D39J682L0k586p561J6330o802o579Q275n957M791j791L13J016n896K161J2524
1448A0389j3539m369J2884n717L706q242M389M958r552P082K514r773J814Q532
1462E076l472p99j0214J2299N681j6724R543j766j036L661k553l9K89m942J0026
1477E030m18j3589J1392l501L890o29q922Q932j036j066K486n279q64R525p782
$$ plain form
1492 -1831 1617 2 -6107 6817 -313 421 -895 -4294 5116 3726 -4737 129 516 -380 6444
1507 6444 -6294 633 1721 -2590 6290 -3072 -2951 2241 435 1664 1065 -6708 3048 3488 -1866
1522 -1866 1326 -6798 4871 3011 -4580 1787 -1355 -1216 3128 -85 -1512 -362 -4787 8498 -276
1537 -276 -8805 3791 1047 2090 -2759 -2708 3584 -724 -2900 5323 -2468 -5610 5141 522 1452
1552 1452 -6289 -532 8006 -3937 -2167 2062 -1132 -148 2323 -1957 658 -3747 2709 5775 -8145
1567 -8145 1494 2369 -260 1010 -1560 -168 979 -742 2821 251 -6774 6144 1736 -2767 228
1582 228 -823 3538 -2301 100 3033 -3133 -2540 7000 -657 -4835 970 2255 4101 -7264 453
1597 453 5754 -4109 -1062 3439 -605 -3617 1137 2766 1225 -7519 2405 5756 -5237 -563 733
$$ packed form
1492a831L448j615o109J2924p130P34j316l399R410j390q463M866L87q96O824
1507F444j2738O927J088m311Q880r362J21N192j806J229n99p773R756M40n354
1522a866L192q124J1669j860p591O367l142J39M344l213j427J150m425J3285q774
1537b76q529J2596k744J043m849N1O292m308k176Q223p791l142J0751m619R30
1552A452p741N757Q538j1943J770M229l194R84K471m280K615m405O456L066j3920
1567h145R639Q75k629J270k570J392J147j721L563k570p025J2918m408m503K995
1582B28j051M361n839K401K933o166N93R540p657m178N805J285J846j1365P717
1597D53N301r863L047M501m044l012M754J629j541q744R924L351j0993M674J296
$$ plain form
1612 733 1730 -2221 -717 2706 -1281 -4141 3511 2821 -5507 1246 234 2219 -1749 -2238 3306 -1812
1628 -1812 -415 1733 -704 -3010 3105 -180 -468 -846 -372 3453 -3874 1698 1387 -1901 -693 2181
1644 2181 648 -2490 -129 1861 2368 -5133 2143 2372 -1908 -31 188 2435 -2654 -95 2683 553
1660 553 -3851 2039 2784 -2385 -9 -523 3231 -2539 -1014 2462 -240 -1558 34 2379 -1457 -243
1676 -243 -877 2691 -1202 -1405 1445 -544 1251 -1961 718 256 130 -1099 531 309 -1176 859
1692 859 -1450 1802 -1649 -135 733 -549 -80 -751 1174 -1163 494 -785 913 -985 -149 1189
1708 1189 -1459 1195 -1090 983 -640 417 -81 -431 639 -109 616 -1753 2351 -556 -611 -29 1095
1725 1095 833 -2583 1658 1419 -118 -2404 2290 1508 -2030 -329 1338 2157 -3667 867 2221 -290
$$ packed form
1612G33R97l951J504L423l987k860P652o90q328O753j012J985l968m89N544n118
1628a812J397K148k437k306O115l285k88l78M74L825p327N572l11l288J208K874
1644B181j533l138K361J990N07p501P276K29m280J877K19K247n089K559K778k130
1660E53m404N890P45n169K376n14L754n770J525L476k702j318J592K345l836J214
1676b43o34L568l893k03K850j989J795l212K679m62j26j229J630k22j485K035
1692H59k309L252l451J514Q68j282M69o71J925k337J657j279J698j898Q36J338
1708A189k648K654k285K073j623J057m98l50J070p48P25k369M104k907n5N82J124
1725A095k62l416M241k39j537k286M694p82l538J701J667Q19n824M534J354k511
$$ plain form
1741 -290 -2265 1092 2633 -2537 -704 1108 1915 -3448 478 2637 -1457 -1351 461 2814 -2912 -709
1757 -709 1818 901 -2635 -179 2685 -2160 -541 206 1878 -2351 -428 2130 -1257 -916 484 1413
1773 1413 -2299 537 757 -195 -1697 716 2337 -3525 550 1571 322 -2835 823 2511 -1780
1788 -1780 -1531 1368 2388 -4004 1052 2357 -600 -2020 444 3643 -2761 -1293 2254 1859 -3306
1803 -3306 410 2548 -772 -1356 -43 4028 -3004 -1197 2907 643 -1933 -469 2491 -499 -918
1818 -918 -476 2588 -2396 -240 2415 -1712 36 -662 1730 -779 -971 660 792 -1736 487 1389
1834 1389 -2893 1548 -206 824 -1486 -1098 2698 -1199 -1170 802 592 -2063 1438 -180 276 -1468
1850 -1468 -680 3829 -3244 -719 1437 428 -914 -625 506 666 -1010 -700 3186 -3220 417 1213
$$ packed form
1741b90j975L357J541n170J833J812Q07n363L926K159m094J06J812K353n726K203
1757g09K527r17l536K456K864m845J619P47J672m229J923K558l387L41J400R29
1773A413l712K836K20r52j502K413J621n862M075J021j249l157L658J688m291
1788a780K49K899J020o392N056J305k957j420K464L199o404J468L547l95n165
1803c306L716K138l320n84J313M071p032J807M104k264k576J464K960k990m19
1818i18M42L064m984K156K655m127J748o98K392k509j92J631J32k528K223R02
1834A389m282M441j754J030k310L88L796l897K9J972k10k655L501j618M56j744
1850a468P88M509p073K525K156j009j342K89J131J60j676L10L886o406L637P96
$$ plain form
1866 1213 133 415 -2848 2027 1490 -1480 -846 1707 -1080 1397 -320 -756 1940 -2786 2633 410
1882 410 -1608 350 136 1277 388 -1842 358 2441 -2276 1954 -1200 -531 2189 -1851 1751 -1084
1898 -1084 -1474 1975 901 -1831 666 -1053 901 1783 -3223 1924 -1559 453 2274 -2832 -54
1913 -54 858 -236 772 -430 -2036 2594 -1766 1054 1287 -4336 2364 899 -445 -1014 -1700 2263
1929 2263 1434 -3256 1228 1019 -2996 2973 -689 63 -1065 -1434 4920 -1842 -3648 2302 1625 -1232
1945 -1232 478 -1418 1867 -516 -1266 4322 -4005 -689 3460 -229 -526 -1577 526 3135 -1597
1960 -1597 -1272 3032 -3267 1846 1925 -2369 555 -1249 2749 449 -3377 1180 1753 -1869 1994 -628
1976 -628 -2272 2268 -1096 2498 -2527 -2723 4713 -822 -2100 865 -218 -207 807 -1239 1847 -3212
$$ packed form
1866A213j080K82l263M875n37k970O34K553k787K477j717m36K696m726N419k223
1882D10k018J958k14J141q89k230K200K083m717M230l154O69K720m040L602k835
1898a084l90L449j074k732K497j719J954Q82n006N147l483K012J821n106K778
1913e4R12j094J008j202j606M630m360K820K33n623O700j465j344n69o86L963
1929B263q29m690M484k09m015N969l662P52j128l69O354o762j806N950o77k857
1945a232J710j896L285k383p50N588q327L316M149l689k97j051K103K609m732
1960a597L25M304o299N113P9m294K924j804L998k300l826M557N73l622L863k622
1976f28j644M540l364L594n025j96P436n535j278K965j083J1J014k046L086n059
$$ plain form
1992 -3212 -376 5143 -3729 -1506 797 1218 846 -2735 52 2550 -2577 221 2761 -4007 940
2007 940 832 937 -131 -4052 3111 1623 -2396 202 674 -1240 2009 -872 64 489 -2698 4258
2023 4258 -1142 -2162 1475 -141 871 275 -1545 501 698 -652 2576 -3324 -52 2708 -1435
2038 -1435 872 -1597 374 1545 -1006 196 1024 -2423 1469 1923 -2575 915 -1575 2178 648
2053 648 -2905 1402 398 -736 539 -173 -1154 870 -1218 2092 -880 -3115 2816 -353 -49 -829
2069 -829 -787 1464 20 -1681 1109 -267 -1474 2116 -1486 903 -966 -689 2417 -1513 -939 541
2085 541 506 -76 151 -1288 1668 -418 -714 1955 -1928 775 304 367 296 -1215 525 1369 -749 -369
2103 -369 1189 -1314 1615 -331 -385 654 -1063 1648 -289 -823 580 582 -862 857 -148 -513 621
$$ packed form
1992c212K836N519q872K223K303M21l72l581K787K498n127K798K540o768M947
2007I40j08J05j068l921P163j488m019K598M72j914L249k881R36M25l187O956
2023D258n400j020L637j616J012n96j820K046J97j350L228n900L272K760m143
2038a435K307k469J971J171k551J202Q28l447L892M54m498L490k490L753j530
2053F48l553M307j004j134J275p12r81K024k088L310k972k235N931l169L04p80
2069h29M2K251j444j701K790j376j207L590l602K389j869K77L106l930N74J480
2085E41l5n82K27j439K956k086k96K669l883K703m71O3p1j511J740Q44k118L80
2103c69J558k503K929j946n4J039j717K711j937n34J403Kj444J719j005l65J134
$$ plain form
2120 621 -656 1773 -1786 -435 1887 -396 -856 -135 1006 -333 -533 -225 1832 -1959 -401 2116
2136 2116 -1087 -692 -572 1686 -587 -1494 705 1210 -1444 -703 1682 -770 -277 -727 1493 -525 -1787
2153 -1787 1505 442 -933 -715 1203 -286 -431 -187 863 -390 -1177 1878 -749 -398 89 590 -199
2170 -199 -618 793 102 -531 -524 1831 -1188 -507 916 326 -472 -769 1731 -293 -796 330 1254 -1026
2188 -1026 -698 1562 -19 -580 -915 1994 -472 -1422 965 891 -791 -1155 1629 80 -723 -779 1600
2205 1600 -266 -1557 1172 240 -231 -1176 1281 172 -1055 -276 726 121 -1384 883 -167 117
2221 117 -849 421 207 -900 509 -273 122 -630 669 -492 -80 -38 -75 203 -911 1166 -518 -287
$$ packed form
2120F21j277K429l559J351K322k283m60P21J141j339k00L08K057l791J558K517
2136B116l203L95J20K258k273r07K199N05k654P41K385k452M93m50K220k018j262
2153a787L292j063j375K18J918j489j45K44J050j253p87L055k627L51M87N01p89
2170a99m19J411o91o33PK355l019O81J423n90p98k97K500k024n03J126R24k280
2188a026L28K260j581n61l35K909k466r50K387p4j682l64K784j549q03n6K379
2205A600j866j291K729r32m71r45K457j109j227P79J002o05j505K267j050K84
2221A17r66J270k14j107J409p82L95p52J299j161M12M2l7K78j114K077j684K31
$$ [...]
8191A33
##END NTUPLES=NMR FID
##END=
