##TITLE=1H_Pr 4966-b
 CDCl3, 8 sc, 
 5.6.2020
##JCAMPDX= 6.0         $$ Bruker NMR JCAMP-DX V2.0
##DATA TYPE= NMR FID
##DATA CLASS= NTUPLES
##ORIGIN= UXNMR, Bruker Analytische Messtechnik GmbH
##OWNER= root
$$ XWIN-NMR		Version 3.5
$$ Fri Jun  5 11:46:59 2020 Russian Standard Time (UT+4h)  she@DPX200
##.OBSERVE FREQUENCY= 200.1315
##.OBSERVE NUCLEUS= ^1H
##.DELAY= (6, 6)
##.ACQUISITION MODE= SIMULTANEOUS
##.ACQUISITION SCHEME= undefined
##.AVERAGES= 8
##.DIGITISER RES= 18
##SPECTROMETER/DATA SYSTEM= spect
##.PULSE SEQUENCE= zg30
##.SOLVENT NAME= D2O
##.SHIFT REFERENCE= (INTERNAL, D2O, 0, 15.7039)
##AUDIT TRAIL= $$ (NUMBER, WHEN, WHO, WHERE, WHAT)
$$ ##TITLE= Audit trail, XWIN-NMR		Version 3.5
$$ ##JCAMPDX= 5.01
$$ ##ORIGIN= Bruker BioSpin GmbH
$$ ##OWNER= she
$$ F:/spectra/data/she/nmr/H-F/1/audita.txt
$$ ##AUDIT TRAIL=  $$ (NUMBER, WHEN, WHO, WHERE, WHAT)
(   1,<2020-06-05 11:46:01.46 +0400>,<she>,<DPX200>,
      <created by zg, POWCHK disabled, PULCHK disabled
       configuration hash MD5:
       00 E9 B6 7A A2 85 ED C7 34 08 36 98 17 FE 4E 26
       data hash MD5: 16K
       04 20 EA F3 2A 2F D6 C5 E7 6D 53 C6 06 D4 5E 05>)
$$ ##END=
$$ 
$$ hash MD5
$$ FD E5 6B A5 04 98 2F CA 24 DD 63 A5 6F 1D CD C0
##$RELAX= 
##$RELAX= 
##$RELAX= 
##$RELAX= 
##$RELAX= 
##$RELAX= 
$$ Bruker specific parameters
$$ --------------------------
##$DU= <F:/spectra>
##$EXPNO= 1
##$NAME= <H-F>
##$PROCNO= 1
##$TYPE= <nmr>
##$USER= <she>
##$AMP= (0..31)
100 100 100 100 100 100 100 100 100 100 100 100 100 100 100 100 100 100 
100 100 100 100 100 100 100 100 100 100 100 100 100 100 
##$AQSEQ= 0
##$AQ_mod= 1
##$AUNM= <au_zg>
##$AUTOPOS= <>
##$BF1= 200.13
##$BF2= 200.13
##$BF3= 200.13
##$BF4= 200.13
##$BF5= 200.13
##$BF6= 200.13
##$BF7= 200.13
##$BF8= 200.13
##$BYTORDA= 1
##$CFDGTYP= 0
##$CFRGTYP= 5
##$CHEMSTR= <none>
##$CNST= (0..31)
1 1 145 1 1 1 1 1 1 1 1 1 1 1 1 1 1 1 1 1 1 1 1 1 1 1 1 1 1 1 1 1 
##$CPDPRG= <>
##$CPDPRG1= <>
##$CPDPRG2= <>
##$CPDPRG3= <>
##$CPDPRG4= <mlev>
##$CPDPRG5= <mlev>
##$CPDPRG6= <mlev>
##$CPDPRG7= <mlev>
##$CPDPRG8= <mlev>
##$CPDPRGB= <>
##$CPDPRGT= <>
##$D= (0..31)
0 1.2 0 0 0 0 0 0 0 0.06 0 0.03 0 0 0 0 0.0002 0 0 0 0 0 0 0 0 0 0 0 0 
0 0 0 
##$DATE= 1591343160
##$DBL= (0..7)
120 120 120 120 120 120 120 120 
##$DBP= (0..7)
150 150 150 150 150 150 150 150 
##$DBP07= 0
##$DBPNAM0= <>
##$DBPNAM1= <>
##$DBPNAM2= <>
##$DBPNAM3= <>
##$DBPNAM4= <>
##$DBPNAM5= <>
##$DBPNAM6= <>
##$DBPNAM7= <>
##$DBPOAL= (0..7)
0.5 0.5 0.5 0.5 0.5 0.5 0.5 0.5 
##$DBPOFFS= (0..7)
0 0 0 0 0 0 0 0 
##$DE= 6
##$DECBNUC= <off>
##$DECIM= 24
##$DECNUC= <off>
##$DECSTAT= 4
##$DIGMOD= 1
##$DIGTYP= 9
##$DL= (0..7)
0 120 120 120 120 120 120 120 
##$DP= (0..7)
150 150 150 150 150 150 150 150 
##$DP07= 0
##$DPNAME0= <>
##$DPNAME1= <>
##$DPNAME2= <>
##$DPNAME3= <>
##$DPNAME4= <>
##$DPNAME5= <>
##$DPNAME6= <>
##$DPNAME7= <>
##$DPOAL= (0..7)
0.5 0.5 0.5 0.5 0.5 0.5 0.5 0.5 
##$DPOFFS= (0..7)
0 0 0 0 0 0 0 0 
##$DQDMODE= 0
##$DR= 18
##$DS= 0
##$DSLIST= <SSSSSSSSSSSSSSS>
##$DSPFIRM= 0
$$ [...]
##$SUBNAM2= <"">
##$SUBNAM3= <"">
##$SUBNAM4= <"">
##$SUBNAM5= <"">
##$SUBNAM6= <"">
##$SUBNAM7= <"">
##$SUBNAM8= <"">
##$SUBNAM9= <"">
##$SW= 24.9337058887773
##$SWIBOX= (0..15)
0 0 2 0 0 0 0 0 0 0 0 0 0 0 0 0 
##$SW_h= 4990.01996007984
##$TD= 16384
##$TD0= 1
##$TE= 0
##$TE2= 300
##$TE3= 300
##$TEG= 300
##$TL= (0..7)
0 120 120 120 120 120 120 120 
##$TP= (0..7)
150 150 150 150 150 150 150 150 
##$TP07= 0
##$TPNAME0= <>
##$TPNAME1= <>
##$TPNAME2= <>
##$TPNAME3= <>
##$TPNAME4= <>
##$TPNAME5= <>
##$TPNAME6= <>
##$TPNAME7= <>
##$TPOAL= (0..7)
0.5 0.5 0.5 0.5 0.5 0.5 0.5 0.5 
##$TPOFFS= (0..7)
0 0 0 0 0 0 0 0 
##$TUNHIN= 0
##$TUNHOUT= 0
##$TUNXOUT= 0
##$USERA1= <user>
##$USERA2= <user>
##$USERA3= <user>
##$USERA4= <user>
##$USERA5= <user>
##$V9= 5
##$VALIST= <valist>
##$VCLIST= <CCCCCCCCCCCCCCC>
##$VD= 0
##$VDLIST= <DDDDDDDDDDDDDDD>
##$VPLIST= <PPPPPPPPPPPPPPP>
##$VTLIST= <TTTTTTTTTTTTTTT>
##$WBST= 1024
##$WBSW= 4
##$XGAIN= (0..3)
0 0 0 0 
##$XL= 0
##$YL= 0
##$YMAX_a= 268999
##$YMIN_a= -258708
##$ZGOPTNS= <>
##$ZL1= 120
##$ZL2= 120
##$ZL3= 120
##$ZL4= 120
##$ABSF1= 10
##$ABSF2= 0
##$ABSG= 5
##$ABSL= 3
##$ALPHA= 0
##$AQORDER= 0
##$ASSFAC= 0
##$ASSFACI= 0
##$ASSFACX= 0
##$ASSWID= 0
##$AUNMP= <proc_1d>
##$AZFE= 0.1
##$AZFW= 0.1
##$BCFW= 1
##$BC_mod= 2
##$BYTORDP= 1
##$COROFFS= 0
##$CY= 11.3945322036743
##$DATMOD= 1
##$DC= 2
##$DFILT= <>
##$DTYPP= 0
##$F1P= 16.9975609425685
##$F2P= -3.02152046262296
##$FCOR= 0.5
##$FTSIZE= 0
##$FT_mod= 4
##$GAMMA= 1
##$GB= 0.15
##$INTBC= 1
##$INTSCL= 1
##$ISEN= 128
##$LB= 0.24
##$LEV0= 0
##$LPBIN= 0
##$MAXI= 10000
##$MC2= 0
##$MEAN= 0
##$ME_mod= 0
##$MI= 1.114404
##$NCOEF= 0
##$NC_proc= 0
##$NLEV= 6
##$NOISF1= 3.799351
##$NOISF2= 2.8
##$NSP= 1
##$NTH_PI= 0
##$NZP= 0
##$OFFSET= 15.70392
##$PC= 1
##$PHC0= -9797.136
##$PHC1= 20.20082
##$PH_mod= 1
##$PKNL= yes
##$PPARMOD= 0
##$PSCAL= 0
##$PSIGN= 0
##$REVERSE= no
##$SF= 200.130013532006
##$SI= 16384
##$SIGF1= 3
##$SIGF2= 2
##$SINO= 400
##$SIOLD= 16384
##$SREGLST= <1H.CDCl3>
##$SSB= 0
##$STSI= 0
##$STSR= 0
##$SW_p= 3612.71676300578
##$SYMM= 0
##$S_DEV= 0
##$TDeff= 0
##$TDoff= 0
##$TI= <>
##$TILT= no
##$TM1= 0
##$TM2= 0
##$TOPLEV= 0
##$USERP1= <user>
##$USERP2= <user>
##$USERP3= <user>
##$USERP4= <user>
##$USERP5= <user>
##$WDW= 1
##$XDIM= 8192
##$YMAX_p= 0
##$YMIN_p= 0
$$ End of Bruker specific parameters
$$ ---------------------------------
##NTUPLES= NMR FID
##VAR_NAME=  TIME,          FID/REAL,        FID/IMAG
##SYMBOL=    X,             R,               I
##VAR_TYPE=  INDEPENDENT,   DEPENDENT,       DEPENDENT
##VAR_FORM=  AFFN,          ASDF,            ASDF
##VAR_DIM=   8192,          8192,            8192
##UNITS=     SECONDS,       ARBITRARY UNITS, ARBITRARY UNITS
##FACTOR=    0.0002004,     1,               1
##FIRST=     0,             0,               0
##LAST=      1.6414764,     0,               0
##MIN=       0,             -258708,         0
##MAX=       1.6414764,     268999,          0
$$ Real data points
##PAGE= N=1
##DATA TABLE= (X++(R..R)), XYDATA
0@%%%%%%%%qJ6j6J6k0K8l3L9m8N8o9Q2r8J14j31J52j76K01k32K65k98L39l84M30
$$ 0 0 0 0 0 0 0 0 0 -8 8 -8 8 -12 16 -17 22 -26 32 -37 45 -53 61 -70 82 -94 107 -125 140 -158 181 -203 227
32B27m82N41o06O77p54Q40r34J036j148J271j405J554j722J908k116K352k619
$$ 227 -255 286 -320 357 -397 443 -491 545 -603 668 -737 817 -905 1003 -1113 1239 -1380
49a380K924l281L703m210M832n620O653q070J0157j3576K0397n7319J95383J16163
$$ -1380 1544 -1737 1966 -2244 2588 -3032 3621 -4449 5708 -7868 12529 -44790 150593 266756
63B66756k91210k25324Q7719K71443P0129j52215j50477L5058J10659N9739k0694
$$ 266756 -24454 -249778 -162059 109384 179513 27298 -123179 -88121 22538 82277 61583
74F1583m0217n4089l2768L7668R9856K4017j05225j21697M0922J56795N9014j27066
$$ 61583 21366 -32723 -65491 -27823 72033 96050 -9175 -130872 -89950 66845 125859 -1207
86a207j26612N3047J59332L7116j19560r1539N7273J09388Q135q9477n3124L5243
$$ -1207 -127819 -74772 84560 121676 2116 -89423 -32150 77238 85373 -4104 -57228 -21985
98b1985N0791K962l1671k3517r588J2711L2743K6569k3919m8904l745N6372M8619
$$ -21985 28806 31768 97 -23420 -33008 -20297 12446 39015 15096 -33808 -37553 18819 67438
111F7438k5038o4563j8627M1203L8891n156l3111k7669j1677J7745L8947K4137
$$ 67438 42400 -22163 -40790 413 39304 34148 1037 -26632 -38309 -20564 18383 42520
123D2520l4325o0858p863P9508O7878l7770r7691k1558Q7235P1687m2463r1709
$$ 42520 8195 -52663 -60526 18982 86860 49090 -48601 -70159 17076 88763 46300 -45409
135d5409j4874O8600L8043m4562m2468K0691L5942j5563l2283J9904M5097o356
$$ -45409 -60283 8317 46360 1798 -40670 -19979 15963 400 -31883 -11979 33118 26762
147B6762m9809o331M8426K4952l9337l8288K8172L5377k6780n1984J8220O7107
$$ 26762 -23047 -29378 19048 44000 4663 -33625 -5453 29924 3144 -48840 -30620 36487
159C6487j664q1464m0180P8077R2298k8822j13919l3922R8521R2757l5457j10354
$$ 36487 34823 -46641 -86821 -8744 83554 54732 -59187 -93109 5412 98169 62712 -47642
171d7642l0477P2176O6152k1410o2397k8346K2824L0959J3289m72j6937k9946
$$ -47642 -78119 -5943 60209 38799 -23598 -51944 -29120 1839 15128 14656 -2281 -32227
183c2227m356M5798M4283k1892o0896j4660N6088M2204l0539o2598m241N3186
$$ -32227 -36583 9215 53498 31606 -29290 -43950 12138 54342 23803 -38795 -43036 10150
195A0150K5401l6487m0481J3932M1550J0991k6404k4166J2854K9957J1846j4271
$$ 10150 35551 -936 -41417 -27485 14065 25056 -1348 -25514 -12660 17297 29143 14872
207A4872k3442q227J6598K5474M791l0560l4773J697M2996K9139k3933m7813q624
$$ 14872 -8570 -16797 -199 25275 30066 -494 -35267 -33570 9426 38565 14632 -33181 -41805
220d1805M3478M0707j1121l9422j4399K3573K0352K747q884j3235j4837m888J9088
$$ -41805 1673 42380 31259 -8163 -22562 1011 21363 24110 15226 1991 -12846 -17734 1354
233A354K4495n495l8554k3666L0144M4362j789l9624j9147K4309L0495j577k3691
$$ 1354 25849 20354 -18200 -41866 -11722 32640 30851 -8773 -27920 -3611 26884 25307 1616
246A616o199J0441M219j0745l071O887J877j4373o868Q601J3793k007j1117N74
$$ 1616 -4583 5858 10077 -668 -3739 3148 5025 -9348 -16216 -7615 6178 4171 -6946 -6372
260f372J3275P68j1219j89K0779J0828k8649k9470J2986M4005J1138m6691m2757
$$ -6372 6903 7671 -3548 -3737 17042 27870 -779 -30249 -17263 26742 37880 -8811 -51568
273e1568J8778N3738J7634l8349l5987M077L6033K7775n898k9323k4175Q208L0228
$$ -51568 -32790 20948 38582 233 -35754 -31677 4356 32131 26233 -3090 -27265 -19057 11171
286A1171K2967j3225m1463k3390K5603M0212P214l9732l4002J6286M1460J5890
$$ 11171 34138 20913 -20550 -43940 -18337 21875 29089 -10643 -44645 -28359 13101 28991
298B8991k5172k5711M048K8201J0585j5771j3751J854O802K832m967o183r75N392
$$ 28991 3819 -21892 -17844 10357 20942 5171 -8580 -6726 76 2908 -2059 -8242 -9217 -3825
312c825J849j110o591l124J0775J7406K98k1224j3474J5882K8273J252k8176k4636
$$ -3825 -1976 -3086 -9677 -12801 -2026 15380 15678 -5546 -19020 -3138 25135 26387 -1789 -26425
326b6425J1401K5855J2207k1080k2517l606J7656J8355M308j2526j8400k238J9071
$$ -26425 -15024 10831 23038 1958 -20559 -24165 -6509 11846 16154 3628 -14772 -17010 2061
339B061K3558m40k2578k2297M813K8428J2760j9071k7341j940K1485J2567m266
$$ 2061 25619 25179 2601 -19696 -14883 13545 26305 7234 -20107 -22047 -562 12005 7739
352G739j3598l682P496O184J772N379o2r873n861O886J1237n9j3336q033M219
$$ 7739 -5859 -9541 -2045 4139 5911 11290 11228 1355 -4506 2380 13617 13558 222 -7811 -3592
367c592M298m67l785K746P718o889q904L363J7010J0408j2964j9935q14K0686
$$ -3592 706 239 -3546 -800 6918 29 -8875 -5512 11498 21906 8942 -10993 -11807 8879
381H879J4915r218k3510j1575R439K0890N372j2127j7182p228J4884K0475M476
$$ 8879 23794 14576 -8934 -20509 -11070 9820 15192 3065 -14117 -21345 -6461 14014 18490
394A8490j5226k1730L689K1846J8417j0235k6006r326J6171J6481o76j6957j2507
$$ 18490 3264 -18466 -14777 7069 25486 15251 -10755 -20081 -3910 12571 11895 -5062 -17569
407a7569L321J2631O557k795n577l227R93O092N443j113l101k384Lj578M12n96
$$ -17569 -14248 -1617 4940 2145 -3432 -6659 -5666 426 5869 4756 1655 -729 -726 -2304 -1892 -2488
423b488M073j063q373q296N299J3664O973j1467j2092l3J6899J5385o662j8694
$$ -2488 1585 522 -7851 -16147 -10848 2816 9789 -1678 -13770 -13803 3096 18481 11819 -6875
437f875r498Q393J5412M592r266j4988r052J0255J7430O530j1857j9013O62J6801
$$ -6875 -16373 -7980 7432 12024 2758 -12230 -21282 -11027 6403 12933 1076 -17937 -17275 -474
451d74J8557m725j7813r865J1321J2701L931p462j2720m039O748Q802L27l401
$$ -474 18083 13358 -4455 -14320 -2999 9702 13633 6171 -6549 -10588 -3840 4962 5289 1888
465A888p299m302M081R050N593l310o976j995M394O152P30m648l139k549j637
$$ 1888 -5411 -9713 -5632 3418 9011 5701 -1275 -3270 1124 7276 8006 3358 219 -2330 -3967
480c967J566P684J946q730p803j215J1770J1132l468r845o908N323J1144P356
$$ -3967 -2401 5283 7229 -1501 -9304 -10519 1251 12383 8915 -930 -7838 -2515 8629 15985
494A5985m108j3762q553P141J3195M008j0638j4310j510J1107J2990n1j2221q568
$$ 15985 11877 -1885 -10438 -3297 9898 13906 3268 -11042 -12552 -1445 11545 11494 -727 -9295
508i295L825J1977P393m757r276m449L680P092R67l344n825m905J849L776L007
$$ -9295 -5470 6507 13900 9143 -133 -4582 -902 6190 7157 3813 -2012 -6917 -5068 -1292 1715
523A715o1l889j867M98K495M414L562j571o624n062K888J0225M370j0229j3790
$$ 1715 1654 -2235 -4102 -3604 -1109 3305 6867 5296 -1328 -6390 -3502 6723 11093 864 -12926
538a2926l92Q507J0559J194j1730q666J801J2122J1818k952j2271q521K734J6925
$$ -12926 -13318 -4811 5748 6942 -4788 -13454 -11653 469 12287 9335 -2936 -11457 -8723 8202
552H202O750q935j7826m192R898J5228J305j4698j2557K193J5615Q057l336j0153
$$ 8202 14952 6017 -11809 -16001 -6103 9125 10430 -4268 -16825 -14632 983 9040 5704 -4449
566d449l645K396P403N249n95n372r559p10R609Q024m573j1455l132M516P219
$$ -4449 -8094 -5698 1705 6954 6359 987 -8572 -9282 327 8351 3778 -7677 -10809 -6293 926
581I26O497o571m536k159M327M084L380K14n423l726k64M023N536O91r991q871
$$ 926 7423 852 -3684 -5843 -1516 2568 5948 6162 739 -2987 -3251 772 6308 6999 -2992 -11863
597a1863K480J3701N303o805r453j204Q766O052N17n475m513K626M888j82p1l613
$$ -11863 -9383 4318 9621 2816 -6637 -7841 925 6977 7494 2019 -2494 132 5020 4838 4767 1154
613A154k658j284L81M078K801q6p240k379M431O824Q09m122k888K007K171n30
$$ 1154 -1504 -2788 -2407 1671 4472 4386 -2854 -5233 -802 6022 6831 2709 -179 1828 3999 3469
629C469k41K475j584o660m887K540J1145O747j1759j5167M112J6623J1258p353
$$ 3469 3228 5703 4119 -2541 -7428 -4888 6257 13004 1245 -13922 -9810 6813 18071 10718
643A0718j7883q141J3605J7703N88j5426j2381r79J4086Q024q96j0425j2248p67
$$ 10718 -7165 -15306 -1701 16002 16590 1164 -11217 -12196 1890 9914 9018 -1407 -13655 -14422
657a4422J4564J5058k070j9954j4938J1002K6094Q130j9684k2435J096K3112J1998
$$ -14422 142 15200 13130 -6824 -21762 -10760 15334 23464 3780 -18655 -17559 5553 17551
670A7551r283k0183n055J0828J2408j546q249m827K338O385J309J240j119n285
$$ 17551 8268 -11915 -16970 -6142 6266 4720 -3529 -8356 -6018 367 1676 2916 1797 -3488
684c488j838L131O521O24n887n835J5P233M46n091l618N556N036k749p476K695
$$ -3488 -5326 -2195 4326 4950 -937 -6772 -6757 476 922 -4169 -7787 -2231 2805 56 -7420 -4725
700d725P970N787p033j0958K345J0455O909q926j0716l00Q005Q697n250p507k58
$$ -4725 3245 9032 1999 -8959 -6614 3841 10750 1824 -8892 -9192 -1187 7510 2260 -5247 -5505
715e505L113J636K943K881L50n233p413N192R792K523p717j0778o43J0463Q936
$$ -5505 -2392 -756 2187 5068 5418 185 -7228 -2036 7756 10279 2562 -8216 -8859 1604 10540
730A0540n975j1351l448P716R189J143o549l863J096L151j2N874Q85o266q443
$$ 10540 4565 -6786 -10234 -2518 6671 7814 1265 -2598 -1502 1649 1637 7511 8396 2130 -6313
745f313L86R886Q127m127j3811n508Q067J4343l15q281j1077K429J0161P461k839
$$ -6313 -5927 3959 12086 7959 -5852 -11360 -3293 11050 10735 2454 -8623 -6194 3967 11428 8589
760H589q335k365k322O434P535j36r607j0511J311J2338J1734o504j4527p632
$$ 8589 254 -2111 -4433 2001 9536 9400 -207 -10718 -9407 2931 14665 8161 -6366 -13998
774a3998J0213J6846O25j4533q828L756J3528L673q715p563j793O576M061j837
$$ -13998 -3785 13061 13686 -847 -9675 -5919 7609 11282 2567 -4996 -6789 -213 3848 2011
788B011l748j373n40K101J273m08J118r77L93j481M291k908q70K103J454j243
$$ 2011 -1737 -3110 -3650 -1549 -276 -684 434 -543 -150 -1631 2660 -248 -1118 985 2439 1196
804A196p283j572N958Q257l309j3147j436J0046J1024m574j1692m566O840J2227
$$ 1196 -6087 -7659 -1701 6556 3247 -9900 -11336 -1290 9734 5160 -6532 -11098 -4258 7969
818G969J823r307r287J4P242O124k602l979n873q08P894O657N05q089q600L236
$$ 7969 9792 485 -8802 -8788 -1546 4578 1976 -2003 -7876 -8684 -790 5867 6372 -1717 -10317 -7081
834g081Q657P044l957r563l942P062O034J07m183o761p18N526L984J294l588k803
$$ -7081 1576 8620 4663 -4900 -8842 -1780 4254 4361 178 -6583 -7301 -1775 2209 3503 -85 -2888
850b888j689J576P228J52j356m446r54J013O035R58l869l338k758K004M754K086
$$ -2888 -4577 -3001 4227 4379 3023 -1423 -2377 -1364 4671 5629 1760 -1578 -4336 -2332 2422 4508
866D508l373l382k280K856O011L942l501o983k985M452P588M25l373p788l718
$$ 4508 1135 -2247 -4527 -1671 4340 8282 4781 -2202 -5187 -735 6853 7278 3905 -3883 -7601
881g601Q310Q779k446r946p651N646J0899M094n811r074j063N888O917l50m036
$$ -7601 709 9488 7042 -2904 -10555 -4909 5990 10084 4273 -4801 -5864 24 6941 6591 2555
896B555n436k65M099L425o50l989m185J474N714j332j270j459J783K370j015l016
$$ 2555 -2881 -3146 953 4378 3728 -261 -4446 -2972 2742 1410 140 -1319 464 2834 1819 -1197
912a197J49L541O81l279n583K798O397J313l813r078O85N897O434j659o397m485
$$ -1197 -1048 2493 3174 -105 -5688 -2890 3507 4820 1007 -8071 -7386 -1489 4945 3286 -3111 -7596
928g596M461N030M400p38q237m949L079Q833K098n177q643j478Q036P536r49r143
$$ -7596 -3135 1895 6295 5557 -2680 -7629 -4550 4283 6381 1204 -7439 -8917 -881 6655 5706 -3437
944c437o053J280Q856N540l911n115l612K387N365J678k70o472m313L458O764
$$ -3437 -9490 -8210 646 6186 2275 -2840 -6452 -4065 1300 2978 2708 -3764 -8077 -4619 2145
959B145R15m742n502K109M406L986m59j219n045l26L733L211j04l018k260k096
$$ 2145 3060 -1682 -7184 -5075 -669 3317 2858 1639 -3406 -3732 1 3212 3108 90 -2170 -4266
975d266L395L101p84j873p90R7j75P53K715L40k146k798R23K842M893k663n842
$$ -4266 -871 2230 1446 -427 -1217 -1120 -1295 -542 2173 2513 367 -2431 -1508 1334 6227 3564 -2278
992b278j477J656P117j2k957p284n78M958N263L21l361m145r77N991L116J97n933
$$ -2278 -3755 -2099 5018 5006 2049 -5235 -5813 -855 4408 4729 1368 -2777 -3754 2237 5353 5550 -383
1009c83k542r33Q307M407m748o991l99K677L394K293k737l047j842Q10M637K790
$$ -383 -2925 -3858 4449 8856 4108 -2883 -3282 -605 2789 5082 2345 -702 -2544 -1734 2903 5693
1025E693j249l453m439K760K806J851q54m537j878J139M972K242m825l631j450
$$ 5693 4444 991 -3448 -688 2118 3969 3115 -1422 -3300 -2161 2811 5053 228 -3403 -4853
1040d853L688M386K013m951l552l81L482M985j791l832l823J625L717j7m39k132
$$ -4853 -1165 3221 5234 283 -3269 -3650 -168 4817 3026 -806 -4629 -3004 713 696 257 -1875
1056a875j194k377L786L264N08m108k341J663J670M563j771k969k709J478J207
$$ -1875 -3069 -5446 -1660 1604 2112 -1996 -4337 -2674 -1004 3559 1788 -1181 -3890 -2412 -1205
1071a205J292J988k792k503k287L265M759M80k180m622j167N370M054j756n874
$$ -1205 87 2075 -717 -3220 -5507 -2242 2517 2997 817 -3805 -4972 398 4452 2696 -3178
1086c178j140J262L606J920k394l347k240J719N299K407k136o226j419M418L252
$$ -3178 -4318 -3056 550 2470 76 -3271 -5511 -3792 1507 3914 1778 -4448 -5867 -1449 1803
1101A803M304l391p259n45N000L090L57l139m020m01M865K995o75m501m195M227
$$ 1803 6107 2716 -4543 -5088 -88 3002 3359 220 -3800 -4201 664 3659 2984 -1517 -5712 -1485
1117a485J553K853M74m194k176L001K542J411j667j578k727R46K989J798j334
$$ -1485 68 2921 3395 -799 -2975 26 2568 3979 2312 734 -1993 -1047 1942 3740 2406
1132B406k588j801K80J413M270j271k090j847J125Q85J682K447l746l885k40L939
$$ 2406 -182 -1983 -1703 -290 3980 2709 619 -1228 -103 782 2464 4911 1165 -2720 -2960 979
1148I79M044j199l499l044q41N875K379q55n125k333J869N216J760l237k854k684
$$ 979 5023 3824 325 -2719 -3560 2315 4694 3839 -1286 -3619 -1750 3466 5226 1989 -865 -3549
1164c549L199M415J058m233l612j186L547K701J077m377l754K746L015K593j291
$$ -3549 -350 4065 5123 890 -2722 -3908 -361 2340 3417 -960 -4714 -1968 1047 3640 2349
1179B349k835k798M35L851J501j102k944k309N22K506K113k013j821P9L67L003
$$ 2349 -486 -3284 -2849 1002 2503 1401 -1543 -3852 -3330 -824 1289 -724 -2545 -2466 -2099 904
1195I04o19J49j742k532J869J793J602q82k284j522J571O61K112k62k926j468
$$ 904 285 434 -1308 -3840 -1971 -178 1424 542 -1742 -3264 -1693 -1032 1080 818 -2108 -3576
1211c576J023J788K741q76k138k696R14K909L425r95m918k315K058L210L047k937
$$ -3576 -2553 -765 1976 1100 -1038 -3734 -2820 89 3514 2519 -2399 -4714 -2656 554 3601 664
1227F64m250j330L721L427P37k973l314j12M337J231K058l061l482j662L857L570
$$ 664 -3586 -4916 -1195 2232 2969 -4 -3318 -3430 907 2138 4196 1135 -2347 -4009 -152 3418
1243C418j280j491l975j114L922M754L37m397k876R77M736J195k761l47j938p44
$$ 3418 2138 647 -3328 -4442 -520 4234 4571 174 -2702 -1725 3011 4206 1445 1098 -840 -1584
1259a584K600K086n97k492j408q72M602J940r99m912j542J941M306K988m595m123
$$ -1584 1016 3102 2505 13 -1395 -2267 2335 4275 3276 -1636 -3178 -1237 3069 6057 1462 -2661
1275b661J262J396K353k23k25k650k70j092K810K571j694m260j287L975N273j816
$$ -2661 -1399 -3 2350 2127 1902 -748 -1018 -2110 700 3271 1577 -2683 -3970 5 5278 3462
1291C462l625k107K25L959R55j220k727Oj261L171n33J18j120R9q18Q06J238M91
$$ 3462 -163 -2270 -2045 1914 2869 1649 -1078 -1072 -2333 838 305 423 -697 -598 -1416 -610 628 1119
1309A119m36l358Q54K176J983r04k840k035J745J105Q92m30o32k475J844r77K224
$$ 1119 683 -2675 -1821 355 2338 1434 -1406 -3441 -1696 -591 301 -129 -761 -3236 -1392 -2369 -145
1326a45K245j913k787q07J502M196Q34m902l156RN296L768l732k489j326J521
$$ -145 2100 187 -2600 -3407 -1905 2291 3125 -1777 -4933 -4924 372 4140 408 -2081 -3407 -1886
1342a886L301Q24l088j144j330O34M416K084j233n705k198L821M805O76n194m284
$$ -1886 1415 2239 -849 -1993 -3323 -2689 1727 3811 2578 -3127 -5325 -1504 3301 3977 -1217 -5501
1358e501J374O004J739l363k353k026L853K814J11k480p08p43mJ361K745n78l839
$$ -5501 -4127 1877 3616 253 -2100 -4126 -273 2541 2652 172 -536 -1279 -1283 78 2823 2245 -1594
1375a594k711L545L044J922l960k961Q91L075j51m53j007L75l38L15K623q17Q08
$$ -1594 -4305 -760 2284 4206 246 -2715 -1824 1251 1100 647 -360 15 -323 -8 2615 1798 2606
1392B606j804l58l36J729O86l29k026j766L062l05J501j48l565Q16m18J208K390
$$ 2606 802 444 108 1837 2523 2194 168 -1598 1464 1159 2660 2512 -1053 -237 -655 553 2943
1409B943P70l140k462Q29L063L33M54l746j846J839L493p8j817k352j249J972
$$ 2943 3713 573 -1889 -1060 2003 2336 2790 -956 -2802 -963 2530 2452 635 -1717 -2966 -994
1425i94M113l03k827m077J664K223J887N87k724j924o61K481L498p25k614l832
$$ -994 3119 2816 -11 -4088 -2424 -201 1686 2273 -451 -2375 -3036 -555 2943 2218 -396 -4228
1441d228J066M316K426k119l390k539L526K596J241l226k232O63K56J495R02N18
$$ -4228 -3162 1154 3580 1461 -1929 -4468 -942 1654 2895 -331 -2563 -1900 -1644 -149 753 1271
1457A271k250k986J629K215K549k155l817o43M363J913r19k528o95j006L192M90
$$ 1271 -979 -3965 -2336 -121 2428 273 -3544 -4187 176 2089 1170 -1358 -2053 -3059 133 623
1473F23K78k317L16j085R40K966O26k758k884J541J970J815j361j721j731J519
$$ 623 901 -1416 -1100 -2185 -1245 1721 2347 -411 -3295 -1754 216 2031 670 -1051 -2782 -1263
1489a263J599K45m4j041j049M1J590P23J078k797o56J82J105L088q53k782j001
$$ -1263 336 581 537 -504 -1553 -1512 78 801 1879 -918 -1574 -1392 -287 2801 1948 -834 -1835
1506a835J009K369p7m36j189j957J201K146N64n5j510l055K630J800R98J16l474
$$ -1835 -826 1543 1466 1030 -159 -2116 -915 1231 1795 1740 230 -2825 -195 1605 2603 2719 -755
1523g55o80J119K198J887k146j115k093J270L284K5j715l354p05K370K797L04
$$ -755 -1435 -316 1882 3769 1623 508 -1585 -315 2969 2994 1279 -2075 -2780 -410 2387 2691
1539B691j692j756j655K364J289J450j938k402n49K686J666N85l762j310R47J742
$$ 2691 999 -757 -2412 -48 1241 2691 753 -1649 -2198 488 2154 2739 -1023 -2333 -1386 356
1555C56J396l63j543k262K042P06R54p91j007q35n87K409J774k091k079k80J027
$$ 356 1752 1389 -154 -2416 -374 332 1286 495 -512 -1347 -1934 475 2249 158 -1921 -2201 -1174
1572a174L179n12j136l142J780P39O39Q6m58j343o86K99J300J721p86k713O55
$$ -1174 2005 1493 357 -2785 -1005 -266 373 459 1 -1342 -2028 -1729 -429 1292 506 -2207 -1552
1589a552J614l17J362j077j622K28K001L08Q0j956j830N84J349J998J87r88k888
$$ -1552 62 -255 1107 30 -1592 -1364 637 945 1025 -931 -2761 -2177 -828 1170 1357 369 -2519
1606b519K70J057K871j243Q5k441M47J054J863N39j900k295m56J786L295j355
$$ -2519 -2249 -1192 1679 436 521 -1920 -1473 -419 1444 1983 83 -2212 -2668 -882 2413 1058
1622A058k953j872K284K370J384p68k939k40P65J815J435p5m302n74J747J661
$$ 1058 -1895 -3767 -1483 887 2271 1503 -1436 -1676 -911 904 2339 2264 -2038 -2612 -865 796
1638G96K019l007n96q09J501K114o66j114j715l01K772R49P30l598j25n97K013
$$ 796 2815 -192 -788 -1597 -96 2018 1352 238 -1477 -1778 994 1943 2673 -925 -1050 -1647 366
1655C66Q81J647j814k574J202N75K68Q56j236p79m99J896k2M40p86O07k605K871
$$ 366 1247 2894 1080 -1494 -292 283 551 1407 171 -608 -1107 789 767 1207 421 1028 -1577 1294
1673A294j02P42k349N36m06QK081n40j869o42m78J469Q78J240j461l391J898O30
$$ 1294 1192 1934 -415 121 -285 -277 1804 1264 -605 -1247 -1725 -256 622 1862 401 -2990 -1092 -462
1691d62K816j156j096k835J065K608J771k450j529j061P00K276K481k374k133
$$ -462 2354 1198 102 -2733 -1668 940 2711 261 -1268 -2329 -1629 647 3128 754 -1379
1706a379j99q23L707J00j881j015j358L558Q91o99j785j692J86K754k87o1m20
$$ -1379 -1578 -2401 1306 1406 -475 -1490 -2848 710 1601 902 -883 -2575 -2389 365 78 17 -403
1723d03k507J27K941L47J18j606q81K021j91P09j188Q5j879J250J727L05j398
$$ -403 -2910 -2783 158 505 623 -983 -1864 157 -34 675 -513 -428 -2307 -1057 670 975 -423
1740d23n03k50l7Q28N11R9q05m08M23J868n6j342J86j056q5J787J771j003k799
$$ -423 -926 -1176 -1213 -385 126 225 -580 -988 -565 1303 1247 -95 91 -965 -1050 737 2508 1505 -1294
1759a294O39k67J367K065j578l390J123L70K426R27j818j730o5M83K636p97m57
$$ -1294 -655 -922 445 2510 932 -2458 -1335 -965 1461 2388 570 -1160 -1225 -742 1894 1097 640
1776F40j658j302K380K950j98k958j276O44R00K906j440j823j338J266K247R16
$$ 640 -1018 -2320 60 3010 2812 -146 -1422 -778 122 3028 1588 -235 -1573 -307 1940 2856
1792B856j611P8j898n90L005p1n7k500j93O66J737R61q04j869q10K149j9M26l14
$$ 2856 1245 1323 -575 -1165 1840 1769 1712 -788 -981 -315 1422 2383 1579 -290 -1100 1049 1030 1456 1142
1811A142q52j616K24J384J434n03j310q80P48M76J270p10k321k61J856M43L65
$$ 1142 290 -1326 -1102 282 1716 1213 -97 -977 -229 247 1517 807 -1514 -1775 81 524 889
1828H89j742k90L01k56J892J271k725l3j766J315J996p6M57k184L92J191L15o32
$$ 889 -853 -1143 -842 -1098 794 2065 -660 -693 -2459 -1144 852 776 1233 -951 -559 632 947 315
1846C15M03k844m1Q93K467j086n16p62m92J274J121R46k944N98o25K25J167L94
$$ 315 718 -2126 -2167 -1274 1193 107 -409 -1171 -1663 -389 732 1678 -1266 -668 -1293 -1068 99 493
1864D93j391n72l70J242J148J62j849r74J903J738l21j684p15M63m16J763k14
$$ 493 -898 -1470 -1840 -598 550 712 -1137 -2111 -208 1530 1209 -475 -1190 -727 -1143 620 406
1881D06P86k533J088j364K306J505k773O58j839J288K322R0j168n34j331K637
$$ 406 1192 -1341 -253 -1617 689 2194 -579 79 -1760 -472 1850 1940 772 238 -1093 1544
1897A544L46O83j772j342j173K730J59P3j31j585R6O08J635j009M27k223O40K647
$$ 1544 1890 2573 801 -541 -1714 1016 1175 1248 1117 -468 -372 236 1871 862 1289 -934 -294 2353
1915B353p5J00j380k344J083K49J883o09k300J407o04K075Q31j735j635J53K61
$$ 2353 2278 2378 998 -1346 -263 -14 1869 1260 -1040 367 -237 1838 2669 934 -701 -548 -287
1932b87o94K269J91o99k53j022J934M47o04k489Q40j07J43J310j109o3l83l08
$$ -287 -981 1288 1479 780 527 -495 1439 1886 1282 -1207 -367 -474 -331 979 -130 -193 -576 -884
1950h84J726N66k9k685j028K769J651j309j898l40k79K980j62J403k678k190J550
$$ -884 842 1408 1379 -1306 -2334 435 2086 777 -1121 -1461 -1740 1240 1078 2481 -197 -2387 -837
1967h37J096k47n33j163J74j18K476J135j358j875M8j533K064Q89M58j965p28
$$ -837 259 12 -521 -1684 -1510 -1628 848 1983 625 -1250 -1202 -2735 -671 218 676 -1289 -2017
1984b017J142J644N41j677j68j913P55J366O33J20j102k237K378J803j262L68
$$ -2017 -875 769 1310 -367 -535 -2448 -1693 -327 306 426 -676 -2913 -535 1268 6 374
2000C74j068l58l17K077J367j653r10j63J511p12j38M05m92j337N76J866O29J13
$$ 374 -694 -1052 -1369 708 2075 422 -488 -651 860 148 10 415 -77 -1414 -838 1028 1657 1770
2018A770j929q10j48K274m68k69j149p82J196K096j83j658J98l11J317L38J50
$$ 1770 -159 -969 -1117 1157 689 420 -729 -1511 -315 1781 1598 -60 138 -173 1144 1482 1632
2035A632p77j339N00Q95J476m18j416j458J042J452n90O1j083j537M67K017n09
$$ 1632 855 -484 16 911 2387 1969 553 -905 137 1589 999 1060 -23 -1560 -1093 924 415
2052D15K341k740j019P32J976Q76j700k067R86l66K311n11j465j868K224J103
$$ 415 2756 16 -1003 -271 1705 2581 881 -1186 -200 -566 1745 1234 -231 -2099 125 1228
2068A228l10q67o62q33J828k77Q02m38l2j452J008J98N44K39m88K16j729R21R29
$$ 1228 918 51 -611 -1444 384 107 909 471 439 -1013 -5 193 737 976 488 704 -1025 -104 825
2087H25j81j333p49r53K461m68J111j168p40j55J292P76o35L02l118K084K43L76
$$ 825 644 -689 -1438 -2391 70 -398 713 -455 -1195 -1350 -58 718 83 385 -2733 -649 -406 -30
2105c0J316j456j190n1J960J272r53k475J248P39j112J224j75j680n9L03O78J992
$$ -30 1286 -170 -1360 -1411 549 1821 868 -1607 -359 380 -732 492 317 -1363 -1422 -1119 -441 1551
2123A551j590j371m28P76R91K097j523k470K58K019J629j122j101j269J556K00
$$ 1551 -39 -1410 -1838 -1062 -71 2026 503 -1967 -1709 310 1939 817 -284 -1553 3 203
2139B03o43J530j821j069K68J334Q59O60k62j788j055J330K186j123j556p26K352
$$ 203 -440 1090 -731 -1800 -1532 -198 661 1321 1059 -729 -1784 -454 1732 609 -947 -1673 679
2156F79P01R19j126p49j113n59J666K520j936o42l8r53J540L84j72p64n05J347
$$ 679 1380 2299 1173 424 -689 -1248 418 2938 1002 360 322 -631 909 1293 1121 357 -148 1199
2174A199j272J579j3p73j070L8K154j536J115j780N63l43M66J199r57m72o20J448
$$ 1199 -73 1506 1493 720 -350 -312 1842 306 1421 -359 204 -139 327 1526 569 97 -523 925
2192I25k04N83q13r37m3J417J274k220k95k82L09nP73M66r2j803K39p0J644m21
$$ 925 721 1304 491 -446 -489 928 2202 -18 -313 -595 -286 -291 482 948 856 -947 -708 -778 866 445
2212D45k4q18j803K351R98o68L59k608p26K519k83N10o79p54K03O30O32J061k108
$$ 445 421 -397 -2200 151 1149 481 840 -1768 -2494 25 -258 252 -427 -1181 -978 -348 284 1345 -763
2231g63q91J507R80k95Q6j641o5J475j329K018p31l069K050p28K761j875J034
$$ -763 -1654 -147 833 538 624 -1017 -1082 393 -936 1082 351 -2718 -668 -1396 1365 -510 524
2248E24o27r22k97l68J022M11j344L06K624o28o97j640O47k05R11R49M61j517
$$ 524 -103 -1025 -1322 -1690 -668 -257 -1601 -1295 1329 701 4 -1636 -989 -1194 -283 666 1127 -390
2266c90n53J415m87k00J524j086j085m91K296o24Q49k203J46K94J078J039o48
$$ -390 -943 472 -15 -215 1309 223 -862 -1353 943 319 1168 -1035 -889 -595 483 1522 874
2283H74l68j074n20J465N85n27j110M37N59j7J182n61r58J387q71n36J479o72
$$ 874 506 -568 -1088 377 962 435 -675 -238 321 304 1486 925 -33 1354 483 -53 1426 754
2301G54J07q63k43J144J417k423o0q7l94J277M86m93m11n58J029M65k64j87j392
$$ 754 861 -2 -245 899 2316 -107 -167 -254 -648 629 1115 622 211 -347 682 1147 883 696 -696
2320f96R71L84O49k9j895j071K466k13P63p44j074p39l26P69J297O27k059N62
$$ -696 275 659 1308 1279 -616 -1687 779 566 1329 585 -489 -1228 -1554 -785 512 1139 -920 -358
2338c58L3J095j16r33O06n07L37j278J794p02J53p05O67K37j078J611j009r39
$$ -358 -325 770 654 -279 327 -180 157 -1121 673 -29 124 -581 86 323 -755 856 -153 -1092
2356a092M50J83J088Q83j001j411P04Q13r23L77J01q67M49R24l30p0o80o11J743
$$ -1092 -642 -459 629 1512 511 -900 -196 617 -306 71 172 -695 -246 678 348 278 -402 -1013 730
2375G30K70l96Q14j407j351Q68J634k66r38r82O27m36J814n81j474k1o65J430
$$ 730 1000 604 1418 11 -1340 -472 1162 896 -42 -1024 -397 -833 981 400 -1074 -1095 -1760 -330
2393c30p1J617j142j392K17J597r76O77L0j164J008O77p01J409p11j857K089j001
$$ -330 -401 1216 74 -1318 -1101 496 -480 197 227 -937 71 748 47 1456 745 -1112 977 -24
2411b4J184k433J458j143J301N68k57O81k399O90K57P46m22M78j754J41J304N53
$$ -24 1160 -1273 185 -958 343 911 654 1335 -1064 -374 -117 629 207 685 -1069 -928 376 929
2429I29P1r97K54k55J21J4Q07J233l281p9R31J796j511J197k296R28O27n79J058
$$ 929 1000 3 257 2 123 137 944 2177 -1104 -1183 -252 1544 33 1230 -1066 -138 489 -90 968
2448I68o94R6p04J8Q14k39L95k635K797K01J07j873n14J316j620K158Q3L47l55
$$ 968 274 370 -334 -316 498 259 654 -1981 816 1017 1124 -749 -1263 53 -1567 591 674 1021 666
2467F66Kj582J046MO60j035l41Q38K96l0k40k508J63J938J153p80r49J039k8r37
$$ 666 668 -914 132 136 796 -239 -580 258 554 524 284 -2224 -2061 -123 1030 250 -699 340 312 -625
2487f25M25L17j619J066m25J002k72N66n01m83M36Q00j862J095J26j455J458q28
$$ -625 -200 117 -1502 -436 -861 141 -131 435 -66 -549 -113 687 -1175 -80 46 -1409 49 -779
2505g79K66N36M9M18j430J424K24m70l20p61j492J898R26J61o14r70L59J152r24
$$ -779 -513 23 72 490 -940 484 708 238 -82 -843 -2335 -437 489 650 36 -934 -575 577 -347
2524c47O11p62j14J86O21k20J001k055n33J583l00J270j569J797k175J693K56
$$ -347 264 -498 -612 -426 195 -25 976 -1079 -1612 -29 -329 941 -628 1169 -1006 687 943
2541I43M03o02j329k3J061p26J034kj507J642j135j88K37P80k134R53J95J344
$$ 943 1346 744 -585 -608 453 -273 761 759 -748 894 -241 -429 -192 588 -1546 -593 -398 946
2559I46q30P67j875n71K714m20o75N11j676M19J999J20l8j234J3j026l51K274
$$ 946 116 883 -992 -1563 1151 731 56 567 -1109 -690 1309 1429 1391 157 170 -856 -1207 1067
2577A067k23l58j253J451N13j154K26p02M3Q80N42J52o87o03j211O74J578Q59
$$ 1067 844 486 -767 684 1197 43 269 -433 -390 490 1032 1184 497 -106 -1317 -643 935 1794
2595A794p39o87j106L00N35l44j59l38K4Q40M98R24j854K54j43p00J29J109M5
$$ 1794 1055 368 -738 -438 97 -247 -406 -744 -720 120 618 1542 -312 -58 -201 -901 -772 337 382
2614C82n67o0P85j401J133r11n27K56J025k91R9j490J081q72P16K28K8l47P51
$$ 382 -185 -245 540 -861 272 -639 -1166 -910 115 -176 -77 -1567 -486 -1358 -642 -414 -386 -733 18
2633A8m52L20L88l05q0q13J355n75J092r25j765K68M23P62J029j018K98q21m05
$$ 18 -434 -114 274 -31 -111 -924 431 -144 948 23 -1742 -1474 -1051 -289 740 -278 20 -801 -1206
2652a206J781o11q6p26l35J103J065p11p9j057N1J165P46o81q85Q0K48j26M88
$$ -1206 575 -36 -122 -848 -1183 -80 985 274 195 -862 -811 354 1100 419 -466 -386 -138 -264 224
2671B24O29m00k46m19m34M46J446m53j647J167o87J058o01O80j106R9Q67j08o31
$$ 224 853 453 207 -212 -646 -200 1246 793 -854 313 -374 684 83 763 -343 -244 623 515 -116
2690a16N96j418R24J443k23J55j043J001j597j56M48Q57p95K01q69R25K49O67
$$ -116 480 -938 -14 1429 1206 1361 318 1319 -278 -434 14 871 76 277 -592 333 582 1249
2708A249j563n31L86K96J311J81k005J044L33k90P18l43j006n45O51m26R13L22
$$ 1249 -314 -845 -459 -163 1148 1329 -676 368 701 411 1129 786 -220 -765 -114 -540 373 695
2726F95J94j624J541j628J570j50j038j64J287M93m46q76j420O31n28J780L12
$$ 695 889 -735 806 -822 748 598 -440 -604 683 1176 730 -146 -1566 -935 -1463 317 629
2743F29n72m5n39L43J6j089J155j200K91k8J698p41j038K39k86Q20J193j51j666
$$ 629 57 12 -527 -184 -168 -1257 -102 -1302 -1011 -1039 659 -82 -1120 -881 -1167 -347 846 695 -971
2762i71J6K24J466nr72o18J780k88j003j52N89j833J356L24l13J154j772R4L20
$$ -971 -955 -731 735 730 -242 -860 920 632 -371 -523 66 -1767 -411 -87 -400 754 -1018 -924 -604
2781f04O30O43j622Q45P8p19O86P05m98J4q71n67P07J364o80j022J97K73L11J036
$$ -604 26 669 -953 -108 -30 -749 -63 642 144 158 -713 -1280 -573 791 111 -911 -714 -441 -130 906
2801I06j109j37J838j646n83J648L0M59k386M11J683o04J72o71oj213K231j11
$$ 906 -203 -340 1498 -148 -731 917 947 1406 -980 -569 1114 510 682 11 5 -1208 1023 912
2819I12L61r33j454N17R80K90l29p95L97k58R49O33j425L47o87l95K152l60j23
$$ 912 1273 340 -1114 -597 383 673 344 -451 -54 -312 637 1270 -155 192 -495 -890 1262 902 779
2838G79l37r89MJ408r72L65r7o45P64N5m32M61l47r88P9R65L73m97l49M57j093
$$ 779 442 -547 -543 865 -107 258 161 -484 280 335 -97 364 17 -971 -892 73 446 -51 -400 57 -1036
2859a036K382n93j025n2n74J616m76j397P64P11j225L35Q42k68j90K00r64P23
$$ -1036 1346 753 -272 -324 -898 718 242 -1155 -391 320 -905 -570 272 4 -186 14 -950 -227
2877b27P68J126k004l62K06m50O79J41J64l33mO97n61K33o11K06J73l49M25p0
$$ -227 541 1667 -337 -699 -493 -943 -264 -123 41 -292 -296 401 -160 73 -538 -332 -159 -508 -83 -153
2897a53O17j57j498J413L00q74K43j037J403j3j18p9j006M48L71m47J416p86J09
$$ -153 464 307 -1191 222 522 -352 -109 -1146 257 244 126 47 -959 -511 -140 -587 829 43 152
2916A52n54L19k72J061j092J35p00J162m51J039q40j141O79K91M01K72m59m77
$$ 152 -402 -83 -355 706 -386 -251 -951 211 -240 799 -41 -1182 -503 -212 189 461 2 -475
2934d75J082l0j31N59j836l98L17L079r92r18j19n78K01K62P06m50r19Q29R79
$$ -475 607 577 446 1005 -831 -1229 -912 2167 1175 257 138 -440 -239 23 729 279 -640 189 1168
2953A168j032M32p49l9J93j37j121J874o77K92o62J390n15j71M32p13J82j20K214
$$ 1168 136 568 -181 -220 -27 -164 -1285 589 -88 204 -458 932 417 246 678 -35 147 27 2241
2972B241k066j385O77O39k84r00R40O45J6J90o15O36K51j332n12L25j62lj14M81
$$ 2241 175 -1210 -533 106 -178 -1078 -138 507 523 713 98 734 985 -347 -859 -534 -696 -699 -813 -332
2992c32q10J453j150J129J08M02m00O4r31P92L30n31l54p21K205r06q2j71k69
$$ -332 -1142 311 -839 290 398 800 400 464 -467 325 655 124 -230 -951 1254 348 266 95 -174
3011a74o88Q87l14m40O30M10r5k41M86k17n20p95M72N38J047j093l84o82K50R42
$$ -174 -862 25 -289 -729 -99 311 216 -25 461 244 -276 -1071 -599 -61 986 -107 -491 -1173 -923 19
3031A9J117k072M07q4Q48K17l40l67l15j100J815j26j92J74j65l24L63p2L35J69
$$ 19 1136 -936 -529 -613 235 452 112 -255 -570 -1670 145 19 -173 1 -164 -488 -125 -197 138 307
3051C07L0j466J420p28M21L00n88K40L29m45L93J52j44j54k10J043o56l12p7m34
$$ 307 337 -1129 291 -437 -16 284 -304 -64 265 -180 213 365 221 67 -143 900 244 -68 -145 -579
3071e79L28P56o73L93o26L10J840n51j339L53o13O94J68o0k54N5J12Q53p04N54
$$ -579 -251 505 -168 225 -401 -91 1749 1198 -141 212 -401 293 461 401 147 202 314 1167 463 1017
3091A017J07k93n06j32L23N43j800O66J72K29j051J418p71o5k15K77L27N99m10
$$ 1017 1124 831 325 193 516 1059 -741 -75 97 326 -725 693 -78 -143 -358 -81 246 845 435
3110D35l16o60M82m36M98Mr48J304j48j149J111j255O29M99O25qkl25l60n98J122
$$ 435 119 -541 -59 -495 3 7 -941 363 215 -934 177 -1078 -449 50 675 667 665 340 -20 -618 504
3131E04J18j05o04q4J2n7R38j018RR42m76O56j448R80k33l92l79O53j52n06R47
$$ 504 622 517 -87 -171 -159 -216 722 -296 -287 655 179 835 -613 367 134 -258 -637 16 -136 -642 305
3152C05j897J442J240j550J571j670N11j458Q68K694j453o82j029NK80K216q79
$$ 305 -1592 -150 1090 -460 1111 -559 -48 -1506 -638 2056 603 -79 -1108 -1103 -823 1393 514
3169E14j515N01j52J532L63k527K2J022N43K66J14r98k69l68J912r16j82M77j127
$$ 514 -1001 -500 -652 880 1243 -1284 -1262 -240 303 569 683 -315 -584 -952 960 44 -138 339 -788
3188g88J612m03L54j067o5L46J089o18k54j75o69L75M54J73P7M28o72k25l82Q89
$$ -788 824 421 775 -292 -357 -11 1078 460 206 31 -638 -263 191 364 441 869 197 -28 -410 479
3208D79n80O70o03R95j763P93Q31l47J90r4k79k33Q12l28j12p00P58j063O80K76
$$ 479 -101 569 -34 961 -802 -9 822 475 665 571 292 59 871 543 431 -269 489 -574 106 382
3228C82j03L84N87m53j485Q41r34N03L21L00k47j55K03M69l12J81l30J60j48q80
$$ 382 279 663 1250 797 -688 153 -781 -278 43 343 96 -59 144 613 301 482 152 312 164 -716
3248g16M64J042k5R9j393J004j87k48M13j281K52q59J077P39K63q76m01M54l42
$$ -716 -252 790 765 864 -529 475 288 40 453 -828 -576 -1435 -358 381 644 -232 -633 -179 -521
3267e21L44o58P14j7J264j137P68l83j885J519J8n8o30m0K25L65P15P3J50o98
$$ -521 -177 -835 -121 -138 1126 -11 757 374 -1511 8 26 -32 -662 -702 -477 -112 603 676 826 128
3287A28p47l35J935p56k09j17p3M73L42j257J92q29J58J317o17j19l8M38L6j7
$$ 128 -619 -954 981 225 16 -101 -174 299 641 -616 -424 -1253 -1095 222 -395 -514 -552 -114 -78 -95
3307i5P80j330k23J234p97n69P65O85m71J337j367L74q4L72r13M56j254J180L6
$$ -95 685 -645 -868 366 -431 -1000 -235 450 -21 1316 -51 323 239 611 -302 154 -1100 80 116
3326A16j86o0J225q68j70L69L58o16p80K62M87M65q07L79K51N01j106J138q46
$$ 116 -70 -130 1095 227 57 426 784 168 -612 -350 137 602 -205 174 425 926 -180 958 112
3345A12J434j863O16J88p51j49j88j7J349o68Rm08R1j88L16O27j046Q89n64L11
$$ 112 1546 -317 299 487 -264 -413 -601 -618 731 63 72 -336 -245 -433 -117 510 -536 353 -211 100
3365A00K77O80N11p28j276M07l90P09j490J255O99j106O95m02j026J138r2o2p91
$$ 100 377 1057 1568 840 -436 -29 -419 290 -1200 55 754 -352 343 -59 -1085 53 -39 -101 -892
3384h92J214n18j29k74O76K50J3k25N28j387M81K94o10N33p59M23J70M47m66R2
$$ -892 322 -196 -325 -599 77 327 340 115 643 -744 -263 31 -579 -46 -805 -382 -212 235 -231 -139
3404a39J582j680q42M27M47J40j72l18Q04L69p60N20k25j95k26K6k94O66N10j399
$$ -139 1443 -237 -1079 -652 -205 -65 -237 -555 249 618 -142 378 153 -42 -268 -242 -536 130 640 -759
3424g59M29J125o44J460k275r8O03P11J25m68j024K40N46K58n37P86l15O57j214
$$ -759 -330 795 151 1611 -664 -762 -159 552 677 209 -815 -575 -29 229 -308 478 163 820 -394
3443c94M93J534o12o50o00o26Q38P14L61o67Q5J75M08r73n69k3M43O67q40L65
$$ -394 99 1633 1021 371 -229 -855 -17 697 1058 391 476 651 1059 86 -483 -506 -63 604 -236 129
3463A29P57j228O29o18O57Q03p20k37M19Q32r60k58L01J62j184K40M49n7M69p20
$$ 129 886 -342 287 -331 326 1129 409 172 591 1423 463 205 506 668 -516 -276 173 116 585 -135
3483a35n13Q17r2j58r9J81J80o21N17m36K14K63km47O36K58p10J23P13m67P0j034
$$ -135 -648 169 77 -81 -180 1 181 -440 77 -359 -145 118 116 -331 305 563 -147 -24 689 222 292 -742
3505g42N37K54l38O65l43P50k86q13k12N18j7k43R7j05J77n29J313r42L26n89
$$ -742 -205 49 -289 376 33 783 497 -316 -528 -10 -27 -270 -173 -278 -101 -630 683 -259 67 -522
3525e22M55P05o88j32n83K98M20j88O51p65o8O70m15R04p96M43j005J045n51J218
$$ -522 -67 638 -50 -182 -765 -467 -47 -235 416 -349 -417 253 -162 742 -54 389 -616 429 -122 1096
3545A096p20o15m31L46L96k25n14K73K99k24K11L98l31j05J24n9j64N41O50p90
$$ 1096 376 -239 -670 -324 72 -153 -667 -394 -95 -319 -108 290 -41 -146 -22 -81 -245 296 946 156
3565A56J20o93N42j89K04o60J125m98O35p98M3l70L24o6O49j44l4J21m87K60K1
$$ 156 276 -417 125 -64 140 -520 605 107 742 -56 -13 -383 -59 -125 524 380 346 467 -20 240 261
3586B61m90M13k16m72M01P43k16o19p36l07J694J4n64M37k72m35L78J11J41J54
$$ 261 -229 184 -32 -504 -103 640 424 -195 -931 -1238 456 470 -94 343 71 -364 14 125 266 420
3606D20l12L63p38R29j121N18K60l36L43O27j76o5q75J010k28p48K92l57l98K54
$$ 420 108 471 -267 662 -459 59 319 -17 326 953 777 712 -163 847 619 -129 163 -194 -592 -338
3626c38M21p71K67O41o63o47J034m69R01n05o67J157j0Q58j909Q09%r90R46k17
$$ -338 83 -688 -421 220 -443 -1090 -56 -525 376 -129 -796 361 351 1209 -700 109 109 -881 65 -152
3646a52Jq31P58M65l26M75K95j076L97K36l09l2J61rl55j74J093M80j665M10k72
$$ -152 -151 -982 -224 241 -85 390 685 -391 6 242 -67 -99 62 53 -302 -476 617 1097 -568 -158 -430
3667d30P53l88j581J138o21K72M53j86J09Q18j76p68P87o08Q40j011J71J191j18
$$ -430 323 -65 -1646 -508 -1129 -857 -404 -590 -481 337 161 -607 180 -428 412 -599 -428 763 645
3686F45o98P13j156j96J622j145j23N2j203J082J342n84M94j232Q31l46M52Q53
$$ 645 -53 660 -496 -692 930 -215 -338 -286 -1489 -407 935 351 845 -387 444 98 550 1403
3704A403r82o39l19M55J37j447J109L88k35K57Q04p06p08L19NM10o0o22K54Q29
$$ 1403 421 -218 -537 -82 55 -1392 -283 105 -130 127 931 225 -483 -164 -159 251 191 -431 -177 652
3724F52J01j880N78K76k49q6J212m5q74M2q42R96M18k73q6L93j41k50K19K14q57
$$ 652 753 -1127 -549 -273 -522 -608 604 559 -315 -273 -1115 -119 299 26 -60 333 192 -58 161 375 -482
3745d82J088l32O96j572m8J328j68R8j167k52J265j183R67k22k50N7n06Q69m46
$$ -482 606 274 970 -602 -650 678 510 608 -559 -811 454 -729 238 16 -234 -177 -683 186 -260
3764b60J38P17j054K30m62Q74o66n85Q24L32K05j01L00n52j360K029j081P22o21
$$ -260 -122 595 -459 -229 -691 183 -483 -1068 -244 88 293 192 492 -60 -1420 609 -472 250 -371
3783c71p97O23J472p31O82j175m82k78J255k99K95l03j63m35O20nnj51L64k37
$$ -371 -1168 -545 927 196 878 -297 -779 -1057 198 -101 194 -109 -272 -707 -87 -92 -97 -248 116 -121
3803a21K77m60J28L78m39N23j243J091j020J326o74j00J97o3j3K44K57j56Q03
$$ -121 156 -304 -176 202 -237 286 -957 134 -886 440 -234 -334 -137 -200 -213 31 288 132 935
3822I35n15k84l30P45q85P78m84r8n74J091p6m28j28J252j820J251m56r0L33J34
$$ 935 420 136 -194 551 -334 444 -40 -138 -712 379 303 -125 -253 999 -821 430 -26 -116 217 351
3842C51r3R2o80L42P88j379M77l45M94J81K55n32N2n63J386l34j02J01q34J77
$$ 351 258 350 -330 12 800 -579 -102 -447 47 228 483 -49 3 -560 826 492 390 491 -343 -166
3862a66K13r41N84m54R26P2L48j32j09j015K69N04J21k30m86j78M52O10ro48K13
$$ -166 47 -894 -310 -764 162 234 582 450 341 -674 -405 99 220 -10 -496 -674 -222 388 379 -269 -56
3883e6m67R42l92j57K5M2l30O72p91R47m55m67R13k88N22m66j52J07r26P08O7
$$ -56 -523 419 27 -130 -105 -63 -393 279 -512 435 -20 -487 426 138 660 194 42 149 -777 -69 -2
3904bL45K48j94m72J85q21Q83j00n05L58j06K44q4O1l83N53J77Q2p38p6L50o15
$$ -2 343 591 397 -75 110 -711 172 72 -433 -75 -181 63 -21 40 -343 210 387 469 -269 -345 5 -610
3926f10N01J05L19p3M11j058q9K0j9J111o20N16l34n56K21P07o54j15R49j025
$$ -610 -109 -4 315 242 653 -405 -494 -474 -493 618 -2 514 180 -376 -155 552 -102 -217 732 -293
3946b93L37Q0m46R25p55Q25m62q29J96L88l12MJ27P51k68M4L15l52K56k61n84
$$ -293 44 124 -322 603 -152 673 211 -618 -422 -34 -346 -342 -215 536 268 312 627 275 531 270 -314
3967c14Q65n41M28o06L35m38M4m68M97L41j89j2O60o47L79l80L2J713k143N93
$$ -314 551 10 438 -168 167 -271 -227 -695 -198 143 -46 -58 602 -45 334 -46 -14 1699 -444 149
3987A49j45R06o63p2J87K62j802P15O65J73q87N60q42P01O23r5Q3j40p38O94o49
$$ 149 4 910 247 175 362 624 -1178 -463 202 375 -512 48 -794 -93 530 435 518 378 -360 334 -315
4008c15k66L50m3l98j00J213q70O62K81Q40j623q06O66O02P66j006J62m18m44
$$ -315 -581 -231 -274 -672 -772 441 -429 233 514 1354 -269 -1075 -409 193 959 -47 115 -303 -747
4027g47Q75j92N30m47o81J108j100Q33o09N0l01P83N49J66p11m26M4k29r6l14
$$ -747 128 -64 466 19 -662 446 -654 179 -430 -380 -681 102 651 817 106 -320 -276 -505 -601 -915
4047i15J452p98k61J59j07M31L98l61r37J245q70j94M69k43O40j69N54o15M01
$$ -915 537 -261 -522 -363 -470 -39 359 -2 -939 306 -564 -758 -289 -532 108 -61 493 -122 279
4066B79j259O05J63N2k24L83l8j53L03o63K36K44r97P96M0N48l63p89J082L08
$$ 279 -980 -375 -212 -160 -384 -1 -39 -192 111 -552 -316 -72 -1069 -273 -233 315 -48 -837 245 553
4086E53j007J604j704O47k5q87J861j530K15M98j75P21o1j298N79J126j392o50
$$ 553 -454 1150 -554 93 68 -819 1042 -488 -273 225 50 771 710 -588 -9 1117 -275 -925
4104i25J346q53R86j019M56k57K02n7K55K45m09j071J629M82j32j522K29R0J034
$$ -925 421 -432 554 -465 -9 -266 -64 -121 134 379 -30 -1101 528 1010 878 -644 -415 -325 709
4123G09o67r86R69L97n84J082k57q41J13o73P67Q23K09m18p1k27M51j342R13l83
$$ 709 42 -944 25 422 -162 920 663 -178 -65 -738 29 852 1061 643 572 345 796 -546 367 -16
4143a6O4l34O9j22L39J39l55p1O29n15m3j62M89n6J71p12L66J22n93O94L16p65
$$ -16 48 -286 -217 -339 0 139 -216 -287 342 -173 -216 -378 111 55 226 -486 -120 2 -591 103 419 -346
4165c46L9o75R31N17o31P13m47P34r61q69R24M79r7J25K87q45M07K86q83k63P72
$$ -346 -307 -982 -51 466 -165 548 101 835 -126 -995 -71 408 311 436 723 -122 285 571 -312 -575 197
4186A97n97N42p47J15M69m35P14l69l49K59L68k24K76j81R2k18Q94n70m33M32
$$ 197 -400 142 -605 -490 -21 -456 258 -111 -460 -201 167 -57 219 38 130 -88 806 236 -197 235
4206B35J30p28L58m27q40J402J19n96M62l73K69Qk93M9N27k13k95K84m72N60j63
$$ 235 365 -363 -5 -432 -1272 130 249 -347 115 -258 11 19 -274 -225 302 89 -206 78 -394 166 3
4227Cj94k2j62L89K36n93R89r92O12o21R06o13N83l61N87q66l96l5N24l9P81j205
$$ 3 -191 -213 -375 14 250 -343 646 -346 266 -355 551 -62 521 160 747 -119 -515 -550 -26 -65 716 -489
4249d89N00k2N39o62O03l22l21J29O0P60m09J88j51k93K19K65j099M75R4l09J42
$$ -489 11 -11 528 -134 469 147 -174 -45 15 775 366 554 403 110 329 594 -505 -30 64 -245 -103
4270a03Q27o38J76o49P30L40p02J6L43q67L12j07k29R40o35J78J15l35L13P7n9
$$ -103 724 86 262 -387 343 683 -19 -3 340 -527 -215 -322 -551 389 -246 -68 47 -288 25 102 43
4291D3q60N17k41L46j6k90j9l4O29L21k92l25L67o41M78L6N9j05l12J01o4O04
$$ 43 -817 -300 -541 -195 -211 -501 -520 -554 75 396 104 -221 146 -495 -17 19 78 -27 -339 -238 -302 302
4313C02n68l00N43L73l97o7o7K80L19n46q42J372M6j057P80M4l80L05m67Q06K64
$$ 302 -266 -566 -23 350 -47 -114 -181 99 418 -128 -970 402 448 -609 171 215 -165 140 -327 479 743
4334G43n91k55n91L63j38O73j35o62N63J06j5j39p69Q19j50o76n8O83l3M00J70
$$ 743 152 -103 -694 -331 -469 204 69 -593 -30 76 61 -78 -847 -28 -178 -854 -912 -229 -262 138 308
4355C08l35Q1J72J59l51l57L80j20M49m6j50l30k02R60m56k80l09R16q41j70O75
$$ 308 -27 54 226 385 34 -323 57 -63 386 340 190 -140 -342 618 162 -118 -427 489 -352 -522 153
4376A53k04j52J8J56N47p42N13n43L61k8o79L78Q7N96l51q39J403n90N5j65N40
$$ 153 -51 -203 -185 -29 518 -224 289 -254 107 79 -600 -222 -135 461 110 -729 674 84 139 -26 514
4397E14j177N08L22r40Q12l3n94L55n77O98k7J92j56k18K35l94R02lk56j11K35
$$ 514 -663 -155 167 -773 39 6 -588 -233 -810 -112 -139 53 -103 -321 -86 -480 422 419 163 52 287
4418B87Q3o96J39n5J76n19O50q71J164l88L92J79m42N87n77M12j322M47M56R4
$$ 287 370 -326 -187 -242 -66 -585 65 -806 358 -30 362 541 99 686 109 521 -801 -354 102 196
4438A96p06M01n1M89n91N91j88k69J62R5n04j80M05q09J515p11O66j257N4K34
$$ 196 -510 -109 -160 329 -262 329 141 -128 34 129 -375 -555 -150 -959 556 -155 511 -746 -692 -458
4458d58L75m29N02J69p39L10j106J166k87J246j123O4N71o94K89N6m2r34J725
$$ -458 -83 -512 -10 159 -580 -270 -1376 -210 -497 749 -374 -310 261 -433 -144 -88 -130 -1064 661
4477F61p72l99Q58l01N2P04k04j232O13J064j228M62Q9n40O15J51q49J195j196
$$ 661 -111 -510 348 47 99 803 599 -633 -20 1044 -184 278 367 -173 442 593 -256 939 -257
4496b57L13J72n18K26L39j16L58j519R67M06K30m61J279j639J771j037o74J21
$$ -257 56 228 -290 -64 275 159 517 -1002 -35 371 601 140 1419 -220 1551 514 -160 -39
4514c9K42j268L77Q56j35M82n08J96MM4R3p38N08o64N73M90k11m98K61K52j11
$$ -39 203 -1065 -688 168 33 515 7 203 207 251 344 -394 114 -550 23 513 302 -196 65 317 206
4535B06L68o87J77L22p37N78L77n43n32J004j454J330p45PP1O4M23p18M72p00
$$ 206 574 -113 64 386 -351 227 604 61 -471 533 -921 409 -336 -329 -258 -194 229 -489 -17 -717
4555g17J058K14o95P05j061n2K85k8NR85n81L92j93p51l00N87j71J222k68j098
$$ -717 341 555 -140 565 -496 -548 -263 -291 -286 699 118 510 317 -434 -734 -147 -318 904 636 -462
4575d62N65m37O43k83r2o19K88K22n23R99p08L57M55k48p70P6M24K81k83p9J33
$$ -462 103 -334 309 26 -66 -685 -397 -175 -698 301 -407 -50 405 157 -613 -537 -113 168 -115 -194 -61
4596f1M29j515O89Q27o52J084r3k31n5j95M38n9j274l05N11P54m99j70M12M61
$$ -61 368 -1147 -458 369 -283 801 708 477 422 227 665 606 -668 -973 -462 292 -207 -377 35 496
4616D96J81p37j48P37o7q15P22j284P56P05p0l92N9k12L32p10K12O07r08P87p77
$$ 496 677 -60 -208 529 462 -353 369 -915 -159 546 476 84 143 -69 263 -447 -235 372 -536 251 -526
4637e26M70k70R6K65O16q13k27J061J66j583Q93L17j65j033R04L2j73m42R11Q5
$$ -526 -56 -326 -230 35 651 -162 -389 672 838 -745 148 465 300 -733 171 203 30 -412 499 584
4657E84m41n82j59M62k32k00k75M45J1N32J01q54Q31K10r38R5j76j08N01J65M
$$ 584 143 -439 -598 -136 -368 -568 -843 -398 -387 145 246 -608 223 433 -505 -410 -586 -694 -193 -28 -24
4678b4N30j295P71q9M20j094l46Q21M99l64j80R30j109L37j233Q97K96J53J00
$$ -24 506 -789 -18 -107 313 -781 -1127 -306 193 -171 -351 579 -530 -193 -1426 -529 -233 -80 20
4697B0l86J148j195J57N57J60q43l61P54L27k60j37M20j43j66N81q26j78n2K12
$$ 20 -366 782 -413 -256 301 461 -382 -743 11 338 78 -59 361 218 52 633 -193 -371 -423 -211
4717b11n64P24j376K350o30k58K84Q6n69K18k39J60J56j85R07j176O89M69o04
$$ -211 -775 -51 -1427 923 293 35 319 405 -164 54 -185 -25 131 -54 853 -323 366 835 231
4736B31p01L70N91J23n88K53j045Q51o8R10p06n0q6R54j631R63r24J323m50j033
$$ 231 -470 -100 491 614 26 279 -766 85 17 927 221 171 85 1039 -592 371 -553 770 320 -713
4756g13J361p58o95J175L74r76K3J09k81O75M48o85n06J070j4j307J175O24o03
$$ -713 648 -110 -805 370 744 -232 -209 -100 -381 294 742 57 -449 621 607 -700 475 1099 496
4775D96p5r15L19Q59J76j001Q51k44j140O88K10k24L11q84K38j32j32K8P08q29
$$ 496 421 -494 -175 684 860 -141 710 466 -674 14 224 0 311 -573 -335 -467 -599 -571 137 -692
4795f92L89R0k30N37q57Q7J087p72J66J336k060M9J885j88p71n0n89L57Q9Q14
$$ -692 -303 -213 -443 94 -763 -676 411 -361 -195 1141 -919 -870 1015 827 56 6 -583 -226 -137 677
4815F77l42n64J335j386O4N72k93K07R59k290R91n38Q64o55O69k44M5q57O30n32
$$ 677 335 -229 1106 -280 -216 356 63 270 1229 -1061 -70 -608 256 -399 270 26 71 -786 -156 -688
4835f88J02J171j869J223n81j75J448k86j55m60N91j156J348j338O7J308l71n61
$$ -688 -586 585 -1284 -61 -642 -817 631 345 190 -270 321 -835 513 -825 -758 550 179 -382
4853c82L95k44n67O77P44n50K64q53J422j59j856K018m34J81j235J300m95L4Q81
$$ -382 13 -231 -798 -121 623 73 337 -516 906 747 -1109 909 475 656 -579 721 226 260 1141
4872A141n63m37r60o91K488p13k53N92n58l03M33q21J069n18nj25Q1L70K69P64
$$ 1141 578 141 -819 -1510 978 265 12 604 46 -257 176 -645 424 -94 -99 -224 -143 227 496 1260
4892A260q2j196K56N98j507J105j0k48q61J005j57n4L99j289J020m28MM74q94
$$ 1260 1178 -18 238 836 -671 434 424 176 -685 320 163 109 508 -781 239 -189 -185 289 -605
4911f05P42n86O07m04l85Q83m45M8O29p76P54n64P54j85N91j823K56J555j790
$$ -605 137 -449 158 -246 -631 252 -193 -145 484 -292 462 -102 652 467 1058 -765 -509 1046 -744
4930g44m51J715p97j9j11qR67p52J368j876J061O73o50m4p30k02J84j83R59r33
$$ -744 -1195 520 -277 -296 -407 -415 552 -200 1168 -708 353 1026 376 332 -398 -600 -416 -599 360 -573
4950e73N2R53j454J164J456j903j43J260p57p21N38O29j14j291M38J059k39n8
$$ -573 -521 432 -1022 142 1598 -305 -448 812 55 -666 -128 501 387 -904 -466 593 354 296
4968B96j660J531l75n96Q32p76P21n51J94K11K14p30J893j78j045j66L92J46l02
$$ 296 -1364 167 -208 -804 28 -748 -27 -578 -384 -173 41 -689 1204 1026 -19 -185 207 353 51
4987E1R47j329Q81j718J057M59q55j61K16J084n28N94n33N88l6m13J19M08n91
$$ 51 998 -331 550 -1168 -111 348 -507 -668 -452 632 104 698 165 753 717 304 423 831 240
5006B40n20q92J723J13K47p24j222R13k58J58J451j418N61l67K19M03j018O37
$$ 240 -280 -1172 551 664 911 187 -1035 -122 -380 -222 1229 -189 372 5 224 627 -391 246
5024B46n91j3J276j195J214j305P64q86L07O1o6N7J131j534J191o99m45j80N63
$$ 246 -345 -358 918 -277 937 -368 396 -490 -183 -122 -188 -131 1000 -534 657 -42 -487 -667 -104
5043a04J126j584P32p55L90J9p5l5r9M98L7p1p44J146j238p1l72J362j5q06M94
$$ -104 1022 -562 170 -585 -195 -176 -251 -286 -385 113 150 79 -665 481 -757 -828 -1200 162 147 -659 -165
5064a65Q40j490Q75R30o76P91j097m93N47k73J194K57j127l53J397j582J40R3
$$ -165 675 -815 60 990 314 1105 8 -485 62 -211 983 1240 113 -240 1157 -425 -285 -192
5082a92J145p16J097k147J47O2m06O43L41q17K75R23q05K38J89K60o04Q27q09
$$ -192 953 237 1334 -813 -666 -604 -1010 -367 -26 -843 -568 355 -450 -212 -23 237 -367 460 -349
5101c49J018J5j761L20K037j732L38k85N27L23j140O46o4l04n34M91J58j82r5
$$ -349 669 684 -1077 -757 1280 -452 -114 -399 128 451 -689 -43 -107 -411 -945 -454 -296 -478 -573
5120e73M76J05L95m83j30N49j234M74j229K000o82J429j244l51K023j147K61k13
$$ -573 -97 8 403 -80 -210 339 -895 -421 -1650 350 -332 1097 -147 -498 1525 378 639 426
5138D26J65N7J56j096p14Q06K57L33M86r61l40R46n19P81j344J154Q7q10n64Q30
$$ 426 591 648 804 -292 -1006 -200 57 390 876 -85 -425 521 2 783 -561 593 680 -130 -694 136
5158A36J79K06L87j771P8J000J099j675J22J143L37k076J578q62L75O87o34l13
$$ 136 315 521 908 -863 -785 215 1314 -361 -239 904 1241 -835 743 -119 256 943 309 -4
5176dP1N27j903J620M8n17k09N73p89J335p36K74l10r28J621o71r32J552j316
$$ -4 67 594 -1309 311 359 -158 -367 206 -583 752 16 290 -20 -948 673 2 -930 622 -694
5195f94J799k332R07J77K70j09Q52j502Q37j12O41j036k61J095m78M75p03M69
$$ -694 1105 -1227 -320 -143 127 18 870 -632 205 93 734 -302 -563 532 54 529 -174 295
5213B95K72r13J103j602P47j84n84P4J19J172J38r51j25N63p25J208j061n88J336
$$ 295 567 -346 757 -845 -98 -282 -866 -792 -673 499 637 -314 -439 124 -601 607 -454 -1042 294
5232B94n71p87J879j637k69L88L57M74O43p00R8K03O23k047J070L59q80k58J324
$$ 294 -277 -1064 815 -822 -1091 -703 -346 128 771 71 169 372 995 -1052 18 377 -503 -761 563
5251E63n16N78r17Q78p21R1P70j68j126M75N63k69p15J659j121J00k70j195J896
$$ 563 47 625 -292 586 -135 -44 726 558 -568 -93 470 201 -514 1145 24 124 -146 -1341 555
5270E55n61N45Nl38L84p30k15N11j17m08J287j082j43l7J35j67l01N88r0K94m98
$$ 555 -6 539 544 206 590 -140 -355 156 39 -369 918 -164 -307 -344 -209 -376 -677 -89 -179 115 -383
5291c83Q09j210K036n2j520J181j485J81J468j495P32O4j21k24m21J15J706p49
$$ -383 426 -784 1252 1200 -320 861 -624 -443 1025 -470 262 326 205 -19 -440 -325 1381 632
5309F32j52j956J764m82o74Q70L52j43j257J540j350j52J09P62m6J358o96m17
$$ 632 480 -1476 288 -194 -868 2 354 211 -1046 494 -856 -1008 -899 -137 -183 1175 479 62
5327F2j13N41J62M18n60j727J901k7kr73M19O91R4k41l11R22k485J468o81J271
$$ 62 -51 490 652 1070 510 -1217 684 657 655 -318 101 792 886 645 334 1256 -1229 239 -442 829
5347H29M0r82Q31j510J138r98R19l59J341k042n61J349j38Q75o64r20J164j017
$$ 829 869 -113 718 -792 346 -652 267 -92 1249 -793 -1354 -5 -143 732 68 -852 312 -705
5365g05J55j188J423p76P74L50l00l4l07m87K033j338m81M58J957j101p74p90
$$ -705 -550 -1738 -315 -1091 -317 33 -267 -301 -608 -1095 938 -400 -881 -423 1534 433 -341 -1131
5383a131J143N65j489J485j77r73O02M31r45k13R26j033l73L590l169L73N76O6
$$ -1131 12 577 -912 573 396 -577 25 456 -489 -702 224 -809 -1182 2408 -761 -388 188 254
5401B54l82q14M84J208n90J674k650K140j225l38p87J287K69J55q20k86o70J252
$$ 254 -128 -942 -458 750 160 1834 -816 1324 99 -239 -1026 261 530 685 -135 -421 -1091 161
5419A61N62j085R82j020J251o12L90j122J006r56R18j59l70k9j64R59N69q61N53
$$ 161 723 -362 620 -400 851 239 629 -493 513 -443 475 316 -54 -83 -247 712 1281 420 973
5438I73j003l32r8r6K15N79m20o0O26R18m26n60r12R12j048n7K37J99J010n26
$$ 973 -30 -362 -460 -556 -341 238 -182 -242 384 1302 876 316 -596 316 -732 -789 -552 -353 657 131
5458A31J88k53n27J24N49P15q86O79r24J029j007L08j032O94L72k32n90j79O32
$$ 131 319 66 -461 -337 212 927 41 720 -204 825 -182 126 -906 -212 160 -72 -662 -841 -209
5477b09J68K86N38j33n82j113J497q20l59J277j560R85r72J900q02O45n52j334
$$ -209 -41 245 783 650 68 -1045 452 -368 -727 550 -1010 -25 -997 903 101 746 194 -1140
5495a140K674j884J152J24j535m05P35N72l60J256j842J992j350K16j8rL71n07
$$ -1140 1534 -350 802 926 -609 -1014 -279 293 -67 1189 -653 1339 -11 205 187 178 549 42
5513D2M93n01K40m09K58O98j506m21R23L8L05n35L63j02J022o19j02J15q79J4
$$ 42 535 34 274 -135 123 821 -685 -1106 -183 -145 160 -375 -12 -114 908 289 187 302 -577 -563
5533e63M07q4q18Q83M74K57R4n92m09M82j41n11J82J54L61P17P19l79j566K87
$$ -563 -156 -240 -1058 -175 299 556 650 58 -351 131 -10 -521 -339 -185 176 893 1612 1233 -333 -46
5553d6J091n81R0Ml4j79N5j30l46j08M73j48J44m79N93l67m65R53o33R94r36L99
$$ -46 1045 464 554 558 524 345 400 270 -76 -184 289 141 285 -194 399 32 -433 520 -113 881 -55 344
5575C44m71R5J74l03k50J092p78j152J764q61l19j59O97M50o80j016J550o37k5
$$ 344 -127 -32 142 -161 -411 681 -97 -1249 515 -346 -665 -824 -127 323 -357 -1373 177 -460 -485
5594d85l04Q09m11J19l50J058j467L27J079K70j120M89J50l59p65Q74J0j58M57
$$ -485 -789 20 -391 -272 -622 436 -1031 -704 375 645 -475 14 164 -195 -960 -86 -76 -234 223
5613B23q83o14J32J010j096M55R88L01o42RL28l89K87j46j164J919n18K75O38
$$ 223 -660 -1274 -1142 -132 -1228 -773 215 516 -126 -117 211 -178 109 -37 -1201 718 200 475 1113
5632A113j119n05J111j403O38J69J08j493J400o14L55J26N5p55k09J581o05k53
$$ 1113 -6 -511 600 -803 -165 4 112 -1381 19 -595 -240 -114 -59 -814 -1023 558 -47 -300
5650c00L92j276J182k03J09K37M33j298p65J065N18K3n08q93M92Q86q45K148j728
$$ -300 92 -1184 -2 -205 -96 141 574 -724 -1489 -424 94 117 -391 -1284 -792 94 -751 1397 -331
5669c31J75l92R02j93J99m82M64r89k8L40J202p17k91R3p50R02P45p67M38j166
$$ -331 -156 -548 354 161 360 -122 342 -647 -675 -335 867 150 -141 -48 -798 104 849 82 520 -646
5689f46N51J77m21q2J156o01p36P19k39l02Q7Q12j90k46k56M63k63N30p46J936
$$ -646 -95 82 -339 -421 735 134 -602 117 -122 -424 -337 475 285 39 -217 246 -17 513 -233 1703
5709A703j26j550L49r48O21m78J111q97m96J014p76L27K55L85O9j879J014O2n14
$$ 1703 1577 27 376 -572 49 -429 682 -215 -711 303 -473 -146 109 494 563 -1316 -302 -240 -754
5728g54K44K6N34J21J31p23R17q89M54K73j132J049l73M86o43m48J115j054K86
$$ -754 -510 -484 50 171 302 -421 496 -393 61 334 -798 251 -122 364 -279 -727 388 -666 -380
5747c80j37l8L27J374j776N08p6j010J499j11J82J91p52J6M8J054r60k90n2l3
$$ -380 -517 -555 -228 1146 -630 -122 -198 -1208 291 180 362 553 -199 -183 -135 919 -41 -331 -383 -416
5767d16M93L38j99Q32p61K43j118J292p14J59m97O42j63J83q0o98J407j41j409
$$ -416 77 415 216 1048 287 530 -588 704 -10 149 -348 294 131 314 234 -464 943 802 -607
5786f07M24Q6P9k98K52R21q57m68l1k38j93J026R97q82q33Q34J51j165M25N88
$$ -607 -183 -97 -18 -316 -64 857 0 -468 -499 -737 -930 96 1093 211 -622 212 363 -802 -377 211
5806B11p63L83j35j75k16M48m90J485j061N74k91m11K10j5n61Q1J388o20l99J57
$$ 211 -552 -169 -304 -479 -695 -247 -737 748 -313 261 -30 -441 -231 -246 -807 -726 662 42 -357 -200
5826b00J01j13o45O93o8Q97q42n05Q62P5l89N94L69o59j26Q91j494L26k20J89
$$ -200 -99 -212 -857 -164 -232 665 -177 -682 180 255 -134 460 829 170 44 935 -559 -233 -453 -264
5846b64M50q01L65p2L60o72J244o20p9j83p2J44M96K28j113O65O58j410J005m99
$$ -264 186 -615 -250 -322 38 -634 610 -10 -89 -272 -344 -200 296 524 -589 76 734 -676 329 -170
5866a70M99j111J352o39L80k7J36j622J310O04O22j452k5P96P3j580L06O30R4
$$ -170 329 -782 570 -69 311 284 420 -1202 108 712 1334 -118 -143 653 726 -854 -548 82 176
5885A76o85K82K40m33O16n52K91L43o41O61k22j60L07j275O10p0k78O3R59o10
$$ 176 -509 -227 13 -420 196 -356 -65 278 -363 298 76 -84 223 -1052 -442 -512 -790 -727 232 -378
5905c78o4N52m49K84O54m10l26L87K2o00O46o65J664k101J150m89l27j48J055
$$ -378 -442 110 -339 -55 599 189 -137 250 272 -328 318 -347 1317 -784 366 -123 -450 -598 457
5924D57m94q39k5q5M79P28m35m15P95L77j79L01J48j769J421q65m20R57N05q55
$$ 457 -37 -876 -901 -986 -507 221 -214 -629 166 543 364 665 813 -956 465 -400 -820 137 642 -213
5944b13k09O2k33J535K3r95r7K7m72K28M90M21n54J0r75J5J732j034O50j063J011
$$ -213 -422 -360 -593 942 965 -30 -127 -100 -572 -344 146 567 13 23 -952 -937 795 -239 411 -652 359
5965C59r02O33p6j60L87M20q82M14n18M44j13j45K12k60K39R9j38R5K35q19j22
$$ 359 -543 90 14 -146 241 661 -221 193 -325 119 6 -139 73 -187 52 151 13 108 343 -476 -598
5986e98L3O24L5j00N58o70O06k9m29j27P07n00j53K12n11L63j0L05j52Q94j070
$$ -598 -565 59 94 -6 552 -118 488 459 30 -97 610 110 -43 169 -342 21 11 316 164 1058 -12
6007a2m98J021r2m85L4p07P23m18N71J16j33m84M05j47K8n60N37l02M77k66O1
$$ -12 -510 511 419 -66 -32 -739 -16 -434 137 253 120 -364 41 -106 -78 -638 -101 -403 74 -192 -131
6028a31K79n75Q06l30K33k5o02L1o8O59o37J47M16k53K88o46N20l48O22n31k84
$$ -131 148 -427 379 49 282 257 -345 -314 -382 277 -360 -213 203 -50 238 -408 112 -236 386 -145 -429
6049d29O38n8k14j43L76J41N90j072N2j70J9L26l08P06r10k30P49Q5J59K55j256
$$ -429 209 151 -63 -206 170 311 901 -171 -119 -289 -270 56 -252 454 -456 -686 63 148 307 562 -694
6070f94P32O3o77J74L30M46m08l16M88l8k85K30L13j23p72L02m64Q94k85l39L46
$$ -694 38 101 -576 -402 -72 374 -34 -350 138 100 -185 45 358 235 -537 -235 -699 195 -90 -429 -83
6091h3J75p3R5j68k23K61j21j14O03l7n83K4q5n6O10n34L73k10K6Q0Q27j27n33
$$ -83 92 19 114 -54 -277 -16 -137 -251 352 315 -268 -244 -329 -385 225 -309 64 -146 -120 -40 787 660 127
6114A27q5n71O44o19Q30J51r55J79J32N40K68j185R93k84k52q84J450p74m69R31
$$ 127 42 -529 115 -504 326 477 -478 -299 -167 373 641 -544 449 165 -87 -971 479 -295 -764 167
6134A67l38k1J65Mm70J103m72P1P4l71j34N41j84p49L12O99k72K98o74j54N88
$$ 167 -171 -192 -27 -23 -493 610 138 209 283 -88 -222 319 135 -614 -302 397 125 423 -251 -405 183
6155A83J52J79j120L08Q38j25n43N41l89K86k54K84o56l07Q81k34J82j29m89M9
$$ 183 335 514 -606 -298 540 415 -128 413 24 310 56 340 -316 -623 258 24 206 77 -412 -363
6175c63L85n6q14N48m83J059k43K31j62j90l72M74j70K99j36J70q76P44l72m51
$$ -363 22 -34 -848 -300 -783 276 33 264 102 -88 -460 14 -156 143 7 177 -699 45 -327 -778
6195g78J306j254M53O41q83R63k28O9j35l31j12O87k1l78L8l36j15J29K11k73
$$ -778 528 -726 -273 368 -515 448 220 289 154 -177 -289 398 377 -1 37 -299 -414 -285 -74 -347
6215c47N73m03O59r83L36K29L67j91l39L78N22r55j45L32N06n20o5l50J60lL35
$$ -347 226 -177 482 -501 -165 64 431 240 -99 279 801 -154 -299 33 539 19 -46 -396 -236 -239 96
6236I6m6K31j86j25J66k14K45k09J42j32j72L42J97l86L40l71J76k64q4n5L40
$$ 96 50 281 95 -30 136 -78 167 -42 100 -32 -204 138 335 -51 289 -82 94 -170 -254 -309 31
6257C1Rk02M25n57P3J02M61n79J08k87L47R0j25P4l16K41n8K41j10J98j53n6j12
$$ 31 40 -162 263 -294 -221 -119 342 -237 -129 -416 -69 21 -104 -30 -346 -105 -163 78 -32 166 13 -43 -155
6280a55l6N75m27R1p2M2K24L1l12k75K08j4K06m0j29qM07l90R8o4K21j54M3k78
$$ -155 -191 384 -43 48 -24 18 242 273 -39 -314 -106 -120 86 46 -83 -91 316 -74 24 -40 181 27 70 -208
6304b08K39J18j82K86j62l06L25k83K02L9M9k77O5lJ76nk49J86r4N1J22l18K8
$$ -208 31 149 -33 253 91 -215 110 -173 29 68 117 -160 -95 -98 78 73 -176 10 -84 -33 89 -229 -201
6327b01K10o8j66M45m10j64K50J92k59N7J00p2q0O3l3N5N2k8K8k44L29k26K55
$$ -201 9 -59 -225 220 -190 -354 -104 88 -171 -114 -14 -86 -166 -103 -136 -81 -29 -57 -29 -273 56 -170 85
6350H5N3L1j55m1l45M96R2j65J24m8l45M77k08J33k95K81k23J65k97O1r9L69p0
$$ 85 138 169 14 -27 -372 124 216 51 175 127 -218 259 51 184 -111 170 -53 112 -185 -124 -223 146 76
6373G6k01K79k19j12k2J96r4K37k1j03J35q8k41K83R0k72j61K74K23M9l46n7N4
$$ 76 -125 154 -65 -177 -199 -3 -97 140 119 16 151 63 -178 105 195 -77 -238 36 259 308 -38 -95 -41
6396d1j72K38K64l49J07j10q5k49K88Q9j66K0L37j24l64J35Q0j22L27j46J01j31
$$ -41 -213 25 289 -60 47 -63 -148 -397 -109 -20 -186 -166 171 47 -317 -182 -102 -224 103 -43 58 -73
6418g3K66q2l36L64Q2N3n67K94J2l4n1Q4L53n75J99J74l3j80K0k13J70l9o5K40
$$ -73 193 111 -225 139 221 274 -293 1 13 -21 -72 12 365 -210 -11 163 130 -50 -30 -243 -73 -112 -177 63
6442F3m5K27j80K7j26K29j70K98k88J85j37j01J8l95M65k64J21L00k26J42j71
$$ 63 18 245 65 92 -34 195 25 323 35 220 83 -18 0 -395 70 -194 -73 227 1 143 -28
6463b8K29k60J33L46k72L29n21m33O76n74J73L03L29n00l26M10k67P51n56J86
$$ -28 201 -59 74 420 148 477 -44 -477 199 -375 -202 101 430 -70 -396 14 -253 498 -58 128
6483A28l64L94L1k71j02L20n22O39K21n88K99k72K22p8n61L97L25l4n51K75K79
$$ 128 -236 158 189 -82 -184 136 -386 253 474 -114 185 -87 135 57 -504 -107 218 184 -367 -92 187
6504A87J09m44o0L76k55l6J3L20o5K13k31N70j170J78K86L70m54P0K51J80p48
$$ 187 296 -148 -208 168 -87 -123 -110 210 145 358 127 697 -473 -295 -9 361 -93 -23 228 408 -340
6525c40O45m63N48j60j76N28m06J7k16J34j22M72j077Q69J14o6l94J10O2k88M85
$$ -340 305 -158 390 230 54 582 176 193 -23 111 -11 461 -616 253 367 301 -93 17 79 -209 276
6546B76n98K67k5K6l53L8O25l67p2K16L70n00L73l24J42j4k18L43n7q6p41Q42
$$ 276 -322 -55 -80 -54 -407 -369 256 -111 -183 33 403 -97 276 -48 94 80 -138 205 148 62 -679 163
6568A63k92M53q18O89M37o10R5k08J73j23k12K38R0k37k05K87K86m04j12J38j79
$$ 163 -129 324 -494 195 632 22 117 -91 82 -41 -253 -15 75 -162 -367 -80 206 -198 -310 -172 -351
6589c51L43j68L26m28J63P78p18L05k8K9m52J55j73m48M98K45k3J21m01M3R1N04
$$ -351 -8 -176 150 -278 -115 663 -55 250 222 251 -201 -46 -219 -667 -169 76 53 174 -227 -184 -93 411
6611D11l18n06J55K97J58l11k69L53K11J1o4k80O10n97n2R3R17j306M37K94l87
$$ 411 93 -413 -258 39 197 -114 -383 -30 181 192 128 -152 458 -139 -191 -98 819 -487 -50 244 -143
6632a43m54P98r4L08l35m61P52m21O05j054M91M82j164J207l12l52m0j44O8P25
$$ -143 -597 201 107 415 80 -381 371 -50 555 -499 -8 474 -690 517 205 -147 -187 -331 -263 462
6652D62j051J310q47M5r9O98o65Q24p43K96q6K6m57m0j89l09O73n63O61m50J004
$$ 462 -589 721 -126 -81 -180 518 -147 677 -66 230 144 170 -287 -327 -516 -825 -152 -715 -54 -504 500
6673E00p97L49J63M49j062O18O8n66M03o4o99M03j04N99K00l45O47q42M51j38
$$ 500 -297 52 215 664 -398 220 288 -278 125 61 -638 -235 -339 260 460 115 762 -80 371 233
6693B33r37N81L96R0K4m3j17l88L8K03m77N13k04KJ79o78M79k75L90j37L15q8
$$ 233 -704 -123 273 363 387 344 227 -161 -123 80 -397 116 -88 -86 93 -585 -106 -381 9 -128 187 99
6715I9m23J62P31n95j43k55K66J08J07o2k62P19n55l25M1N38k88M20j41k67J68
$$ 99 -324 -162 569 -26 -169 -424 -158 -50 57 -5 -267 452 -103 -428 -387 151 -137 283 142 -125 43
6736D3N0pK91m65j51L87m37PJ16J86p6L51j51k16j00J58j94j44J92K57M03J45
$$ 43 93 86 377 -88 -239 148 -289 -282 -166 20 -56 295 144 -72 -172 -14 -208 -352 -160 97 500 645
6758F45j114P2J117r50m28L53K44n3k35k20N01J81j88k4j03N37m16J18k90Q2K28
$$ 645 -469 -397 720 -230 -658 -305 -61 -114 -349 -569 -68 113 -75 -99 -202 335 -81 37 -253 -171 57
6779E7o57M53M66k96n14l77O23mk2P28n4p74O14j082R94n9r8r6k13J22N2k99O18
$$ 57 -600 -147 319 23 -491 -868 -245 -249 -271 457 403 -371 243 -839 155 96 -2 -98 -311 -189 -137 -436 182
6802A82o90J150n75k87K07k56P9K84L09o66p0L96K75J84m72n0J64L56p99J02M69
$$ 182 -508 642 67 -220 -13 -269 -190 94 403 -263 -333 63 338 522 50 0 164 520 -279 -177 292
6823B92j27o61P17m14J41K94R6l9L8l86j23Q34j011Q33n91N99q48O8J187q32P5
$$ 292 165 -496 221 -193 -52 242 338 299 337 -49 -172 662 -349 484 -107 492 -356 -288 899 67 142
6844A42r1j73L64o4J16p4l57O45j118J098m51k89L64K34M77p82l25K53J47K2n4
$$ 142 51 -122 242 178 294 220 -137 508 -610 488 37 -252 112 346 823 41 -284 -31 116 138 84
6865H4k26O78q11P12o8j137J137r33N91j21l65K50P34o55j66J49j1lQ5p50J195
$$ 84 -142 536 -275 437 369 -768 369 -564 27 -94 -459 -209 525 -130 -296 -147 -158 -161 -76 -826 369
6886C69j370O54j95J76Q58p66r1K38n20O70n40P46N43j048l6P60l46m47J6k84
$$ 369 -1001 -347 -542 -366 492 -274 -365 -127 -647 23 -517 229 772 -276 -312 448 102 -345 -329 -613
6906f13P44o30R02o3Ol94K5M97k81k01O57J71r3j172M13K21p99M22O43m35m0j72
$$ -613 131 -499 403 340 346 -48 -23 474 193 -8 649 820 727 -445 -32 189 -610 -188 455 20 -20 -192
6928a92r02L71P94J66k52o32O71J75j80k63NM8J115r30P28r79M18l53J46Q86j138
$$ -192 -1094 -723 71 237 -15 -647 24 199 19 -244 -239 -191 924 -6 722 -257 161 -192 -46 840 -298
6949b98L65K50n72N82k55j42p56O59R06p95J01J06l82K0j63J138j044r5J614j611
$$ -298 67 317 -255 327 72 -70 -826 -167 739 -56 45 151 -231 -211 -374 764 -280 -375 1239 -372
6969c72M2J139p82O18k79j071P06l44R03N6j021P16m38J58M9o68K31K09N11j150
$$ -372 -330 809 27 645 366 -705 1 -343 560 616 -405 311 -127 31 80 -588 -357 -148 363 -787
6989g87Q85k09L48N1Q1r07P59P05j045k72O9J38k58J018q87p58R78n31R34J74
$$ -787 98 -111 237 288 369 -538 221 926 -119 -391 -322 -184 -442 576 -311 -1069 -91 -622 312 486
7009D86J21Q5j418Q05N22m38p8j137Q49K63K6q54J238n07K58q91M07O5K9K15J00
$$ 486 607 692 -726 79 601 163 85 -1052 -203 60 86 -768 470 -37 221 -670 -263 -198 -169 46 146
7030A46k40K86q35N68o48Q55o92J20R04j51k41j07o73J756j242m28O71m60j82
$$ 146 -94 192 -643 -75 -723 132 -560 -440 464 313 72 -35 -708 1048 -194 -622 49 -411 -593
7049e93m5O84N65q78K71O71l93m8n54P16k04K54l99l92j23K091k040n06N64r03
$$ -593 -638 46 611 -267 4 675 282 234 -320 396 192 446 47 -345 -468 1623 -417 -923 -359 -1262
7069a262J195o19L66k57R31M08n29O86q87k73M4n73M4Q67j82L30j114N06L07r53
$$ -1262 -67 -686 -320 -577 354 762 233 919 32 -241 -197 -770 -726 141 -41 289 -825 -319 -12 -965
7089i65P41O44J65p68o21J186r93N28k60j21M50N15j169J97j69J137j13j418J247
$$ -965 -224 420 585 -183 -804 382 -611 -83 -343 -464 -14 501 -668 -471 -640 497 384 -1034 213
7108B13j273L72K36O78L09Q5r82k04N76N44j487M41N32j134J779o29K71j10j06
$$ 213 -1060 -688 -452 226 535 620 -362 -566 10 554 -933 -492 40 -1094 685 56 327 217 111
7127A11o56M04P3O08l25M36j320L73L22n61m03K14j29L71Q78n44R88k36o81M20
$$ 111 -545 -141 -68 540 215 651 -669 -296 26 -535 -938 -724 -853 -482 396 -148 840 604 -77 343
7147C43o98j49n6J023N67j639L87K70N47p84j341J337R16j345l5J267L74q37o24
$$ 343 -355 -504 -560 463 1030 -609 -222 48 595 -189 -1530 -193 723 -622 -657 610 984 147 -477
7166d77L09m21O89m22N70m92K24n31L23K52K50k33M21j013m57J078o18L78M33
$$ -477 -168 -589 100 -322 248 -244 -20 -551 -228 24 274 41 462 -551 -1008 70 -548 -170 263
7185B63o21K47q7n49K28L28mj74J32L44L4J3n15K71K05k22M79m66k3L95l66r8
$$ 263 -358 -111 -198 -747 -519 -191 -195 -369 -237 107 141 154 -361 -90 115 -107 372 -94 -117 278 -88 -186
7207a86M84K1m86k30N49l01M9k88Q19n51Kj38O60m73M2K90k68k52L87m25L62j96
$$ -186 298 319 -167 -397 152 -149 -100 -388 431 -120 -118 -256 404 -69 -27 263 -5 -257 130 -295 67 -129
7229a29l7R0j02L69M40r16M62L46o89N22j01l57P75j049k23J042l95r6M07k03
$$ -129 -166 -76 -178 191 631 -285 177 523 -166 356 255 -102 673 -376 -599 443 48 -48 359 156
7249A56l10M35Qj85J43J15j9r13P26n2r5n86L29K55r4l92M40j10k71Q53o45j06
$$ 156 -154 281 289 104 247 362 343 -570 156 104 9 -577 -248 7 -87 -479 -39 -149 -420 433 -212 -318
7271c18j58P08n33Q0L74L60j054L87L64j39K19m35l00J503j338N6K96N9l48J44
$$ -318 -476 232 -301 -221 153 513 -541 -154 210 71 290 -145 -445 1058 -280 -224 72 131 -217 -73
7291g3k45O36Qm62J42k83J76J15M58n87M28j61J64m03n37J063n65j15J49N3L5
$$ -73 -318 318 326 -136 6 -277 -101 14 472 -115 313 152 316 -87 -624 439 -126 -241 -92 -39 -4
7312dO28o06K27M00o27N00m20P8k63Q5K88J20m66Q5pL46l24m30P73r85O96K07
$$ -4 624 18 245 645 18 518 98 176 -87 -2 286 406 -60 25 18 364 40 -390 383 -602 94 301
7334C01P41p98n77k44N79k36N61q73M13N05K71K9j361R54m00K3m1k26p5J087o95
$$ 301 1042 244 -333 -577 2 -234 327 -546 -133 372 643 672 -689 265 -135 -112 -153 -379 -454 633 -62
7355f2O0J33k10J94M50j322N15K65r5J55k42K68k84k37j48R83n00p10P79J63K24
$$ -62 -2 131 -79 115 565 -757 -242 23 -72 83 -159 109 -175 -412 -560 423 -77 -787 -8 155 379
7376C79n40K87N18L0r71M80r41J215n03k19k0L5j12J20J6J29N78L27n19Q8j68
$$ 379 -161 126 644 674 -297 183 -758 457 -46 -265 -285 -250 -362 -242 -226 -97 481 808 289 377 209
7397B09J06J27n72r4Q9O8m06P99L4j95l54O3O2K99o34K34N95j205K59P19n58K90
$$ 209 315 442 -130 -224 -135 -67 -473 326 360 165 -189 -126 -64 235 -399 -165 430 -775 -516 203 -355 -65
7419f5l2M5j81O53j19O36r53K69j140J248J58n97k11j30Q91r48M13L91j153K03
$$ -65 -97 -52 -233 420 301 937 -16 253 -887 361 519 -78 -289 -419 472 -476 -63 328 -825 -622
7439f22K80K71M65o24k08k26J283n36N26r59J239r80OL07p55N83O06p08q1j42
$$ -622 -342 -71 394 -230 -438 -664 619 83 609 -350 889 -91 -85 222 -533 50 656 -52 -133 -275
7459b75L32r51N88J65L77J85j127N58M7O2l66K64J171j581j92N56K94o74j00L38
$$ -275 57 -894 -306 -141 236 421 -706 -148 -101 -39 -405 -141 1030 -551 -743 -187 107 -567 -667 -329
7479c29J523j469L79K24p24K31j97O83m86j81j92O91j161J431p59p0l06J082J7
$$ -329 1194 -275 104 328 -396 -165 -362 321 -165 -346 -538 153 -1008 423 -336 -406 -712 370 387
7498C87q11J578q45m55P50j88j58j8k84P43Q9q03o79M22j13M47O6j29Q76j088
$$ 387 -424 1154 309 -146 604 416 258 240 -44 699 788 -15 -694 -272 -385 62 128 -1 875 -213
7518b13N48r31N3K66N67j40o28J297j380J089p44j50L0R86r21N70J44l0l30o86
$$ -213 335 -596 -543 -277 290 150 -478 819 -561 528 -216 -366 -336 650 -271 299 443 413 83 -603
7538f03L80L62j339J473k83M81r74N56M09j105N43l42n11Q46N23k35K54O6q31
$$ -603 -223 139 -1200 273 -10 471 -503 53 462 -643 -100 -442 -953 -107 416 181 435 501 -330
7557c30O71%n27J810k217N72L55k97M05j010R60j58o58R52k59r01J88K84M54o80
$$ -330 341 341 -186 1624 -593 -21 334 37 442 -568 392 234 -424 528 269 -632 -444 -160 294 -386
7577c86N85j83m98M03j07R05j36J25J10j402O63P41j000P09r33k2O67p47P80M26
$$ -386 199 16 -482 -79 -186 719 583 708 818 -584 79 820 -180 529 -404 -426 241 -506 274 700
7597G00n12n61L60R44p48l19R28q54J20M5j03O37m08R5r01M25l3N22r36M49J43
$$ 700 188 -373 -13 931 183 -136 792 -62 58 103 0 637 229 324 -577 -152 -185 337 -599 -150 -7
7618gO81k44m3r11M33n14J758j050j95R22j229l53J418m15k25L95q02l0J202j53
$$ -7 674 430 387 -524 -91 -605 1153 103 -92 830 -399 -752 666 251 26 421 -381 -411 791 638
7638F38k55o58K06m17k5O12j002J690m86k2l1J95l18J131r61m65N67l49m65N40
$$ 638 383 -275 -69 -486 -511 101 -901 789 303 281 250 445 127 1258 297 -168 399 50 -415 125
7658A25m5L41k4p26o15R3J113N97q51k60J25r29J623j233J707j480L43m30K95
$$ 125 80 421 397 -329 -944 -851 262 859 8 -252 -127 -1056 567 -666 1041 -439 -96 -526 -231
7677b31J13m42J239j623O58m7M83P19r16O5K91p65q03K245j29p46rK60p4n53N53
$$ -231 -118 -560 679 -944 -286 -333 150 869 -47 18 309 -456 -1259 986 857 111 102 362 288 -265 288
7698B88l72p94O98n31K28k50m13K202j708P81M56m22K30N07m53p31R89r27P80
$$ 288 -84 -878 -180 -711 -483 -733 -1146 1056 -652 129 585 163 393 900 447 -284 705 -222 558
7717E58o24J55P84k465K595m04k57l64k23j11Q24j37k95k81K03M25P35p87k59
$$ 558 -66 89 873 -1592 1003 599 342 -22 -245 -356 468 331 36 -245 -42 383 1118 331 72
7736G2K09r55M78m07k71J168j051J021j135P79p81J155o25K32M08P46r91j51n62
$$ 72 281 -674 -196 -603 -874 294 -757 264 -871 -92 -873 282 -343 -111 297 1043 52 -99 -661
7755f61N25q17k97K016n14j24m2K20m79j49J59P4k36n6L03J99q30P96R06n87j11
$$ -661 -136 -953 -1250 766 252 128 86 306 -173 -322 -163 -89 -325 -381 -78 121 -709 87 993 406 295
7776B95o76P51p07M20K05l03m49J276p64o78j70N30R51j676J474k03Q2o02O80
$$ 295 -381 370 -337 83 288 -15 -464 812 48 -630 -800 -270 681 -995 479 276 358 -244 436
7795D36j35l51L88j27j54k8l83K17p7P03k09k10K10L50n93j036N84P35R57j896
$$ 436 301 -50 338 211 57 29 -354 -137 -214 489 280 70 280 630 37 -999 -415 320 1277 -619
7815f19J490j35j560O95J8l31j67K034r47o76j27Q11j087M56N88p32N11p67P11
$$ -619 871 736 -824 -129 -111 -442 -609 1425 478 -198 -325 486 -601 -145 443 -289 222 -545 166
7834A66L98J73j124q3R66l72o42J064j852J000P03n16l64J679j036J14j86r64
$$ 166 564 737 -387 -470 496 124 -518 546 -1306 -306 397 -119 -483 1196 160 274 88 -876
7852h76P26R4j15p9P1RL77j85m04N79Q48l97q7n65o75J172p70p3P50m64M5j78
$$ -876 -150 -56 -171 -250 -179 -170 207 22 -382 197 1045 648 561 -4 -679 493 -277 -350 400 -64 -19 -197
7874a97q79Q06k45q5P34R7k00L03j056K26N58k98J74J04l79J71M7M52m47L99n
$$ -197 -1076 -270 -515 -600 134 231 31 334 -722 -496 62 -236 -62 42 -337 -166 -119 333 -114 285 280
7895B80j53n26L01M32j104r74R41Q23L39j041O46j79L34J50o32j94J278j119J027
$$ 280 127 -399 -98 334 -770 -1744 -803 20 359 -682 -36 -215 119 269 -363 -557 721 -398 629
7914F29n61m90Q77no2k63J34j87K91o37Jn5O13O34j530N18m56m26J362l15r0k35
$$ 629 68 -422 455 450 388 125 259 72 363 -274 -273 -328 285 919 -611 -93 -549 -975 387 72 -18 -253
7936b53R4q7J30k92N00q7m75J82j82J137j065Q40l93J15J81j53J87n4j05m88L64
$$ -253 -159 -246 -116 -408 92 5 -470 -288 -470 667 -398 442 49 164 345 192 379 325 220 -268 96
7957I6j99K01j5J56j84l64M18k1j25K90M82o91k76k00O18o92l57J290J04N0m70
$$ 96 -103 98 83 239 55 -309 109 88 -37 253 735 44 -232 -432 186 -506 -863 427 531 581 111
7978A11M37k57j25l90q9m89N02Q07k52q9q63O57L2j91P61p78l89Q49l93K96J97
$$ 111 548 291 166 -224 -313 -802 -300 507 255 166 -697 -40 -8 -199 562 -216 -605 244 -149 147 344
7999C44p85M77O19n56L07m36J18j81j15o4L83m24N02j49L38o56M02P6j78q22Q36
$$ 344 -441 36 655 99 406 -30 88 -93 -208 -272 111 -313 189 40 378 -278 124 200 22 -800 36
8020C6R8j200J222l25l35Q43K10m62O7P8o1k53J7j29j80L03P2M19j062N04P23
$$ 36 134 -1066 156 -169 -504 339 549 87 154 232 171 -82 -65 -194 -374 -71 1 420 -642 -138 585
8041E85m73Q4l1M46p56O94l9j02j88j99J85P8l34K91K52j18q68M47k65L39n03
$$ 585 112 196 165 611 -145 549 510 408 220 21 206 284 -50 241 493 375 -493 -46 -311 28 -475
8062d75M74M52M9j37l48r3K06N0R29j215K54n5O98p17o16J80J92j26O29k7p0K43
$$ -475 -1 451 500 363 15 -78 128 178 1107 -108 146 91 789 72 -544 -364 -172 -298 331 304 234 477
8084D77J17j90n84K90o45m8P77j38m61L70K89j14L91m38L13j6k58j23r1m30M53
$$ 477 594 404 -180 110 -535 -583 194 56 -405 -35 254 140 531 93 406 390 132 9 -82 -512 -59
8105e9M99o27M38L98o44j10k85K66o4P2M42j58n86O53j96k65N1K29k8k16J130
$$ -59 440 -187 251 649 5 -105 -390 -124 -188 -116 326 168 -418 235 39 -226 -175 54 26 -190 940
8126I40j186K40n82L47P88r04N03j192J499m60l74M77J36m02j41J29J331j880
$$ 940 -246 -6 -588 -241 547 -357 146 -1046 453 -7 -381 96 232 -170 -311 -182 1149 -731
8144g31P92M77k75j40p32M79JN16J07q2m02k51P71p59O50l22o06o14P77O59r46
$$ -731 61 538 263 123 -609 -130 -129 387 494 412 10 -241 530 -229 421 99 -507 -1121 -344 315 -631
8165f31L02O38j80m37J0K53R3K05j066K71O77m43N03p90J313j368K51j13K8j04
$$ -631 -329 309 129 -308 -298 -45 48 253 -813 -542 135 -308 195 -595 718 -650 -399 -512 -484 -588
8185e88N24j74J58J47m85P53
$$ -588 -64 -238 -80 67 -418 335
8191C35
$$ Imaginary data points
##PAGE= N=2
##DATA TABLE= (X++(I..I)), XYDATA
0@%%%%%%Pj5J6j6K3l1L8m9N8p0Q6j02J22j44J68j96K28k67L06l48L99m55N15n83
$$ 0 0 0 0 0 0 0 7 -8 8 -8 15 -16 22 -27 31 -39 47 -55 67 -77 91 -105 123 -144 162 -186 213 -242 273 -310
30c10O58p39Q31r31J039j160J291j435J595j769J959k169K403k661K947l269L632
$$ -310 348 -391 440 -491 548 -612 679 -756 839 -930 1029 -1140 1263 -1398 1549 -1720 1912
47A912m044M514n057N694o452P378q535J0027j2037J4913j9406K7480m6493J70774
$$ 1912 -2132 2382 -2675 3019 -3433 3945 -4590 5437 -6600 8313 -11093 16387 -30106 140668
61A40668J28331l66794j60913J70353K76402j7051k14540j33572R9052J37860
$$ 140668 268999 -97795 -258708 -88355 188047 170996 -43544 -177116 -78064 59796
71E9796L2287o7375n2251k2767J5491N5191P5076j3748j10769q0142P8979J38173
$$ 59796 92083 24708 -27543 -50310 -34819 20372 95448 81700 -29069 -109211 -30232 107941
83A07941N830j55476j01627R0786J52226j0589j40339o8291R8837J09949j9956
$$ 107941 113771 -41705 -143332 -52546 99680 89091 -51248 -119539 -20702 89247 69291
94F9291r8215l1853O2778N8216j4464m7919k0525O688J6770K0360J310l4052m0074
$$ 69291 -28924 -60777 2001 60217 45753 -2166 -22691 -16003 767 21127 22437 -11615 -51689
107e1689R269N8615L2510m2127n6929R140N8904L6099k2903m0770j6048R656K5001
$$ -51689 -42420 16195 48705 6578 -50351 -41211 17693 53792 30889 -9881 -25929 -16273 8728
120H728K4353j440m9249m8744J6892P3582L7844o0748q3759J0960J02406N4059
$$ 8728 33081 31641 -17608 -66352 -49460 24122 61966 1218 -82541 -71581 30825 84884
132H4884o3691q5368J4413Q4126K9068n5828m6756K6428L6289k1304l6176J6378
$$ 84884 21193 -64175 -49762 34364 63432 7604 -39152 -12724 23565 2261 -33915 -17537
144a7537L9239j5033m8572L730N3653K1434m1677k7255L3458L7891k6844m2505
$$ -17537 21702 6669 -41903 -38173 15480 36914 -4763 -32018 1440 39331 12487 -30018
156c0018K2880N5672j6161p8326k3620Q3306O5801n8002j10078L94J14859P1649
$$ -30018 -7138 48534 32373 -45953 -69573 13733 79534 21532 -88546 -88152 26707 98356
168I8356p1642j00147L376R9123N3929m4482p0544r986M2943L0919m229k2703
$$ 98356 26714 -73433 -70057 29066 82995 38513 -32031 -42017 926 31845 27616 4913
180D913k1137j7943R316M1568K4411l6800n0030O083O6031L5023m3840n4645J4703
$$ 4913 -16224 -34167 -24851 16717 41128 4328 -45702 -39619 26412 61435 17595 -37050 -22347
193b2347N7864J4429m6586l6403K1984L7295k608l7192j6903J7579L0775Q09k1509
$$ -22347 35517 49946 3360 -33043 -11059 26236 23628 -13564 -30467 -12888 17887 18696 -2813
206b813j7209N849K5982K0485n888k9419k2114J7380M0095J1857m1511m4002N205
$$ -2813 -20022 -14173 11809 32294 26406 -3013 -25127 -7747 32348 44205 2694 -41308 -36103
219c6103M8400K6673k9767m3268M5L4973K1589m336j5213j0632k233R831J7132
$$ -36103 12297 38970 9203 -34065 -34020 953 22542 18206 2993 -7639 -9872 -41 17091
232A7091J4339j6473l6399j1991L4970L2911j7189m8131r216L3750K8605j1531
$$ 17091 31430 14957 -21442 -33433 1537 34448 17259 -30872 -40088 -6338 22267 10736
244A0736k6607K47K0589P379q357m007Q117K027j2981p441R378R456q919j5699
$$ 10736 -15871 -15624 4965 12344 3987 -20 8097 10124 -2857 -10298 -920 8536 -383 -16082
258a6082O18J2000R4r932J969J9976N029k4610j7249K4525M0337m590m7426l0641
$$ -16082 -15464 -3464 -3370 -13302 -11333 8643 13672 -10938 -28187 -3662 36675 32085 -15341 -45982
272d5982L4019M7526j840m9956l1948K0163M1362J3837k2231l0060q573K3492
$$ -45982 -11963 35563 33723 -16233 -48181 -28018 13344 27181 4950 -25110 -33683 -10191
284a0191L2914J1714k4196l5379n433L7482L5271j5115m4827k4895K8643L9487
$$ -10191 22723 34437 10241 -25138 -30571 6911 42182 27067 -17760 -42655 -14012 25475
296B5475j232l5185k4138J8074L0440N843j9746j1483R348J4708k92n811m857
$$ 25475 24243 -10942 -35080 -17006 13434 19277 -469 -11952 -2604 12104 11812 6001 1144
309A144J756L081p0p821m607l301J0571Q592m641j9553o580K3547K2519n888k6815
$$ 1144 2900 5981 5911 -1910 -6517 -9818 753 9345 4704 -14849 -21429 2118 24637 18749 -8066
324h066j1447J9964K8981k23k7041k0900Q085J9972J0758r096j9537j2324O839
$$ -8066 -19513 451 29432 29209 2168 -18732 -10647 9325 20083 10987 -8550 -20874 -14035
337a4035K1633J3953r056k3295r694J7085K8082N068k4271k3691P525K3626O842
$$ -14035 7598 21551 12495 -10800 -20494 -3409 24673 29741 5470 -18221 -10696 12930 19772
350A9772j3760j7816j126R661N608j728m6j812p395N98R101J1616j355j2409o492
$$ 19772 6012 -11804 -12930 -3269 2339 611 565 -1247 -8642 -8044 1057 12673 11318 -1091 -7583
365g583R717N954l099p893J498L168o770o344M357J2297K754j4344j3737P220
$$ -7583 2134 8088 4989 -2904 -1406 1762 -5008 -11352 -6995 5302 8056 -6288 -20025 -12805
379a2805K4880R485j4601k0222k449J9266J6416n646j7524j5448O29J8555J2983
$$ -12805 12075 21560 6959 -13263 -15712 3554 19970 14324 -3200 -18648 -18019 536 13519
392A3519n613k1995j2866R700K6644J1669j8818k2327K576K2620J4354p896j8713
$$ 13519 7906 -14089 -26955 -17255 9389 21058 2240 -20087 -17511 5109 19463 11567 -7146
405g146o980R197R133L071p762q774l377M426P051K947j821n110K827L004O1L043
$$ -7146 -14126 -4929 4204 7275 -487 -9261 -12638 -8212 -1161 1786 -35 -5145 -2318 686 747 3790
421C790K104M68l327n378n115O148J1427k926j3934r823P071J6827P003j1823
$$ 3790 5894 6362 3035 -2343 -7458 -1310 10117 7191 -6743 -16566 -9495 7332 14335 2512
435B512j6787Q40J5511J5037p68j3032j2409r80J3936J4473l783j8692j4280N620
$$ 2512 -14275 -13435 2076 17113 16345 3313 -9096 -10076 3860 18333 14550 -4142 -18422 -12802
449a2802J8696J0486j1050j9174k252J7543J4260k828j0220q426K740R493N888
$$ -12802 5894 16380 5330 -13844 -16096 1447 15707 12879 2659 -5767 -3027 6466 12354
462A2354k014q493p154M75N176O226k244n285o538K327M431P116j02m499k518
$$ 12354 10340 1847 -5307 -4832 344 6570 4326 -959 -7497 -5170 -739 6377 6275 1776 -742
477g42J593R81L991L529k307p943q162M106Q227N616q073j1315l553J1066J1905
$$ -742 851 1832 5823 9352 7045 -898 -9060 -4954 3273 8889 816 -10499 -14052 -2986 8919
492H919J622j0593q826k82J1041J1533k200j2926j1295M648J1258Q612q853j2204
$$ 8919 10541 -52 -8878 -9160 1881 13414 11214 -1712 -13007 -8359 2899 11511 2658 -9546
506i546p318R416J2781J370q576p133j36R970O319J34n520m951o3K171M487k6
$$ -9546 -16864 -7448 5333 6703 -1873 -9006 -9142 828 7147 7281 1761 -3190 -3253 -1082 3405 3379
522C379m825m848k12j31K072L783J585m138l959r44P576J1085p86j2463p824M504
$$ 3379 -1446 -6294 -6506 -6637 -4565 -782 803 -3335 -7294 -8238 -662 10423 9637 -2826 -10650 -6146
538f146J0664P961q279j1961n729N462J1893N882q604j4117l369J2553J3851L974
$$ -6146 4518 12479 4200 -7761 -13490 -8028 3865 9747 1143 -12974 -16343 -3790 10061 14035
552A4035j3947j1709K822J3596J1554o365j5795q558R121J2907L182r689j0665
$$ 14035 88 -11621 -8799 4797 16351 9986 -5809 -14367 -5246 7661 10843 1154 -9511
565i511k26O317Q837K952m815l710n858M775J0159M016o532j0256k541N758J0413
$$ -9511 -9737 -3420 5417 8369 3554 -156 -6014 -1239 8920 12936 6404 -3852 -6393 -635 9778
580I778k423q642n753J082O253N643j029k232n107r56L120P169L654k377r217
$$ 9778 7355 -1287 -7040 -5958 295 5938 4909 2677 -2430 -3386 -266 6903 10557 8180 -1037
595a037m501O686Q066J302j2186p586K612R817L905l507p832j530N417N091J286
$$ -1037 -5538 1148 9214 10516 -1670 -9256 -6644 3173 7078 3571 -4261 -5791 -374 4717 6003
610F003J29m686k518P05L126J867j217j804o030k859P464K874J80p076k373L915
$$ 6003 6132 1446 -1072 -367 2759 4626 3409 1605 -4425 -7284 180 3054 3234 -3842 -6215 -2300
626b300L148J052m64K6j10l373l486N599J0028k558j4156r014O419J5865N513
$$ -2300 848 1900 1436 1462 1352 -2021 -5507 92 10120 7562 -6594 -15608 -9189 6676 12189
641A2189j3894j5458L90J7330J2990m363j6774p143Q928J3736N345p920j1776
$$ 12189 -1705 -17163 -16773 557 13547 9184 -7590 -14733 -5805 7931 13276 5356 -6420
654f420q457N618J4794R084j0849j9067o131J6341K1744o18k3891j5352J3045
$$ -6420 -14877 -9259 5535 14619 3770 -15297 -21428 -5087 16657 16039 -7852 -23204 -10159
667a0159K1046Q599j6248j8728K596J5386R697p401j1192l282M728N140J914k574
$$ -10159 10887 19486 3238 -15490 -12894 2492 12189 4788 -6404 -9686 -4958 182 2096 -478
681d78n70l680j255M106Q444j775l919p014N022P110m94p668j346M334K809l611
$$ -478 -1048 -4728 -5983 -1877 6567 4792 873 -6141 -1119 5991 5497 -2171 -3517 817 3626 15
697A5o701M507P176Q49q251m177L423J2938P55q910q116M607R615L742j0101n405
$$ 15 -6686 -2179 4997 5846 -2405 -6582 -3159 9779 10534 1624 -6492 -1885 7730 11472 1371 -4034
713d034Q57M163K080j935O87n01n064p92N413P309K199j0064p284K992J4532L172
$$ -4034 -3177 986 3066 1131 1818 1317 -3747 -4539 874 8183 10382 318 -6966 -3974 10558 13730
729A3730r568j1944r9R937O368l434p403m442L570M175K024Q54P27o641o196N852
$$ 13730 4162 -7782 -7881 2056 8424 4990 -2413 -6855 -3285 890 2914 3768 4495 -2146 -8342 -2490
745b490R452P552j0610j3600R20J1719R897n085j3790n979N743J1914K148n899
$$ -2490 6962 14514 3904 -9696 -8776 2943 12840 7755 -6035 -12014 -6271 5643 7791 1892
759A892r005j148N906P481M402m009r867o816N638J2774O042j2313j4794j690
$$ 1892 -7113 -8261 -2355 5126 9528 5519 -4348 -11164 -5526 7248 13290 977 -13817 -15507
773a5507J4811J3295n159j7168n834J1506J2459j582r540n922L342Q759K151n271
$$ -15507 -696 12599 7440 -9728 -15562 -4056 8403 6821 -2719 -8641 -5299 3460 5611 340
787C40l415p49L116n20n91J064j578j402J286N26P95j15r85R91L451j394n203
$$ 340 -3075 -3824 -708 -1228 -1819 -755 -2333 -3735 -2449 -1923 -1128 -1243 -2228 -1237 2214 820 -4383
804d383L035N101M370o067j0204M24J1813M348n687j2043j513J0181J1269l756
$$ -4383 -1348 3753 8123 2056 -8148 -7724 4089 8437 2750 -9293 -10806 -625 10644 6888
818F888j0103o688N581R354N369m333q724l022L570M222O561l780r366m131M467
$$ 6888 -3215 -9903 -4322 5032 10401 6068 -2656 -5678 -2108 2114 8675 4895 -4471 -8602 -4135
833d135J1055K266p635q703J871J0262N489m185o465l019J670M212L292k784k999
$$ -4135 6920 9186 1551 -7152 -5281 4981 10470 6285 -180 -3199 -1529 2683 5975 3191 192
848A92l717K83M752J936P9m803j200j161N463L955L38n474m121L587K737K420
$$ 192 -3525 -3242 1510 3446 3525 -1278 -2478 -3639 1824 5779 6117 643 -3478 109 2846 5266
864E266j101m493l393p74M048L860J081n373n221j230P999P497k500o067o026
$$ 5266 4165 -328 -3721 -4495 -447 3413 4494 -879 -6100 -7330 669 8166 5666 -401 -6427
879f427J140Q965P005n227j1571l499P616R575k182q658o047J977Q933K801j807
$$ -6427 -5287 3678 10683 5456 -6115 -9614 -1998 7577 5395 -3263 -9310 -7333 1600 4401 2594
894B594m365m551K417O217K078l51o331l968N013L290J476n599k934J730K815
$$ 2594 -1771 -6322 -3905 2312 4390 4039 -2292 -6260 -1247 2043 3519 -2080 -5014 -3284 -469
909d69j595j645J234L117M19l895k030M461M471j166m235o109M078N328K846l417
$$ -469 -2064 -3709 -2475 642 1061 -2834 -4864 -403 4068 2902 -1333 -7442 -3364 1964 4810 1393
925A393p721j785O040N916J084m772n410j930P030N447J286q223n274K578P209
$$ 1393 -6328 -8113 -2073 3843 4927 155 -5255 -7185 -155 5292 6578 -1645 -6919 -4341 2868
940B868N245m551q564l257O089P978K33o152n474m93N273N571J213m706m984R53
$$ 2868 8113 3562 -5002 -8259 -2170 5808 6041 -111 -5585 -6078 -805 4766 5979 1273 -3711 -2758
956b758M153M825l55p131m027K782N675J505k955m032j645J746L991K702j694
$$ -2758 1395 6220 5865 -1266 -5293 -2511 3164 4669 1714 -2318 -3963 -2217 1774 4476 2782
971B782k768p98K04L148K510k485k593p5J090n8J996j030P34k765k599R30N948
$$ 2782 14 -784 -580 2568 5078 2593 0 -75 1015 957 2953 1923 2657 -108 -2707 -1777 4171
988D171J262m090m085M64L335N528j223o479l294K628M567J784j211o341k31o09
$$ 4171 5433 1343 -2742 -2278 1057 6585 5362 -1117 -4411 -1783 2784 4568 3357 -2984 -3215 -3824
1004c824M962L506j157o380l606M391P514M75n623m945L83N102L291j239l609
$$ -3824 1138 4644 3487 -2893 -6499 -2108 5406 5881 258 -4687 -4304 798 4089 2850 -759
1019g59k494k042L533M572M68m030l664J171J499N036Q13m441n053N64N815K470
$$ -759 -3253 -5295 -1762 2810 3278 -752 -4416 -3245 -1746 3290 4103 -338 -5391 -4827 988 3458
1035C458l29o062k550J327M577L837k333n292j534L94M052M167j267n614k432
$$ 3458 3129 -2933 -5483 -4156 421 4258 1925 -3367 -4901 -4507 -455 3712 2445 -3169 -5601
1050e601L886L143R39j323k775k403J056K417L373l599n03l123J869M118l12J791
$$ -5601 -1715 1428 2367 1044 -1731 -4134 -3078 -661 2712 -887 -1390 -4513 -2644 1474 1162 2953
1066B953o130j036K907K200J484Q53l088k865J286L592J039j506l252k441L027
$$ 2953 -3177 -4213 -1306 894 2378 3231 143 -2722 -1436 2156 3195 1689 -1563 -4004 -977
1081i77L255J931m053k442j577L926K868K556k412m368p74J739N323o65l098n360
$$ -977 2278 4209 156 -2286 -3863 63 2931 5487 3075 -1293 -2067 -328 4995 4330 1232 -4128
1097d128M31L959L875j900j943m704R82N923K731j217l883l190M232J603K802
$$ -4128 -3697 262 4137 2237 294 -4410 -3428 2495 5226 4009 126 -3064 1168 2771 5573
1112E573k028n964o18L200K259J548k406l170j061K346L859K00j538l364o5J433
$$ 5573 3545 -2419 -3037 163 2422 3970 1564 -1606 -2667 -321 3538 3738 2200 -1164 -1229 204
1128B04K907O64k960j893j157J923K918K284n653q82n90K348J946M03k75l328
$$ 204 3111 3775 815 -1078 -2235 -312 2606 4890 -763 -1645 -2235 113 2059 2462 2187 -1141
1144a141j525Q17N511J416m672l213k254K707N227o3m134l867O82L555M247j119
$$ -1141 -2666 -1849 3662 5078 406 -2807 -5061 -2354 2873 2810 -1324 -5191 -4509 -954 3293 2174
1160B174m788j825J272L141K610O94n023k059K28N159O97q83m696k445K310N392
$$ 2174 -2614 -4439 -3167 -26 2584 3278 -1745 -3804 -3576 1583 2280 1397 -3299 -5744 -3434 1958
1176A958J225m104r70j978K281K363J981l076k415N96J218K236p15j736j832j198
$$ 1958 3183 -921 -1891 -3869 -1588 775 2756 -320 -2735 -2139 -921 1315 600 -1136 -2968 -4166
1192d166L135L638n48k157k497j675L567J323J318l09l517q18K419K470m61k16
$$ -4166 -1031 2607 2059 -98 -2595 -4270 -703 620 1938 1629 -1888 -2706 -287 2183 1722 1506
1208A506k931K58l46L938L51j869k382r27J946K091L066l723l656r28N035L315
$$ 1506 -1425 -1167 -1513 2425 2776 907 -1475 -2402 -456 1635 4701 978 -2678 -3606 1429 4744
1224D744m92l687l903Q73L286L343q91l746j739N31K882K733k360q59k236J401
$$ 4744 4252 565 -3338 -2465 821 4164 3273 -473 -2212 -1681 1201 3934 1574 715 -1521 -120
1240a20L322J635r67l290l398Q96N238J431k001m885K39K896K470l02j787l477
$$ -120 3202 4837 3870 580 -2818 -1922 3316 4747 2746 -2139 -1900 996 3466 3164 1377 -2100
1256b100L42J266K091J951k591k065j574J939J789K619k325m615o78L614L971
$$ -2100 -1758 -492 1599 3550 959 -1106 -2680 -741 1048 3667 1342 -3273 -3951 -337 3634
1271C634n63m154l916K502L481J888r27j663q86j177K176J955J01m801q80o81
$$ 3634 3071 -1083 -4999 -2497 984 2872 1945 282 -604 -1781 395 2350 2451 -2350 -3230 -3911
1287c911N050J981k978l728j442L678L358J406l211m239J780J748K969j421p51
$$ -3911 1139 3120 142 -3586 -5028 -1350 2008 3414 203 -4036 -2256 -508 2461 1040 289
1302B89j341p68J032J069M75j81k054p56Q3K627J037k283j200r01K210J655N76
$$ 289 -1052 -1820 -788 281 756 575 -1479 -2235 -2152 475 1512 -771 -1971 -2872 -662 993 1569
1319A569j488j561j236J754O59M40J094k427j543p27L123M443j798m763k394L326
$$ 1569 81 -1480 -2716 -962 -303 137 1231 -1196 -2739 -3466 -343 4100 2302 -2461 -4855 -1529
1335a529N103l30k922l980K499J382M093j409l778k587MK800K881K530l567n604
$$ -1529 3574 3244 322 -3658 -1159 223 4316 2907 -871 -3458 -3454 -654 2227 4757 1190 -4414
1351d414O21N132M286j764n103l343L988N620l09l930m125K033L102O77K3j805
$$ -4414 -3793 1339 5625 3861 -1242 -4585 -597 5023 4714 784 -3341 -1308 1794 2471 2494 689
1367F89k123P95J829K012R71l790j939j035M425L223k110l002k740L388J557j8
$$ 689 -1434 -639 1190 3202 4173 383 -1556 -2591 1834 5057 2947 -55 -2795 593 2150 2132
1383B132j234j231L17j89J046n05l1q74k11N8K87K465J082l426q48O42J132Q07
$$ 2132 898 -333 -16 -205 841 336 305 -569 -780 -722 -435 2030 3112 -314 -1162 -520 612 1419
1401A419m02j512j779J432p06K225K54l85j872j784J780K209J499l648m10j747
$$ 1419 1017 -495 -2274 -842 -1548 677 931 546 -1326 -3110 -1330 879 2378 -1270 -1680 -3427
1417c427L156L004p72l785k349J882L475K453k613l119k817K922K308J341j994
$$ -3427 -271 2733 1961 -1824 -4173 -2291 1184 3637 1024 -2095 -4912 -1990 318 1659 -335
1432c35j547j382J939J215J301o14l483k619L380O050J78n025j737j506N380J389
$$ -335 -1882 -3264 -1325 -110 1191 577 -2906 -5525 -2145 3905 4083 -942 -2679 -4185 1195 2584
1448B584o63k673k320P56J872P8K527k193j198k167K304M215K3m841k069J304
$$ 2584 1921 -752 -3072 -2316 -444 -366 2161 -32 -1230 -3397 -1093 3122 3145 -1696 -3765 -2461
1464b461N283l26k241l129M89L492p6L75n15j047j43L21O99O40O35j724l447K304
$$ -2461 2822 2496 255 -2874 -2385 1107 1031 1406 891 -156 -299 22 721 1361 1996 272 -3175 -871
1482h71K162J246j147k325M07K455J114j089j300K12j200M96N23J484l59k169
$$ -871 1291 2537 1390 -935 -528 1927 3041 1952 652 864 -336 160 683 2167 1808 -361
1498c61j838J705K438N34j542k106m53K329J276L63j350j311j562J984J145L40
$$ -361 -2199 -494 1944 2478 936 -1170 -1623 706 1982 2345 995 -316 -1878 106 1251 1591
1514A591r56k958J249M3L308M1k775k059P49J735J343R46j938k012o37L310K258
$$ 1591 635 -2323 -1074 -1031 2277 2318 -457 -2516 -1767 -32 1311 2257 319 -1693 -2330 980 3238
1531C238k413k520j920J960L129P74j444j055k262J006K803J633k001j716j903
$$ 3238 825 -1695 -3615 -1655 1474 2248 804 -251 -2513 -1507 1296 2929 928 -788 -2691
1546b691R11L894M15k088l242j516L965L127p93k574j532l5J620K143j438j268
$$ -2691 -1780 2114 2529 441 -2801 -4317 -352 2775 1982 -592 -2124 -2159 -539 1604 166 -1102
1562a102R9j466J461K873r3k195k272L31K755J007lk462n78l17K536J463q64r27
$$ -1102 -1003 -2469 -1008 1865 1772 -423 -2695 -2364 391 1398 1395 -1067 -1645 -1962 574 2037 1173 246
1580B46j564r25K533J413n31j806k366J676K629J343j428j966q43k58L014O22
$$ 246 -1318 -2243 290 1703 1172 -634 -3000 -1324 1305 2648 1220 -746 -1589 -1847 1167 1789
1596A789m31k455j122M64J158K819l95k611r63J361K273J110j033l336n77K686
$$ 1789 1358 -1097 -2219 -1755 -597 2222 1827 -784 -1747 -386 1887 2997 1964 -1372 -1949 737
1612G37J137k80q65j755o05J268K134J426k957j860o53L027J793J14k555j727
$$ 737 1874 1594 729 -1026 -1631 -363 1771 3197 240 -1620 -2273 754 2547 2661 106 -1621
1628a621O4J580J726Q25k326k086N65J531K058o8k065j190l0K406J638j614k567
$$ -1621 -1557 23 1749 2574 248 -1838 -1273 258 2316 2248 183 -1007 -1037 1369 3007 1393 -1174
1645a174k05J866N98J121j265k781m51J641J091J489k81k07k701J179O45n60J500
$$ -1174 -1379 487 1085 2206 941 -1840 -2291 -650 441 1930 1649 1442 -1259 -80 565 5 1505
1662A505k825K83N2N76K405j397r39q73M34L81J445j007j233j068J861J799n81
$$ 1505 -1320 -1037 -985 -409 1996 599 -340 -1213 -779 -398 1047 40 -1193 -2261 -400 1399 818
1679H18j69j481j239J202J671K048k712j775j566K393K461q94j123j214j037K177
$$ 818 649 -832 -2071 -869 802 2850 138 -1637 -3203 -810 1651 757 -366 -1580 -2617 -440
1695d40K057m37k581j415R21J493J733J00k745k32p2K283J752j733k566j939K864
$$ -440 1617 1180 -1401 -2816 -1895 -402 1331 1431 -1314 -1546 -1618 665 2417 684 -1882 -3821 -957
1712i57J359J788k335j930K44J829J543j57r93j736O71K1J742M52j33m201R69
$$ -957 402 2190 -145 -2075 -1831 -2 1541 1384 391 -1345 -674 -653 1089 1541 1408 -2793 -1824
1729a824J958J045P28j681q87p72K931K06p88j62j269p0N76J359k60l57n02j725
$$ -1824 134 1179 1907 226 -661 -1433 1498 1704 916 754 -515 -585 -9 1350 1090 733 231 -1494
1747a494K780J174o96j531q60J05J14K332j323M20k82o85J434o46N26k097n75
$$ -1494 1286 2460 1764 233 -627 -522 -408 1924 601 1021 739 54 1488 842 1368 -729 -1304
1764a304N83P18K308j78k573p32N42N99K868r52j996k025P67K447J596j426j716
$$ -1304 -721 -3 2305 2127 -446 -1178 -636 -37 2831 1879 -117 -2142 -1375 1072 2668 1242 -474
1781d74j116J168K409m46J77k879K5J141M34O00k75k348L14K234J82M49j481j940
$$ -474 -1590 -422 1987 1541 1718 -1161 -1136 5 439 1039 764 -1584 -1270 964 1146 1595 114 -1826
1799a826J90J457J115Q2k117j93J14J407J495n05k312k24q09J796P24R38j877
$$ -1826 -1636 -179 936 1018 -1099 -1292 -1178 229 1724 1219 -1093 -1317 -2126 -330 394 1332 -545
1816e45j012r85K073R70J90l33k042N17o75K445l04j359j251K068J579j708J463
$$ -545 -1557 -2542 -469 501 691 358 -1684 -1167 -1842 603 299 -1060 -2311 -243 1336 -372 1091
1833A091q21j886M91K385k41p43j190k99L86N74J507j246k33j195J415J144J42
$$ 1091 270 -1616 -1125 1260 1019 276 -914 -1213 -827 -253 1254 8 -225 -1420 -5 1139 1281
1850A281j146j458L40Q67P81K225k247j583J106k12J423n33L46j616q96J148J236
$$ 1281 135 -1323 -983 -116 665 2890 643 -940 166 -46 1377 844 1190 -426 -1322 -174 1062
1867A062J023Q1k410j581L675l5m74l49j977R26Q58L34l08j107J7j379J958J061
$$ 1062 2085 2166 -244 -1825 1850 1815 1341 992 -985 -59 799 1133 825 -282 -265 -1644 314 1375
1885A375n49j0j889J451M62J019j008o54j548O29L266p25r99j727K5O59K971j311
$$ 1375 826 816 -1073 378 840 1859 851 197 -1351 -722 2544 1819 820 -907 -882 -223 2748 1437
1903A437j781J71l61J20N63J023o54o48o64N63J650l3j70k355K94O50O36R61j254
$$ 1437 -344 -173 -534 -414 149 1172 518 -130 -794 -231 1419 1386 1216 -1139 -845 -195 441 1402 148
1922A48j773J136m48K209M37l203R39O0k76P91J389j720j852J885q14Q45q0j489
$$ 148 -1625 -489 -937 1272 1709 -1494 -555 -495 -771 20 1409 -311 -2163 -278 -1092 -247 -327 -1816
1940a816J310q90Q96M09P52j131k38K62L44K032j755j378n50r51K108K288j505
$$ -1816 -506 -1396 -500 -91 661 -470 -708 -446 -102 1930 175 -1203 -1753 -2704 -596 1692 187
1957A87j111J42n4o78L839k163r65p61p40L356K28j845L45j607J455J442O63j847
$$ 187 -924 -782 -836 -1514 2325 162 -803 -1564 -2304 1052 1280 -565 -220 -1827 -372 1070 1733 -114
1975a14K97j375J229R5J329j944n33R50J099j478J781j919j52R47j019J522j113
$$ -114 183 -1192 37 132 1461 -483 -1016 -66 1033 -445 1336 -583 -735 212 -807 715 -398
1992c98N39q30J604q95N96J30j183n19J355M11Q64o51j711p12Q61K207l55r43
$$ -398 141 -689 915 20 616 746 -437 -956 399 810 1674 1023 -688 -1400 -539 1668 1313 370
2010C70o20L28N8K01J596n4j695j558R02J755R11q27J86j424M3L01J080O67j587
$$ 370 -250 78 136 337 1933 1879 184 -1374 -472 1283 2194 1367 1553 129 172 473 1553 2220 633
2029F33j179m92J204J029N44k045J7q3N90J950j449j421j202J463J327L25j230
$$ 633 -546 -1038 166 1195 1739 -306 -289 -372 218 2168 719 -702 -1904 -441 886 1211 -19
$$ [...]
8191A87
##END NTUPLES=NMR FID
##END=
