##TITLE=1H_Pr 4965-HCl
 D2O, 108 sc, 
 5.6.2020
##JCAMPDX= 6.0         $$ Bruker NMR JCAMP-DX V2.0
##DATA TYPE= NMR FID
##DATA CLASS= NTUPLES
##ORIGIN= UXNMR, Bruker Analytische Messtechnik GmbH
##OWNER= root
$$ XWIN-NMR		Version 3.5
$$ Fri Jun  5 12:19:45 2020 Russian Standard Time (UT+4h)  she@DPX200
##.OBSERVE FREQUENCY= 200.1315
##.OBSERVE NUCLEUS= ^1H
##.DELAY= (6, 6)
##.ACQUISITION MODE= SIMULTANEOUS
##.ACQUISITION SCHEME= undefined
##.AVERAGES= 108
##.DIGITISER RES= 18
##SPECTROMETER/DATA SYSTEM= spect
##.PULSE SEQUENCE= zg30
##.SOLVENT NAME= D2O
##.SHIFT REFERENCE= (INTERNAL, D2O, 0, 15.7039)
##AUDIT TRAIL= $$ (NUMBER, WHEN, WHO, WHERE, WHAT)
$$ ##TITLE= Audit trail, XWIN-NMR		Version 3.5
$$ ##JCAMPDX= 5.01
$$ ##ORIGIN= Bruker BioSpin GmbH
$$ ##OWNER= she
$$ F:/spectra/data/she/nmr/H-F/1/audita.txt
$$ ##AUDIT TRAIL=  $$ (NUMBER, WHEN, WHO, WHERE, WHAT)
(   1,<2020-06-05 12:18:22.28 +0400>,<she>,<DPX200>,
      <continue with go, POWCHK disabled, PULCHK disabled
       configuration hash MD5:
       00 E9 B6 7A A2 85 ED C7 34 08 36 98 17 FE 4E 26
       data hash MD5: 16K
       99 0A 36 38 29 96 16 C5 76 1D 80 CD 74 5E B0 B4>)
$$ ##END=
$$ 
$$ hash MD5
$$ 82 10 FE 6A 28 E4 3D 36 69 7B 48 C7 58 DA E9 9B
##$RELAX= 
##$RELAX= 
##$RELAX= 
##$RELAX= 
##$RELAX= 
##$RELAX= 
$$ Bruker specific parameters
$$ --------------------------
##$DU= <F:/spectra>
##$EXPNO= 1
##$NAME= <H-F>
##$PROCNO= 1
##$TYPE= <nmr>
##$USER= <she>
##$AMP= (0..31)
100 100 100 100 100 100 100 100 100 100 100 100 100 100 100 100 100 100 
100 100 100 100 100 100 100 100 100 100 100 100 100 100 
##$AQSEQ= 0
##$AQ_mod= 1
##$AUNM= <au_zg>
##$AUTOPOS= <>
##$BF1= 200.13
##$BF2= 200.13
##$BF3= 200.13
##$BF4= 200.13
##$BF5= 200.13
##$BF6= 200.13
##$BF7= 200.13
##$BF8= 200.13
##$BYTORDA= 1
##$CFDGTYP= 0
##$CFRGTYP= 5
##$CHEMSTR= <none>
##$CNST= (0..31)
1 1 145 1 1 1 1 1 1 1 1 1 1 1 1 1 1 1 1 1 1 1 1 1 1 1 1 1 1 1 1 1 
##$CPDPRG= <>
##$CPDPRG1= <>
##$CPDPRG2= <>
##$CPDPRG3= <>
##$CPDPRG4= <mlev>
##$CPDPRG5= <mlev>
##$CPDPRG6= <mlev>
##$CPDPRG7= <mlev>
##$CPDPRG8= <mlev>
##$CPDPRGB= <>
##$CPDPRGT= <>
##$D= (0..31)
0 1.2 0 0 0 0 0 0 0 0.06 0 0.03 0 0 0 0 0.0002 0 0 0 0 0 0 0 0 0 0 0 0 
0 0 0 
##$DATE= 1591344765
##$DBL= (0..7)
120 120 120 120 120 120 120 120 
##$DBP= (0..7)
150 150 150 150 150 150 150 150 
##$DBP07= 0
##$DBPNAM0= <>
##$DBPNAM1= <>
##$DBPNAM2= <>
##$DBPNAM3= <>
##$DBPNAM4= <>
##$DBPNAM5= <>
##$DBPNAM6= <>
##$DBPNAM7= <>
##$DBPOAL= (0..7)
0.5 0.5 0.5 0.5 0.5 0.5 0.5 0.5 
##$DBPOFFS= (0..7)
0 0 0 0 0 0 0 0 
##$DE= 6
##$DECBNUC= <off>
##$DECIM= 24
##$DECNUC= <off>
##$DECSTAT= 4
##$DIGMOD= 1
##$DIGTYP= 9
##$DL= (0..7)
0 120 120 120 120 120 120 120 
##$DP= (0..7)
150 150 150 150 150 150 150 150 
##$DP07= 0
##$DPNAME0= <>
##$DPNAME1= <>
##$DPNAME2= <>
##$DPNAME3= <>
##$DPNAME4= <>
##$DPNAME5= <>
##$DPNAME6= <>
##$DPNAME7= <>
##$DPOAL= (0..7)
0.5 0.5 0.5 0.5 0.5 0.5 0.5 0.5 
##$DPOFFS= (0..7)
0 0 0 0 0 0 0 0 
##$DQDMODE= 0
##$DR= 18
##$DS= 0
##$DSLIST= <SSSSSSSSSSSSSSS>
$$ [...]
##$SUBNAM2= <"">
##$SUBNAM3= <"">
##$SUBNAM4= <"">
##$SUBNAM5= <"">
##$SUBNAM6= <"">
##$SUBNAM7= <"">
##$SUBNAM8= <"">
##$SUBNAM9= <"">
##$SW= 24.9337058887773
##$SWIBOX= (0..15)
0 0 2 0 0 0 0 0 0 0 0 0 0 0 0 0 
##$SW_h= 4990.01996007984
##$TD= 16384
##$TD0= 1
##$TE= 0
##$TE2= 300
##$TE3= 300
##$TEG= 300
##$TL= (0..7)
0 120 120 120 120 120 120 120 
##$TP= (0..7)
150 150 150 150 150 150 150 150 
##$TP07= 0
##$TPNAME0= <>
##$TPNAME1= <>
##$TPNAME2= <>
##$TPNAME3= <>
##$TPNAME4= <>
##$TPNAME5= <>
##$TPNAME6= <>
##$TPNAME7= <>
##$TPOAL= (0..7)
0.5 0.5 0.5 0.5 0.5 0.5 0.5 0.5 
##$TPOFFS= (0..7)
0 0 0 0 0 0 0 0 
##$TUNHIN= 0
##$TUNHOUT= 0
##$TUNXOUT= 0
##$USERA1= <user>
##$USERA2= <user>
##$USERA3= <user>
##$USERA4= <user>
##$USERA5= <user>
##$V9= 5
##$VALIST= <valist>
##$VCLIST= <CCCCCCCCCCCCCCC>
##$VD= 0
##$VDLIST= <DDDDDDDDDDDDDDD>
##$VPLIST= <PPPPPPPPPPPPPPP>
##$VTLIST= <TTTTTTTTTTTTTTT>
##$WBST= 1024
##$WBSW= 4
##$XGAIN= (0..3)
0 0 0 0 
##$XL= 0
##$YL= 0
##$YMAX_a= 953003
##$YMIN_a= -851828
##$ZGOPTNS= <>
##$ZL1= 120
##$ZL2= 120
##$ZL3= 120
##$ZL4= 120
##$ABSF1= 10
##$ABSF2= 0
##$ABSG= 5
##$ABSL= 3
##$ALPHA= 0
##$AQORDER= 0
##$ASSFAC= 0
##$ASSFACI= 0
##$ASSFACX= 0
##$ASSWID= 0
##$AUNMP= <proc_1d>
##$AZFE= 0.1
##$AZFW= 0.1
##$BCFW= 1
##$BC_mod= 2
##$BYTORDP= 1
##$COROFFS= 0
##$CY= 11.3945322036743
##$DATMOD= 1
##$DC= 2
##$DFILT= <>
##$DTYPP= 0
##$F1P= 16.9975609425685
##$F2P= -3.02152046262296
##$FCOR= 0.5
##$FTSIZE= 0
##$FT_mod= 4
##$GAMMA= 1
##$GB= 0.15
##$INTBC= 1
##$INTSCL= 1
##$ISEN= 128
##$LB= 0.24
##$LEV0= 0
##$LPBIN= 0
##$MAXI= 10000
##$MC2= 0
##$MEAN= 0
##$ME_mod= 0
##$MI= 1.114404
##$NCOEF= 0
##$NC_proc= 0
##$NLEV= 6
##$NOISF1= 3.799351
##$NOISF2= 2.8
##$NSP= 1
##$NTH_PI= 0
##$NZP= 0
##$OFFSET= 15.70392
##$PC= 1
##$PHC0= -9820.854
##$PHC1= -72.5992
##$PH_mod= 1
##$PKNL= yes
##$PPARMOD= 0
##$PSCAL= 0
##$PSIGN= 0
##$REVERSE= no
##$SF= 200.130013532006
##$SI= 16384
##$SIGF1= 3
##$SIGF2= 2
##$SINO= 400
##$SIOLD= 16384
##$SREGLST= <1H.CDCl3>
##$SSB= 0
##$STSI= 0
##$STSR= 0
##$SW_p= 3612.71676300578
##$SYMM= 0
##$S_DEV= 0
##$TDeff= 0
##$TDoff= 0
##$TI= <>
##$TILT= no
##$TM1= 0
##$TM2= 0
##$TOPLEV= 0
##$USERP1= <user>
##$USERP2= <user>
##$USERP3= <user>
##$USERP4= <user>
##$USERP5= <user>
##$WDW= 1
##$XDIM= 8192
##$YMAX_p= 0
##$YMIN_p= 0
$$ End of Bruker specific parameters
$$ ---------------------------------
##NTUPLES= NMR FID
##VAR_NAME=  TIME,          FID/REAL,        FID/IMAG
##SYMBOL=    X,             R,               I
##VAR_TYPE=  INDEPENDENT,   DEPENDENT,       DEPENDENT
##VAR_FORM=  AFFN,          ASDF,            ASDF
##VAR_DIM=   8192,          8192,            8192
##UNITS=     SECONDS,       ARBITRARY UNITS, ARBITRARY UNITS
##FACTOR=    0.0002004,     1,               1
##FIRST=     0,             0,               0
##LAST=      1.6414764,     0,               0
##MIN=       0,             -851828,         0
##MAX=       1.6414764,     953003,          0
$$ Real data points
##PAGE= N=1
##DATA TABLE= (X++(R..R)), XYDATA
0@%%%%%%%%%%%%%j06K14k16K16k16K16l23M31m32M82n90O51p58Q66r74J128j243
30f54J409j614J826k042K264k503K800l121L467l858M267m721N215n770O400p092
46c727P865q763R792j0967J2355j4010J6027j8553K1819k6258L2624m2627O0829
59C6406j04546M02674O18469l32638m83008o11753l22255r003M05208N65603N21598
70F86755J66772k18680n36218n59739l57080M3826L96930N84855M72347J57156
80H36924k45987n12720n53947l23344M9763M10387N62682M55089J27414k47930
90E58331n07196n27733l06512O6123M05803N51579M31190J13273k57441n02098
100B5319n13601k78978Q7292M05764N25684M04417J00074k52462m95271n01475
$$ y = [0, 0, 0, 0, 0, 0, 0, 0, 0, 0, 0, 0, 0, 0, -106, 108, -108, 108, -108, 108, -215, 216, -216, 266, -324, 327, -431, 435, -539, 589, -654, 755, -859, 967, -1075, 1189, -1314, 1486, -1635, 1832, -2026, 2241, -2480, 2735, -3035, 3365, -3727, 4138, -4625, 5167, -5800, 6555, -7455, 8572, -9981, 11838, -14420, 18204, -24423, 36406, -68140, 334534, 953003, 620365, 137357, -474396, -796651, -805654, -400446, 165157, 686755, 853527, 634847, 98629, -461110, -818190, -774364, -377434, 207421, 679768, 836924, 590937, 78217, -475730, -799074, -749311, -338924, 223758, 678847, 806261, 558331, 51135, -476598, -783110, -716987, -311184, 240395, 671585, 784858, 527417, 25319, -488282, -767260, -679968, -274204, 251480, 655897, 755971, 503509, 8238, -493237]
110d93237k62166J04254M07638N10153L81516Q1555k59544m85120m78493k38826
120g32270J11692L99601M94830L65446O7673k64758m74200m58976k23904J16431
130e98435L97299M88012L50211M7711k75865m64901m31874j99884J20243L81664
140a85819M69806L41734M5463k79628m64116m20862j80895J33706L80281M54323
150B93993L19690L0228k77210m48733m04639j72183J36638L79462M45575L01682
160F04503J4374k75742m33321l89236j65771J38431L79846M39539K86338r30k80458
171C17573m21975l70166j49790J42214L69622M22864K75498k116k78106m19644
181a14026l65035j36778J56291L71374M06479K52485j4181k70666m03277l51919
$$ y = [-493237, -755403, -651149, -243511, 266642, 648158, 729713, 470169, -14951, -493444, -732270, -620578, -220977, 273853, 639299, 706972, 442214, -31986, -490962, -714866, -598435, -201136, 286876, 637087, 684798, 408933, -55968, -487842, -687726, -567483, -185819, 283987, 625721, 671184, 391556, -72560, -493422, -674317, -540611, -160330, 293993, 613683, 643911, 366701, -82032, -486671, -658854, -522216, -142754, 302821, 604503, 618877, 343135, -90186, -479422, -645193, -506762, -126916, 312623, 598961, 598031, 317573, -104402, -474568, -624358, -482144, -112522, 310342, 585840, 583724, 305618, -114026, -479061, -615839, -459548, -88174, 318305, 570790, 556609, 285943, -117334, -469253]
191d69253j32845J56330L69458M00035K40869k4518k72737l96272l38608j18931
201e86472J62196L63261L85645K27925l1025k71335l87186l24532j08308J62556
211d07275L54026L77517K22590l5377k77288l85316l11109r1065J69123L45938
221c8236L61245K10999m0310k73226l76680l01607q2922J71303L42192L53334
231C26092K00743m7926k74950l70512k88066p1636J75086L36073L41941J89430
241E16275n4420k72410l59947k77026o5971J74040L32097L37894J81996o3303
251D49225k76975l53505k63279n3375J77049L25088L24265J70889o4923k71265
261A63194l46114k58888n0043J82815L26667L16665J57344p4888k69108l35638
$$ y = [-469253, -602098, -445768, -76310, 323725, 564594, 540076, 267339, -128933, -467541, -586472, -424276, -61015, 324630, 552555, 521530, 250195, -136991, -461523, -569831, -407275, -53249, 324268, 546858, 511481, 234193, -151123, -462232, -553297, -384174, -38236, 323009, 534008, 493698, 220472, -156208, -457815, -540737, -369434, -27242, 326092, 526835, 478909, 203959, -166553, -454619, -526255, -351169, -15096, 326845, 516275, 461855, 189445, -170502, -447528, -513499, -339459, -7362, 330532, 512528, 449225, 172250, -181255, -444534, -497909, -320860, 4228, 328493, 499382, 434459, 163194, -182920, -441808, -491851, -309036, 17631, 334296, 491640, 416752, 147644, -187994]
271a87994k47851m3098J83793L22206L07648J47846q0019k66439l28567k39191
281d31666l7002J85730L20183L00503J38420q7658k67382l21042k27294k6586
291d53794J86664L12095K89637J31393q7876k65132l17896k22142j8456J92663
301b52844L10352K80041J19660r4601k63566l09205k10419j1399J92136L03438
311F3593K72626J14219r8125k63642l05682k01984k825J96609K99753K63251J03982
322D41775j04609k62355k96322j90779M028J94843K93248K56355R9719j07382
332C28521k63238k93416j83275J2571K00074K90093K46191Q7847j12444k60002
342E2922k82923j74864J7036J98862K86527K40758Q1117j17674k59700k77988
$$ y = [-187994, -435845, -478943, -295150, 27056, 334704, 482550, 402531, 136092, -192475, -431666, -468668, -282938, 37245, 337748, 476168, 388510, 121128, -199914, -427208, -453794, -267130, 44965, 334602, 465995, 378119, 112987, -204909, -427051, -445507, -252844, 57508, 337549, 457209, 362608, 99042, -210163, -420582, -431981, -239845, 63593, 336219, 450438, 352313, 88671, -217011, -418995, -421820, -225211, 74542, 337793, 441775, 337166, 74811, -221511, -412290, -408262, -213419, 79829, 336184, 435903, 328521, 65283, -228133, -411408, -398837, -198763, 91330, 337521, 425368, 312924, 52922, -230001, -404865, -387829, -188967, 97560, 338318, 419435, 301761, 42061, -235927]
352b35927j65782K4845K01078K83145K31894P0494j22575k56528k68123j57728
362c95207K8192K00886K79333K26027O4499j27409k56176k63868j48527L6430
372c55820K04085K74215K15406N6426j30276k52386k56680j42338M0587K04289
382a42492K71316K10025M8460j34381k52152k50874j33445M8537K06059K64778
392A35831K00167M1748j36095k48206k44897j27288N1981K06712K62144J94622
402C36719L4434j40350k47940k39437j17075N9732K06522K54514J85395K9389
412C61903j40717k44491k33895j12475O3346K07406K52733J79243K2479j46081
422B09451k43169k26615j03412O9129K06134K45914J72516J7152j46442k39911
$$ y = [-235927, -401709, -376864, -175786, 107359, 339253, 409747, 287172, 30644, -237479, -395207, -367015, -166129, 113204, 339231, 403730, 276321, 20145, -243723, -392250, -355820, -151735, 122480, 337886, 394312, 264036, 11650, -245030, -387368, -346781, -142492, 128824, 338849, 387309, 252928, 776, -250098, -383543, -335006, -128947, 135831, 335998, 377746, 241651, -6555, -251452, -378740, -326759, -120047, 142097, 336719, 371153, 230803, -17137, -256574, -373649, -313917, -107395, 147119, 332514, 361903, 221186, -23305, -257200, -369675, -306329, -98923, 153810, 333053, 355532, 209451, -33718, -260333, -363745, -294616, -88482, 157432, 329948, 347100, 200658, -39253]
432c9253k21994r8060P1776K07686K43545J65881J0314j50881k37878k13991q9589
443c52444P6344K05040K37393J59893N883j50931k35664k09636q4935Q0510K06390
454f2157K34817J52736j377j54424k32096k01863p7240Q2990K04065K29374J47756
465C22581n177j54916k30686j97871p2315Q7943K05420K25327J40138j1897j56710
476A51837k26702j90317o5835R0123K02443K20393J35435j4876j57460k25216
486h0175j87275o0390R4910K04324K15733J27174k1602j58351k20397j79292n5153
497c20494R5857K01790K11534J23308k4758j60303k19447j75500m8415J01398
507b15030K01601K06682J14760k9899j60716k14368j68750m4177J02498J99994
$$ y = [-39253, -261247, -359307, -287531, -79845, 163700, 329581, 339895, 189014, -48864, -262855, -352444, -276100, -71060, 166333, 326226, 332109, 181178, -54486, -264122, -349057, -268547, -62157, 172660, 325396, 324019, 169595, -62501, -264364, -341604, -258614, -54549, 174825, 322581, 317404, 162488, -68198, -266069, -338384, -250441, -45021, 180306, 320444, 308547, 151837, -74865, -265182, -331017, -240894, -38451, 181942, 317377, 302501, 145041, -80175, -267450, -327840, -232930, -28606, 187127, 314301, 292699, 134348, -86049, -265341, -320494, -224637, -22847, 188687, 311995, 287237, 126934, -92513, -268013, -316428, -215030, -13429, 193253, 308013, 278114, 117398, -96970, -265720, -309897, -207399, -7405]
517g405K02645J10864l3999j62161k13312j64374l6634J06765J98298J97118J03617
528C01422l8170j61866k08604j58266l2957J07628J97201J93659R9132m2318j63610
539I3251k06490j52600k6893J11211J95837J87987R2449m6238j63051k01850j47611
550b63998k2718J12175J94378J84641Q8329n0154j65398k00630j41100j6043J16212
561a64306J91577J77716Q1527n3130j61860j96139j37722j4019J17380J91938
571C2962J75526P6467n8405j64900j92069j30081p723J18248J87718J70067P2447
582B80257o0112j63654j89282j27081l642J20104J87649J65887O6783o4675j63550
593D8684j85794j20899J359J22333J83744J60643O1675o6884j62173j81666j16693
$$ y = [-7405, 195240, 306104, 272105, 109944, -103368, -267742, -304376, -197611, 687, 197805, 301422, 263252, 101386, -107218, -265484, -298441, -190813, 6388, 200047, 299179, 256861, 93251, -113239, -265839, -292732, -181521, 14316, 202303, 294752, 248514, 85463, -116387, -263998, -286716, -174541, 19837, 204478, 292807, 242653, 77255, -123375, -264475, -280518, -164306, 27271, 204987, 286514, 233384, 71524, -124615, -262337, -276356, -158976, 32962, 208488, 284955, 226550, 61650, -130419, -260500, -268223, -149975, 37743, 207810, 280257, 220145, 56491, -132791, -259872, -263514, -143410, 44239, 210126, 276909, 212234, 48684, -137110, -258009, -256650, -134317, 49427, 210070, 271745, 204861, 42688, -138978, -255671]
604b55671L785J22766J84027J57480N6547p1431j63378j77005j10662R192J23570
615a20780J79624J51860N2825p1617j62080j75635j06741J3050J25602J78790
625F4898J47839M7327p6150j62121j70726j00287J7194J25072J75026J43722M4023
636B55817p7079j61729j68749r6918K1294J28355J73265J37625L8248q0377j58494
647A1258j64204r1839K3643J27367J70929J34622L4958q2295j59486j60351q7254
658b42652K7645J28319J67833J30492L0821q4430j59082j56850q1849L1272J28290
669h0191J64846J25533K7295q4960j56603j55344q0049L4891J31638J63485J20200
680B10741K0326q7268j53542j48861p5410L5786J28633J61318J18530J9323q9902
$$ y = [-255671, -251886, -129120, 54907, 212387, 268934, 197503, 34125, -142880, -253542, -244350, -120780, 58844, 210704, 263529, 191912, 29832, -145803, -252544, -239494, -113892, 64898, 212737, 260064, 183914, 21793, -148933, -249220, -232026, -106954, 68072, 211794, 255817, 178738, 17009, -151740, -248658, -227364, -99009, 74256, 211881, 250129, 169752, 11258, -152946, -244785, -221142, -93775, 77154, 211776, 246734, 164439, 4953, -155398, -242652, -215007, -86688, 81145, 211637, 242458, 158028, -1054, -157904, -239753, -208481, -80191, 84655, 210188, 237483, 152523, -4080, -159424, -239473, -204582, -72944, 90541, 210741, 231067, 143799, -9743, -158604, -234014, -198228, -69595, 91723, 210253, 229576, 139674]
691A39674j55544j46779o9551M0734J29261J57769J12565J5050r0235j52272j43347
702a62675o6832M2258J29958J56359J09101J0737r1914j51180j39842o2234M5076
713a81188J30482J53157J03800P424r2842j48699j36197n8825M6780J29817J51125
724A04834J01389L780r4964j48419j32125n4269M9837J29538J47113R6598J411
735B04723r5215j46043j28322n1837N1031J29220J45903R4102k267r7302j45294
746d1301j26026m5944N4572J28755J41277Q9288n273r5903j42720j22841m4949
757b11065N5271J29142J41523Q6050r697r9731j40602j16668m0160N6772J26679
768b2486J37348Q4155j1072j00135j39548j15197l6340N9418J26750J34416P9280
$$ y = [139674, -15870, -162649, -232200, -191466, -62205, 95564, 208129, 223179, 132944, -19328, -162675, -229507, -187249, -57291, 99068, 208169, 218906, 126992, -24188, -164030, -226264, -181188, -50706, 102451, 206251, 213675, 120833, -27866, -164063, -222888, -176108, -46291, 104834, 206223, 210003, 115039, -33380, -165505, -219774, -169937, -40399, 106714, 203312, 204723, 109508, -36535, -164857, -216694, -165663, -36443, 109460, 203562, 201295, 103993, -41301, -167327, -213271, -158699, -29944, 111333, 200621, 195348, 99445, -43275, -166116, -211065, -155794, -26652, 114871, 200921, 191224, 91493, -49109, -165777, -205937, -149165, -22486, 114862, 199017, 187945, 87810, -51738, -166935, -203275, -143857, -17107, 117309, 196589]
779A96589j3922r9943j38170j11710l2811O1492J26503J30909P5506j6793r9934
790G7716j36061j08694k9993O2483J26510J29639P2229k0887j01396j33867j03753
801a66074k6025O4021J23675J25991O9349k1508j01283j33370j02458k2541O7514
812a22709J24482J22152O4276k4466j01457j30203r8049j9755O7780J22445J20163
823A24659O2041k6292j02264j29267r5577j6335P0353J22694J16836N7574l0036
834A54386j02039j25335r1859j4102P0491J21140J14962N4768l1364j02568j24819
845g6339q8632j0314P2647J19796J11207N1268l3636j02269j22603q4469p766
856a71110P2479J18648J08944M8489l5221j02623j20579q2569m936P4878J18205
$$ y = [196589, 182667, 82724, -55446, -167156, -199967, -138475, -11972, 118937, 194443, 177650, 77716, -58345, -167039, -197032, -134549, -8039, 121600, 193829, 172942, 71546, -62321, -166074, -192099, -128078, -4403, 121588, 190937, 169429, 68146, -65224, -167682, -190223, -122709, 1773, 123925, 188201, 163735, 62278, -67925, -165974, -185729, -117949, 4496, 124659, 186700, 160408, 58144, -71123, -166700, -183035, -112682, 10012, 126848, 184422, 154386, 52347, -72988, -164847, -178949, -108458, 12682, 127644, 182412, 151048, 48480, -76339, -164971, -175285, -102638, 17158, 128365, 179633, 145997, 43728, -78875, -163344, -171110, -98631, 20017, 128961, 177450, 142229, 39606, -80973, -163542, -168478, -93600, 24605]
867B4605J05544M4418l8294j01331j16737p9446l825P4766J17320J03728M2860
878A73608m0453j03081j15674p5568R34P5808J14983R9832L9331m0977j01363
889B7380j13922p3205K130P6991J14085R7957L6068m2947j01434j11839o9642
900a58378M805P7791J12225R4765L2985m4154j00260j09308o7497O309P8263J11728
912C9274R3192L0437m6978j00705j07139o3980R913P8181J09170Q9579K8526m7008
924A12462r9881j05280o2379J1784P9163J08895Q7205K5060m9149r9632j02536
935i4288n8560J3987P8759J06881Q4447K2644m9618r8449j00796n6680J5297P9612
947e6764J06279Q2439J9812n2190r8148r8340n2438J7526P9478J03449Q0020J8113
$$ y = [24605, 130149, 174567, 136273, 34942, -81795, -161241, -165066, -90300, 27020, 130748, 173608, 133155, 30074, -85600, -161168, -160234, -84426, 30557, 130389, 169720, 128743, 27380, -86542, -159747, -157617, -80626, 33459, 131416, 167484, 124537, 23103, -88736, -158378, -153573, -75782, 36443, 131208, 164193, 120039, 19779, -89529, -157026, -150717, -72454, 39274, 132466, 162903, 115925, 15220, -91919, -155899, -145986, -67805, 41365, 130944, 159470, 112462, 12581, -92699, -155078, -143294, -64131, 44764, 131969, 157029, 107880, 8248, -94288, -152848, -138861, -60102, 46779, 131226, 153870, 104252, 5803, -94993, -151673, -136376, -56764, 49515, 131954, 151766, 99576, 1428, -96912, -149350, -131824, -52346, 51103, 131123, 149236]
959A49236n2373r7954r6742n0713J9936Q0395J02471P6706J5271n3920r7022r3819
971i8528m7982K1834P9855J00313P4919J3067n4435r6670r1992m5676K3365Q0963
983d0967R9556P1507J0213n6059r5077q9243m2716K4625Q0294R7709O9312Q908
995A38062n6795r4980q7875m0348K7457Q1027R6054O6477N566n7719r3184q5331
1007a01589l8146K8316Q0615R4750O4342M465n8949r3118q3605l5213L0485Q0847
1019b6800R3006O1261J306n9219r1167q1164l3048L1425P9988R1587O0041j4o0532
1032F6670r1461p9434l0089L3852Q0418Q9250N6825k740o0238r0195p6917k8244
1044a32303L4309Q0344Q7835N5497m625o1536q9433p4857k5630L6421P9809Q6030
$$ y = [149236, 96863, -1091, -97833, -148546, -128610, -48215, 54256, 130962, 146233, 92313, -4709, -98528, -146510, -124676, -44821, 55492, 130411, 143478, 89043, -7627, -99619, -145295, -121930, -40967, 58589, 130096, 140309, 84250, -10827, -100070, -142786, -118161, -37867, 59842, 129154, 138062, 81267, -13713, -101588, -141936, -114479, -33452, 62602, 129079, 134645, 76926, -16258, -101589, -139735, -111419, -30804, 63946, 128288, 132753, 73804, -19314, -102919, -138132, -107647, -26800, 66206, 127467, 128773, 69554, -21613, -102777, -135825, -104400, -24412, 67175, 127216, 127202, 66670, -24791, -104225, -134314, -100462, -20044, 69206, 126031, 123291, 63053, -27142, -104059, -132303, -97994, -17650, 70185, 125682, 121057, 59521, -29912, -104769, -130399, -93978, -14169, 71861]
1056G1861N2145o215o1426q8143p2660k3988L7399P9365Q5243N0414q687o2714
1068E2594q7197p0608k0853L8724P8914Q3212M7400r738o2607q6085o8633j9349
1080a24226L9822P9012Q1283M5907j2072o4184q4768o5607j6348M0773P7883P9567
1092G7042M2981j3483o3713q3402o4299j5336M2307P8457P7982M0905j5634o4816
1104C8991q2496o1277j2381M2920P7370P5776L8788j6882o4080q1100o0804j0949
1116a16124M4784P7096P4854L6527j8952o5330p9773n7496q511M4742P6262P2611
1128H0690L4717k0001o4362p9388n6481o699M6355P6583P0330L2518k1976o4992
1140B7294p7726n3019n042M6405P5066O9261L0759k3246o4689p7064n1749k872
$$ y = [71861, 124006, 117791, 56365, -31778, -104438, -128426, -91027, -11662, 73581, 123995, 115308, 52594, -34603, -105211, -126064, -87340, -8426, 74786, 122186, 112448, 49841, -36244, -104877, -124226, -84404, -5392, 75891, 121798, 109726, 45542, -39226, -104833, -121181, -80408, -2525, 77042, 120023, 106540, 42827, -40575, -104874, -120210, -77903, 554, 78536, 119441, 103807, 38991, -43505, -104782, -117163, -74243, 3127, 78903, 117691, 100809, 36729, -44371, -105175, -116124, -71340, 5756, 80610, 117137, 98185, 32855, -46918, -104414, -112925, -68183, 8079, 80690, 115407, 95406, 31044, -48344, -104825, -111524, -65169, 11414, 81744, 114262, 92286, 27294, -50432, -103451, -108493, -62088, 12978, 82239, 112998, 89752, 25063, -52001, -103750, -106622]
1152a06622M7491P5010O7492K8247k4589o5682p4542m9751j590M7814P4614O5336
1164H3228K6726k5319o5584p4054m7861M94M8966P3499O3703K4326k7165o4852
1176A6107p1961m5933K323M8293P2912O2619K2595k7855o4992p1833m4084M132
1188i7677M9853P2094O0293K0345k8996o4288o9755m1912M736M9653P1679N9012
1200H5037J8829k9825o5224o8587m0422P040N1050P0113N7193J6289l0349o4092
1212G052o7760l8309Q008N0846O9466N5710J5344l1770o4266o6376l6651J0073
1224h8633N1365O8698N3384J3381l2280o3479o5021l5088J1215N1072O8242N2441
1236H5297J1880l3576o3884o3421l2821J2437N1907O6675N0490J0054l4299o2765
$$ y = [-106622, -59131, 15879, 83371, 111618, 87029, 21347, -53195, -102946, -104536, -56722, 17892, 83228, 109954, 84635, 19051, -55003, -102864, -102370, -53404, 20095, 83798, 108124, 80959, 16107, -55854, -101787, -99464, -51171, 21741, 84360, 106955, 79100, 14108, -57725, -101809, -97677, -47824, 24270, 84563, 104908, 75912, 11624, -58131, -100043, -95307, -45654, 26025, 85037, 103866, 74041, 8817, -59770, -100192, -93152, -42102, 28011, 85204, 101493, 71144, 7052, -60708, -99017, -91009, -40163, 29303, 85013, 100357, 68587, 4321, -62055, -98706, -88633, -37268, 31430, 84814, 98195, 65915, 2436, -62585, -97673, -86458, -35386, 32856, 85297, 97177, 63601, -283, -63704, -96525, -84088, -32181, 34494, 84984, 95038, 60739, -2026]
1248b026o1717l1791J3154N2624O6057M8869Q534l5572o3083o0217k9181J5063
1260g9286N1685O4927M7000P544l5671o2078n9652k8429J6243N2433O4558M5595
1272H4869N092l6964o1724n7391k5828J6833N2164O3138M3923M179l7068o1491
1284a0268n6310k5140J8510N2964O2286M2289K212l8288o0827n4865k2391J9216
1296g0612N2284O0763M1090R89l8146o0262n3972k1365K0220N3057O0450L8953
1308H3449l75l9498n9477n1284k0450K0996N2374N9759L7190j239l9536n9198
1320a7289n0533j9183K2459N3009N7990L5665k726l9889n8747m8919j6996K2922
1332f2237N1997N7276L4758l973m0511n8007m8257j5145K4074N2268N5831L2750
$$ y = [-2026, -63743, -95534, -82380, -29756, 36301, 85170, 93704, 58132, -4951, -65168, -94349, -79286, -27601, 37326, 84326, 91870, 56199, -5879, -65531, -93960, -77717, -25284, 39274, 84869, 89961, 52997, -8727, -66118, -91946, -75113, -22949, 40189, 84112, 88291, 51223, -10268, -66578, -91718, -73208, -20244, 42042, 84331, 86543, 48255, -12572, -67437, -89828, -70612, -18328, 42435, 83525, 84514, 46368, -13894, -67866, -89231, -69011, -15954, 44496, 83449, 83074, 43576, -15901, -67185, -87635, -66639, -14265, 45494, 82684, 81445, 41909, -17289, -67822, -87005, -64546, -11537, 46453, 82118, 79392, 39503, -19244, -68163, -85159, -62237, -10240, 47036, 81794, 77821, 37310, -20697, -68954, -84099, -60025, -7757, 48074, 80824]
1344H0824m826m0559n7569m6387j4117K4454N1874N5179L1870o596m0862n6937
1356b3652m5462j2454K5744N1628N3958L0165p598m1295n6181m3522j1228K5875
1368e4022N1124N3117K9279q522m1778n5781m2807r461K7161N1232N1425K6897
1380G7864r280m1217n4462m1094r541K7171N1369N0955K5563j0027m2098n4320
1392b9117l9407p663K8332N0240M9753K4234j1215m2140n2630l8592o701K8735
1404d6171N0365M8553K3206j2286m2326n2362l7226n451K9621N0236M6492K1966
1416G4617j3011m1591n1987l6611l784K9703N0116M6099K0775j4425m2140n0976
1428c3215l4688k537L0218M9336M4745J9258j4648m2165m9944l4097j760L0854
$$ y = [80824, 75998, 35439, -22130, -68517, -82634, -58180, -6306, 48873, 80743, 74147, 33285, -23652, -69114, -81568, -55824, -4196, 49762, 79927, 72329, 31034, -25147, -68669, -79897, -54022, -2898, 50219, 79498, 70976, 29198, -26583, -69390, -78851, -51690, -458, 50967, 77864, 68584, 27367, -27095, -68189, -77730, -50559, 810, 51765, 77328, 67301, 25203, -29117, -68524, -76187, -47855, 2385, 52138, 76372, 65157, 23017, -29613, -68205, -74906, -46171, 4194, 52747, 75953, 63667, 21341, -31021, -68247, -73698, -44077, 6159, 52651, 74617, 61606, 20015, -31972, -68583, -72367, -42664, 7452, 53551, 74326, 59901, 17761, -33215, -67903, -70440, -40222, 9114, 53859, 73117, 58469, 16304, -33640, -67737, -69497, -38643]
1440c8643M9178M4106J7699j5870m2624m9384l1723m12L1361M8056M2570J6614
1452G0928j5720m2464m8713l1096N55L1665M8160M1645J5615j7437m2725m7509
1464c7096k9252J704L1291M7877M0873J4272j8215m2499m6483k8555K411L2155
1476c1517M7477L9679J2945j8667m2800m5851k7116L777L2560M6535L8638J1814
1488F7474j9337m2106m5518k5997M757L2808M6560L7492J0170k0228m1841m3716
1500c9482k4894M751L2963M5823L7052R262k0458m1711m3693k4112O443L3321
1512b4735M5641L4994Q470k1258m1626m2530k2741P078L3497M4645L4220P987
1524F3642k1685m1835m1985k1662Q459L3645M4265L2670P067k2527m1031m0723
$$ y = [-38643, 10535, 54641, 72340, 56470, 13846, -35538, -67261, -67673, -36312, 11744, 54314, 70928, 55208, 12744, -35969, -67065, -66510, -34845, 13315, 54960, 70575, 53138, 10413, -37096, -66348, -64644, -33353, 14524, 55397, 69669, 51454, 8955, -37528, -66083, -63672, -31517, 15960, 55639, 68584, 49917, 7117, -38734, -65850, -62073, -29513, 17022, 55660, 67474, 48137, 6031, -39487, -65484, -60727, -27919, 18641, 56133, 66303, 46075, 4234, -39482, -64376, -59625, -26662, 19161, 56213, 65475, 45017, 3306, -40387, -64499, -58056, -24735, 20906, 55900, 64370, 43112, 1486, -41044, -63785, -56707, -23210, 21435, 55655, 63642, 41957, 122, -41863, -63525, -55066, -21421, 22844, 55514, 62581, 40054, -977, -41700]
1536d1700k0971Q812L3826M4002L1753N899k2983m1511l9887j9152R565L4007
1548a8340M2871L0889M416k3025m0482l9223j8158J0022L3767M2348L0322M028
1560E9435k3744m1695l7615j6888J1488L3600M1773K8947K613k3839m0414l7632
1572d3971j5700J1312L4244M1567K8032J261k4446m0437l6209j4630J2192L3970
1584a2815M0823K6766R92k4413m0444l5317j4061J3043L4189M0250K5951l25k5401
1597B9238l9486l4609j2661J3455L4094M0020K4381r97k5274l9220l3685j2111
1609e6855J3776L4846L8697K4071k031k6067l8677l3002j0828J4964L4115L7994
1621C1003K2535k172k6073l8553l2224r927J5251L4498L7537K1389l257k6323
$$ y = [-41700, -62671, -53859, -20033, 23969, 55722, 61621, 38638, -2873, -42760, -61912, -52347, -18340, 24531, 55420, 59836, 36811, -3671, -42894, -61052, -51030, -17263, 25085, 55407, 59435, 35691, -6004, -43619, -60507, -49019, -15419, 26354, 55301, 57914, 34075, -6339, -43971, -59671, -48359, -14115, 27452, 55484, 56745, 32299, -8138, -44347, -58977, -46785, -12815, 28008, 54774, 55766, 31353, -9091, -44408, -58469, -45426, -11237, 29013, 54964, 54639, 29238, -10248, -44857, -57518, -44063, -9969, 30051, 54432, 53435, 28161, -11059, -44744, -56855, -43079, -8233, 30464, 54535, 52504, 26437, -12240, -45242, -56070, -41106, -6991, 31003, 53538, 51366, 25293, -13260, -45484, -55411, -40160, -5662, 31875, 53264, 50007, 23684]
1633B3684l8078l0856r554J6405L4064L6345K0970m077k6415l7659l0527q597
1645e4295J7102L4380L6208J9253m782k6745l7399k9144p377J6929L3979L5086
1657C3195J9060n395k6993l7196k8355o403J7251L4015L4665J7840o323k6917
1669A8444l6427k7445n817J7734L3540L4052J6982o530k7458l5906k6892m582
1681e0305J8151L3496L3281J6360p782k7276l5641k5831m102J8539L3606L2243
1693C4739J5747q151k7902l4903k4710l577J9155L3455L1460J4167q431k7917
1705A3132l4188k4026k907J9389L3087L1313J3473r171k8084l3664k3170k358
1717d7174K0418L2762K9708J3015r859k7982l3180k2634j599K0383L2808K9449
$$ y = [23684, -14394, -45250, -54804, -38399, -4335, 32010, 52980, 48903, 22488, -15171, -45698, -54295, -37193, -2813, 33395, 52648, 47866, 21121, -16278, -45422, -52799, -35870, -1891, 33195, 52255, 46860, 19867, -17329, -45684, -52087, -34836, -821, 33844, 51684, 45361, 18444, -17983, -45428, -51245, -33511, 29, 34081, 51063, 44533, 17075, -18831, -45723, -50305, -32154, 1342, 34623, 50983, 43201, 15925, -19716, -45547, -49649, -31110, 2496, 34739, 50486, 42335, 14433, -20470, -45180, -48757, -29602, 3853, 35313, 49480, 41049, 13132, -21056, -45082, -47989, -28600, 4487, 35800, 49273, 40102, 12018, -21646, -44816, -47174, -26756, 6006, 35714, 48729, 38870, 10888, -22292, -44926, -46525, -26142, 6666, 36115]
1729C6115J2142j0299k8238l2898k1654m96K0759L2133K8802J0859j0798k7712
1741H715l2322k0968J19K0895L1843K7938J0735j1186k8189l2272j9572P45K1320
1754b2199L1849K6927R832j1625k8381l1395j8981J173K1618L1403K6714Q803
1766D5738j2275k8302l0191j8534J906K1873L0971K5640Q393j2695k8156l0258
1778b5890j7966L000K2225L0452K5406P322j3384k8057k9350j6917L491K1909
1790a7759L0102K4694O524j3340k7806k9123j6243L799K2364L0363K3671O296
1802D3542j4403k8121k8343j5041M708K2248K9556K3170N102j4500k7935k7713
1814b7730j4532N269K2946K9311K1780M394j4433k7848k6952j3950N952K2292
$$ y = [36115, 48257, 37958, 9720, -23178, -44832, -45328, -24569, 7564, 36366, 47225, 36427, 8715, -23607, -44575, -44456, -23561, 8282, 36220, 46955, 35769, 7580, -24692, -44264, -43519, -22199, 9650, 36577, 46409, 34784, 6403, -24992, -43973, -42800, -21182, 10221, 36935, 45738, 33463, 5161, -25030, -43564, -41658, -19785, 11186, 36826, 45219, 32524, 4368, -25890, -43856, -40856, -18631, 11821, 37227, 44549, 31165, 3108, -26242, -43159, -39668, -17759, 12343, 37037, 43561, 30221, 2415, -26708, -42951, -39152, -16788, 13575, 37246, 43542, 29139, 1018, -27325, -42366, -37658, -15410, 14146, 37316, 42418, 27918, -17, -27730, -42262, -36993, -14047, 15264, 37044, 41438, 27005, -843, -27795, -41745, -35793, -13501]
1826a3501K9249K1454L704j4825k7697k6775j2977O298K2984K8520K0412L356
1838D0202j5569k7112k5882j2477O944K2723K7952K0330K848j6175k7245k5860
1850b9321j1640P619K3318K7628J9427J894j6302k6994k4708j1091P694K2952
1862i524K7645J8844J720j7012k6740k4226j0429Q443K2764K7332J7892P20j6897
1875B0532k6249k3728r560Q159K3205K6588J7771J28j6878k6633k3168q847R070
1888b9610K3308K6023J6501l96j6994k6072k2787q603R842K3162K5908J5800r08
1901C5174j7519k5875k2039p190R606K3702K4854J5112j150j7866k5600k1187
1913b9978p147R905K3318K4814J5074k160j7722k5881k0812o267J0692K3450K4025
$$ y = [-13501, 15748, 37202, 40906, 26081, -1616, -28391, -41368, -35070, -12086, 16434, 36846, 40202, 24633, -2479, -28361, -40838, -33894, -11171, 16781, 37111, 39959, 23784, -3461, -29321, -40961, -33342, -10024, 17604, 37031, 38925, 22623, -4371, -29079, -40170, -32476, -9524, 18121, 36965, 38685, 21673, -5067, -29293, -39722, -31279, -8515, 18817, 36709, 37429, 20532, -5717, -29445, -39005, -30846, -7641, 18947, 36718, 36846, 19968, -6665, -29833, -38680, -29610, -6302, 19721, 36222, 35826, 18832, -7240, -30027, -38630, -28788, -5626, 20282, 36082, 35174, 17655, -8220, -30259, -37449, -27843, -4141, 20713, 35825, 34675, 16809, -8791, -29978, -37125, -27220, -3902, 20912, 35986, 33826, 16104, -9777, -30589, -36856, -26164, -2714, 21311]
1926B1311J4105k223j8408k5006k0346n697J1052K3248K4009J3626l193j8547
1938A3931k4937j9368n395J1733K2994K3510J2734l717j8260k4536j9196m826
1950c5333J1934K3112K2836J2210m226j8112k4813j8216m268J2521K2712K2751
1962B3108J1318m404j8954k3781j7984l560J2887K2581K1955J1144n117j8598
1974A0595k4007j7191k899J2826K2778K0904J0845n727j8433k3321j6869k734
1986c3233J3298K2350K1724R401o097j8855k2947j6004k108J3200K2469K0619
1998B3817R575o409j9035k2958j5484r35J3162K2342K0144Q957o981j8777k2649
2011a5231j5075q96J4158K1748J9653Q195o978j9212k2066j4689k37J3889K2161
$$ y = [21311, 35416, 33193, 14785, -10221, -30567, -36264, -25212, -1964, 22045, 35671, 32478, 13931, -11006, -30374, -35769, -24036, -1042, 22468, 35202, 31485, 13225, -11311, -30507, -35333, -23399, -287, 22549, 34759, 30533, 12421, -12392, -30608, -34876, -22355, 357, 23108, 34426, 30022, 11068, -12713, -30697, -34257, -21370, 1211, 23166, 34310, 29193, 10595, -13412, -30603, -33502, -20676, 2102, 23006, 33851, 28124, 9691, -13630, -30499, -33233, -19935, 2415, 24139, 33540, 27443, 8588, -14359, -30363, -32471, -19271, 3198, 23817, 33392, 26983, 7948, -15010, -30494, -31429, -18267, 4075, 24219, 33176, 26195, 7418, -15231, -30306, -31202, -17044, 4704, 24357, 32552, 25574, 6362, -15704, -30393, -30630, -16741, 5420]
2024E420J9543P074p349j9250k1459j3758J03J3851K1705J8736P201p862j9074
2037D881k1306j3381L95J4491K1249J8335O148p626j8861k1095j3298Q71J4960
2050a4237K0937J8419N868q311j9150k0968j2375K012J4354K1180J7336N266q634
2063B1697j8735k0334j2199K347J4259K0950J7106M985q785j9504j9664j1371
2075b9248K440J4986K0281J6954M526r857j8233j9820j1274L007J5011K0604J6024
2088B5401M285j0143j8603j9706j0374L455J5474K0013J5478L785j0080j8741
2100B44j9190r656L422J5560J9845J5252L084j0403j9295j7656r527L674J5375
2113i271K0026J4374K827j0391j8722j8317q551M024J5432J9888J3934J962j0653
$$ y = [5420, 24963, 32037, 24688, 5438, -16021, -29779, -29676, -15825, 5880, 24616, 31817, 23955, 4881, -16425, -29806, -29411, -14920, 6329, 24664, 30812, 23186, 4325, -16770, -30068, -29197, -14237, 6700, 25119, 30987, 22676, 3526, -17442, -29817, -27805, -13451, 7729, 25065, 30331, 21697, 2962, -17372, -29571, -27224, -12965, 7985, 25091, 30076, 21291, 1787, -17877, -29248, -26808, -11822, 8459, 25413, 29939, 20082, 1849, -17971, -29245, -26238, -11227, 9377, 25401, 29686, 19543, 940, -18766, -29140, -25685, -10211, 9802, 25280, 29065, 18985, 244, -18946, -28602, -25180, -9620, 10225, 25477, 28561, 18158, -1137, -18793, -28320, -24646, -9271, 10755, 25129, 27956, 17565, -1157, -19474, -28025, -24001, -8569, 11319, 25253, 27215, 16562]
2126A6562j8376j8071p579M477J5405J9042J3555J949j0832j8575j7297p893M998
2139b2635J5760J8921J3063J652j1539j8426j6817p162N351J5554J8682J2569
2151B4973J022j1230j8206j6511p248N811J5656J8777J2204J60j1151j8384j6133
2164b0260o400N748J5931J7850J1763O76j1828j8061j5991o112O668J5533J8109
2177A3626J1180l08j1532j8089j5297n497O332J6214J7068J0858k85j2178j7942
2190e850j5074n149P097J5708J7252J0427j034j2162j7495j4088n336P559J5458
2203b687J7353R909j589j2134j7599j4392m224P789J5943J6281R663j845j2141
2216A0327j7266j4141l843P617J6025J6470Q864j877j2944j6861j3341l335P917
$$ y = [16562, -1814, -19885, -27464, -22987, -7582, 11460, 25015, 26964, 16132, -2443, -19740, -27633, -22635, -6875, 12046, 25109, 26761, 15222, -3204, -20021, -27183, -21832, -6278, 12404, 24973, 25995, 14765, -3441, -19952, -27200, -21389, -5733, 13044, 25248, 25408, 14257, -4127, -20260, -26660, -20912, -4981, 12869, 24632, 25308, 13480, -4581, -20572, -26684, -20016, -4483, 13626, 24806, 24498, 12966, -5123, -20420, -25917, -19585, -3371, 13697, 24555, 24270, 12092, -5850, -20924, -26073, -18976, -3268, 13984, 24411, 23377, 11215, -6280, -20368, -25704, -18145, -2687, 14666, 24575, 22986, 10852, -6747, -21139, -25363, -17574, -1631, 14650, 24313, 22468, 10327, -6939, -21080, -24923, -17306, -1281, 15189, 24053, 22176, 9232, -7629, -20970, -24305, -16388]
2229a6388J5675J5936Q835k737j2451j7014j2857l232Q610J5398J5821Q372k882
2242B1086j2830j6723j2446k666Q671J5429J5198P862l081j2642j6556j2395k430
2255b3523Q921J5631J4964Q063m148j2927j6149j2194j273Q961J5187J4704P408
2268B3625m298j3165j5593j1855j610R309J5652J4610O467m384j2708j6085j1008
2281b1043j190R044J5888J3809O234m194j3179j5728j0664n98R189J5398J4144
2294A7110N806m991j3187j5381j0050p39R838J4712J3899N523n402j2837j4939
2307a0638j0421l16J0277J5111J3045N098n655j3390j4459r693N55J0160J4662
2320D336J3041M712n534j3659j4715q739O48J0036J4529J2802M150n759j3347
$$ y = [-16388, -713, 15223, 24058, 21321, 8870, -8144, -21001, -24233, -15623, -225, 15596, 23968, 21086, 8256, -8467, -20913, -23579, -14908, 521, 15719, 23581, 20500, 7858, -8698, -21093, -23523, -14602, 1029, 15993, 24056, 19908, 6981, -9168, -21362, -22635, -13674, 1513, 16217, 23625, 19327, 6162, -9431, -21286, -22896, -13587, 2065, 16675, 23142, 18758, 6050, -10035, -21043, -22233, -13189, 2699, 16508, 22742, 18548, 5369, -10359, -21023, -21621, -12432, 2966, 17110, 22916, 17925, 4738, -10643, -20693, -21432, -11594, 3118, 17017, 22540, 17138, 4301, -10638, -21059, -21375, -11098, 4013, 17058, 22156, 16501, 3111, -11348, -21041, -20486, -10326, 4336, 17377, 22089, 16555, 2896, -11819, -20558, -19910, -9874, 4655, 17457, 21607, 15848, 2501]
2333B501j4240q743R28R977J5198J1894L914o310j2778j4526q364J551J0168J4649
2347E819J1859L249o209j3294j4182p745J582J0488J4520J1696K548o135j3358
2360H38j3830p189J783J0551J4464J1413K520o575j3179j3676p260K330J0505
2373g305J3875J1513K305p327j3288j2801o858K683J0624J3705J0455K520p164
2386A2937j3767j2417o826L122J0464J4189R795K486p706j3280j2603o411L221
2399a6796J1344J3339R895J376p633j2731j2405o083L372J0959J3670R787Q95
2412A8989p708j3255j2222n222L956J0929J3163Q771J138p546j3415j1401n349
2425a9172L756J1280J3225R011K72q255j2652j2070m312M296J0819J3047Q169
$$ y = [2501, -11739, -20482, -19554, -9577, 5621, 17515, 21429, 15119, 2341, -12185, -20549, -18998, -8830, 5819, 17678, 20927, 14718, 1424, -12758, -20503, -18921, -8433, 6087, 17783, 20331, 14196, 838, -12992, -20181, -18398, -7847, 6617, 18030, 20550, 13975, 796, -12880, -20140, -17810, -7305, 6570, 18083, 20388, 13061, -227, -13028, -19886, -17203, -6579, 7126, 17581, 20101, 12937, -830, -13247, -20073, -16951, -6487, 7702, 17497, 19983, 12277, -1003, -13606, -20017, -16796, -5452, 7887, 17782, 19158, 11525, -1206, -13611, -19694, -16322, -5363, 8307, 18094, 18989, 11281, -1974, -14196, -19418, -15462, -4533, 8630, 17401, 18539, 10993, -2422, -13823, -19172, -15416, -4136, 9089, 18100, 18372, 10117, -2535, -14605, -18917, -14621, -3802, 9245, 17414]
2438A7414L37q128j2536j1453m824M686J1234J2879P998J32q489j2730j1003m110
2452a8593M295J1520J2546P877n04q526j2511j0663m112M901J1130J2628P580
2465A7568p48q427j2732j0124l844N175J0917J2486O955q06q936j2131j0181l156
2479a7984N330J1118J2134O848j273r067j2104r713k833N660J0837J1427O778
2492A7158j601q734j1941r597k668N731J0804J1705O475k130q816j1952r224k129
2506a6919N756J0881J1449N914k204q799j2085q960j941O007J1185J0901N688
2519A6873k253r212j1973q465j479O074J1078J0473N888k482r482j1649q574j228
2533a6411O357J1140J0643N095k695r750j1470p850j006O482J0823J0411M528
$$ y = [17414, 17751, 9623, -2913, -14366, -19190, -14504, -3270, 9609, 17607, 17739, 9250, -3480, -14483, -18593, -14298, -2778, 9768, 17645, 17141, 8615, -3896, -14559, -18671, -13770, -2640, 9988, 17568, 16820, 8393, -4339, -14463, -18307, -13132, -2215, 10271, 17226, 16420, 7484, -4647, -14828, -17984, -12654, -1536, 10598, 17446, 16173, 7106, -4998, -14711, -17544, -11884, -1047, 10380, 17158, 15557, 6823, -5118, -14715, -17383, -11652, -848, 10857, 17332, 15202, 6386, -5566, -14790, -16919, -11163, -282, 11167, 17081, 14877, 6078, -6007, -14967, -16908, -10901, 284, 11185, 16873, 14620, 5408, -6565, -15030, -16509, -10435, 643, 11116, 17004, 14522, 5040, -6609, -15183, -16411, -10054, 1086, 11729, 16824, 14129, 4379, -7091, -14941, -15947, -9465, 1358, 11769, 16297]
2546A6297l050q920j1418p948o50O290J1297R804M410k875r523j0994q008l54
2560a5642O905J0837R893M241l889q885j0937p595j06O833J0638R532M013l426
2574A2412r239j0857p028m32P007J0858R562L565l818r286j0925o561J73P353
2588g216J0682Q973L376m197r684j0392o235K02P499J0609Q702K980m149r331
2602A819j0186o676J007P432J0846P768L502m620r338j0212o168J236P351J0346
2616D107P952K821m327r698r650n521R60P426J0167Q244K476n039q960j0175n445
2631a4662J656P661J0144P613K203m745r829r416n135K109P378R637P902J769
2645A4285m870r300r252n259J975P731R894P081J731n324q872q847m752J376Q318
$$ y = [16297, 13247, 4327, -7091, -15039, -15689, -9399, 1898, 11702, 16112, 13237, 3714, -7280, -15288, -15642, -8737, 2100, 11993, 16234, 12345, 3460, -7477, -15072, -15178, -8345, 2293, 11825, 15838, 12412, 3173, -7684, -14712, -15144, -8137, 2721, 12283, 15848, 12030, 2744, -8181, -14742, -14569, -7216, 3466, 12439, 15815, 11618, 1934, -8458, -14693, -14491, -6992, 3617, 12319, 15299, 11150, 1819, -8367, -15043, -14036, -6604, 4242, 12010, 15512, 10892, 1554, -8658, -14826, -13590, -6239, 4107, 12059, 14880, 10553, 855, -8795, -14316, -13356, -5930, 4237, 12481, 14957, 9918, 958, -9217, -14662, -13006, -5345, 4799, 12412, 14615, 9870, 41, -9375, -14510, -12401, -5023, 4614, 12516, 14285, 9415, 115, -9137, -14396, -12421, -4690, 5204, 12285, 14016, 8692, -180, -9027, -13779, -12403, -4085]
2660d085R553O813J865n778r054q973m159K102P879R536O784J359o000r101q524
2675i783m265K533P843R550O944K70n258r135q490m044K438Q254R260O434N34
2690A3085n699r199q052l547K550Q112Q866O670J62n933q897q058l357K797P909
2705b591R145N925J26n996q868q119k683K921P699R145N728l2o122q912p488k801
2721a2923L118Q026Q725N552k72o016r007p625k426L153Q218Q621N221n52o082
2736E731r097o830k950M108P738Q874M985j061n983q913o990k394M027P712Q373
2751G330M894j063o074q498o913j946L669P916Q276M536j210o152q264p134j647
2766a2280L802Q001Q076M480j258o557q129o690j509M020P783P983M146j089o693
$$ y = [-4085, 5468, 12281, 14146, 8368, -686, -9659, -13818, -11716, -3837, 5699, 12483, 13842, 7842, -1259, -9783, -14048, -11515, -3672, 5878, 12822, 13092, 7834, -1301, -9791, -13835, -11397, -3143, 6117, 12551, 13085, 7386, -1813, -9865, -13412, -10862, -2750, 6116, 12786, 12948, 7015, -1882, -9940, -13297, -10500, -2591, 6554, 12479, 12605, 6609, -2259, -10378, -13061, -10140, -2441, 6704, 12432, 12400, 6278, -2634, -10122, -12923, -9805, -1779, 6946, 12498, 12226, 6210, -2797, -10422, -12848, -9695, -1477, 7144, 12365, 11813, 5731, -3366, -10196, -13146, -9038, -1300, 7574, 12559, 11498, 5515, -3398, -10388, -12782, -8755, -1043, 7330, 12224, 11161, 5087, -3411, -10324, -12270, -8601, -685, 7591, 12127, 10917, 4765, -3499, -10633, -12280, -8478, -477, 7599, 12079, 10821, 4264, -3865, -10555, -12064, -8044, -261, 7722, 11868, 10779, 4086]
2781D086q474o095j147L885P907Q044L586j559o507q119o058j045M215Q057P054
2796G830M246j959o664q402n406j214M764P944P069L747k274o466q174n510r29
2811a1398M873P409P119L751k168o924p688n767o23M922P846P039L140k238o870
2826B423p851n110n57M971P468O746L126k179o708p570n342J57M893P378O631
2841H476K650k171p000p417m926k58N135P818O131K615k445o791p689m149n02
2856a0523N621P152O161K493k846o557p287m661J67N361P434O396K061l218o732
2871A022p248m253O28N166P205O526J547k947o891o729m501Q79N145P478O013
2886I040J460l388o426o835m198R52N071P522N454J817l229o756o793l758R20
$$ y = [4086, -4388, -10483, -11630, -7745, 162, 8206, 11792, 10233, 3726, -4393, -10451, -11496, -7281, 776, 7830, 12076, 10117, 3453, -4949, -10355, -11569, -6805, 1139, 8208, 11955, 9681, 3215, -4959, -10469, -11398, -6525, 884, 8003, 11754, 9586, 2662, -5026, -10793, -11416, -6494, 1352, 8391, 11531, 9293, 2423, -5428, -10538, -11095, -6124, 1344, 8090, 11216, 9037, 2329, -5241, -10583, -10426, -5533, 1845, 8476, 11126, 8955, 1955, -5462, -10388, -10646, -5511, 2307, 8438, 11053, 8608, 1817, -5872, -10021, -10523, -4902, 2250, 8411, 10904, 8058, 1501, -5786, -10447, -10280, -4919, 2515, 8911, 10972, 7754, 1022, -6226, -10479, -9851, -4685, 2520, 9046, 10593, 7646, 755, -5974, -10475, -9596, -4451, 3027, 9040, 10500, 7112, 686, -6149, -10347, -9395, -4324, 3198, 8652, 10469, 7240, 484, -6309, -10067, -9147]
2901i147N261P307N258J695l560o727o505l337O92N475P062N522J310l727o420
2916A59o959l149J141N652O988N234R21l833o336o959k978J844N433O774N033
2931H965J149m212o462o257l043J419N640O966M818Q06m244o539n962k725J459
2946h222N914O460N231K38m117o189o138l037K112N579O757M127L44l652o422
2961a015o432j927J952N436O552M338M40m322o650n517k378K029N620O640M155
2976H921K02m321o451n752j990K454N304O295M228Lm479o470n605j652K587N457
2992a269O327L621m72m020o381n119j695K130N737O517L553o77m225o400m937
3007g310j566K452N801O049L734q81m988n779m784j740K884N718N602L741r49
$$ y = [-9147, -3886, 3421, 8679, 10374, 6814, 87, -6418, -9755, -9063, -3588, 3474, 8996, 10306, 6579, 159, -6800, -9949, -8808, -3156, 3832, 9066, 9987, 6154, -182, -7141, -10119, -8275, -2842, 3932, 8965, 10114, 5902, -560, -6817, -9860, -8441, -2801, 4165, 8983, 9789, 5545, -994, -6956, -9681, -8222, -2308, 4152, 9383, 9621, 5504, -685, -6823, -9860, -7748, -2169, 4588, 8715, 9059, 5407, -1015, -7447, -9374, -7422, -1986, 4566, 8904, 9344, 5022, -1628, -7145, -9523, -7494, -1874, 4766, 8921, 9123, 4802, -1649, -7401, -9391, -6937, -1633, 4662, 8890, 8893, 4414, -2056, -7661, -9313, -6726, -1269, 5058, 8679, 8207, 4187, -2194, -7313, -9008, -6878, -1141, 5376, 8929, 8252, 4027, -2373, -7310, -8876, -6424, -623, 5426, 9160, 8279, 3291, -2488, -7272, -9012, -6128, -410, 5192, 8933, 7984]
3022G984m728n660n114j113K695N590O187K977j195m667n716m547j367L023N724
3037G3N342L139j126m498n966m497j334L210N772N497K998j242m638o004l973
3052g247j157L138N666N486K976j583m871n680m523m27L198N493N518K471j183
3067G275m726o283m168k79K997O110M605K840j584m437n717m258l20L436N624
3082A115N065K036j482m795o110l187n09L360N580M879K440j712n072n593l385
3097g370n06M064M877M860K146j753n150n205l248n38M059N192M510K217k066
3112F089m938n383l180J8L824N340M598J519j972m857n500l145K63M010N027M731
3128F444J219k430m547n112l244N65M010N107M339J423k398m895m950k882M30
$$ y = [7984, 3256, -2404, -7518, -8631, -5936, -346, 5841, 8818, 7623, 2956, -2760, -7307, -8674, -5651, 73, 5415, 8554, 7428, 2930, -3036, -7533, -8867, -5657, 115, 5612, 8610, 7368, 2730, -3274, -7247, -8404, -5266, 400, 5886, 8862, 7279, 2408, -3272, -7795, -8222, -5024, 469, 5987, 8458, 7275, 2549, -3734, -7902, -8181, -5184, 926, 5531, 8371, 6787, 2350, -3367, -7625, -7945, -4509, 1115, 6180, 8216, 6734, 1939, -4171, -7358, -7867, -4507, 1073, 5952, 8392, 6680, 1608, -3985, -7370, -7876, -3812, 1065, 5925, 8071, 6318, 1168, -4037, -7285, -7823, -3764, 1428, 5938, 8155, 6089, 1151, -4232, -7412, -7394, -3570, 1770, 6368, 7887, 5915, 1058, -4442, -7587, -7324, -3314, 1713, 6444, 7663, 5233, 686, -4426, -7670, -7105, -3095, 2012, 6351, 7774, 5376, 481, -4469, -7351, -6921]
3143f921L663N545M020J618k651m560n319k761O64L814N055M016J671k658n061
3158A35m760k772N60M400M598M065J159k221m638n419k784J171L964N057M334
3173F849O37l086m483m517k813J220L957M771L974O59k625m827m922j931Q81M182
3189b074M915L767N41k953m721m597j906J498L595N027L275N96l170m067m629
3204d903k342J713L869N001L297J26k824m814m239j620J095M168M673K826Q48
3219F874k861m783m441j651J372M006M539L215L67l069m604m303j600J537M066
3234a336M675L146K3l182m314m343j431J590L767N348K569q9l142m205m326j551
3250f801J628M535M418K369J48l081m574m158j038J932L866M764K060j8l481m179
$$ y = [-6921, -3258, 2287, 6307, 7925, 5274, 714, -4605, -7366, -6702, -2888, 2167, 6183, 7854, 5196, 135, -4625, -7397, -6837, -2437, 2161, 6226, 7385, 5164, 526, -4893, -7677, -6506, -2542, 2515, 6849, 7486, 4400, -83, -4600, -7413, -6193, -2236, 2535, 6509, 7168, 4543, -284, -5206, -7137, -6256, -2074, 2841, 6608, 7149, 4196, -525, -5122, -7028, -5530, -1935, 3092, 6367, 6963, 3793, -274, -4903, -7245, -5532, -1663, 3338, 6635, 6761, 3937, -877, -5116, -6736, -5641, -1473, 3200, 6026, 6874, 4013, -770, -5211, -6862, -5490, -1484, 3055, 6270, 6637, 3568, -1036, -5339, -6939, -5402, -1336, 3339, 6485, 6508, 3326, -988, -5331, -6762, -5172, -1405, 3943, 6512, 6423, 3281, -924, -5250, -6801, -5173, -638, 3780, 6149, 6297, 3216, -1358, -5516, -6554, -4622, -756, 4008, 6068, 6050, 2569, -1610]
3266a610l631j408J802M698L969K879j67l718m775l721q01K097L931M490K147
3281F182k77l515m347l253j340K409M064M051K050k45l303m252l795q61K044M407
3297A9L842K391j025k866m613l526p12K637L739M496J734m91l673m024l145q09
3313f026K329L702M247J504o11l129m460k819n20K185L880M032J989j106l474
3328A723m447k613m04J830M666L748J315q57l646l837k864l11J978M121L966J437
3344E805j062l340m181k624l87K341L999L956J285j128l232m187k886K4K405L850
3360F38L802J342r28l697l932k774j03K940M044L213J400j504l153m299k375P1
3376e315K657M363L133P46j603k858m112k426K53K767L734L021J477j640l841
$$ y = [-1610, -5241, -6649, -4847, -149, 3820, 6699, 6532, 2814, -1961, -5682, -6483, -4386, -455, 4035, 6182, 5905, 2390, -1957, -5210, -6550, -4141, -77, 3974, 6024, 5779, 2476, -1776, -5571, -6432, -4388, 19, 3861, 6252, 5227, 2361, -2252, -5778, -6490, -3853, -114, 4382, 6116, 5625, 1952, -2072, -5217, -6026, -3697, 5, 4252, 5756, 5145, 2016, -2444, -5263, -5783, -3598, 282, 4314, 6303, 5197, 1723, -2724, -5337, -5741, -3911, 755, 4503, 5818, 4961, 1315, -2522, -5386, -5697, -3719, 402, 4368, 5805, 4743, 1403, -2778, -5402, -5789, -3448, 551, 4507, 5792, 4664, 1432, -2755, -5641, -5617, -3212, 638, 4440, 5782, 4854, 1157, -2775, -5549, -5652, -2712, 1332, 4545, 5945, 4441, 1288, -3011, -5386, -5315, -2658, 1705, 4838, 5584, 3981, 1123, -2989, -5415, -5162, -2395, 1339, 4360, 5837, 4197, 356]
3391C56l876j732K68K604L700L028J358j917l328l714k214K51K832M182K604Q78
3407E280j458l400l953j712K87K793L679K896J012j615m146l011j966O02K998
3422a714L330L029J287k467l674l037j878K53L195L878K448M58j786l554l644
3437c876j194L11K998L785K481R55k084l407l459j343J63L396L332K791M94j937
3453C406l815l704q54O78L153L198K432N12k284l193l069j510J033K614L485K510
3469D592J78j685l560l459j119R49K875L700K326K68k108l345l310j510R90L156
3485a062L604K441k17k051l629k767j244P99L571L351K136k75k319l569k511j036
3501d778P53L490L250K013p7k883l004k825j088J546L210K782K108O3k303l620
$$ y = [356, -3520, -5252, -4984, -2380, 1320, 4348, 5706, 3789, 461, -3253, -5467, -5216, -2384, 1798, 4402, 5280, 3822, 422, -3531, -5243, -4956, -2163, 1516, 4412, 5424, 3809, -337, -3348, -5314, -4712, -1714, 1616, 4645, 5932, 3465, -209, -3246, -5124, -4871, -1676, 2202, 4650, 5108, 3322, -232, -3876, -5070, -4759, -1761, 2024, 4505, 5460, 3376, -31, -3490, -4833, -4670, -1274, 2058, 4849, 5343, 3406, -409, -4113, -4967, -4289, -1136, 2062, 4494, 5006, 2722, -471, -3540, -5050, -4017, -1403, 2082, 4592, 4770, 3085, -475, -3934, -5053, -4104, -1229, 2471, 4797, 5065, 2957, -388, -3698, -5208, -4218, -1062, 2542, 4983, 4766, 2715, -914, -3681, -4925, -4126, -555, 2796, 4932, 4657, 2338, -1231, -3742, -4778, -4025, -535, 2715, 4728, 4651, 1768, -1236, -4061, -5149, -3603, -393, 2389, 4497, 4560, 2257, -1363]
3517a363l021q03J471L241L266J795j39k392l396k741p47R99L284L079K197o34
3533D096k262l661k216m81J498K883L130J592m13k439l076k693l30J113L539K603
3549B883K209j070k290l513k534n62K025K852L360J102l57k715k805k490n77J428
3565c054K848L455J217n31k660l190k406L19R16L054L290J402p67k992k800k155
3581d054k60J820L088K339J379n09k381l347k501O9J910K875L024Q92k38l186
3597I20l198k042k0J812L597K212J620j501k505l118j929k3K022K643K929J107
3613D526j089k685l210j734K83J673L268K591Q56j124k384l311j753J34K035K875
3629I51K167J110j143k159l067j951R0J929L229K304P26j190k657l080j366K19
$$ y = [-1363, -4384, -5187, -3716, -475, 2791, 4586, 4447, 2055, -1341, -4082, -4829, -3830, -546, 2533, 4730, 4096, 1834, -1827, -4043, -4524, -3026, -143, 2987, 4579, 4166, 1727, -1349, -4042, -4372, -3259, 280, 2883, 5092, 4022, 1732, -1781, -4315, -4877, -2852, 0, 3360, 4462, 4105, 1390, -1415, -3905, -4482, -3054, -206, 3249, 4466, 3935, 1275, -1915, -4321, -4002, -3086, -32, 3258, 4660, 3893, 901, -1899, -4054, -4314, -2494, 594, 2933, 4312, 3803, 1422, -1925, -4426, -4357, -2447, 428, 3452, 4344, 4106, 920, -2278, -4320, -4340, -2528, 1069, 3281, 4901, 3400, 895, -2223, -4152, -4175, -2153, 490, 3419, 4526, 3437, 752, -2458, -4192, -3909, -2236, 1032, 3623, 4479, 3355, 971, -2340, -4093, -3959, -1924, 951, 3118, 4228, 3085, 926, -2141, -4092, -4002, -2073, 1156, 3460, 4186, 2996, 339, -2741, -4107, -3888]
3645c888K174K951J674J596j855j808l020j514M51J237L156K090J083j445k633
3660B49k748j238J02K129K277K786N28j320k432k917j225k9K322L075K101N93
3676D253j542k179l026j232L13K081K578K393M98j509k652k424j543L78K210K811
3692A408J863Q63j702k787k682j199Q11K325K845J635M21j153l035k236j478Q31
3708c270J995K663K091J70j432k571k205j036L00K402K932J596J88j613k574k503
3724b867o02K40K392K667J428N25j872k518k577m68O66K239K541J754J01j775
3740A874k671j877j128P84K395K457J728J46j585k805k083j245R82K124K539K138
3756C773m64j958k195k285n20R40K299K406J005N46j784k911j667p31O17K601
$$ y = [-3888, -1714, 1237, 2911, 4507, 2652, 844, -2176, -3690, -3239, -2002, 1154, 3244, 4327, 2882, 249, -2499, -3737, -3635, -1506, 771, 3557, 4085, 2765, 333, -2584, -3809, -3838, -1516, 1559, 3660, 4253, 2711, 532, -2494, -3726, -3413, -1332, 1246, 3639, 4137, 2628, -24, -2448, -3991, -3613, -1403, 1408, 3271, 4134, 2432, -355, -3037, -4236, -3425, -1100, 1745, 3380, 3801, 2648, -387, -2623, -4101, -3270, -1275, 1388, 3479, 3649, 2217, -354, -2559, -3595, -3295, -893, 2039, 3635, 3823, 2210, -364, -2867, -3469, -3229, -837, 1830, 3258, 3783, 1911, -607, -3184, -3652, -2986, -747, 1794, 3548, 3649, 1874, -797, -2674, -3802, -3018, -623, 1834, 3562, 3708, 2123, -682, -2765, -4010, -3028, -904, 1635, 3773, 3309, 1351, -844, -3129, -3649, -2709, -410, 1996, 3001, 3547, 1763, -1148, -2815, -3546, -2929, -328]
3772c28K385J523k68j651k519j912q85J433K143K574M45L99j766k575j746r84
3788c732J104K511K273J350j6k149k709j399p25J291K010K327J703p48j528k425
3804h62k024k88R12K200K194J417n13j691k825j615j02J035K264K160J538q64
3820B936j820k409j965n11J155K927K036R38p11j481k464j756n0Q97K747K058
3836B527R81o49j945k514j724J05J355K333J976P81m46k019k493j281m24J367
3852b070K608J801J039o17j883k668j480J35J546J998K358O32j057j692k067j875
3868c292J35J313K502J933O50o92j854k390j292Q1J320K277J594Q80r21j604k234
3885a594j299l31J465K862J209J156j219j853j859j618Q8J592J786J963O68m85
$$ y = [-328, 2057, 3580, 3312, 1661, -858, -2770, -3655, -2222, -79, 2495, 2940, 3339, 1573, -1002, -2748, -3732, -2628, -117, 2156, 3506, 3490, 1341, -1368, -2767, -3492, -2201, -191, 2136, 3839, 3091, 1563, -862, -2886, -3174, -2262, -62, 2132, 3549, 3036, 1345, -1480, -3095, -3197, -2162, 102, 2262, 3800, 2936, 1116, -1293, -3258, -3769, -2614, 313, 2349, 3287, 2576, 1095, -1369, -3125, -3175, -2278, 469, 2527, 3508, 2859, 914, -1600, -3324, -3219, -1864, 469, 2445, 3226, 2780, 761, -1732, -3013, -3437, -2070, 538, 2339, 3378, 2761, 878, -1790, -3270, -3135, -1589, 409, 2767, 3399, 2342, 650, -1417, -3292, -3157, -1844, 658, 2591, 3241, 2549, 695, -1695, -2987, -2906, -1586, 691, 2285, 3165, 2244, 640, -1594, -2893, -3224, -1759, 1103, 2312, 3468, 2249, 396, -1463, -3081, -2993, -1401, 385, 2348, 3016, 2531]
3901B531k104k243j314L15J576J857K006P00r62k097k081j055k60J851J847K174
3917B741P0m15j911k122j413M49J665J823J623O13j022k029j669j542K08J745
3933a186K279J642L92r36k078j810r93K43J492K095J357L10q63k071j773j190
3949c090L69J851J919J672J73q57k236j807p98J98J568K301J447m6n52k490j410
3966a788j384P78J669J785J516J0r28j739k169o29Q45J249K026J383L82j279k158
3983d31j738p48N18J749J774J283O26j523j838j418r97K70J671K045J308J45j004
4000A692k282j318p23J88J994J933R78K8j283j652j793m20L69J673K201J244l1
4017B798j067k195j900o62J076J242K011J356o5j500j564j250j208J130J259J972
$$ y = [2531, 427, -1816, -3130, -2815, -1239, 618, 2624, 3324, 2362, 265, -1816, -2871, -3131, -1280, 567, 2741, 2811, 2396, 485, -1637, -3050, -2601, -936, 887, 2510, 3123, 2101, 72, -1597, -3139, -2931, -1186, 1093, 2735, 3127, 2191, 113, -1697, -2690, -2447, -955, 1140, 2497, 2807, 1944, -127, -1900, -3090, -2721, -870, 1049, 2721, 2894, 2037, -199, -2006, -2804, -2606, -1038, 1263, 2710, 2664, 2112, -378, -1788, -3172, -2394, -725, 1060, 2576, 2586, 1658, -81, -2250, -2879, -2034, -785, 1241, 2624, 3006, 1727, -431, -2169, -2917, -2399, -650, 1124, 2407, 3033, 1510, -328, -1746, -2743, -2473, -802, 1243, 2551, 2696, 1692, -590, -1908, -2631, -2443, -449, 1484, 2462, 2490, 1207, -445, -2238, -2658, -2289, -616, 1585, 2829, 2798, 1731, -464, -2364, -3026, -1950, -708, 1303, 2659, 2594, 1094, -470, -1720, -2928, -1798, -539, 1433]
4033A433J090j05j391j656j481p27R06J477K108Q78M8j615j670j694l68Q67J310
4050e90K088J087j12j167k421j083m85R06J227J844J387m05j301j786j456l06
4066b573P16K046J403J157l30j195j888j504j21L69K141J536J219n90j413j717
4082g44j341m92J061J589J777M15k16j300j398j420k98Q66J363J909Q31n44j306
4099G52j668j376k42R05J981J247P16m34j430j562j251N7R18J319J940O79o85
4116A866j141j691j287l65J284J727J350N28Q0j871j440j403J1J011J696J331
4132A686O77p4j941j528j036l20J174J479J622Q07m68j409j743j160k22J354J607
4149E05J344N53n48j427j576r97j81J259J524J435M69n52j710j112j665J59J432
$$ y = [1433, 2523, 2418, 1027, -629, -2110, -2837, -1931, -454, 1654, 2532, 2580, 965, -705, -2399, -2767, -1900, -590, 1498, 2585, 2473, 1306, -1115, -2198, -2683, -1777, -550, 1294, 2681, 2276, 975, -811, -2267, -2573, -1857, 189, 1592, 2749, 2419, 1224, -664, -2168, -2289, -1920, 221, 1757, 2976, 2386, 973, -744, -2085, -2577, -1516, 73, 1850, 2265, 2049, 749, -649, -2069, -2367, -1501, -138, 1771, 2602, 2058, 752, -916, -2292, -2534, -1629, 352, 1599, 2315, 1881, 451, -1111, -2362, -2305, -1387, -68, 1872, 2551, 1866, 725, -966, -2253, -2618, -1334, 393, 1743, 2271, 2351, 480, -960, -2363, -2352, -1341, 355, 1686, 2363, 2289, 348, -1180, -2216, -2536, -1362, 117, 1739, 2546, 2078, 669, -1074, -2234, -2456, -1102, 505, 1849, 2402, 1854, 427, -1149, -2146, -2327, -1068, 456, 1891, 2360, 1808, 98, -1014, -2679, -2520, -1088]
4166a088J602J296L43m82j488j228j252J36J131J838J240L32r34j279j362p14
4182a909j60J174J553J516j06m28j199j526j000j4J053J447J176P79n05j888j518
4199a555n36l12J371J534J643L66p99j539j736l33k35J237K098R04K87j078j693
4216c76j104m34j53J365J389J239Q7o83j491j178j041K08J623J173J323L87j252
4233A082j374r35j042k7J613J410J380M71q18j898j324p49L11J642J186J011O04
4250B543q94j941j196n52N82Q20J500J121M55j049j751j081o99N59J105J666Q06
4267A994Oq37j511j135n67N2J678J123J232Pj037j111j263j095J049P96J679P42
4285A802K08j021j606n60j055N56J524J417N52o0o51j375j140l68N07J093J308
$$ y = [-1088, 514, 1810, 2153, 1671, 183, -1045, -2297, -2161, -1030, 808, 2048, 2380, 1446, 167, -1195, -1909, -2069, -895, 658, 2174, 2068, 1640, 441, -1085, -2085, -2099, -1046, 401, 1577, 2356, 1851, -37, -1555, -2091, -2403, -1032, 502, 2145, 2511, 1712, 173, -1563, -1896, -2131, -894, 1204, 2108, 2395, 1317, -376, -1480, -1914, -2067, -702, 687, 1926, 2013, 1330, -161, -1339, -2380, -2172, -549, 624, 1947, 2334, 1082, -292, -1227, -2269, -2296, -683, 727, 2107, 2578, 1760, -138, -1462, -2211, -1900, -258, 928, 1939, 2543, 1649, -292, -1488, -2040, -1458, -638, 862, 1983, 2438, 1389, -362, -1443, -2142, -1583, -478, 1188, 1994, 2000, 1163, -348, -1483, -2050, -1998, -320, 803, 2035, 2042, 1005, -106, -1369, -2464, -1415, -619, 1060, 1802, 2010, 989, -617, -1177, -2232, -1676, -152, 1265, 1817, 1757, 1106, -269, -1409, -1777, -1270, -177, 1131]
4302A131J114l87j197j165j034l19L57J363J164R41l10o47j451j003j91J92J380
4319f2J372M70J0r20j583r62j76N53J123J533Q11m16p86j663j104r4O54J113J487
4338A360M33j75q39j853q44j58P39J578J064Q86l95j345j163r89n1L08J377J554
4356A487M44k4p82j917q15j57O23P71J676K45M15j086j631r14k48M89J215J813
4374A604L79o17r15r50r35l52O06J353J012O96k71j184j271q31j38P63R66J428
4392A343N60j28q50j566j467J65R48J039J265O90j98j356j402r33M10J03J722
4409C45R31K87R5j257j317o54j36M68J530J334k19Q0j274j068o54J7N82J226J506
4428A822J25l25j193j561o17L48O86J284N92P82m80r06j240j115K59O42J178J081
$$ y = [1131, 2245, 1858, 661, -504, -1538, -1857, -1500, -137, 1027, 1968, 1658, 1011, -440, -1443, -1634, -1442, -62, 1310, 1780, 1790, 870, -713, -1675, -1851, -1298, -175, 1358, 2169, 1753, 967, -696, -1800, -1894, -1240, -127, 1360, 1793, 1618, 779, -1074, -1918, -2076, -1337, 241, 1305, 2191, 1796, 451, -712, -1701, -1752, -1444, -67, 1487, 1931, 1907, 1125, -792, -1607, -1764, -1141, -370, 1306, 1551, 1966, 880, -751, -1665, -1913, -1424, -209, 1604, 1983, 1366, 451, -499, -1434, -1786, -1180, 173, 1185, 1881, 1610, 426, -845, -1676, -1814, -1051, -85, 1343, 1903, 1775, 925, -641, -2108, -1943, -995, 44, 1309, 1999, 1801, 445, -957, -1890, -1480, -1377, 345, 1276, 1563, 1658, 401, -916, -1570, -1706, -1238, 292, 1626, 1407, 1487, 213, -855, -1509, -1492, -910, 316, 1822, 1947, 1622, 429, -1132, -1749, -1401, -715, 569, 1161, 1943, 1463, 557, -683, -1798, -1539, -897, 281, 1362]
4446A362M47n73r39q90r56k46J093J098Q91L75k70j066j519m14k08Q77J164J520
4464A746j98k33j556j153k96j17J019J229J052N67j049r57j117l58o5Q07J243
4481E64R68K53j032p62j012o74P1J037J010R69K3n35j059q17o87R1Q35J343P67
4500A353L76p34r56p82j060L58R38J153Q45Pj252o72m49n23M4M35J393R85K24
4519A683p85j079r50l06j62J395O53J090M6o68j454o20l94K48Q63J107R57pq48
4538G69j271n40p60O00O25J454O74q6j080q87n15o75L78R60J278M84K36j075r25
4557c56l42p34m4J489P27N96K43r32p23j549p2N69L82J804L33J19r23o93r46j33
4577a185M0P04J622O38l51o58j275o89k90L30Q15J141N32p6n50j294n31m30O92
$$ y = [1362, 1809, 1236, 297, -593, -1549, -1795, -702, 396, 1287, 1662, 1392, 326, -1193, -1607, -1815, -938, 226, 1746, 1548, 1315, -241, -1394, -1690, -1807, -788, 441, 1493, 2060, 1011, 54, -1063, -1421, -1486, -679, 564, 1532, 1785, 753, -9, -1021, -1695, -1624, -587, 423, 1392, 1415, 880, -179, -996, -1683, -1592, -757, 586, 1353, 1729, 995, 39, -743, -1803, -1445, -507, 646, 1491, 1498, 246, -426, -875, -1398, -1354, -919, 474, 1459, 1683, 898, -181, -1131, -1437, -1599, -204, 449, 1539, 1585, 917, -537, -1157, -1551, -1303, -440, 667, 1624, 1617, 769, -502, -1042, -1802, -1202, -577, 877, 1551, 1465, 385, -502, -1017, -1692, -1314, -354, 924, 1408, 1644, 569, -356, -698, -1432, -1476, 13, 740, 1336, 1579, 647, -76, -1625, -1697, -1128, -746, 1058, 1391, 1510, 587, -106, -1052, -1185, -1145, -441, 1181, 1819, 1468, 810, -465, -1154, -1444, -1114, -299, 842, 1374, 1298, 748, -546, -1077, -1507, -815]
4596h15L77J396O31l52n46r51r86k62M07R48J231K11Mo74j079n80l12L45J173
4615A66O94O31l94o85o71j060o18J077Q72R74M83o45k92q79q70k33M39P81J160
4634I30Q14q35j63j368o16l06O47Q82J160J34N0r48j011m92j79M02Q90J173N81
4653A745m34p83j079p00%N35J257L64L93l88p35q12p09R1O41Q06R24M21k61j263
4673A3r86k77M1L43J379L71M03m21p30j015j56l54O38J015O43O56o18o68o11j152
4693a486K82O60J047M20K64j01r13j061l42o5K66J415P11J97l74p85o36p91l1
4712a323O65R50R26J00j83j055o20m99l86N30J234O41K75m23q22p51l82P5N30
4731e18O09J230l0m81o73p07p32p4P55J133N45J77n93n37q39m18j46O33R17R41
$$ y = [-815, -438, 958, 1589, 1237, 691, -260, -1246, -1508, -1101, -153, 1078, 1289, 1293, 619, -460, -1040, -1352, -1007, 166, 860, 1491, 1097, 412, -259, -1319, -1937, -860, 12, 986, 1469, 824, 532, -347, -1217, -1450, -1011, -230, 930, 1744, 909, 746, -622, -1238, -1544, -897, -15, 1145, 1279, 1329, 381, -630, -1122, -1301, -899, -9, 1164, 1745, 1311, 528, -551, -1251, -1251, -716, 541, 905, 1298, 910, 175, -637, -1346, -1255, -614, 192, 1116, 1537, 1276, 13, -973, -1250, -1209, -866, 513, 884, 1287, 866, 136, -879, -1035, -1389, -751, 264, 907, 1563, 945, 277, -334, -1486, -1204, -544, 503, 923, 1187, 1086, 173, -888, -1230, -1295, -1029, 386, 1097, 1294, 920, 135, -501, -1292, -1323, -658, 292, 1218, 1318, 1135, 80, -540, -1039, -1425, -895, 339, 980, 1255, 832, 10, -741, -1123, -1048, -518, 91, 1321, 1291, 810, 137, -570, -1302, -1376, -621, 512, 1057, 1234, 641, 104, -735, -1153, -1299, -666, 251, 1192]
4751A192Qm64p45q07l36q1Q02J004L52K30l24q32p28p51K94Q02J272J33J24l67
4771G78p16q55o45K26R99M45Q13k60k57o75n81n43M96L89J005L39L06m32j073
4790b41p82j76J66N19J064P06k54k14q30p50j10k68J034L42O92K20n14j126m10
4809i32m27M62Q22M92M33J81l54p28r99k65N40M92J024L75k07j76o68q67l09K6
4829a085J026O67L56L43l57j123p69r7K76O91M98P09P3q36l66p98k45L55O21M23
4849C62P00o1n10m80j055j88N48M27R79K93J55o76p84p04L00L7L87Q08O05q3o81
4870C79o76o63QP6P73J098N4j18n38o10q00J8N10M06P84L00k47n12o72n31j91
4891a152K99P22J126L04n64l98j090j95j38L24P37O21Q10o21l58j145j71M6L81
$$ y = [1192, 1200, 736, -9, -816, -1152, -1233, -431, 573, 925, 1155, 831, -1, -729, -1480, -1186, -384, 888, 1021, 1145, 778, 62, -793, -1438, -1212, -213, 232, 1045, 785, 528, -147, -728, -1271, -775, -386, 619, 958, 1264, 832, -241, -1023, -1199, -1033, -514, 550, 1256, 1002, 788, -42, -792, -902, -1170, -136, 206, 898, 1118, 604, -522, -932, -1359, -897, -75, 417, 850, 1031, 677, -51, -1050, -1315, -775, -283, 741, 1116, 909, 733, 65, -802, -1111, -1085, -59, 608, 964, 1307, 950, -173, -942, -1039, -763, -72, 426, 1135, 1208, 372, 6, -792, -1037, -682, -61, 362, 1062, 1001, 491, 11, -1044, -1232, -684, -257, 722, 1015, 1170, 494, -290, -994, -694, -657, -270, 538, 1143, 1060, 379, -297, -960, -952, -876, -103, 995, 1049, 931, 393, -217, -1017, -999, -489, -83, 701, 1001, 754, 242, -430, -961, -1152, -853, -131, 995, 1299, 735, 337, -753, -948, -1086, -762, -25, 596, 1406, 785, 427, -718, -889, -843, -462]
4910d62M63R15J52j08j084m21o05O1P31O34J76K38M10j141o68o66M15M35P91P75
4930A041j66k86n76n27n81N4M12Q33N10M77m69n05j052j91j01L04R83O83M04o46
4950F01m38p43k03j91Q20L66N62J28k04o99p45l42O5P46M18P34K91n55p20j30
4970b39p07k5P44K97J187o2n98n26n62n06o7O98P40M28L26m79n92j027m0o3M93
4991e80Q86O30N0m64l36j038k07M16O74n3R28O2j61j003l95m37K32M07O32Q06
5011A049j95m16j76q62n54O23K48Q19L9J86j01p00o96j96j3M75Q26M57K26n27
5031E12n01n50o84L27O89M06N62J64o25m80n23j97K27L35O40P95j61o14m80r13
5051a071L47JL07Q55J35L27j34q88q13j63M62N21N67L27m8k40q33n72l16O31L37
$$ y = [-462, 1, 916, 1068, 960, -124, -545, -1150, -1089, -358, 276, 452, 690, 1100, -41, -709, -1375, -960, -525, 266, 1041, 875, 589, 13, -514, -1095, -1041, -629, 204, 714, 1191, 722, 217, -835, -1026, -1127, -823, 160, 843, 1247, 601, 163, -580, -783, -974, -154, 212, 774, 902, 698, -1, -746, -1088, -1023, -277, 141, 875, 1166, 611, -109, -239, -946, -971, -227, 70, 1257, 1195, 597, 71, -491, -997, -1064, -366, 374, 802, 1128, 649, 57, -970, -1010, -1073, -580, 306, 936, 986, 522, 186, -852, -1059, -643, 31, -22, 906, 968, 807, -196, -591, -1028, -796, -389, 243, 1049, 854, 438, 262, -600, -1154, -531, -283, 536, 575, 761, 660, -40, -736, -932, -945, -470, 356, 813, 1039, 512, 11, -539, -1223, -896, -207, 199, 761, 925, 300, -180, -703, -900, -673, -338, 302, 1097, 936, 322, -158, -1071, -724, -723, -416, 439, 574, 901, 767, -121, -934, -1097, -635, -114, 453, 780, 732, 492, -341, -913, -1229, -598, -261]
5072b61Q28L69n5o38j21j004k44M38P45L94M78l01l98m08n30J46j54O10P10J30
5092G34r9l36m77m56j43K45J54P74O76m72j92n11p18L20j5N37O06M73m06k22r40
5113d68l15J92J29O04L66L33m6q15l44l67o8L66L56M57L95m6p83m77j33k72M72
5134d64P10K93L45l28m82k78k56m57L03Q32K86L84r4o41l68n87j92O01M48L88
5154D43M94m83l22n33j47q1K5M81N94J42M62r34n96o31L50K15L79O70L21l46l10
5175A93o39l08j38L95P62M80P6j91p17k61m66k82N98L30P88N69o86k72q70j22
5195g61J87M9O93K93N63n47n99k89k19l54P49J68Q10o2p4n62k63l94j70K39P00
5216A57K62M00j60p89k65o79K93P94K14J44N65l78l48q94k13K74M52P85n1L49
$$ y = [-261, 567, 936, 881, 243, 122, -882, -1126, -688, 57, 451, 929, 628, 230, -178, -708, -562, -716, -106, 604, 734, 635, 299, -178, -634, -777, -532, -378, 396, 1072, 600, 408, -103, -821, -501, -516, 21, 627, 1100, 694, 472, -468, -783, -591, -462, 142, 508, 841, 795, -20, -364, -731, -799, -433, -77, 380, 775, 729, -54, -531, -664, -936, -464, 246, 539, 884, 556, 74, -204, -460, -917, -614, 218, 504, 888, 794, 153, -215, -802, -994, -393, 55, 443, 937, 454, 132, -401, -548, -629, -604, -123, 471, 613, 1075, 141, -455, -1086, -736, -521, -142, 528, 849, 503, 193, -446, -754, -892, -497, 265, 745, 821, 630, -87, -348, -814, -1096, -498, -168, 620, 1189, 503, 231, -639, -761, -574, -525, 168, 461, 1024, 477, -122, -411, -630, -984, -235, -67, 743, 681, 607, 45, -218, -612, -782, -543, 157, 419, 819, 659, -130, -395, -1074, -781, 13, 227, 371, 936, 558, 210, -684, -897, -623, -171, 614, 563, 912]
5236I12m94m85n38l04L11J81N18O79r4o24L32j318K17L1K66O74K66K68l35j84
5256B79r75j49J36K82P47L45L2n03k19o14Q0p7M62O79J23n5j11l83p39J67n15
5277a008Q42M80Q3J21k86M9j277j12O00M11N71J68j74k57l65o54K3K65M93O49
5297F22K23j12m78k14o45k04r9N15J032J42J55m82o37l97J08l14M74P36M76l19
5317E82k68o94k17r0M1L28R50k26L20m01n24k38l02K28K94P67j3N77n55n97l58
5338c96j02o5N77L00P52l47m78n44n14J49L46L19N5M62J0n82q7o14J96K20j55
5359d98J195q2J37m12n54o64R3K54N01P86r2j61m43l53j96o5J28N71K77P5J39
5380F36m62j99n98q5M38P0M91M41J6n56k62j019M31L35O17o2O83m11k6j071j08
$$ y = [912, 418, -67, -605, -909, -598, -417, 101, 780, 686, 62, 394, -924, -707, -676, -410, 264, 530, 798, 463, 279, -696, -845, -709, -427, 320, 665, 697, 194, -25, -639, -559, -636, -174, 505, 628, 573, 462, 79, -660, -493, -1008, -166, 314, 397, 518, 232, 281, -996, -1108, -508, -97, 474, 642, 468, 211, -154, -808, -785, -520, -27, 622, 845, 733, 255, 41, -604, -808, -907, -392, 640, 782, 937, 455, -182, -579, -471, -785, -311, 425, 901, 582, 314, -380, -597, -687, -646, -318, 632, 406, 726, 325, -199, -437, -739, -511, -217, 550, 537, 1114, 559, -38, -396, -498, -563, 14, 314, 1066, 719, 241, -303, -817, -668, -322, -3, 52, 514, 524, -58, -145, -759, -563, -343, -498, 697, 615, 752, 340, -214, -878, -785, -531, -30, 756, 664, 503, 60, -293, -489, -554, -426, 145, 422, 497, 636, 174, -25, -623, -708, -270, -200, 291, 732, 748, 192, -70, -1089, -658, -323, 294, 232, 915, 504, 478, -593, -701]
5401g01j0K64Q04J26J54k17k85m45k97K11j10P89M45j41J16k22j001P2m88M79
5421d57K33O97O7J82n88n62k91P9M32L89J47M01k21j87p80O2m37M93L59L95K62
5442F75J6m66p40k87J63M51J90Q38j28l35k42m83k28R2L71O42J24j30l9m5l37
5463A02l19n74M25Q52p8J94l73o12k01P3k8K77O29K36n8l47j37r8n41l28P43N38
5485C75O68l59l49k89q44L15K21K66K91K21M57k09o56o62n7J75N41J23K31R4R3
5506F46q65j52m3k22M24M91L81j61m0n90o48k11P15j44M16N12L6l95m21j60m73
5527i04J61M94N79J32K83m15k54p06L6M89J20K77K28m3J34n60o22j53K42N65L14
5548C97O63n82K42r71M5q5m95Q76K97L70Lq81P9j79n14J86M11N64q8n6L30p86
$$ y = [-701, -711, -447, 357, 483, 637, 420, 135, -310, -607, -396, -506, 283, 728, 587, 703, 481, -520, -448, -936, -457, -224, 473, 540, 722, 134, -428, -719, -640, -208, 181, 328, 729, 508, 321, -459, -397, -834, -341, 18, 413, 675, 691, 225, -515, -802, -639, -188, 2, 840, 712, 377, 135, -348, -576, -484, -113, 529, 653, 523, 484, 439, 102, -217, -791, -366, 486, 408, 602, 229, -383, -584, -511, -539, -262, 367, 603, 545, 198, 61, -37, -578, -906, -163, 375, 1043, 684, 335, 46, -798, -483, -262, 4, 295, 516, 973, 764, 108, -554, -611, -436, 105, 228, 459, 553, 646, -219, -371, -414, -636, -212, 279, 660, 499, 459, -131, -779, -990, -275, -419, -3, 509, 545, 150, -271, -431, -904, -743, -249, 330, 462, 745, 330, 76, -630, -594, -105, 15, 292, 520, 477, 611, 51, -571, -724, -482, 83, 397, 1060, 478, 720, -251, -206, -291, -786, 90, 387, 757, 760, -121, -42, -221, -735, -549, -138, 426, 338, 282, 612, -174]
5570a74k19j48J95N28J31P29l15l30p84Q7n70N35M96J25N02l08j98k94n83j68
5590g63K53Q19l27L79J26k39m67J82o15K51L63O37K28j84n31m34o3M3j84M55K90
5611B19N27k82o90K82l77k27J45O77J48K57j31j38p60M9l87K57Q61J52J27m1o73
5632ej98k03k97L47O59k01N19n16k0m59l18RM82J87K09L66K85n05q28K49n40O98
5654h0J32P38m2n25k74j68l83l0M82L11P7J31Q8k92Nm67k33%P97J62J09K68r02
5677i6l35L1p6L09O08J55N2l79m59q1n96J70M59K54J17L34J95n81m98r9j97O74
5699c9L26J78K00l06m72l91N5r3N13K86M94Nm96n87j42k4j68K87N60L24P2j91
5721C91l10o14L9q4O09LM63R3j49l04q31J89J04q2O86O16J8r68n9m67J56K95Q3
$$ y = [-174, -393, -541, -346, 182, 313, 1042, 727, 397, -387, -300, -870, -335, 161, 286, 788, 480, 282, -12, -595, -763, -510, 309, -18, 361, 487, 248, -219, -37, -652, -401, -38, 599, 827, 643, 112, -322, -385, -342, -526, -71, 219, 746, 464, -226, 56, -321, -548, -403, 274, 422, 679, 548, 410, -350, -301, -688, -431, 430, 582, 709, 668, -5, -203, -406, -703, -356, 303, 102, 621, 105, 85, -374, -692, -683, -201, -14, 195, 561, 846, 341, -487, -238, -778, -80, 52, 790, 748, 223, -51, -219, -602, -632, -150, 161, 238, 369, 457, 165, 170, -297, -530, -530, 267, 429, 538, 806, -96, -431, -400, -476, -167, 441, 596, 648, 269, -190, -271, -867, -697, -238, 16, 133, 467, 662, 81, -417, -516, -713, -39, 287, 465, 665, 359, -113, -504, -449, -542, -29, 257, 751, 756, 260, -327, -469, -493, -661, -374, 186, 510, 582, 391, 81, -533, -494, -578, 31, 34, 497, 590, 441, 137, -694, -505, -401, -483, 203, 819, 837, -131, -190, -657, -501, -206, -123]
5744a23M41J6L16p77Q2m16l77N12J68M08r4J96j44l11p18K56M34J20qP12k39k59
5766A95n79J2k28O3L55L78J86K04m53j27l98j45J0K42P19l39N52l03l57l40q9
5787d42n4L64M34N92m47P4q76k5j57o6P42j3L60J08q69o8J82l99N20l3M66k49
5809A44L89n97k59Lm05K68K28K55N08J96j13o77l50r1K45J14N36R4O9k8n02o27
5831f00L05k15N11O37J31l22q8n79j21l08L55M99P6M45l36k42j77m68j21N55J7
5852d6R3M70M07j008l44j08J82k6M39M26J38j05k79k14o15J09k0M73O26j02l34
5873A62R7l44P3q10O80M07J83L04l16l54l74K5l00L98K56O31k83l54q8k52j29
5894c88k16O24K79J23N2L5m65l72l66K77L0P51l6j31L22K26j083l18K02M30J80
$$ y = [-123, 318, 334, 650, -127, -45, -461, -838, -326, -158, 250, 156, 352, 208, -103, -821, -565, -131, -11, -19, 693, 454, 195, -384, -372, -600, -537, -182, 196, 382, 586, 133, 6, -392, -537, -527, -285, 434, 95, 647, 344, -13, -353, -442, -496, -132, 302, 894, 447, 521, -355, -380, -537, -603, 139, 126, 486, 594, -275, -343, -161, -560, -40, -73, 393, 144, 533, -64, -323, -320, -725, -457, -229, 26, 534, 730, 617, -60, -410, -501, -256, -142, 394, 488, 557, 529, 27, -600, -295, -510, 1, 638, 769, 447, 359, -220, -341, -649, -294, 205, 281, 726, 390, 148, -29, -497, -618, -63, -46, 47, 517, 924, -84, -428, -536, -354, -380, 59, 485, 623, 518, 239, 25, -590, -481, -501, -28, 598, 496, 162, 259, -85, -12, -822, -142, 265, 448, 752, 436, 82, -292, -267, -567, -169, 87, 718, 435, 81, -7, -259, -388, -604, 20, 299, 422, 474, 509, 44, -328, -694, -417, -387, 364, 328, 197, 519, 745, -338, -656, -454, -24, 156]
5915A56P5L22j63n65k74N0m36M14K84N84K51l03n28o13N30o5K8K13M12J63k31
5936C04k52j39j77l70O61l2P65k75m66L1n12l90M24M86q2M84p9j29L4l11m45k95
5958g65N81K48J89M91m57o02L2j49M16k98M64K23K08m56l72k14p8o1O65J65L70
5979F00j1m06R2q36J21L7M63o2L25L74m08m65m28o8J03O82k0M40k14M6J03p94
6001c26k07m2L42L86K17j68J87j34n67m50k9P48K26n7M70j82kp77l13n5O10L36
6023B13K55p7j66p3l59l29j21N81P7O15n5L2m72n05k84J78M30L24L02j3m95k68
6045b10j34M2m62R69K3L66j05P9j069j7J4M86N8L39J8k15J9n05J07j01K1RO60
6068C92m4N61q41K40n27k55Q7N26M27J40k97m60M4l83j15M50j11L98J81k59o6
$$ y = [156, 231, 553, 390, -175, -449, -399, -835, -421, -137, 447, 698, 395, -133, -746, -216, -281, -253, -40, 372, 535, 304, 52, -87, -264, -634, 27, -5, 760, 485, 19, 50, -462, -852, -428, 58, -24, 460, 381, 252, 286, -25, -470, -765, -184, 64, 253, 744, 287, -315, -283, -432, -16, -314, 150, 373, 581, 125, -247, -461, -539, -600, 65, 230, 600, 589, 183, 275, -561, -440, -403, 60, -2, 323, 697, 289, -176, -604, -672, -569, 113, 93, 533, 319, 365, 468, -326, -533, -575, -233, 153, 370, 202, 389, 255, -312, -762, -791, -43, 183, 126, 596, 414, 412, -365, -678, -733, -123, 213, 468, 391, 225, 152, -207, -536, -657, -76, 1, 616, 561, 593, 121, -384, -668, -490, -60, 264, 566, 553, 58, -210, -344, -302, -764, 205, 228, 594, 489, 568, -501, -518, -504, -18, 40, 379, 397, 182, 201, -304, -197, -298, -277, -268, 392, 348, 909, 68, 308, -219, -474, -387, 139, 566, 706, 409, -51, -7, -390, -505, -55, -166, 232, 413, 154, 88]
6089H8k78J12m46K10K53L31K19L26m54l90m81K05n86R06L45J98k42l95p4j64q6
6110d03j38Q06j83J40K87l03l28l54n5M95l0Q15j87o8m94p1p62N38j50P73j8K91
6132F01l09k14j63o46K83L12M86PK38Qm20m88j48Q8p1J74M78K55J40o16j21k55
6154c81N3M0M11M94j84l99J02k24p85P47j99K60M95K23l70m4o3o59L49K2J68J27
6176A83q9K38k38l07l12j2N60P2O7K75M9l54n86L1J40q9N15L28nL6m11l22m87
6199g18K70K32L64K15n7m4P2o67j22m2N81q7M25q6k40L74l58p18J2N21K8K67J43
6222C65J43o59k85J05Q4pJ21M30L30m07r8m19l76M65L61J25K31J3k08l06m00j26
6244e18J72J86O01L43n75N3m64Ml50j74O53J08K72J65J66o84l68j01L52p4P59
$$ y = [88, -190, -78, -524, -314, -61, 270, 489, 815, 361, -29, -510, -305, -891, 15, 360, 558, 316, -79, -153, -317, -403, -541, 265, 82, 222, 509, 206, -122, -476, -531, -36, -66, 749, 562, 494, 0, -71, -833, -295, -445, 328, 310, 601, 292, 78, -85, -731, -448, -136, 350, 357, 595, 603, 183, -305, -453, -365, -436, -262, 216, 471, 611, -5, -126, -381, -328, -288, 123, 617, 433, 34, 136, -88, -873, -126, -325, -65, 430, 653, 283, 239, 176, -483, -134, -112, 56, 183, 94, 332, 94, -213, -525, -537, 23, 95, 162, 437, 486, 132, -454, -423, -283, -372, 143, 471, 466, 502, 91, -231, -718, -448, -216, 148, 363, 306, 262, 334, -333, -455, -497, 84, -3, 422, 336, 96, 470, 112, -606, -594, -73, -45, 222, 365, 508, -151, -436, -331, -247, -254, -133, 297, 627, 220, 122, -297, -673, -208, 153, 278, 509, 522, 314, 8, -392, -518, -346, -160, 441, 784, 209, 262, -202, -198, -548, -722, -69, 39, 311, 476, 642, -42, -410, -511, -159, -233, 526]
6265E26l50N40m46m00O9m99L47L03L85K67k83l97k5p61JL09K90o1P08j34k1l67
6287An39m6K40K80L14J18q4Q4l40l91q6M90k21N91j88K44m26j91m22J77k23N47
6309g1N37j25K4J30p59j39n58O66j01Q40J14l12j53n01J93j75J60J33M60J60j94
6330C29k05j10l64K5j93Q23KJ87Q6n6m49k39j64L58K36k92M33L81n70l70jk86
6352d39K07M0M09L35n5j71o64k31L44j29L33O50k29N1m4l02p49J95L1P70n5J9
6374C16J91l69k40p5l05L16L57K96p7J18o55J05k87k74K68N93k86M85l7m32r7
6395h9k99J05k6M70M4M02l11j58m16L09o13M06M9N10M15n33o8m46Q1l72L91MM17
6418B72Q1j16m41l5k17p2K99L3L93L45j6m69l69K32m39N80j4K67K69l40k13n62
$$ y = [526, 176, 716, 270, -130, -61, -560, -213, 90, 475, 742, 459, 62, 37, -724, -723, -414, -124, -185, 523, 389, 368, 1, -538, -584, -344, -64, 250, 368, 284, 368, 28, -363, -449, 41, -180, 411, 223, 467, 41, -150, -572, -395, -618, -71, 466, 341, 365, 495, -264, -403, -961, -295, -396, 444, 558, 246, 93, -408, -215, -390, -230, -97, 363, 523, 329, 124, 14, -350, -325, -518, 305, 307, 494, 580, 524, 75, -164, -328, 30, 266, -26, 407, 788, 218, -152, -153, -439, -232, -192, 217, 552, 497, 326, -338, -569, -225, -354, -21, 629, 400, 451, 407, 105, -644, -449, -418, 352, 297, 316, 507, 138, -102, -177, -482, -166, 191, 487, 410, 528, -127, -22, -309, -583, -315, 278, -8, 477, 440, 8, -89, -388, -283, -309, 161, 205, 607, 296, 138, -278, 31, -582, -176, -127, 383, 798, 265, 197, -249, -168, -540, -149, -145, 272, 353, 237, -204, -239, -456, -528, -229, -196, 197, 542, 526, 57, -312, -80, -519, 61, 47, 314, 583, 243, 30, -532]
6440e32J43P8J89J54M30K7R1n51m49Q7m26P91J08K40K5j30m88j29k96J56q4M39
6462a27O23k30K01k78l96j16k4K05O18J34O6j08j90m64l48K43j22L03L33Q8j02
6483C09m15K02p66J21L28M71PK72j64m02k81J48k13Q4K11M54J78o03K94m05m22
6504e92L27K59L81j47M18p78L46p68N4L16j12O98M8kl20m01J9k32N4J53K74J71
6526A66N96p08j50k12K66n27L64N28k02N53k00l22p26L01j49M58N0O39n81O9J12
6547C25k15l03n5J3N57L98l30m2o26oP5L3L61j66N20j36N0o14l67J11K85J46N10
6570E24K38l81L62q93j57j83K2P13n6J07R9k83o1l92j92k4O02Q1K50J05j70n05
6592a94l75L99K06o2N21M1m82m2o8n23K65r7L25K77K10l35R2m65J56l51N28q2
$$ y = [-532, -389, -311, -122, 32, 462, 489, 580, 29, -420, -333, -759, 32, 140, 380, 405, 275, -213, -342, -638, -482, -566, -127, 496, 266, 467, 189, -207, -323, -347, -142, 476, 610, 676, 568, 378, -86, -434, -191, -313, -10, 323, 411, 309, -106, 96, -670, -549, -221, 250, 257, 529, 365, -37, -318, -170, -383, -299, -88, 366, 544, -59, 235, -170, -592, -265, -6, 375, 228, 646, -132, 214, -554, -500, -184, -296, 402, 450, 448, 128, -273, -254, -486, -432, -279, -5, 166, 762, 54, -96, -308, -42, -569, -205, 323, 121, 674, 474, 152, -574, -273, -422, 36, 86, 725, 144, 213, 325, 110, -193, -248, -235, 322, 720, 390, 348, -278, -284, -209, -176, 185, 19, 539, 403, 453, -161, -528, -417, -132, 14, 524, 762, 381, 743, -150, -307, -490, -468, 245, 189, 296, 395, 112, 51, -341, -533, -557, 45, 126, 376, 481, 311, -194, -569, -170, 36, -26, 495, 536, 54, 12, -56, -579, -314, -411, -86, 191, 401, 66, 158, -307, -151, -502, 26, -56]
6614e6L99J31j33k61n9o25K10K96J00K88L48m50j11k6l58k56J3L81L01N84l59
6635C57j97n75j51L73J59P6M76j66J79o10J16r3k51p2L70L16l61L32j88l59k50
6656e19L37J52rL26J11j39J92l39k06m17R9O30M03q0l27l90QJ8J43k0m4K65L22
6679E16j51l51m31k65J62K48O65j01r9R5j65m10k22J97K84N35m02M15k12m32l8
6700a62k00j57L32L12M82k85K13k89n86J4J3J90j02N26L39k96n2m51m82J77N12
6721D8K20N6K34k49m07j4m29J51M05O5O81n12n1j37j82n12j55O74J71L21k17M2
6743B03J43j071J75J01K67N70L38j81n29jk69J2k03P4L55O48j94l0m00j89m72
6764f53K34P73q6M2l47L55k45m75j43L10N0M22K30M00r89R4J02p20J42K98M53
$$ y = [-56, 343, 474, 341, 80, 21, -604, -394, -98, 2, 290, 638, 188, 77, 51, -307, -563, -550, -169, 132, 716, 357, 160, -415, -566, -193, -34, 42, 518, 352, 531, -79, 37, -56, -307, -379, -9, 307, -54, 278, 90, -269, -519, -182, -30, -39, 287, 398, 259, 451, 112, -94, -511, -412, 218, 621, 541, 214, -176, -168, -150, -7, -27, -71, 194, 516, 365, 14, -417, -682, -520, -272, 393, 292, 193, 288, 123, -287, -509, -312, -28, 507, 105, 520, 308, -124, -162, -362, -519, -187, 125, 607, 322, 535, 246, -340, -326, -313, -123, -225, 301, 640, 344, 292, -159, -641, -464, 48, 268, 324, 558, 309, -98, -112, -541, -390, 15, 80, 761, 249, 198, 61, -121, -633, -788, -114, 57, 378, 161, 203, 346, -725, -550, -449, -182, 388, 726, 545, 16, 15, -254, -242, -445, -371, -16, 632, 438, 408, 8, -181, -653, -419, 354, 268, 310, -37, 318, 73, -402, -545, -235, -185, 237, 467, 867, -122, -28, 74, -646, -504, -206, 247]
6785B47N1L86p83N6k46j26j57M02LM67M20k06o95j96j88J33K80M70OM37o51k50
6807a40j89l7K96l16P75j05J33m97j1k61J32l51L65K02M58k51k37k45jk01J80
6828c01J11O12J70l68j38K7l08l83L13J86M41k53L7p7m52r4l3M11j41O37l91L66
6850C72j82m62j28l1M32NL41Qpl54p0p76O78J34j5N34j72L71l26m37%m31M49N18
6874D51j91R8j1j90l10j83m96P28j92P01J66J6j63k68o06l3J12L19K62K73k9k38
6896B16q01N34j14l90O28M44n99K18k30l60K32K0j7L11K96k24L86j38n19l38L04
6917a41p6J09J78L54J34p23j10n00K08L21N07l03N48j16n97j3j54K42K54k19M12
6938C15M20j88l95o83J59k50L80K44O3N11l41j24k88N7p1l70J022j40L59k94p02
$$ y = [247, 298, 684, -99, -43, -289, -415, -572, -170, -167, 300, 720, 514, -181, -377, -565, -432, -152, 318, 324, 761, 110, -140, -329, -366, -70, -386, 389, 284, 417, -80, -91, -352, -220, -571, -206, -4, 454, 203, -34, -279, -280, -481, -301, -190, 422, 592, 224, 86, 113, -195, -578, -265, -79, 362, 109, 146, 69, -383, -477, -510, -99, -240, 397, 6, 372, 190, -272, -400, -431, 1, 6, 347, 355, 348, -6, -76, -852, -174, -40, -55, 479, 307, 678, 352, -85, -85, -516, -67, 451, 260, 358, 347, 157, -153, -336, -832, -104, -296, 405, 571, 587, 424, 156, -450, -483, -371, -52, 210, 483, 454, 216, -585, -51, -165, -555, 73, 517, -82, 136, -94, -454, -222, -202, -219, 92, 388, 164, 550, 412, -107, -445, -141, -217, -108, 70, 424, 558, -165, -275, -775, -567, -246, 261, -42, 506, 390, -207, -220, -374, -132, 122, -97, 315, 735, 547, 152, -531, -372, -622, -242, 2, 65, 576, 235, 111, -177, -120, -191, -561, 461, 321, 680, 386, -316]
6959c16M00p72L02M5M15M26J0J75n17l30k03K13L90K27l04J45k3l82k29k98L07
6980c19J99K99N8L58j86j50m74K72o67N94R6J94L05k52p29j19j65N57L62l88N25
7001C70J11j60j19n70j27M4n0J029k9%k05k18m38L47j72P5O76j62J17l36j28n49
7023d94j09r4M17L29L98k62j6m93J4j76oO9L90M31K69l34m53k26J15k82N25L41
7045C53l48M34m53l04K76k97r1L51OM82J31k34o39M19l98j24K76K19K48Q5l25
7066F7k83m27L53N5J26K93Q6J43J48l29p44L49j95O02M3O5Kj17m08j44n26M90
7088c51L25J2M50k96R2n25m7R4L35k17L07L00l4j81l82m14J24J52n8N32O8Q0n70
7111b04J46m26L9L31K16M38N8j64N2n67m47K80j98M01L08J52K3k61j87l09J31
$$ y = [-316, 84, -688, -386, -341, 74, 500, 510, 685, 168, -162, -365, -152, 238, 465, 161, 306, 283, -99, -328, -626, -319, -120, 179, 237, 595, 409, 259, -215, 57, -610, -16, 80, 274, 579, 327, -402, -521, -686, -129, 233, -155, 370, 481, 321, 202, -368, -495, -451, -501, 528, 499, 499, 294, 76, -362, -15, -187, -112, 564, 402, 519, 183, 55, -494, -603, -697, -280, 49, 447, 185, 169, -324, -310, -486, -492, -423, -33, 398, 667, 333, -120, -346, -231, -513, 12, 353, 5, 439, -14, -318, -42, -339, -430, -79, -73, 409, 540, 306, -333, 86, -312, -436, -160, 59, 307, 392, 67, -216, -643, -290, -235, -109, 184, 270, 413, 561, 232, -512, -163, -358, 244, 287, 352, 354, 237, -171, -315, -841, -351, -26, -14, 436, 140, 232, -293, -340, -246, 89, -128, 179, 479, 445, 264, -118, -532, -408, -256, -314, 218, 286, 366, -204, -58, -484, -445, -114, 102, 540, 598, 434, 486, -81, -528, -248, -446, -45, 263, 415, 438, 177, -10, -319, -188]
7132a88L33K31m2j75q8L01m45m48L39j44o0O03L16J03q30K15m91m9L75K83oq5
7154D8N40m13k97j34K20J3J61L78j62O3j23n11lk89P4J72Q7N18J47m35m11l4j70
7177e61M16J9O75k31J6j81j25j07q9k84N88K7L58j69j47o95K19M7J66J56K9K47
7199C74j49l2l8o29K84J70j67M79kP9k03l91N4k60J21N78J40j42J88m92k30r2
7221c60q4J20L57L96k71L91m58k19l03R5J53J43O00k02j32j33l82j02p3M53J12
7242A01K47P3k33k27n10L52l36L69K18L61L13o32j39n70L05n4M51j1J33k56K20
7263A75j65j13j5Q9o1JL72j10N7j91l08Pj10K28J23M63k07l06R7m34j53O68j9
7286H8K2k9L75q4j96q3rl71J59L55M1l22L05k58m24J83K04p7J99K30N6k35K16
$$ y = [-188, 145, 376, 334, 159, 71, 372, -73, -521, -182, -326, -386, 217, 533, 636, -194, 21, -470, -519, -144, 139, 133, 48, 588, 175, -122, -256, -36, -23, 138, 516, 354, 417, 294, -217, -220, -509, -435, -263, -176, 342, 489, 54, -357, -391, -561, -145, -126, 549, 318, 334, 153, 28, -79, -168, -452, 136, 163, 521, 352, 205, -490, -271, -224, -58, 98, 127, 374, 225, 193, 155, -474, -190, -20, -187, 292, 290, 369, 166, -225, -171, -431, -310, 268, 408, 266, 454, -38, -268, -360, -444, -324, 33, 429, 158, 549, 91, -128, -431, -336, -183, -40, 560, 358, 226, 93, -289, -391, -464, -11, 101, 348, 421, 188, -39, -549, -197, -533, -164, 54, 415, 728, 96, -43, -613, -308, -362, 89, 78, 211, -45, 175, 10, -103, -118, -29, -90, -89, 283, 173, 230, 39, -269, -262, -372, -144, -21, 442, 235, -71, 26, -408, -561, 107, 88, 110, 81, 456, 372, 176, 93, 84, -287, -128, 227, 268, -54, 251, -7, -431, -248, -44, -121, 78, 308, 364, 129, 345]
7309C45m68r9j55M50L00j63K37l10n9k75l86J54M31L02L25l87j48j08k56l86J01
7330e55M46P22k82K29m61l04j98M4J81NM14L71l87m39q1k11J23L92m2j00L24L4
7352B25j1Qm46l54L11J50K6M87J37o30L37p07O2M31j79N05o5J43l70r1k9j22J20
7375f2qm2P74m12k87k7m34L78J26j2r3O79n21J11m77p3M92k28K91o4M8J14n8m42
7399b27k46L0N16p2k6J22J62J23n66k97K63K91N5J39j8J30m33q0K02o71L97L57
7421A51j23J14R6j49k25l19k20M49K76j0Q59q35l3j53j90k06L19J50K50j39M9
7442A11M4k1m77j24J72n8O78k33L0j44j61k85K12j55R9M85N8K47k09l22j40k58
7464d51J46L45J75j00J67q9k34m14J09L34nM24K87l62j7l48l12j7K69j67P28j1
$$ y = [345, -123, -222, -377, 73, 373, 210, 447, 137, 78, -197, -583, -429, 2, 304, 629, 242, 94, -14, -270, -656, -555, -109, 613, 331, 560, 99, -205, -403, -359, -178, -173, 241, 612, 225, -214, -295, -506, -383, 9, -33, -133, 191, 225, 214, 222, -224, -578, -267, -117, -91, 396, 533, -97, 240, -467, -405, 26, -153, 352, 287, 430, 60, -31, -60, -182, -62, -70, -112, 662, 250, -37, -64, -498, -120, 6, -6, -99, 580, 59, 170, -307, -380, 112, -116, 175, 111, 159, 273, 215, -227, -473, -443, 73, 1, -25, 97, 259, 382, -184, -481, -218, 73, 128, 267, 249, 379, -54, -134, 68, -603, -206, 151, 28, 142, 238, 89, -136, -455, -675, -226, 50, 40, 899, 64, 31, -122, -312, -518, -199, -49, 201, 62, 111, 155, 134, -343, -467, -295, -353, 325, 92, 122, -22, -183, -468, -256, -411, -312, 173, 231, 478, 269, -53, -193, -451, -305, 40, 215, 115, 282, 193, -41, -455, -346, -12, -17, 407, 694, 332, 315, -33, -345, -362, -93, -260, 468, 457]
7486D57r3l28pm14K50k24L19M93J20k88j99l58q4O8J05r6N19K56j95l50k7j16
7508a92k5J37J4K59M7j32n5m84N00m19j8M38K35M6j72j67K48n68P4J83J80K83
7530D12k43K20k91n08j54n1O81N7R3L20l02k80J6k84K88j75J23O34P7n51J2j77
7552h3J9j10j12M12K4J88m69R6k43m04L67O40l36L85j18J7j74l36L1l03M17j0
7574a02N8K74k0j13n73J06K56j63L30n8J87K5m57O2K77k17K76j77K77O3J5j85
7596A41l46Pj03L53k77M14J40j41k86J42n15L29N4J93J04k47L29l36l62Q4J56
7617a67R5L4L59k7k07l70K76j81j68M65j52N17l04l3k16k32j85L01J17j10M74
7638B86M7N8n12J09n18M52K31j19K72R1q1m87J61l84J67K59j47N41j16p7L0l07
$$ y = [457, 364, 36, 29, -385, -135, -359, -40, 453, 573, 285, 86, -272, -356, -288, -183, -279, 240, 496, 301, -49, -76, -192, -217, -80, -66, 193, 240, 108, 53, -431, 69, -350, -368, 70, 305, 351, 179, 12, 260, -308, -234, -51, 129, 412, 169, 389, 98, -410, -564, -615, 66, 123, 216, 536, 234, -46, -30, -314, -26, -201, -78, 556, 633, 82, 94, -83, -64, -174, -286, 126, 150, 338, -131, -35, -278, -682, -315, 325, -11, 374, 256, 273, 99, -237, -206, -509, -92, -102, -44, 230, 210, 97, -476, -370, -114, -277, 53, -5, 182, 207, -250, -188, 89, -128, 148, -29, 248, 311, 326, 141, -205, -198, -301, 52, -225, 189, 329, 188, -98, 44, -471, -142, -88, 105, 209, -38, 291, -45, -407, -323, -167, -72, -38, 321, 294, 87, -283, -7, -188, -356, 109, -43, 474, 170, 137, -79, -311, -496, -195, -78, -188, 286, 333, 391, -121, -12, -530, -78, 153, 34, 306, 397, 316, -171, -10, -394, -227, 32, -115, 426, 310, 233, 263, -44]
7660d4l50J41L03o0M21o3j36j92j44r8L40P6J82m57Q22m33j77k87M4j14L37M26
7682E37k54p0k59lm49J62l7L56O4K01K3k10O4q3k91J82q1K75K5K72m24r9P9l20
7706c40L60l70M42J74R2m26l03pJ9N67j81R5K47l28K38q4k95p5m0K30K3M20l83
7729G5j16j04J39j19l35M31J37O9O1j94j20j43J14J98o8P3J51N5k33j89l14L29
7751a03j24Q1M53j91J28J09n07j14q9J19L16M4K12j6l08k23J9l6M36K08l9K6L2
7774D33n47L1m39j7O08m8M67l24j16%l34l7J53K46oJ26rl2l93K10k29J15K11K49
7798C18j0j34m51N8k26o9J1K56M47n8L47j7m89k39K2K8R8j14K11J16Q2l3l14K5
7822a35M5k23L24J98p6j71O07p09P3m9NL49k2lN8l65J4k10P5j3K17L18oj26k02
$$ y = [-44, -394, -253, 50, -10, 411, 348, 212, 20, -124, -222, 118, 194, 376, -81, 741, 308, 131, -156, -112, -226, 111, 537, 283, 213, -46, -49, -498, -336, -373, -17, 47, 248, 271, 61, 125, 42, -249, -67, -148, 127, 152, 424, 0, -99, -20, -340, 20, -350, 92, 266, 358, -68, -371, -378, -359, 208, 27, 122, 369, 41, 279, 195, -100, -175, -215, 15, 38, 458, 75, -41, -145, -6, -125, -460, -29, 108, 177, 238, 44, -76, -219, -105, 93, 25, 98, 249, 304, 71, -118, -432, -103, -227, -146, 307, 116, 244, 353, -154, -268, -357, -238, 78, 122, 334, 318, 10, -213, -194, -230, 206, 414, 375, 401, 433, -114, -83, -522, -539, 69, 21, 488, 164, 48, 48, -286, -323, -170, 76, 70, 196, 187, 155, -238, -28, -257, -142, 69, 318, 308, 174, -277, -219, -445, -514, -503, -247, 200, 142, 489, 472, -17, -256, -234, -206, -108, -222, -11, 105, 187, 154, -160, -135, -90, -313, 11, 209, 133, -38, 569, -140, -67, -116, -111, 238, 216, 213, 271, -94, -80, -290, -215, -228, -11, 307, 301, 175, -27]
7847b7k00l71M74K4K48k46K26J50m25J35k74L9k3M57O3j96L02m96J07k04j04R2
7869b49J57L07M7J05K6m65k64J52K59J00j54L55o2k47l99M7M7M20k66K87L01j14
7891C90j19k28j6o4m3J03N2J36qo9j85k75q9K69J09M02M7n59L15m99k15J88K20
7914a38M50o0j81j0nk61k37L0L86K86o9R6j10l02l59K88J7K99J27N4r7j01J44
7937B47m58M2L64l59L46n6j48p9r3j17j72J11K55O23j67p5j32j56k51K1J41r8
7959b11K45K15o9k04k79q2K58Q8K7N30k76K34n45J42j55l42M11k11K44K41K64
7980E25o37R0o53L68j56K49N47j36K66n09j06k17K86k1K99J61m26K41J95j77n93
8001d04O0K40R6J63j40L8J80j64k7m20L93J6R0N9J82o2n97L93l90J87n5L65L82
$$ y = [-27, -227, -598, -124, -100, 148, -98, 128, 278, -147, -12, -286, -247, -270, 187, 250, 54, 356, -140, -33, -237, -341, -249, -92, 215, 262, 367, 393, -72, -336, -184, 75, 175, 21, 376, 314, 67, -332, -285, -238, 182, -84, 203, 504, 390, 271, 43, 27, -37, -80, 23, 75, 211, 203, 134, -51, -326, -415, -146, -37, 365, 412, -147, 168, -331, -546, -358, -138, 312, 252, 71, 61, 56, -205, -442, -412, -26, 260, 191, 287, 177, -125, -484, -196, -179, 120, 247, 301, 204, 103, 247, -211, -169, 195, -164, 182, 126, -22, -101, -194, -311, -483, -372, -117, 506, 339, 264, 132, -24, -275, -254, -113, -211, 34, 249, 180, -24, -303, -385, -127, -39, -12, 518, 242, 476, -69, 73, -82, -424, -13, -224, 20, 261, 525, -112, -22, -675, -307, -463, -214, 333, 197, 463, -46, -152, -369, -83, -104, 195, 356, -70, 171, 366, 189, -404, -344, -104, -8, 155, 15, 53, 233, 69, 42, -378, 15, 31, 121, 180, 362, 300, -297, 96, -294, -107, -162, 203, 585]
8024E85l36l49n5j36o0K07K26j21K58J64l4n18k58K74j36JN54PL3l31j56m0K46
8047B5j19M5L50j01J06l87j09O5L2P2m1L94J73m99j52r0l40K37M82k89L28K06
8069C88p6j75K2j27l08O0j35N05j80J91j16m8k93N3L1J48J06K5l5j65l2K92l71
8092b40J14L60N7j28N5P9m80K35k72m0K72K73J01k22m21Q0m7j68L20L19j64K92
8114C75q3j40j51k78J91J11J18j29L54pm22Q9m7n32M18K26J60m4n5P2m99O2J81
8137c0M0j12N15m71K1m6l55L18j99L37L05Rk51l1j14l11K44k26N4M82j11K12K08
8160D88m66k4j19J53K0K37o9j80J34K7n90L56k03J02M2K42R6l49K39k68j39Qo5
8183c28P93k56L02r6j27m44J1j14
$$ y = [585, 249, -100, -155, -291, -351, -144, 82, -39, 219, 383, 349, -169, -427, -153, -289, -288, 266, 273, 306, -25, -181, -221, 25, -94, -49, 301, 200, 306, -81, -190, -125, -93, -21, -62, 332, 505, 6, -146, -236, -576, -339, 143, -146, 182, 388, 312, 137, 159, 32, -276, -216, -351, 154, -26, 165, 49, 1, -292, -239, -208, -60, 46, 71, 36, -129, -161, 131, -240, -126, 234, 291, 163, 218, 297, -183, 52, -220, -260, 12, 285, 386, 164, -257, -177, -224, -392, -72, 247, 83, 375, 292, 152, 1, -277, -86, 25, 143, 14, 368, 361, -61, 28, -19, -551, -133, 93, 253, 209, 154, 226, -273, -211, -30, 10, -102, 413, -58, -37, -83, -438, -120, -319, 18, 323, 332, 81, 50, -64, -375, -131, -357, -303, 179, 68, 280, 488, 22, -2, -121, 32, 52, 289, 220, 40, 174, 201, -389, -33, -236, -134, -92, 150, 246, -103, 136, -132, -271, -263, -328, 465, 209, 511, 415, 288, -156, -145, -259]
8191b59
$$ Imaginary data points
##PAGE= N=2
##DATA TABLE= (X++(I..I)), XYDATA
0@%%%%%%%%%%%%%%Q1j89K16k16K16k16K17l22M29m32M88n96O48p54Q63r69J102
31E66j214J398j582J741j937K166k407K664k940L262l624M015m445M911n441O049
47C182o721P501q391R429j0680J2178j4036J6417j9593K4069l0896M2733o9019
60d3827K28145j55839o51458k18678J01329M86795N58087M57158P5099l00499
70E36312n77994n35058k75088J43645M61281N88716M15083O5072l33744n52168
80f3943n23297k38774J44168M69788N63946L99994L6522l32777n45204m94241
90e83818k21436J57776M60268N50651L75217K3495l38201n31657m78696k00809
100g87210J71947M62818N29655L44576K483l30995n12339m60010j90317J79513
$$ y = [0, 0, 0, 0, 0, 0, 0, 0, 0, 0, 0, 0, 0, 0, 0, 81, -108, 108, -108, 108, -108, 109, -213, 216, -216, 272, -324, 324, -430, 433, -536, 566, -648, 750, -832, 909, -1028, 1138, -1269, 1395, -1545, 1717, -1907, 2108, -2337, 2574, -2867, 3182, -3539, 3962, -4429, 5000, -5680, 6498, -7538, 8879, -10714, 13355, -17541, 25192, -43827, 184318, 28479, -622979, -841657, -740328, -253533, 304554, 761712, 836811, 536312, -41682, -576740, -851828, -708183, -246902, 341814, 756897, 821969, 488225, -63943, -587240, -826014, -681846, -212058, 351888, 751882, 788404, 455627, -89577, -583818, -805254, -647478, -187210, 363441, 738658, 762153, 423952, -107705, -586401, -787210, -615263, -152445, 377210, 721786, 724269, 393274, -119065, -579075, -769392, -589879]
110e89879M63323N16335L20783j4525l34367m99513m38967j68200J89034M53435
120a02541M93888L02866k3627l33208m89671m19947j50581J93903M43867M80234
130C95183K89902l4542l39809m84045l98173j25315K03042M28983M54188K73104
140F62518l3684l31511m77169l91721j13057K14358M28490M38823K52859m8431
150F01475l30400m60877l70646j01298K12141M19410M29329K40879o0158l33178
160B46677m46554l49579r0455K08986M09642M21687K32576p0652l37915m37890
170b13477l30570p3553K11868L99041M03050K18247p2618l29415m27855l24412
180e39694o8521K18853M01373L93117J98239q8890l26019m08412l04724o2559
$$ y = [-589879, -126556, 389779, 710562, 696037, 361670, -137843, -576810, -745010, -555976, -102541, 391347, 694213, 670586, 337378, -152293, -572240, -722821, -528918, -85051, 395183, 685085, 650543, 310734, -173311, -571484, -696799, -493757, -64774, 389414, 662518, 628834, 297323, -179846, -571567, -684624, -470266, -41776, 397047, 649906, 601475, 271075, -189802, -560448, -661746, -449605, -30195, 399134, 640013, 579855, 246677, -199877, -549456, -639911, -430925, -21283, 400404, 632980, 562328, 224413, -213477, -544047, -617600, -405732, -6691, 396359, 614606, 541988, 212573, -215282, -539694, -608215, -389362, 12011, 405128, 603367, 514477, 188458, -219954, -524678, -587237]
190e87237K12835L92897L85782J90258r5496l27197m00610k91549n0817K17012
200c54122L86760L71505J75859j01424l22376l89533k79127m1365K18088L77512
210D1777L57370J67655j01192l19210l87104k71563k8612K27178L71566L40368
220C98233J52135j04698l12855l74867k61968k2385K27075L65334L31433J43009
230E40446j09644l11899l67767k50065j2222K29875L58535L18332J32395j14672
240D13314l07932l57959k37560m807K27509L49874L09918J27587j17618l09763
250I2563l53598k26239P157K31914L41448K97015J15433j20998l02536l41851
260b59692k18497Q243K30057L41649K92251J05267j31271l02649l30466k04306
$$ y = [-587237, -374402, 18495, 404277, 594535, 499039, 171842, -228768, -520317, -571134, -354122, 32638, 404143, 580002, 478578, 156202, -233331, -512458, -553823, -335735, 41777, 399147, 566802, 465610, 146400, -240704, -512267, -540879, -313701, 57865, 398233, 550368, 445670, 132815, -242052, -504020, -526405, -299330, 66004, 397437, 540446, 430802, 118903, -248864, -498929, -511151, -281276, 77259, 395591, 527986, 413314, 105382, -252577, -490137, -494944, -267435, 82439, 392357, 519944, 402326, 92563, -261035, -487274, -480117, -248203, 93245, 390260, 505693, 384695, 82159, -259692, -478189, -469946, -239889, 101760, 394011, 499278, 368007, 65358, -265108, -469414]
270d69414J5610K27849L34223K82636R7703j34917k99385l21754j95331K1650
280d41130K27488L28701K75328R0484j39900k99610l14691j83570L0252K28740
290a97908L21220K63220Q0713j39958k93252l07387j78910L3630K32191L19699
300A33258K55219O9599j46800k90500k97369j67962M1030K31580L10918K45194
310C84167O2964j47062k86990k92826j61870M8510K34283L07428K35303N3656
320D37563j51996k84835k84371j50321N5807K32116K98985K25700M8446j51522
330B75572k82242k79588j44232O1046K36120K95836K17094L7619j57778k77973
340a8526k69126j33750O6092K32569K88732K10317L2992j59411k77518k64035
$$ y = [-469414, -453804, -225955, 108268, 390904, 488607, 353690, 54305, -267449, -462780, -441130, -213642, 115059, 390387, 480871, 340971, 41361, -273330, -456900, -426648, -197908, 123312, 386532, 467245, 327287, 34035, -273352, -452262, -418632, -186441, 133258, 388477, 458076, 311276, 20776, -276593, -444555, -403525, -171945, 138973, 384167, 447131, 300069, 13079, -279747, -441617, -393107, -158824, 148604, 383907, 437563, 285567, 732, -283639, -433960, -378153, -146037, 152948, 378648, 427094, 275572, -6670, -286258, -430490, -369444, -133324, 162512, 379606, 417225, 259447, -18526, -287652, -421402, -355310, -122741, 165991, 376308, 409300, 249889, -27629, -291664]
350b91664j25336P2349K34292K84581K01236K4252j64430k74061k53860j15200
360d07841P6688K30650K77866J95339J9095j66427k72782k48791j07659Q3508
370c20354K32867K72407J85596J0047j69811k66947k39096j00602Q5755K30868
380g9270K68557J79552M485j72657k66157k33537r1795R2573K32363K61724J69472
391C65310l733j73506k60096k25489q5919R4645K30364K57826J64157r545j76120
402A77894k58806k19705p7505J01521K30755K50714J53129j5430j75581k52601
412h5615k12651p3522J03197K30116K47317J48004k1114j78990k51448k06251
422c00957o4037J08701K28805K39823J39071k5882j78873k45696k00493n8896
$$ y = [-291664, -417000, -344651, -110359, 174222, 375458, 399710, 235280, -38781, -292641, -407841, -331153, -100503, 177363, 372702, 391797, 225370, -47412, -296203, -403862, -320354, -87487, 184920, 370516, 380563, 210752, -56195, -295291, -395893, -310138, -79270, 189287, 368839, 373324, 200667, -65490, -299027, -390822, -298249, -65886, 195838, 365310, 361577, 188071, -72025, -297514, -383433, -288788, -58424, 199402, 363559, 354014, 177894, -80912, -300617, -378122, -276601, -45846, 204868, 357997, 342567, 166986, -85615, -298266, -371788, -268591, -38475, 208842, 356846, 335732, 156742, -94706, -300957, -364994, -256293, -27488, 212335, 351406, 325524, 146651, -99045, -299538, -358434]
432c58434J10664K27572K35786J33915l1320j81518k44163j93389n0650J15679
442b35858K24773K28383J26393l5099j79933k40380j87611m6731J17731K24090
452d242K25311J20972m1241j83063k37027j79764l8426J20046K20972K18635J14628
463C36801m3881j82688k33406j75618l3835J23287K20503K15058J08306n0302
473B84225j84482k29472j67274k7103J25644K16766K08658J01988n2879j82537
483I3534k26164j63785k3263J28101K18086K04251R5265n9415j83983k21268j55111
494b93752j7165J28825K13931J98325R0506o0602j83923k18566j52247j1810J32995
505a73483K13616J93828Q2876o6977j83477k13301j44255p136J33192K10453J88521
$$ y = [-358434, -247770, -20198, 215588, 349503, 318183, 136665, -107498, -300887, -351537, -235858, -11085, 217298, 343691, 308592, 128659, -111721, -299332, -346063, -228332, -4242, 221069, 342041, 300800, 117737, -119290, -299054, -337480, -217434, 3538, 222173, 336801, 292920, 110232, -123174, -298792, -332627, -209340, 11163, 226221, 334527, 284225, 99743, -129729, -297003, -324106, -198462, 18304, 226962, 328950, 276071, 93534, -132630, -296415, -319678, -191577, 26509, 230760, 326025, 266610, 82627, -138641, -293752, -310917, -182092, 31839, 230164, 320670, 260068, 76145, -142421, -294668, -306478, -173483, 40133, 233961, 316837, 249860, 66383, -146918, -291173, -298309, -165117, 45336, 233857]
516B33857P8335o8827j83409k11244j39769j522J36770K09030J82851P1149p4038
527B33183j82044k05275j33281K463J36747K05720J78433O7632p6518j82917k02722
538a58579j27961P622J39508K03968J73103O0271p9975j81618j97876j21795J1989
549b71343J39335K01031J68714N5923q1840j81955j95496j17415J7542J43078
559a22426J98936J61756M9223q5675j79266j88959j11909J9266J41545J96484
569G8975J60034M6446q9857j81477j86445j04115K5839J42926J92420J52565M1270
580B78581r0614j78280j82149j01335K8438J44372J90625J48897L5770r3861j78015
591B429j78262r5436L3402J44904J87942J42174L1478r6165j76019j73578r0492
$$ y = [233857, 312192, 243365, 59956, -151288, -291057, -292579, -155809, 53221, 236072, 307221, 233183, 51139, -154136, -287417, -284954, -148207, 57513, 235946, 303578, 227060, 44143, -158579, -286540, -278918, -139410, 64558, 237661, 297932, 217957, 36339, -161537, -283332, -271343, -132008, 69023, 237737, 293660, 211820, 29865, -165631, -283046, -265504, -122426, 76510, 238266, 287489, 201814, 22548, -166411, -278320, -259054, -117509, 78975, 239009, 285455, 195598, 14121, -172324, -276439, -250600, -107674, 84746, 237311, 278581, 187967, 9687, -172462, -273797, -245359, -100987, 89638, 238535, 274305, 180444, 2429, -175833, -271269, -237867, -92963, 94979, 237153, 268631, 172466, -3553, -177131, -267623]
602b67623L5750J44264J85365J39869K7307r8957j76691j69652q4570M0875J45306
613g8757J80747J33266K2686r9496j72973j66316q1387M3290J46279J79426J28841
624B35606J7952j02444j72536j61920p5269M7977J45673J74304J23469J4886j02433
635A45265j70564j58929p2160N0060J47581J72942J19206Q575j05627j68047j53127
646a84825o5886N2071J45473J69614J15381N725j06011j68213j50023o1705N6119
657a92280J46107J66358J09988K071j07651j65926j46432n7070N9390J45381J62905
668A22841J05202j892j07985j62689j42416n4834O0196J46267J62857J01048p896
679B20699j11260j60779j35647m8989O2376J43053J58060R7691q135j10840j60380
$$ y = [-267623, -231873, -87609, 97756, 237625, 264932, 165975, -10716, -180368, -264938, -224063, -78757, 101990, 235256, 257942, 158446, -14527, -180843, -262230, -218940, -72661, 106765, 235606, 253558, 151114, -21422, -183342, -258611, -210634, -64961, 109343, 232812, 247698, 145265, -25299, -184228, -256388, -206328, -58747, 114195, 233401, 241976, 136349, -31698, -184825, -250711, -198640, -53167, 116447, 231828, 237553, 131542, -36671, -186694, -248399, -192280, -46173, 120185, 230173, 232244, 124593, -41333, -187765, -244835, -185445, -40064, 122841, 228043, 226151, 118166, -44523, -186939, -241773, -181577, -35310, 127547, 228595, 220699, 109439, -51340, -186987, -235976, -173600, -30547, 127513, 225204, 217069, 106229, -54151]
$$ [...]
8191B31
##END NTUPLES=NMR FID
##END=
