##TITLE=1H_Pr 4962
 CDCl3, 8 sc, 
 17.12.2020
##JCAMPDX= 6.0         $$ Bruker NMR JCAMP-DX V2.0
##DATA TYPE= NMR FID
##DATA CLASS= NTUPLES
##ORIGIN= UXNMR, Bruker Analytische Messtechnik GmbH
##OWNER= root
$$ XWIN-NMR		Version 3.5
$$ Thu Dec 17 13:36:29 2020 Russian Standard Time (UT+4h)  she@DPX200
##.OBSERVE FREQUENCY= 200.1315066352
##.OBSERVE NUCLEUS= ^1H
##.DELAY= (6, 6)
##.ACQUISITION MODE= SIMULTANEOUS
##.ACQUISITION SCHEME= undefined
##.AVERAGES= 8
##.DIGITISER RES= 18
##SPECTROMETER/DATA SYSTEM= spect
##.PULSE SEQUENCE= zg30
##.SOLVENT NAME= CDCl3
##.SHIFT REFERENCE= (INTERNAL, CDCl3, 0, 15.7039)
##AUDIT TRAIL= $$ (NUMBER, WHEN, WHO, WHERE, WHAT)
$$ ##TITLE= Audit trail, XWIN-NMR		Version 3.5
$$ ##JCAMPDX= 5.01
$$ ##ORIGIN= Bruker BioSpin GmbH
$$ ##OWNER= she
$$ F:/spectra/data/she/nmr/H-F/1/audita.txt
$$ ##AUDIT TRAIL=  $$ (NUMBER, WHEN, WHO, WHERE, WHAT)
(   1,<2020-12-17 13:35:15.50 +0400>,<she>,<DPX200>,
      <created by zg, POWCHK disabled, PULCHK disabled
       terminated by command 'halt'
       configuration hash MD5:
       00 E9 B6 7A A2 85 ED C7 34 08 36 98 17 FE 4E 26
       data hash MD5: 16K
       F5 EE EC 9D 78 2F 6E 7C B3 1B D3 AA 2A 63 00 48>)
$$ ##END=
$$ 
$$ hash MD5
$$ D0 D3 38 ED 6A 07 5D 35 E2 7F 71 BA 7C FE 29 E6
##$RELAX= 
##$RELAX= 
##$RELAX= 
##$RELAX= 
##$RELAX= 
##$RELAX= 
$$ Bruker specific parameters
$$ --------------------------
##$DU= <F:/spectra>
##$EXPNO= 1
##$NAME= <H-F>
##$PROCNO= 1
##$TYPE= <nmr>
##$USER= <she>
##$AMP= (0..31)
100 100 100 100 100 100 100 100 100 100 100 100 100 100 100 100 100 100 
100 100 100 100 100 100 100 100 100 100 100 100 100 100 
##$AQSEQ= 0
##$AQ_mod= 1
##$AUNM= <au_zg>
##$AUTOPOS= <>
##$BF1= 200.13
##$BF2= 200.13
##$BF3= 200.13
##$BF4= 200.13
##$BF5= 200.13
##$BF6= 200.13
##$BF7= 200.13
##$BF8= 200.13
##$BYTORDA= 1
##$CFDGTYP= 0
##$CFRGTYP= 5
##$CHEMSTR= <none>
##$CNST= (0..31)
1 1 145 1 1 1 1 1 1 1 1 1 1 1 1 1 1 1 1 1 1 1 1 1 1 1 1 1 1 1 1 1 
##$CPDPRG= <>
##$CPDPRG1= <>
##$CPDPRG2= <>
##$CPDPRG3= <>
##$CPDPRG4= <mlev>
##$CPDPRG5= <mlev>
##$CPDPRG6= <mlev>
##$CPDPRG7= <mlev>
##$CPDPRG8= <mlev>
##$CPDPRGB= <>
##$CPDPRGT= <>
##$D= (0..31)
0 1.2 0 0 0 0 0 0 0 0.06 0 0.03 0 0 0 0 0.0002 0 0 0 0 0 0 0 0 0 0 0 0 
0 0 0 
##$DATE= 1608197714
##$DBL= (0..7)
120 120 120 120 120 120 120 120 
##$DBP= (0..7)
150 150 150 150 150 150 150 150 
##$DBP07= 0
##$DBPNAM0= <>
##$DBPNAM1= <>
##$DBPNAM2= <>
##$DBPNAM3= <>
##$DBPNAM4= <>
##$DBPNAM5= <>
##$DBPNAM6= <>
##$DBPNAM7= <>
##$DBPOAL= (0..7)
0.5 0.5 0.5 0.5 0.5 0.5 0.5 0.5 
##$DBPOFFS= (0..7)
0 0 0 0 0 0 0 0 
##$DE= 6
##$DECBNUC= <off>
##$DECIM= 32
##$DECNUC= <off>
##$DECSTAT= 4
##$DIGMOD= 1
##$DIGTYP= 9
##$DL= (0..7)
0 120 120 120 120 120 120 120 
##$DP= (0..7)
150 150 150 150 150 150 150 150 
##$DP07= 0
##$DPNAME0= <>
##$DPNAME1= <>
##$DPNAME2= <>
##$DPNAME3= <>
##$DPNAME4= <>
##$DPNAME5= <>
##$DPNAME6= <>
##$DPNAME7= <>
##$DPOAL= (0..7)
0.5 0.5 0.5 0.5 0.5 0.5 0.5 0.5 
##$DPOFFS= (0..7)
0 0 0 0 0 0 0 0 
##$DQDMODE= 0
##$DR= 18
$$ [...]
##$SUBNAM2= <"">
##$SUBNAM3= <"">
##$SUBNAM4= <"">
##$SUBNAM5= <"">
##$SUBNAM6= <"">
##$SUBNAM7= <"">
##$SUBNAM8= <"">
##$SUBNAM9= <"">
##$SW= 16.9725356469052
##$SWIBOX= (0..15)
0 0 2 0 0 0 0 0 0 0 0 0 0 0 0 0 
##$SW_h= 3396.73913043478
##$TD= 16384
##$TD0= 1
##$TE= 0
##$TE2= 300
##$TE3= 300
##$TEG= 300
##$TL= (0..7)
0 120 120 120 120 120 120 120 
##$TP= (0..7)
150 150 150 150 150 150 150 150 
##$TP07= 0
##$TPNAME0= <>
##$TPNAME1= <>
##$TPNAME2= <>
##$TPNAME3= <>
##$TPNAME4= <>
##$TPNAME5= <>
##$TPNAME6= <>
##$TPNAME7= <>
##$TPOAL= (0..7)
0.5 0.5 0.5 0.5 0.5 0.5 0.5 0.5 
##$TPOFFS= (0..7)
0 0 0 0 0 0 0 0 
##$TUNHIN= 0
##$TUNHOUT= 0
##$TUNXOUT= 0
##$USERA1= <user>
##$USERA2= <user>
##$USERA3= <user>
##$USERA4= <user>
##$USERA5= <user>
##$V9= 5
##$VALIST= <valist>
##$VCLIST= <CCCCCCCCCCCCCCC>
##$VD= 0
##$VDLIST= <DDDDDDDDDDDDDDD>
##$VPLIST= <PPPPPPPPPPPPPPP>
##$VTLIST= <TTTTTTTTTTTTTTT>
##$WBST= 1024
##$WBSW= 4
##$XGAIN= (0..3)
0 0 0 0 
##$XL= 0
##$YL= 0
##$YMAX_a= 271936
##$YMIN_a= -427136
##$ZGOPTNS= <>
##$ZL1= 120
##$ZL2= 120
##$ZL3= 120
##$ZL4= 120
##$ABSF1= 10
##$ABSF2= 0
##$ABSG= 5
##$ABSL= 3
##$ALPHA= 0
##$AQORDER= 0
##$ASSFAC= 0
##$ASSFACI= 0
##$ASSFACX= 0
##$ASSWID= 0
##$AUNMP= <proc_1d>
##$AZFE= 0.1
##$AZFW= 0.1
##$BCFW= 1
##$BC_mod= 2
##$BYTORDP= 1
##$COROFFS= 0
##$CY= 11.3945322036743
##$DATMOD= 1
##$DC= 2
##$DFILT= <>
##$DTYPP= 0
##$F1P= 15.9154993809931
##$F2P= -4.1035820241983
##$FCOR= 0.5
##$FTSIZE= 0
##$FT_mod= 4
##$GAMMA= 1
##$GB= 0.15
##$INTBC= 1
##$INTSCL= 1
##$ISEN= 128
##$LB= 0.24
##$LEV0= 0
##$LPBIN= 0
##$MAXI= 10000
##$MC2= 0
##$MEAN= 0
##$ME_mod= 0
##$MI= 1.114404
##$NCOEF= 0
##$NC_proc= 0
##$NLEV= 6
##$NOISF1= 3.799351
##$NOISF2= 2.8
##$NSP= 1
##$NTH_PI= 0
##$NZP= 0
##$OFFSET= 15.70392
##$PC= 1
##$PHC0= -10917.17
##$PHC1= 10.60095
##$PH_mod= 1
##$PKNL= yes
##$PPARMOD= 0
##$PSCAL= 0
##$PSIGN= 0
##$REVERSE= no
##$SF= 200.130013532006
##$SI= 16384
##$SIGF1= 3
##$SIGF2= 2
##$SINO= 400
##$SIOLD= 16384
##$SREGLST= <1H.CDCl3>
##$SSB= 0
##$STSI= 0
##$STSR= 0
##$SW_p= 3612.71676300578
##$SYMM= 0
##$S_DEV= 0
##$TDeff= 0
##$TDoff= 0
##$TI= <>
##$TILT= no
##$TM1= 0
##$TM2= 0
##$TOPLEV= 0
##$USERP1= <user>
##$USERP2= <user>
##$USERP3= <user>
##$USERP4= <user>
##$USERP5= <user>
##$WDW= 1
##$XDIM= 8192
##$YMAX_p= 0
##$YMIN_p= 0
$$ End of Bruker specific parameters
$$ ---------------------------------
##NTUPLES= NMR FID
##VAR_NAME=  TIME,          FID/REAL,        FID/IMAG
##SYMBOL=    X,             R,               I
##VAR_TYPE=  INDEPENDENT,   DEPENDENT,       DEPENDENT
##VAR_FORM=  AFFN,          ASDF,            ASDF
##VAR_DIM=   8192,          8192,            8192
##UNITS=     SECONDS,       ARBITRARY UNITS, ARBITRARY UNITS
##FACTOR=    0.0002944,     1,               1
##FIRST=     0,             0,               0
##LAST=      2.4114304,     0,               0
##MIN=       0,             -427136,         0
##MAX=       2.4114304,     271936,          0
$$ Real data points
##PAGE= N=1
##DATA TABLE= (X++(R..R)), XYDATA
$$ [...]
$$ plain form
1422 -194 487 -274 -623 161 337 123 -1079 254 192 -612 -781 -113 1089 -643 -527 -474 803 -382 -759
1441 -759 371 271 -617 -719 1178 115 -755 -376 484 -179 -758 -177 481 510 -593 340 894 237 -560
1460 -560 -37 1126 -439 -32 -218 563 53 -89 -81 70 855 -888 340 204 222 -504 7 459 -9 43
1480 43 -715 662 -34 -241 -393 863 571 -887 374 485 527 -493 21 682 192 -656 -557 972 -45
1499 -45 -278 -103 667 110 -413 192 406 293 -894 403 210 187 -577 -595 293 -231 -531 -833 695 70
1519 70 -762 -834 186 370 -1321 -102 475 270 -884 -568 702 157 -694 -327 974 -266 -488 -295
1537 -295 551 455 -851 464 502 -22 -505 85 542 -123 -159 -182 789 190 382 -1231 705 568 -776 -217
1557 -217 797 376 -577 152 86 1753 -1086 -1358 568 -325 -469 -713 858 -22 123 -300 -74 -231 -1388
$$ packed form
1422a94O81p61l49P84J76k14j202J333o2q04j69O68J202j732J16N3J277j185l77
1441g59J130j00q88j02J897j063q70L79Q60o63n79N81O58K9j103R33N54o57p97
1460e60N23J163j565M07j86P81n10j42QJ51P85j743J228j36J8p26N11M52m68N2
1480D3p58J377o96k07j52J256k92j458J261J11M2j020N14O61m90q48R9J529j017
1499d5k33J75P70n57n23O05K14j13j187J297j93k3p64j8Q88n24l00l02J528o25
1519G0q32p2J020J84j691J219N77k05j154L16J270n45q51L67J301j240k22J93
1537b95Q46r6j306J315L8n24m83N90M57o65l6k3R71n99J92j613J936j37j344N59
1557b17J014m21r53P29o6J667k839k72J926q93j44k44J571q80J45m23K26j57j157
$$ plain form
1576 -1388 -435 193 313 -777 329 523 -35 -168 -511 356 -125 -512 -11 633 -179 -1152 71 -390 608
1595 608 -223 97 296 -695 -722 -579 1298 -498 -77 -218 522 65 -1101 -267 -8 300 -710 164 907
1614 907 214 -544 -28 496 -271 -241 -879 147 -173 99 -368 787 37 -467 638 340 535 -318 230
1633 230 116 134 -288 -111 937 -470 -489 -64 517 -361 -219 -239 311 411 -1107 -157 344 12 -310 -22
1653 -22 331 -344 -363 -550 706 -206 -534 -30 356 42 -714 281 180 75 -653 19 503 1 -496 -18
1673 -18 911 -443 -232 -28 454 -4 -410 -54 298 292 -822 129 254 -30 -447 -82 662 -268 -263 -352 596
1694 596 -56 -642 180 427 61 -607 330 232 174 -485 127 793 -121 -307 45 890 -142 -190 122 663 116
1715 116 -644 370 330 197 -573 337 478 -155 -260 -100 563 -239 -203 -284 546 -78 -605 106 143 16 -846
$$ packed form
1576a388R53O28J20j090J106J94n58j33l43Q67m81l87N01O44q12r73J223m61R98
1595F08q31L20J99r91k7J43J877j796M21j41P40m57j166Q34K59L08j010Q74P43
1614I07o93p58N16N24p67L0o38J026l20K72m67J155p50n04J105k98J95q53N48
1633B30j14J8m22J77J048j407j9M25N81q78J42k0N50J00j518R50N01l32l22K88
1653b2L53o75j9j87J256r12l28N04L86l14p56R95j01j05p28O72M84n02m97M78
1673a8R29j354K11K04M82m58m06L56L52oj114R51J25k84m17L65P44r30Nq9R48
1694E96o52n86Q22K47l66o68R37r8n8o59O12O66r14j86L52Q45j032m8L12N41n47
1715A16p60J014m0j33p70R10J41o33j05J60O63q02L6q1Q30o24n27P11L7j27q62
$$ plain form
1736 -846 26 125 -38 -653 -69 567 -425 -381 -263 607 -421 -482 50 287 -32 -695 390 339 53 -638 272
1757 272 358 -297 -71 -36 590 -194 -214 52 517 -143 -429 319 151 165 -441 201 232 -17 -305 -85 614 -223
1779 -223 -215 27 652 -179 -361 42 171 438 -799 264 358 436 -784 38 502 -199 -15 -326 413 -115
1799 -115 -39 472 105 669 -90 666 -58 169 -203 -73 552 -280 -445 -145 627 -574 -434 -18 367 -225
1819 -225 -522 117 82 -55 -702 329 153 -188 -333 20 394 -398 -184 -195 466 -334 -182 281 321 96 -504
1840 -504 411 108 125 -382 176 389 -142 -56 -24 584 -263 -47 68 461 -166 -404 343 129 135 -502 374 175
1862 175 -109 -262 75 427 -290 -206 57 590 -290 -261 252 207 -92 -432 399 21 -14 -391 215 399 -285
1883 -285 -137 108 644 -477 -208 119 269 -203 -481 270 -71 15 -532 235 223 -337 -310 34 350 -546 -209
$$ packed form
1736h46Q72R9j63o15N84O36r92M4J18Q70j028o1N32K37l19o63J085n1k86o91R10
1757B72Q6o55K26L5O26p84k0K66M65o60k86P48j68J4o06O42L1k49k88K20O99q37
1779b23QK42O25q31j82M03J29K67j237J063R4P8j220Q22M64p01J84l11P39n28
1799a15P6N11l67N64p59P56p24K27l72J30O25q32j65L00P72j201J40M16L85n92
1819b25k97O39l5j37o47J031j76l41j45L53L74p92K14j1O61q00J52M63M0k25o00
1840e04R15l03J7n07N58K13n31Q6L2O08q47K16J15L93o27k38P47k14Oo37Q76j99
1862A75k84j53L37L52p17Q4K63N33q80K9N13m5k99l40Q31l78l5l77O06J84o84
1883b85J48K45N36j121K69L27J50m72k78P51l41Q6n47P67j2n60K7L44L16q96L37
$$ plain form
1904 -209 15 243 -230 -341 154 65 -3 -646 407 151 -209 -330 255 423 -361 17 70 457 -145 -49 292
1925 292 317 -61 -309 565 122 101 -202 451 267 -322 13 28 503 -220 -29 38 345 -136 -355 526 -4
1946 -4 73 -374 283 42 -166 -187 -43 403 -326 -100 -20 437 -407 -300 238 9 -74 -477 427 -3 -43 -432
1968 -432 173 236 -321 -118 33 432 -473 -89 151 61 -132 -452 359 115 -76 -455 320 69 -256 12 248
1989 248 242 -474 -321 -201 414 -336 -159 284 68 17 -350 371 205 -29 -205 120 377 -272 85 60 392
2010 392 -337 18 218 236 -46 -342 436 -39 -128 -221 285 189 -181 -14 64 349 -408 1 158 201 -111 -253
2032 -253 237 -182 5 -317 125 74 -172 -221 75 276 -555 67 14 195 -310 -180 260 21 -127 -329 381
2053 381 -102 -173 -257 262 113 -436 98 195 316 -389 58 183 107 -226 -237 360 -164 49 -93 222 46 -182
$$ packed form
1904b09K24K28m73j11M95q9o8o43J053k56l60j21N85J68p84L78N3L87o02R6L41
1925B92K5l78k48Q74m43k1l03O53j84n89L35J5M75p23J91O7L07m81k19Q81n30
1946dP7m47O57k41k08k1J44M46p29K26Q0M57q44J07N38k29q3m03R04m30m0l89
1968d32O05O3n57K03J51L99r05L84K40r0j93l20Q11k44j91l79P75k51l25K68K36
1989B48op16J53J20O15p50J77M43k16n1l67P21j66k34j76L25K57o49L57k5L32
2010C92p29L55K00J8k82k96P78m75q9r3N06r6l70J67P8K85p57M09J57M3l12j42
2032b53M90m19J87l22M42n1k46m9K96K01q31O22n3J81n05J30M40k39j48k02P10
2053C81m83p1q4N19j49n49N34R7J21p05M47J25p6l33j1N97n24K13j42L15j76k28
$$ plain form
2075 -182 26 101 292 -266 185 48 129 -178 -89 337 120 44 -194 375 9 -190 -94 254 194 -315 181 55
2097 55 183 -341 2 275 -47 -174 -185 491 -230 -41 -149 198 8 -471 53 -12 154 -483 23 98 -4
2118 -4 -239 -240 77 37 -188 -458 625 -118 -589 -42 404 -319 -443 -1 386 52 -434 47 218 -262 -73
2139 -73 -185 271 -108 -90 -11 273 134 -361 178 5 267 -274 161 203 54 -90 -148 417 3 -88 -89 425 -20
2162 -20 -170 185 -36 135 -348 149 128 87 -198 -78 629 -91 -8 -150 444 -42 -122 -118 104 253 -307 174
2184 174 123 -52 -349 -16 186 -242 -58 -242 508 -303 -134 -89 -4 154 -226 -120 10 136 -467 182 295
2205 295 89 -173 -243 130 218 -1 -35 436 -84 -97 -156 73 26 -1171 380 -148 343 -404 -13 286 -264
2226 -264 65 -75 698 -804 -267 514 -71 -628 -323 683 -645 307 -302 -127 52 -309 156 537 828
$$ packed form
2075a82K08P5J91n58M51j37Q1l07Q9M26k17p6k38N69l66j99R6L48o0n09M96j26
2097E5J28n24L43K73l22j27j1O76p21J89j08L47j90m79N24o5J66o37N06P5j02
2118dk35jL17m0k25k70J083p43m71N47M46p23j24M42L87l34m86M81J71m80J89
2139g3j12M56l79J8P9K84j39m95N39j73K62n41M35M2j49j44n8N65m14r1jN14m45
2162b0j50L55k21J71m83M97k1m1k85J20P07p20Q3j42N94m86q0MK22J49n60M81
2184A74n1j75k97L33K02m28J84j84P50q11J69M5Q5J58l80J06J30J26o03O49J13
2205B95k06k62p0L73Q8k19l4M71n20j3n9K29m7j197J551n28M91p47L91K99n50
2226b64L29j40P73j502N37P81n85n57L05J006j328R52o09J75J79l61M65L81K91
$$ plain form
2245 828 -342 -609 -450 -348 -377 -688 56 370 441 -62 455 230 738 -659 -947 -98 -526 54 -202 -203 478
2266 478 539 -53 -144 -237 -704 978 -628 169 -154 -16 219 -421 5 2 302 -197 -150 -192 165 -178 70 324
2288 324 -189 7 -248 94 -304 -5 -56 108 329 -136 16 -18 241 203 -248 105 44 232 -243 208 32
2309 32 4 -291 30 216 -41 -115 144 283 -315 8 -78 129 28 -247 176 75 119 -288 155 102 -76 -54
2331 -54 7 249 -222 -45 -117 223 -156 -220 114 -70 7 -349 112 95 -21 -235 189 111 -175 -32 -122 189 -129
2354 -129 -179 -7 67 -28 -390 299 -38 75 -192 63 145 -171 72 -80 261 -119 -25 34 270 89 -180 144
2376 144 -24 105 -222 146 85 20 -102 -118 285 -158 91 -44 249 -104 -100 188 -7 90 -200 227 -17 -23 -148
2399 -148 84 120 -240 -7 -100 219 -190 0 -22 82 -79 -271 102 65 -104 -115 328 59 -77 -108 -32 165
$$ packed form
2245H28j170k67J59J02k9l11P44L14P1n03N17k25N08j397k88Q49m28N80k56jO81
2266D78O1n92r1r3m67J682j606P97l23J38K35o40M26lL00m99M7m2L57l43K48K54
2288C24n13J96k55L42l98K99n1J64K21m65J52l4K59l8m51L53o1J88m75M51j76
2309C2k8k95L21J86k57p4K59J39n98L23q6K07j01k75M23j01M4m07M43n3j78K2
2331e4O1K42m71J77p2L40l79o4L34j84P7l56M61j7j16k14M24p8k86J43r0L11l18
2354a29n0J72P4r5l62O89l37J13k67K55Q2l16K43j52L41l80R4N9K36j81k69L24
2376A44j68J29l27L68o1o5j22j6M03m43K49j35K93l53MK88j95R7k90M27k44oj25
2399a48K32L6l60K33r3L19m09J90k2J04j61j92L73l7j69j1M43k69j36l1P6J97
$$ plain form
2421 165 -195 -13 42 129 -137 -263 122 97 136 -182 280 34 -12 -85 36 165 -258 30 -41 203 -137 -76 89
2444 89 -10 -188 -52 154 73 -103 -116 144 155 -104 31 126 217 -163 95 84 185 -93 -71 166 -65 57 -128
2467 -128 290 66 29 246 41 332 -109 134 -349 -153 31 -65 187 835 -85 -459 109 -419 -259 -395 -283
2488 -283 390 -84 21 60 436 121 54 147 852 -254 146 -83 1344 1107 120 771 571 -825 -265 25
2508 25 608 -204 -2 -525 226 147 -39 143 -333 -812 584 1469 278 816 -57 139 -116 552 896 307
2528 307 275 -1249 40 159 -169 536 -837 226 -182 556 215 -216 364 666 -129 -813 -565 -500 331
2547 331 6 -416 -146 -82 -418 225 412 -126 -738 733 511 -564 -207 678 203 315 436 382 4 -277
2567 -277 520 -260 -25 -248 474 195 -57 -442 189 -231 -508 540 198 160 196 66 268 84 -568 14
$$ packed form
2421A65l60J82N5Q7k66j26L85k5L9l18M62k46m6p3J21J29m23K88p1K44l40O1J65
2444H9r9j78J36K06q1j76j3K60J1k59J35R5R1l80K58j1J01k78K2K37k31J22j85
2467a28M18k24l7K17k05K91m41K43m83J96J84r6K52O48r20l74N68n28J60j36J12
2488b83O73m74J05L9L76l15o7R3P05j106M00k29J427k37r87O51k00j396N60K90
2508B5N83q12K02n23P51p9j86J82m76m79J396Q85j191N38q73J96k55O68L44n89
2528C07l2j524J289J19l28P05j373J063m08P38l41m31N80L02p95o84K48O5Q31
2547C31l25m22K70O4l36O43J87n38o12J471k22j075L57Q85m75J12J21n4l78k81
2567b77P97p80K35k23P22k79k52l85O31m20k77J048l42l8L6j30K02j84o52N82
$$ plain form
2587 14 159 -360 102 -35 -9 -74 7 -58 -15 283 -211 -188 123 -136 -241 -265 239 -43 498 -126 203 28 -114
2610 -114 -164 -29 49 67 250 43 225 -174 -149 -15 54 48 -277 194 -203 -23 -25 205 122 -380 -75 60 104 -141
2634 -141 -70 -76 60 -247 -54 141 -123 -184 -223 171 -86 -177 132 -90 27 -153 166 -17 158 -133 -56 206
2656 206 -6 -82 -161 203 22 -12 104 -4 35 -175 84 39 119 -112 12 90 -134 -45 -56 59 -60 35 -120
2679 -120 166 -61 -45 84 90 96 -202 48 14 107 -79 -9 188 57 101 -68 168 -33 -33 -10 78 168 -159 11 -68
2704 -68 46 -136 -20 -27 -45 1 -102 100 -18 11 -71 103 -83 -48 118 -38 -51 -228 -136 62 48 -214 102 274
2728 274 -225 100 -89 139 -29 -176 110 -4 76 -244 159 -166 186 -389 -36 66 -322 197 -125 230
2748 230 -160 173 344 353 192 -110 282 -82 -318 41 289 74 48 -168 -404 24 170 -157 207 -42 -28
$$ packed form
2587A4J45n19M62j37K6o5Q1o5M3K98m94K3L11k59j05k4N04k82N41o24L29j75j42
2610a14n0J35P8J8J83k07J82l99K5J34O9ol25M71l97J80kK30q3n02L05J35M4k45
2634a41P1oJ36l07J93J95k64o1l9L94k57r1L09k22J17j80L19j83J75k91P7K62
2656B06k12p6p9L64j81l4J16j08L9k10K59m5Q0k31J24P8k24Q9j1J15j19R5j55
2679a20K86k27J6J29OOk98K50l4R3j86P0J97j31M4j69K36k01%K3Q8R0l27J70p9
2704f8J14j82J16pj8M6j03K02j18K9q2J74j86L5J66j56j3j77R2J98j4k62L16J72
2728B74m99L25j89K28j68j47K86j14Q0l20M03l25L52n75L53J02l88N19l22L55
2748B30l90L33J71Rj61l02L92l64k36L59K48k15k6k16k36M28J46l27L64k49J4
$$ plain form
2769 -28 151 91 -364 -112 -300 119 86 -59 273 35 206 41 -71 -329 507 16 -459 227 -126 96 152
2790 152 -196 229 153 -323 -55 307 -254 69 262 12 -171 327 -312 -116 41 197 -28 275 651 41
2810 41 174 346 279 136 218 363 53 150 -42 -106 -469 -393 -33 224 -446 -157 289 -150 -59 -246 -366 427
2832 427 -91 131 218 105 -274 -147 -86 2 141 -121 282 35 -478 -243 -142 164 -279 -107 365 317 257 -282
2854 -282 420 -211 289 -150 -201 -712 264 -131 210 806 366 -122 249 303 -68 -35 418 316 450 -134 291
2875 291 175 -373 -435 -279 -648 -22 444 94 -115 108 209 268 590 23 -32 199 37 430 180 476 -289
2896 -289 329 292 142 320 26 105 -139 184 -400 74 194 287 -354 -309 82 120 -19 61 -13 34 -33 -177 -83
2919 -83 215 528 -111 -671 90 -240 -188 137 -135 -83 -21 -17 -27 -10 -216 52 -105 -332 110 25 -2 -48 420 -69
$$ packed form
2769b8J79o0m55K52j88M19l3j45L32k38J71j65j12k58Q36m91m75O86l53K22N6
2790A52l48M25p6m76K68L62n61L23J93k50j83M98o39J96J57J56k25L03L76o10
2810D1J33J72o7j43Q2J45l10R7j92o4l63P6L60K57o70K89M46m39R1j87j20P93
2832D27n18K22Q7j13l79J27O1Q8J39k62M03k47n13K35J01L06m43J72M72m8o0n39
2854b82P02o31N00m39n1n11R76l95L41N96m40m88L71N4l71L3M53j02J34n84M25
2875B91j16n48o2J56l69O26M66l50k09K23J01N9L22n67n5K31j62L93k50K96p65
2896b89O18l7j50J78k94P9k44L23n84M74J20R3o41M5L91L8j39Q0p4M7o7j44R4
2919h3K98L13o39n60P61l30N2L25k72N2O2Mj0J7k06K68j57k27M42q5k7m6M68m89
$$ plain form
2943 -69 -184 -89 2 -162 16 -171 -162 50 -213 -256 324 85 412 -121 122 -57 274 168 527 147 -77 -319
2965 -319 277 -117 60 545 -79 193 233 -168 132 474 142 205 361 373 23 256 41 503 39 301 29
2986 29 185 -329 -356 -108 287 -229 329 -112 -550 135 -431 71 -199 -4 -477 -431 366 328 642 232 172 -1044
3008 -1044 -80 120 -284 -774 -742 -67 138 -212 196 -141 207 159 159 -410 82 67 -295 -215 257 -327 -902 -457
3030 -457 242 -1 432 265 -138 -269 -98 24 -209 302 412 -28 240 934 -450 312 -35 -471 -271 411
3050 411 512 161 -377 320 492 407 945 116 681 -218 -186 -433 60 120 -377 248 -205 -496 -211 -20 19
3071 19 -528 -132 143 -93 -452 31 -43 -198 -112 -297 103 554 433 133 -383 607 138 985 -185 547 -275
3092 -275 -443 -341 -32 640 -814 304 -438 521 530 -35 465 342 -286 -114 -317 -150 137 -194 158 18
$$ packed form
2943f9j15R5R1j64J78j87RK12k63m3N80k39L27n33K43j79L31j06L59l80k24k42
2965c19N96l94J77M85o24K72M0m01L00L42l32O3J56J2l50K33k15M62m64K62k72
2986B9J56n14k7K48L95n16N58m41m38O85n66N02k70J95m73M6P97l8L14m10o0j216
3008a044R64K00m04m90L2O75K05l50M08l37L48m8%n69M92j5l62Q0M72n84n75M45
3030d57O99k43M33j67m03j31J71J22k33N11J10m40K68O94j384P62l47m36K00O82
3050D11J01l51n38O97J72q5N38q29N65q99L2k47M93O0m97O25m53k91K85J91L9
3071A9n47L96K75k36l59M83p4j55Q6j85M00M51j21l00n16R90m69Q47j170P32q22
3092b75j68J02L09O72j454J118p42R59Rn65N00j23o28J72k03J67K87l31L52j40
$$ plain form
3112 18 64 90 -157 13 60 -38 145 -105 -126 32 168 20 7 -179 228 -111 -2 11 22 44 -349 145 -18
3135 -18 21 -67 2 124 3 136 -31 77 29 -69 49 35 50 -168 7 -84 127 -243 -22 -63 195 -60 -76 228
3159 228 -15 37 -231 155 -150 101 107 -140 -17 -203 -98 136 223 -2 -87 7 -169 -15 -6 196 -54 -46 -12 8
3183 8 86 -128 -67 -103 166 -289 33 -33 -79 36 -29 169 -229 3 26 -35 37 -31 -4 -122 105 -109 15 -126
3207 -126 137 8 29 127 39 9 -39 71 -34 99 -103 -26 65 -60 141 -52 118 -61 -3 70 -94 -30 -201
3230 -201 -32 111 -34 -175 50 -115 -56 40 -51 19 -195 -3 -37 40 52 -163 -26 -88 -2 -112 100 -47 -54 50
3254 50 -22 -73 -102 -98 -49 271 -125 -28 130 11 119 -141 198 0 -63 -16 80 -28 15 156 -59 266 323 -12
3278 -12 -21 -32 -245 830 237 -373 -26 -106 51 102 -149 137 -7 117 -50 86 -3 110 -78 -16 40 54 49 -40
$$ packed form
3112A8M6K6k47J70M7r8J83k50k1J58J36j48j3j86M07l39J09J3J1K2l93M94j63
3135a8L9q8O9J22j21J33j67J08m8r8J18j4J5k18J75r1K11l70K21m1K58k55j6L04
3159B28k43N2k68L86l05K51Ok47J23j86J05K34Q7k25q5R4j76J54RK02k50QL4K0
3183HP8k14O1l6K69m55L22o6m6J15o5J98l98K32K3o1P2o8K7j18K27k14J24j41
3207a26K63j29K1R8q8l0m8J10j05J33k02P7R1j25K01j93J70j79N8P3j64O4j71
3230b01J69J43j45j41K25j65N9R6r1P0k14J92l4P7J2k15J37o2Q6j10K12j47pJ04
3254E0p2n1k9MM9L20l96R7J58j19J08k60L39j98o3M7R6j08M3J41k15L25N7l35
3278a2rj1k13J075n93o10L47q0J57N1k51K86j44J24j67J36q9J13j88O2N6J4nq9
$$ plain form
3302 -40 29 -75 -14 19 -20 60 -132 79 -24 -36 -139 -32 -5 -113 -21 -148 13 -148 -86 -11 -12 21 -52 53 -127
3327 -127 -1 10 -48 -50 -8 -47 -42 145 -43 42 21 112 18 -66 10 40 198 -107 88 -71 86 -98 26 63 -127
3352 -127 19 2 44 29 -61 -18 -11 46 9 61 50 52 -93 24 -77 17 40 -38 121 -37 124 40 -33 52 -17 28 20 68
3380 68 -74 38 11 -116 32 -49 64 -87 44 -85 79 -8 7 58 -60 -52 -102 40 -57 -57 -97 49 -48 -134 75
3405 75 -80 15 -116 14 -37 1 20 -93 45 -30 -1 78 -72 -56 -11 -51 -92 187 -48 40 20 -40 -87 -24 56 -2
3431 -2 19 -35 121 45 -27 -4 1 -48 -58 -2 63 161 -35 24 38 172 -89 -51 -91 -107 284 -226 -26 -39 -302 284 -79
3458 -79 405 55 -119 173 -61 -273 -92 -216 61 288 -514 411 -378 120 -700 -413 12 3 122 -354 -150
3479 -150 -118 27 -356 33 116 -196 120 -89 -11 -150 27 97 -63 76 -84 -18 -148 -32 -89 -41 -27 -83 43
$$ packed form
3302d0O9j04O1L3l9Q0j92K11j03j2j03J07K7j08R2j27J61j61O2P5jL3p3J05j80
3327a27J26J1n8kM2l9NJ87j88Q5k1R1r4q4P6L0J58l05J95j59J57j84J24L7j90
3352a27J46j7M2j5r0M3PN7l7N2j1Kj45J17j01R4K3p8J59j58J61q4p3Q5o9M5qM8
3380F8j42J12k7j27J48q1J13j51J31j29J64q7J5N1j18Qn0J42r7%m0J46r7q6K09
3405G5j55R5j31J30n1L8J9j13J38p5K9P9j50J6M5m0m1K79k35Q8k0o0m7O3Q0n8
3431bK1n4J56p6p2K3Nm9j0N6O5R8j96N9J4J34k61L8m0j6L91n10K00j3k63N86l63
3458g9M84l50j74K92k34k12J81j24K77K27q02R25p89M98q20K87M25rJ19m76K04
3479a50L2J45l83L89Q3l12L16k09P8j39J77P0j60J39j60O6j30J16n7M8J4n6J26
$$ plain form
3502 43 -12 39 -2 22 -60 74 -38 10 78 -84 84 -55 -30 16 23 109 -32 -18 -84 4 -86 48 -101 -23 122 -1
3528 -1 12 -25 42 -37 21 41 87 11 -20 20 1 -89 -136 36 -41 -110 74 -3 93 -167 -23 34 -87 31 -73 103 35
3555 35 -23 -61 59 -21 -52 -48 -3 -50 -1 -3 -36 -25 -55 -78 -34 -33 -73 -49 24 -36 -49 20 17 87 -87 -32 -71 -22 56 15 -29
3586 -29 -51 48 -39 0 46 47 13 49 33 -28 -50 32 84 -61 -25 32 39 47 -65 -3 -30 -26 -25 92 -26 -48 -53 -83 4 -71 124
3617 124 -20 1 -109 -19 0 -37 18 -10 -2 -74 32 -45 37 -77 54 102 -5 2 -69 35 17 13 -44 -12 -19 14 -70 26
3645 26 83 -7 15 -90 21 -2 -67 41 121 80 -148 -72 143 -63 40 10 133 -51 -14 57 63 -48 -59 10 89 59
3671 59 -74 14 -47 -79 -40 -298 37 116 108 -37 -8 122 358 134 167 -59 88 12 23 -215 -228 427 183 123 -128
3696 -128 139 -69 -6 -163 15 51 19 -102 28 -82 92 -91 35 -15 2 -35 -106 121 29 -4 -55 58 13 80
$$ packed form
3502D3n5N1m1K4q2J34j12M8O8j62J68j39K5M6PQ6j41J4o6Q8r0J34j49P8J45j23
3528aJ3l7O7p9N8K0M6p6l1M0j9r0m7J72p7o9J84p7R6k60J44N7j21J18j04J76o8
3555C5n8l8J20q0l1MM5m7M9kl3J1l0k3M4Jm0K4P3o0j3O9lP0j74N5l9M9P8m1m4
3586b9k2R9q7L9M6Jl4L6j6o1k2Q2N2j45L6N7PQj12O2k7MJJ17j18k2nl0Q7p5J95
3617A24j44K1j10R0J9l7N5k8Qp2J06p7Q2j14J31M8j07Pp1J04j8mn7L2pL3q4R6
3645B6N7r0K2j05J11k3o5J08Q0m1k28P6K15k06J03l0J23j84L7P1Oj11j1O9P9l0
3671E9j33Q8o1l2L9k58L35P9qj45K9J30K36k24L3k26J47p6J1k38j3O55k44o0k51
3696a28K67k08O3j57J78L6l2j21J30j10J74j83J26n0J7l7p1K27r2l3n1J13m5O7
$$ plain form
3720 80 98 -51 -23 -138 114 35 101 -26 -113 177 22 113 -87 105 8 53 -3 -82 92 61 5 -46 11 -40 75
3745 75 58 12 84 -64 1 6 -29 4 25 -44 -53 19 -39 125 -7 88 -10 30 -122 -55 -43 -107 -26 29 60 18 -32 -60 -8
3774 -8 -10 -62 -10 -66 -21 0 -59 67 -35 -9 -65 100 64 111 -28 -7 18 -66 116 25 80 31 119 -18 -54 59 -65
3801 -65 -3 -11 73 31 -32 -48 -13 112 29 36 -58 -35 -36 13 1 24 -62 -1 49 -48 138 -36 21 43 -61 9 -36 102 -25
3830 -25 22 31 -39 -37 -52 5 -44 -9 -63 81 -47 68 -35 -47 61 -39 24 -41 -6 44 -19 19 21 57 -31 35 -60 -51 -48 -97
3860 -97 68 -13 108 -22 31 -78 48 -34 91 48 -134 137 -43 84 -128 -72 53 44 44 -40 -84 -20 2 -67 76
3885 76 76 5 11 15 24 -14 -82 -54 53 -72 70 39 -9 75 -11 27 -55 13 -18 -102 25 -31 97 -25 -11 11 27 123 -5
3914 -5 -100 -16 25 -117 -72 -113 29 45 -46 -40 -51 -81 -77 -68 -67 -21 32 0 20 -37 -44 -85 -8 -50 -26 26 21 -35 -13 -129 -44 52
$$ packed form
3720H0J8j49K8j15K52p9O6j27q7K90j55R1k00J92r7M5n6p9J74l1n6n1N7n1J15
3745G5j7m6P2j48O5Nl5L3K1o9rP2n8J64j32R5r8M0j52O7J2o4Q1N5L1m2n0k8N2
3774hkn2N2n6M5K1n9J26j02K6n6J65l6M7j39K1K5q4J82r1N5m9Q8j37l6J13j24
3801f5O2qQ4m2o3j6L5J25q3Pr4K3jM9j2K3q6O1N0r7J86j74N7K2j04P0m5J38j27
3830b5M7Rp0Kj5N7m9L5n4J44j28J15j03j2J08j00O3o5L5N0o3L8KL6q8O6r5RLm9
3860i7J65q1J21j30N3j09J26q2J25m3j82K71j80J27k12N6J25r%q4m4O4K2o9J43
3885G6%p1OMRl8o8K8J07j25J42l1m8Q4q6L8q2O8l1q4J27n6J28j22J4K2J6R6j28
3914er5Q4M1j42M5m1J42J6r1Oj1l0MRJM6N3l2K0n7pm1P7m2K4N2nn6K2j16Q5R6
$$ plain form
3946 52 41 34 -1 50 62 -25 41 -48 49 -106 -20 -81 -110 59 -35 -12 -66 39 -39 3 -59 -75 17 -27 -40 -58 -11 31 -87
3975 -87 132 9 89 45 21 21 65 -41 30 51 -78 -9 -65 124 -8 -3 7 -37 34 -68 4 -36 44 21 -42 -1 19 128
4003 128 -100 -18 8 77 -137 -154 9 98 -75 -53 -61 -170 -154 -230 257 -27 -43 -123 93 -123 83 -3 -24 255 -31
4028 -31 46 208 209 122 337 -25 242 -42 -419 -311 306 436 450 -154 24 -20 19 -264 215 29 -94 -9 148
4051 148 -69 -244 -148 66 115 -96 153 -356 93 -78 -78 294 204 -147 20 -214 -24 -113 -61 137 -120 -145 102
4074 102 9 -166 -97 -61 178 -76 -9 72 -291 -171 -184 44 -154 237 78 19 -123 -177 -168 -117 432 137 -193 84
4098 84 -170 -101 -219 -351 -74 -69 -415 125 390 -237 36 -274 -99 -577 106 -194 158 -256 -192 67 233 168
4120 168 167 102 -113 -353 -50 -108 -11 -353 -189 117 -128 81 197 55 -154 165 -273 51 -141 5 -60 -135
$$ packed form
3946E2j1pl5N1J2q7O6q9R7j55Q6o1k9J69r4K3n4J05p8M2o2j6R2m4j3j8M7M2j18
3975h7K19j23Q0m4k4%M4j06P1K1j29O9n6J89j32NJ0m4P1j02P2m0Q0k3o3M1K0J09
4003A28k28Q2K6O9k14j7J63Q9j73K2qj09J6p6M87k84j6q0K16k16K06q6k1K79k86
4028c1P7J62Jq7K15l62K67k84l77J08O17J30J4o04J78m4L9k83M79j86j23Q5J57
4051A48k17j75R6K14M9k11K49n09M49j71%L72r0l51J67k34J90q9N2J98k57k5K47
4074A02r3j75O9L6K39k54O7Q1l63J20j3K28j98L91j59n9j42n4RN1N49k95l30K77
4098H4k54O9j18j32K77Nl46N40K65o27K73l10J75m78O83l00L52m14O4K59J66o5
4120A68jo5k15k40L03n8R7l42J64L06k45K09J16j42k09L19m38L24j92J46o5p5
$$ plain form
4142 -135 -262 45 85 76 -93 152 -27 -28 -115 173 19 -23 -116 -62 -97 -48 -6 23 -48 22 43 -81 30 39 -101 29
4168 29 57 -140 39 21 -95 -60 -127 -189 90 73 65 -231 116 -255 12 64 14 150 -17 -32 -146 -27 -69 73
4192 73 35 45 125 2 -61 44 83 -49 148 42 7 53 -194 55 -31 70 -165 89 -135 -45 10 567 349 -53
4216 -53 -121 306 -28 288 264 -177 424 -247 -796 164 540 -148 -68 -5 203 -222 420 170 -4 -206 261 -19
4238 -19 41 33 53 -6 -32 69 -83 -34 36 -43 119 -181 66 -106 120 -92 67 -7 -4 112 46 120 -98 -23 -80 60
4264 60 32 -17 94 1 22 6 0 -79 -50 -70 -61 100 -14 9 -25 -12 11 -77 57 -87 22 -9 25 -9 2 -101 146
4291 146 -68 -20 46 -70 43 -43 -53 42 13 -8 -98 -27 -117 -20 -12 -32 -31 -18 63 6 50 -55 4 -72 66 112 -18 -68
4319 -68 -42 20 -62 156 -31 -19 -26 -27 3 27 -7 -81 -36 -13 -24 3 -39 26 40 82 -111 21 -56 92 125 -100 240 52
$$ packed form
4142a35j27L07M0rj69K45j79jq7K88j54m2r3N4l5M9M2K9p1P0K1j24J11Rj40J30
4168B9K8j97J79j8j16L5o7o2K79j7qk96L47l71K67N2n0J36j67j5j14J19m2J42
4192G3l8J0Q0j23o3J05L9j32J97j06l5M6k47K49q6J01k35K54k24R0N5N57k18m02
4216e3o8M27l34L16k4m41O01o71n49R60L76o88Q0O3K08m25O42k50j74k02M67k80
4238a9O0qK0n9k6J01j52M9P0p9J62l00K47j72K26k12J59p4LJ16o6P4k18P5n7J40
4264F0k8m9J11r3K1j6op9K9k0RJ61j14K3l4J3K3q8J34j44J09l1L4l4J1j03K47
4291A46k14M8O6j16J13q6j0R5k9k1r0P1r0R7Qk0JJ3Q1n7M4j05N9p6J38M6j30n0
4319f8K6O2q2K18j87J2pjL0K4l4p4M5K3j1K7m2O5J4M2j93J32p7J48L3k25L40j88
$$ plain form
4347 52 87 -140 -243 -153 34 89 201 -187 326 -235 -131 522 31 -172 62 -2 93 -146 106 111 -99 -62 -75
4370 -75 7 -71 -81 -112 35 -63 8 -85 -77 -80 -1 4 -37 12 -183 69 -35 89 -14 -6 -92 -2 95 -73 27 45 -5 -5 -34
4399 -34 9 -93 21 -40 45 -102 -8 -11 -47 62 -127 -35 -20 61 16 17 -8 -83 47 -37 77 73 45 -31 13 52 -52 51
4427 51 -57 8 1 -28 -26 22 19 -43 22 -114 11 -30 52 12 -75 43 35 47 9 43 -5 -19 -40 -44 72 -18 -5 136 -40
4456 -40 71 -25 -37 -98 -3 155 42 -10 63 50 -18 8 -20 41 -83 -31 76 -32 -124 56 73 -62 56 21 -2 81
4482 81 -34 -7 -30 38 -23 74 -29 90 -102 -35 69 8 -92 8 -84 -64 -32 -79 -46 -85 -28 -21 -13 -14 -9 26 -23 -33 -59
4511 -59 6 57 132 -9 1 -21 -58 69 -31 -65 22 -176 -7 -2 -2 -55 72 87 -89 45 33 -40 -6 113 36 79 18
4538 18 -51 -28 -18 21 54 23 -59 -124 62 -13 10 -39 -23 -38 77 27 62 93 -48 14 55 -23 -40 -40 -44 22 -17 56 0 -92
$$ packed form
4347E2L5k27j03R0J87N5J12l88N13n61J04O53m91k03K34o4R5k39K52Nk10L7j3
4370g5Q2p8j0l1J47r8P1r3QlP9Nm1M9j95K52j04J24j03Qq6R0R7j68J00J8n0%k9
4399c4M3j02J14o1Q5j47R4ll6J09j89R2J5Q1m5Jk5p5J30q4J14mk8p6M4L9j04J03
4427E1j08O5pk9KM8lo2O5j36J25m1Q2m0q7J18qJ2l8L4m8j4k1mJ16r0J3J41j76
4456d0J11r6j2o1R5J58j13n2P3j3o8K6k8O1j24N2J07j08r2J80J7j35J18l5k3Q3
4482H1j15K7k3O8o1R7j03J19j92O7J04o1j00J00r2K0L2m7L3l9N7PQjNL5m9j0k6
4511e9O5N1P5j41J0k2l7J27j00l4Q7j98J69N%n3J27J5j76J34j2p3L4J19p7M3o1
4538A8o9K3J0L9L3l1q2o5J86p5K3m9J6j5J15n0L5L1j41O2M1p8j7%mO6l9P3n6r2
$$ plain form
4568 -92 -64 -66 55 2 -18 125 -65 94 10 -39 -226 56 21 12 425 35 -112 -326 -12 -1 96 -1 -275 261 538
4593 538 -148 192 -278 -395 -35 128 -267 -22 -332 281 -70 69 -264 -372 125 -224 -451 56 180 -237
4613 -237 -69 182 -539 -61 -322 -318 -279 145 -97 270 -749 -150 109 -240 575 -1028 -277 90 -550 503
4633 503 59 -468 69 747 545 0 -196 -241 122 -175 721 -418 254 -99 -128 -200 275 59 326 195 -13
4654 -13 90 250 126 -122 -189 88 168 -174 41 -227 -115 -16 -135 89 -54 -156 -34 -124 -7 -166 28 -18
4676 -18 -118 68 66 -22 -38 38 -30 -28 -29 -34 -22 -59 37 12 30 2 21 -48 27 -10 -15 -105 -53 76 17 46 16 171 18 95
4706 95 -86 -37 58 3 -107 -161 67 -12 -50 8 34 -12 -25 -54 2 -67 -95 -85 -66 -119 -4 44 36 80 47 -117 19 -8
4734 -8 -14 -52 1 -32 69 -26 62 -64 103 55 98 56 -71 21 36 23 -43 45 -26 20 -50 173 5 -13 39 -32 25 -133
$$ packed form
4568i2K8kJ21n3k0J43j90J59q4m9j87K82l5rM13l90j47k14L14J1R7r7k74N36K77
4593E38o86L40m70j17L60J63l95K45l10O13l51J39l33j08M97l49k27N07J24m17
4613b37J68K51p21M78k61ML9M24k42L67j019N99K59l49Q15j603P51L67o40J053
4633E03m44n27N37O78k02n45j96m5L63k97Q96j139O72l53k9p2M75k16K67j31k08
4654a3J03J60j24k48o7K77Q0l42K15k68J12R9j19K24j43j02J22r0J17j59J94m6
4676a8j00J86kq8j6P6o8KjnJ2l7R6k5J8k8J9o9P5l7nr0N2J29n9K9l0J55j53P7
4706I5j81M9R5n5j10n4K28p9l8N8K6m6j3k9N6o9k8J0J9n3J15M8qM4l3j64J36k7
4734hol8N3l3J01r5Q8j26J67m8M3m2j27R2J5j3o6Q8p1M6p0K23j68j8N2p1N7j58
$$ plain form
4762 -133 12 -1 -8 52 15 -44 4 -5 74 -9 -23 -25 37 -44 69 -481 49 233 -416 -72 -402 -452 184 3 -345 -1
4788 -1 -364 -94 -488 -132 -279 -399 -250 689 -482 -300 158 120 10 83 91 -23 -144 -251 -132 -36 69 -113
4810 -113 78 -63 5 14 68 -14 -37 73 -25 23 -66 35 -54 22 -11 -27 -18 -94 87 -19 37 61 69 -38 -23 -36 -40 41
4838 41 -8 24 -86 5 22 199 65 -88 -94 -24 -110 -13 -44 16 101 -6 -4 0 19 -56 20 -48 -57 -55 3 -35 12 36 76 68 83
4869 83 -14 6 -87 65 97 108 -81 -131 52 -53 -55 -7 -37 -57 -15 12 -8 -11 -26 12 -26 -43 104 11 -19 -62 26 42 -60
4898 -60 49 23 -54 -39 -65 -53 -21 7 -37 -44 -22 47 13 27 0 44 25 34 -20 -111 -24 -36 -14 -9 91 -18 -23 27 -13 30 -6
4929 -6 36 69 63 132 -3 38 -108 -20 40 23 5 78 -42 -94 -18 54 27 29 110 -25 23 4 93 -13 -47 18 -39 32 -39
4958 -39 -55 41 -10 75 -10 20 73 11 41 -60 -120 -23 -31 47 16 -98 -18 -12 19 -47 -24 50 58 -75 42 -69 108 16 105
$$ packed form
4762a33J45j3pO0l7n9M8rP9q3j4kO2q1J13n50N30J84o49L44l30n0O36j81l48L44
4788al63K70l94L56j47j20J49R39j171J82M58l8j10P3Qj14j21j07J19R6J05j82
4810a13J91j41O8RN4q2k3J10r8M8q9J01q9P6l3j6Rp6J81j06N6K4Qj07J5j3mQ1
4838D1m9L2j10R1J7J77j34j53oP0q6R7l1O0Q5j07KMJ9p5P6o8rKN8l8M7K4M0qJ5
4869H3r7K0r3J52L2J1j89n0J83j05kM8l0k0M2K7k0lj5L8l8j7J47r3l0m3Q8J6j02
4898f0J09k6p7J5k6J2L2K8m4pK2O9l4J4k7M4j9Rn4r1Q7j2K2NJ00j09nN0m0M3l6
4929fM2L3oO9j35M1j46Q8O0j7j8P3j20n2P6P2k7KQ1j35M8j9Q9j06l4O5n7P1p1
4958c9j6R6n1Q5q5L0N3o2L0j01o0R7qP8l1j14Q0OL1o6K3P4Qj33J17j11J77r2Q9
$$ plain form
4987 105 -110 4 -7 82 -16 -240 4 -238 45 188 12 19 -106 18 -299 83 327 167 -471 35 -102 -416
5009 -416 -308 227 -64 248 15 286 -690 192 -410 -275 -61 -1082 -52 -178 -139 -327 -116 145 -110 -89
5029 -89 -28 56 -176 -11 -45 22 108 21 3 -60 -58 -11 -38 47 4 2 91 -51 101 4 -13 14 63 -73 44 -68 -53 -94
5057 -94 -111 -21 -39 -12 -65 -62 6 58 -14 -20 19 -61 36 20 98 31 -4 -64 76 106 57 -79 40 50 16 115 -33 -39 23 -131
5087 -131 -51 -29 9 -22 -41 -51 25 42 39 53 32 13 31 75 -46 -84 43 28 55 -20 -41 -23 -85 41 -8 -51 88 -13
5115 -13 78 56 -1 57 55 -17 13 -94 99 -154 6 -15 -31 10 -141 83 -34 38 -19 -90 -20 -26 31 -58 -68 20 -93
5142 -93 -83 16 24 21 60 -9 20 -62 146 -64 -74 -36 44 6 -5 56 -33 -68 -82 69 57 -24 -7 -15 -8 27 46 -3 -88 33
5172 33 -42 -54 -82 55 -63 22 -123 47 68 -55 -130 -88 6 -83 11 14 11 34 -89 -20 -50 -64 64 -55 -39 -58 48
$$ packed form
4987A05k15J14j1Q9r8k24K44k42K83J43j76Pj25J24l17L82K44j60o38N06j37l14
5009d16J08N35k91L12k33K71r76Q82o02J35K14j021J030j26L9j88K11K61k55K1
5029h9O1Q4k32J65l4O7Q6q7j8o3KM7k7Q5m3kQ9j42J52r7j7K7M9j36J17j12J5m1
5057i4j7R0j8K7n3LO8N2p2oL9q0R7j6P8o7l5o0J40L0m9j36J19J0l4R9j48oO2j54
5087a31Q0K2L8l1j9j0P6J7lJ4k1j9J8M4j21l8J27j5K7p5k1J8o2J26m9m3J39j01
5115a3R1k2n7N8kp2L0j07J93k53J60k1j6M1j51K24j17P2n7p1P0oN7q9j0Q8j13
5142i3J0R9QlL9o9K9q2K08k10j0L8Q0l8j1O1q9l5j4J51j2q1J7qPL5J9m9q5J21
5172C3p5j2k8J37j18Q5j45J70K1j23p5M2R4q9R4LlK3j23O9l0j4J28j19J6j9J06
$$ plain form
5199 48 26 58 24 -49 -107 -141 -50 7 -90 -55 10 -16 -64 -69 103 -46 5 89 -111 -37 32 62 43 17 -32 -75 -10 -6 -61 -37
5229 -37 12 40 -49 -116 -131 -38 -68 37 -67 -79 -29 -15 -64 18 82 -104 15 -116 -81 -9 32 64 32 12 32 -54 -9 -18
5257 -18 -54 14 3 9 -64 -32 51 -51 17 -51 7 79 -53 -53 62 -12 -87 72 -16 -60 -37 84 17 -49 -35 7 1 -62 -48
5286 -48 39 -134 -5 50 -115 17 12 30 -46 6 -22 13 92 49 -73 -53 12 -106 71 -10 30 -45 68 108 52 108 -107
5313 -107 28 -66 -100 36 -40 -131 -3 -71 7 -5 29 -40 -8 36 -17 24 8 -120 -29 -137 -108 55 21 5 62 24 -107
5340 -107 44 -16 -49 -4 -40 5 -12 -94 29 -13 67 -10 -18 105 7 -92 8 6 79 46 0 68 27 -22 82 36 -48 36
5368 36 37 36 14 28 -41 43 -12 -59 39 -17 68 -108 -58 -59 -71 -45 50 65 -26 -14 94 16 -50 17 54 -43 -51 -44 47 9 -125
5399 -125 -29 -83 73 -49 100 -81 51 34 -28 5 -22 3 52 57 13 28 -4 -44 36 -9 -1 -111 -58 56 9 25 43
$$ packed form
5199D8k2L2l4p3n8l4R1N7r7L5O5k6m8nJ72j49N1Q4k00P4O9L0j9k6m9m3O5Mn5K4
5229c7M9K8q9o7j5R3l0J05j04j2N0J4m9Q2O4j86J19j31L5P2M1L2l2k0K0q6M5r
5257a8l6O8j1Op3L2Q3j02O8o8N8P2j32%J15p4p5J59q8m4K3J21o7o6J4M2oo3J4
5286d8Q7j73J29N5j65J32nJ8p6N2k8L5P9m3j22K0O5j18J77q1M0p5J13M0n6N6k15
5313a07J35r4l4J36p6r1J28o8P8j2L4o9L2M4n3M1j6j28R1j08K9J63l4j6N7l8j31
5340a07J51o0l3M5l6M5j7q2J23m2Q0p7qJ23r8r9J00kP3l3m6O8m1m9J04m6q4Q4
5368C6Jjk2J4o9Q4n5m7R8n6Q5j76N0jj2K6R5J5r1J2J08p8o6O7L7r7qPR1l8j34
5399a25R6n4J56j22J49j81J32j7o2L3k7K5M9Nm4J5l2m0Q0m5Qj10N3J14m7J6J8
$$ plain form
5426 43 30 -8 -11 18 54 -77 61 -19 50 24 -9 47 -56 18 20 7 -66 62 18 -91 31 -46 1 0 -20 -78 34 -4
5454 -4 -80 61 137 27 -37 29 3 -25 90 104 -84 -36 -60 104 3 45 12 -10 -4 -8 -8 71 -3 54 22 -17 62 -68 68
5483 68 -21 39 -81 -16 -79 -39 -47 99 43 12 -46 -45 22 -80 28 13 -16 92 -4 41 85 114 2 -15 5 67 59 75 100
5512 100 42 -28 33 48 -17 -30 36 -129 -28 35 -197 -5 52 -3 -8 38 -51 35 -25 39 80 21 23 -88 -72 -74 50 -4
5540 -4 42 55 -50 -44 -31 -56 75 -32 -7 -24 -101 -50 45 35 73 -1 -30 -45 -19 47 -42 24 -79 -46 -85 -69 13 -7 -60
5569 -60 47 -17 8 12 32 -66 -15 83 -33 -13 30 36 -58 -8 -81 85 165 49 -52 -37 53 -251 -58 35 -108 147 -50
5596 -50 325 -1 235 -176 -75 138 -7 95 -48 53 -149 54 -139 14 33 -25 -102 168 -54 -118 -234 -380
5618 -380 -238 -232 97 960 -58 -715 116 388 275 26 91 -101 8 -42 -26 -2 14 -7 33 8 9 -23 -16 -58 3
$$ packed form
5426D3j3l8lK9L6j31J38q0O9k6l3N6j03P4Kj3p3J28m4j09J22p7M7jk0n8J12l8
5454dp6J41P6j10o4O6k6k8J15J4j88M8k4J64j01M2l3k2Om%P9p4N7l2l9P9j30J36
5483F8q9O0j20O5o3M0qJ46n6l1n8JO7j02J08j5k9J08r6M5M4K9j12j7K0O2qJ6K5
5512A00n8p0O1J5o5j3O6j65J01O3k32J92N7n5nM6q9Q6o0O4M1n9Kj11J6kJ24n4
5540dM6J3j05OJ3k5J31j07K5j7p7N1R5j0L8p4k9j5K6O6q9O6j03L3l9J6Q2k0n3
5569f0J07o4K5MK0r8N1R8j16K0M3Or4N0p3J66Q0j16j01J5R0l04J93R3j43K55j97
5596e0L75l26K36m11J01K13j45J02j43J01k02K03j93J53J9n8p7K70k22o4j16j46
5618c80J42OL29Q63j018o57Q31K72j13k49O5j92J09n0J6K4J6k1M0k5Jl2Pm2O1
$$ plain form
5643 3 5 -6 -38 -63 69 -67 90 28 -42 44 2 33 26 71 75 -8 49 -52 -38 20 42 22 -43 32 33 -79 92 57 -122
5672 -122 68 -56 112 -71 49 -16 3 -46 -3 31 -2 21 -17 87 -14 105 -69 4 -30 -39 20 -82 -39 67 -7
5697 -7 71 -107 -27 -103 44 -112 58 -20 63 18 53 118 -15 139 46 -20 83 22 16 20 -28 25 52 -25 -95 83 -106
5724 -106 -18 -30 71 -50 -144 -42 144 -55 -43 8 -65 53 -38 101 -3 15 71 -35 8 -24 13 -55 37 -14 -14 -9
5750 -9 85 8 -48 -73 23 -73 -36 9 40 -79 -88 19 -17 6 -13 -40 -22 -7 -38 -119 -25 -42 -56 34 23 80 42 46 -50 -114 -54
5781 -54 -45 -91 24 190 42 132 -72 52 17 -59 -1 103 177 -50 -91 12 -17 58 -88 12 -63 -45 -49 -43 57 -105
5807 -105 21 2 39 -65 -61 11 40 23 68 14 -50 -42 52 34 -23 -96 58 -72 18 -49 33 -32 27 31 -81 -8 0 13 -39
5836 -39 -46 -20 -47 -15 34 41 60 -55 52 72 -42 76 27 -42 73 27 17 -3 47 -35 43 -67 -70 6 -65 -1 64 -53
$$ packed form
5643CKj1l2k5J32j36J57o2p0Q6m2L1pM5Mq3N7j01J4N8K2k0o5P5Jj12J71l5j79
5672a22J90j24J68j83J20o5J9m9M3L4l3K3l8J04j01J19j74P3l4rN9j02M3J06p4
5697gP8j78Q0p6J47j56J70p8Q3m5L5O5j33J54r3o6J03o1oMm8N3K7p7p0J78j89
5724a06Q8j2J01j21r4J02J86j99J2N1p3J18r1J39j04J8N6j06M3l2L7o8R2n1%N
5750iR4p7n6k5R6r6L7M5L1j19rJ07l6K3j9k7J8J5l1q1R4j7j4R0j1N7l8Mr6o4O0
5781e4Rm6J15J66j48R0k04J24l5p6N8J04P4k27m1J03k9P5j46J00p5J8mOJ00j62
5807a05J26j9L7j04MP2K9j7M5n4o4QR4j8n7p3J54j30R0o7Q2o5N9Mj12P3QJ3n2
5836c9pK6k7L2M9PJ9j15J07K0j14J18m9o9J15m6j0k0N0q2P8j10lP6p1O4O5j17
$$ plain form
5864 -53 -19 55 39 19 12 -5 64 -31 -82 -127 -7 133 53 -119 4 -117 -92 23 124 -5 -12 -115 22 -10 17 39
5890 39 107 16 15 24 -27 -13 -28 5 -63 -21 -15 90 -21 -46 -1 -16 -31 26 37 -63 -2 4 22 -16 -53 -16 -79 -29 -62 -25 10
5921 10 -75 44 -56 -77 11 77 1 -13 7 88 -252 206 151 -116 -29 203 159 28 102 -2 5 -27 43 -4 37 -34 -47
5948 -47 -103 39 -60 -25 34 -23 52 -33 -8 57 -48 -4 8 -48 -30 -18 76 122 30 57 -24 -18 -30 78 -30 -91 26 1
5976 1 34 -39 82 76 95 -14 83 -5 -3 88 28 -22 -8 -70 61 39 -103 -27 11 36 -20 -5 56 -21 64 -36 -105 -58 -37
6005 -37 -79 67 9 17 16 62 42 -50 2 44 -40 -2 39 -25 102 80 -32 204 132 -205 76 -146 110 -191 -74 -56
6031 -56 -187 -11 381 134 317 -202 -81 -82 -105 55 51 84 -170 -264 -140 70 353 -147 327 -169 -51 228 -142
6054 -142 246 19 -129 -50 51 58 -306 -145 18 -22 -43 -145 22 -36 -185 -440 -364 13 -56 125 -5 -205 -240
$$ packed form
5864e3L4P4j6k0pj7O9r5n1m5J20J40q0j72J23j21K5J15J01j29pj03J37l2K7K2
5890C9O8r1jRn1J4j5L3o8M2OJ05j11k5M5j5j5N7J1j00O1OJ8l8l7L7o3N0l3L7L5
5921A0q5J19j00k1Q8O6p6j4K0Q1l40M58n5k67Q7K32m4j31P4j04Pl2P0m7M1p1j3
5948d7n6J42r9L5N9n7P5q5K5O5j05M4J2n6J8J2R4M6r2K7q1Oj2J08j08o1J17k5
5976AL3p3J21oJ9j09R7q8KR1o0n0J4o2J31k2j42P6L8K5n6J5O1p7Q5j00o9M7K1
6005c7m2J46n8QjM6k0r2N2M2q4L8M1o4J27k2j12K36p2l37K81k22K56l01J17J8
6031e6j31J76L92k47J83n19J21jk3J60mL3k54r4J24K10K83n00M74m96J18K79l70
6054a42L88k27j48P9J01Pl64J61J63m0k1j02J67n8j49k55P6L77o9J81j30k00l5
$$ plain form
6077 -240 -289 -129 -241 -52 313 -179 -366 104 368 -264 -190 56 344 17 -326 -54 296 -286 -82 223 -22
6098 -22 136 -114 -104 94 -34 71 -100 -151 67 69 29 13 -55 -29 -31 -47 31 -55 -80 26 31 -80 -21 46 -33 -17 -44
6125 -44 -6 -31 13 -65 48 -24 -71 20 -20 70 -20 -43 31 2 -58 21 1 68 -10 -43 1 -34 -24 91 37 -11 -29 2 -47
6154 -47 139 -17 -17 69 -42 -34 -42 -46 23 90 20 15 51 48 16 58 33 19 37 -77 -25 8 28 32 -83 20 -26 -24 -75 17 37
6185 37 -12 19 -14 -19 -35 20 -12 -80 21 43 24 84 75 66 20 29 -140 7 -38 -23 39 -28 -23 -3 32 -16 47 -8 -14 109 -43
6216 -43 -121 -108 47 -26 -71 22 21 -106 -30 -72 21 -3 -42 119 57 17 39 -19 8 -78 34 -12 4 -39 38 -60 28 12 -38
6245 -38 15 28 -10 -20 59 -23 -12 -56 10 -22 -24 -53 -70 19 8 -14 145 -47 18 -190 3 62 -24 -19 0 129 -103 2
6273 2 -51 82 -2 43 -104 -92 -125 75 26 1 61 -52 23 -50 -40 48 -9 57 -6 -4 -3 39 -6 24 85 40 -35 -43 83 -100
$$ packed form
6077b40m9J60j12J89L65m92j87M70K64o32P4K46K88l27l43K72L50n82K04L05k45
6098b2J58k50J0J98j28J05j71n1K18Km0j6o8K6kj6P8q6k5J06Nj11N9O7p9J6k7
6125d4L8k5M4p8J13p2m7R1m0R0r0k3P4k9o0P9k0O7p8l3M4l5J0J15n4m8j8L1m9
6154d7J86j56%Q6j11QqmO9O7p0nL6ll2M2k5j4J8j14N2L3K0Mj15J03m6Kn1R2K0
6185C7m9L1l3nj6N5l2o8J01K2j9O0rrm6Rj69J47m5J5O2o7NK0L5m8O3n5oJ23j52
6216d3p8J3J55p3m5R3jj27P6m2R3k4l9J61o2m0K2n8K7q6J12m6J6m3P7r8Q8j6n0
6245c8N3J3l8j0P9q2J1m4O6l2kk9j7Q9j1k2J59j92O5k08J93N9q6NJ9J29k32J05
6273Bn3J33q4M5j47J2l3K00m9k5O0j13P5p3J0Q8n7O6o3KJM2m5L0O1m5p5qJ26j83
$$ plain form
6303 -100 65 -87 -59 44 -113 13 -52 -75 -37 32 -31 49 0 -2 1 -37 53 -53 13 -71 -48 -26 42 -12 -95 -19 11 -81
6331 -81 -5 -61 -24 3 86 18 40 46 -22 -52 -71 -83 14 28 15 -29 114 -7 -56 39 97 -52 28 -6 -4 -32 -45 -68 -53 1
6361 1 8 -8 -53 32 104 -16 51 35 -68 -18 128 -130 -109 -86 -24 -69 -141 -3 -89 -40 18 12 105 -29 8 16 13 34 33 42 -12
6392 -12 33 -90 -18 35 35 -3 -7 -24 -71 30 -45 57 -9 -1 -32 16 -26 7 19 -40 -19 -28 49 25 91 -56 -2 -28 -48 -30
6422 -30 -44 46 2 -73 23 -45 -30 16 -47 -37 -46 12 17 61 -62 -36 -82 -41 -90 -62 -113 87 27 -23 11 -63 81 26 70 44
6452 44 -12 14 -32 -37 -28 26 -61 22 -61 6 -45 -23 35 -107 3 -18 37 -50 -27 32 23 120 -5 -56 73 -38 103 92 70
6481 70 -35 -49 8 -9 -8 74 101 25 -24 -6 -52 -125 -96 -13 -63 55 56 -24 1 -11 -78 79 9 -30 -38 -4 9 -33 -92 -23
6511 -23 43 50 -1 -57 -42 -27 -16 -33 38 -18 90 21 -9 -63 -16 1 -69 87 -38 -79 10 32 -33 48 96 -25 -101 -66 -37
$$ packed form
6303a00J65j52K8J03j57J26o5k3L8O9o3Q0m9kLl8R0j06O6q4K3K2O8n4q3P6L0r2
6331h1P6n6L7K7Q3o8K2Oo8l0j9j2R7J4j3m4J43j21m9R5N8j49Q0l4Kk8j3k3J5N4
6361APj6m5Q5P2j20O7j6j03N0J46k58K1K3O2m5p2J38q6M9N8oR3j34L7QlK1jRn4
6392a2M5j23P2N3%l8mj7m7J01p5J02o6Ql1M8m2L3J2n9K1rP7k4O6j47N4k6k0J8
6422c0j4R0m4p5R6o8J5M6o3J0rN8NM4j23K6m6M1m9K8n1K00o0n0L4p4J44n5M4k6
6452D4n6K6m6nRN4q7Q3q3O7n1K2N8j42J10k1N5q7K3N9rR7j25n1J29j11J41j1k2
6481G0j05j4N7j7JQ2K7p6m9J8m6p3K9Q3n0J18Jq0K5j2o7J57p0l9qL4J3m2n9O9
6511b3O6Pn1n6J5J5J1j7P1n6J08o9l0n4M7J7p0J56j25m1Q9K2o5Q1M8j21p6L5K9
$$ plain form
6540 -37 -4 -81 -35 40 -44 -26 71 -16 -6 -49 21 41 57 -9 6 41 48 -29 23 -50 47 21 -123 80 41 -5 -164 26 6
6569 6 -114 21 12 -28 50 -38 40 -27 -6 118 -69 -133 14 -14 16 -91 -3 8 -101 88 -28 -51 13 -135 -11 78
6595 78 61 92 -36 -55 -111 -94 -12 34 -39 -16 -30 35 -30 -34 4 -5 -17 -39 14 88 -24 -52 8 19 -67 -29 -8 10 43 55
6625 55 -22 30 13 -1 78 4 -5 24 28 -28 0 -86 53 -66 -25 -21 -57 -27 11 -56 18 2 54 107 64 -91 47 -78 -17
6654 -17 -44 -52 -27 61 39 98 -39 76 74 84 -49 18 43 -131 -73 -32 74 -29 -71 31 -14 35 24 -99 -83 118 64
6681 64 51 14 -75 -129 -8 -49 6 33 -13 19 -99 116 -66 -6 -82 12 -7 -4 -62 -30 -21 77 -10 16 -19 -29 24 53 14
6710 14 -49 108 -27 -19 -51 -7 -109 7 -83 29 -25 -10 -92 -12 -109 -87 -68 33 -80 67 -59 17 -18 60 -86 16
6736 16 -72 -28 -6 -52 -28 85 -22 -101 -35 -12 -2 -31 38 -26 73 -38 48 29 74 -8 31 -2 83 10 39 -15 23 9 97
$$ packed form
6540c7L3p7M6P5q4J8R7q7J0m3P0K0J6o6J5L5Pp7N2p3R7k6j44K03l9m6j59J90k0
6569Fj20J35rm0P8q8P8o7K1J24j87o4J47k8L0j07Q8J1j09J89j16k3O4j48J24Q9
6595G8j7L1j28j9n6J7Q2M6p3K3j4O5o5mL8rj2k2N3P4j12k8O0J1q6L8K1J8L3J2
6625E5p7N2j7j4P9p4rK9Mn6K8q6J39j19M1Ml6L0L8o7P4j6N2N3m3j55J38j25O1
6654a7k7qK5Q8k2N9j37J15kJ0j33O7K5j74N8M1J06j03m2J02m5M9j1j23J6K01n4
6681F4j3l7q9n4J21m1N5K7m6L2j18K15j82O0p6R4j9Ln8L2RR8q7K6l5j0N3K9l9
6710A4o3J57j35Ql2M4j02J16r0J12n4J5q2Q0r7K2J9J01j13J47j26P6l5P8j46J02
6736A6q8M4K2m6K4J13j07p9O6K3J0k9O9o4R9j11Q6j9M5q2L9l3Q5p3K9n4L8j4Q8
$$ plain form
6765 97 -10 -13 -104 67 -76 -18 81 -14 19 -16 -26 -42 59 -32 60 -64 -31 111 -43 28 -59 277 -158 -25 210
6790 210 -46 98 10 277 61 -533 -44 -318 113 131 171 263 362 626 24 286 150 160 -65 -55 -194 -286 -145
6813 -145 66 309 208 -254 352 -93 -246 457 84 -12 301 -119 142 -435 -198 9 -453 -139 -446 354
6833 354 425 -113 94 -153 -882 -510 368 328 -1290 -109 191 30 206 406 -118 -74 -220 171 -51 -337
6853 -337 -196 88 -292 346 496 40 -154 218 23 307 -178 87 -310 -82 94 281 112 -226 -249 -125
6873 -125 -52 -176 -35 -69 -48 -108 4 166 -2 -12 78 2 61 -34 58 6 87 -18 -14 -5 -1 -40 -114 13 1 -3 -6 -35 -51
6902 -51 -2 84 10 61 -1 17 -98 9 82 -76 72 -28 42 -9 78 -12 44 -44 22 18 -8 19 -118 -1 60 73 128
6929 128 48 6 91 -47 24 -53 22 -105 3 72 49 131 -27 -19 -4 -1 58 -50 -42 47 -79 46 26 -30 66 70 -44 -56
$$ packed form
6765I7j07lr1J71j43N8R9r5L3l5j0j6J01r1R2j24L3J42j54P1q7L36m35J33K35
6790B10k56J44q8K67k16n94M89k74M31J8M0R2R9K64o02K62j36J0k25J0j39r2J41
6813a45K11K43j01m62O06m45j53P03l73r6L13m20K61n77K37K07m62L14l07Q00
6833C54P1n38K07k47p29L72Q78m0j618J181L00j61J76K00n24M4j46L91k22k86
6853c37J41K84l80O38J50m56j94L72j95K84m85K65l97K28J76J87j69l38k3J24
6873a25P3j24J41l4K1o0J12J62j68j0R0p6N9r5R2n2Q1j05MRMl9p4J27j2mlk9j6
6902e1M9Q6p4N1o2J8j15J07P3j58J48j00P0n1Q7r0N6q8O6mk6K7j37J17O1J3N5
6929A28q0m2Q5j38P1p7P5j27J08O9k3Q2j58QJ5LN9j08QQ9j26J25k0n6R6Mj14j2
$$ plain form
6957 -56 54 -76 6 63 -13 -68 28 -1 -94 87 -43 -17 36 -4 50 64 30 -44 69 -41 15 68 35 -11 5 14 2 -32
6985 -32 13 58 0 -52 47 32 -95 32 -21 22 31 -30 30 95 -130 -26 -77 -46 -7 56 43 -10 50 -77 42 -75 11
7012 11 -17 -13 20 -137 -12 12 -95 -36 -61 -60 33 62 67 15 -45 -29 31 3 -27 -79 27 24 -47 -17 20 27 63 -25 -35 -8 8
7043 8 -2 -18 -89 -119 131 -91 65 -37 34 -82 -24 8 -17 -170 -64 52 -66 1 40 -48 -15 43 -9 -17 38 -33 17
7070 17 -22 -23 89 -77 18 -5 38 24 -16 -94 21 16 57 34 50 -37 92 -7 -93 36 -14 -15 -61 89 19 39 95 -20
7098 -20 67 84 -87 3 -64 -35 82 -44 -45 25 -17 -48 76 25 29 -73 -20 45 -81 12 114 131 -46 -19 -96 71 -30
7125 -30 -13 -67 11 16 15 25 17 -3 -14 -105 7 -33 104 0 -61 -69 -31 -5 38 50 -20 96 -61 26 40 110 -2 -16 60
7154 60 -56 18 -42 22 7 28 -82 -115 15 -55 118 -58 42 20 -67 46 61 -10 -13 47 -50 -175 51 -110 -8
$$ packed form
6957e6J10j30Q2N7p6n5R6k9r3J81j30K6N3m0N4J4l4p4J13j10N6N3l3m6J6Rj2l4
6985c2M5M5n8n2R9j5j27J27n3M3Ro1O0O5k25J04n1L1L9O3j3n3O0j27J19j17Q6
7012A1k8ML3j57J25K4j07N9k5JR3K9Nn2o0J6O0k8l0n2J06lp1L0L7PL6q8j0K7J6
7043Hj0j6p1l0K50k22J56j02P1j16N8L2k5j53J06J16j18O7L9q8L3N8n2qN5p1N0
7070A7l9jJ12j66R5k3M3j4m0p8J15nM1k3J6q7J29r9q6J29n0jm6J50p0K0N6j15
7098b0Q7J7j71R0o7K9J17j26jP0m2l1J24n1Mj02N3O5j26R3J02J7j77K7p7J67j01
7125c0J7n4P8NjJ0qk0j1r1J12m0J37j04o1qL8K6M3J2p0J16j57Q7J4P0j12j4P6
7154F0j16P4o0O4j5K1j10l3J30p0J73j76J00k2q7J13J5p1lO0r7j25K26j61J02
$$ plain form
7179 -8 94 -123 -16 -15 16 55 63 -45 36 -70 -45 42 61 -161 58 -31 82 39 30 1 -106 32 60 54 -68 -6 -8 67
7207 67 2 -42 28 -105 33 38 -106 -27 -87 27 126 36 36 -10 -51 55 -5 43 7 28 -66 -121 7 13 -1 -78 2 -58 -29
7236 -29 40 2 25 73 -8 -41 37 27 12 -30 -17 -94 -139 -17 -68 62 5 -83 56 -109 -22 -42 -52 -25 -13 -35 40 -20
7264 -20 10 41 -43 -60 15 -11 -19 35 44 53 60 -22 103 46 -40 -74 29 -73 2 52 -85 11 -2 41 7 122 -47 -112 16
7293 16 -32 91 -64 -68 -5 8 -40 -14 -65 -38 40 -13 -69 62 -89 -75 -37 -25 0 14 14 87 43 13 78 -33 8 42 -23
7322 -23 -37 -61 -9 28 -62 -30 5 16 -137 16 -40 61 48 42 -68 -30 50 20 7 -63 34 16 -100 71 40 -15 -73 51
7350 51 -75 41 -39 -141 16 -193 -144 105 -72 -40 145 -186 144 5 45 -143 -12 -164 79 -149 5 -82
7372 -82 361 -175 -6 423 437 -364 344 247 23 -151 -146 -191 -82 -121 -26 -150 93 57 -273 171 169 -66 388 43
$$ packed form
7179hJ02k17J07JL1L9Qj08Q1j06K5Q7J9k22K19q9J13m3rk9j07J38K8oj22O2kP5
7207F7o5m4P0j33J38Nj44P9o0J14R9r0%m6m1J06o0M8l6K1r4n5J28Oj4p7Q0o0K9
7236b9O9l8K3M8q1l3P8j0j5m2J3p7m5J22n1J30n7q8J39j65Q7k0j0K7J2k2P5o0
7264b0L0L1q4j7P5k6qN4RRPq2J25n7q6l4J03j02P5N0j37R6j3M3l4J15j69o5J28
7293A6m8J23j55mO3J3m8K6n1K7P8n3n6J31j51J4L8J2K5J4%P3m4l0O5j11M1L4o5
7322b3j4k4N2L7r0L2L5J1j53J53n6J01j3oj10L8Q0l0j3p0R7j8j16J71l1n5n8J24
7350E1j26J16q0j02J57k09M9K49j77L2J85l31L30j39M0j88J31j52K43k28J54q7
7372h2M43n36J69M29J4q01P08r7k24j74Nm5J09l9R5j24K43l6l30M44kk35M54l45
$$ plain form
7396 43 357 -35 -42 45 335 -240 -80 11 -148 -118 48 539 -341 21 16 -20 325 -183 -489 22 -505 -121 -7
7419 -7 37 147 125 -270 -15 47 -334 -266 335 -35 260 -36 -507 53 -1 -323 293 295 -28 24 -148 833 284
7442 284 56 490 384 -187 219 -424 -398 -338 756 -322 -318 342 -56 83 -392 -110 -431 159 331 345 141
7463 141 217 90 51 15 121 571 120 275 466 282 -576 -466 583 118 140 -96 -343 463 -702 288 368
7484 368 -6 -309 -35 215 -82 -490 -186 -95 404 1 -853 490 297 -53 -395 -54 164 -29 87 112
7504 112 -367 111 -271 -39 -8 -125 301 39 105 219 280 -242 130 -788 -298 -477 -466 -222 -9 -598 -125
7525 -125 1449 -175 259 127 460 -525 -286 -180 218 -110 22 452 22 93 83 -46 358 -314 29 235
7545 235 -49 -263 -166 -217 263 -122 77 250 -357 21 -210 146 -47 9 233 -340 -171 36 -51 52 -18 -139
$$ packed form
7396D3L14l92pQ7K90n75J60R1j59L0J66M91q80L62nl6L45n08l06N11n27L84J14
7419gM4J10k2l95K55O2l81O8O01l70K95k96m71N60n4l22O16Kl23N2j72R81n49
7442B84k28M34j06n71M06o43K6O0J094j078MO60l98J39m75K82l21N90J72J4k04
7463A41P6j27l9l6J06M50m51J55J91j84q58J10J049m65K2k36k47Q06j165R90Q0
7484C68l74l03K74K50k97m08L04R1M99m03q54J343j93l50l42L41K18j93J16K5
7504A12m79M78l82K32L1j17M26k62O6J14O1n22L72r18M90j79J1K44K13n89M73
7525a25J574j624M34j32L33r85K39J06L98l28J32M30m30P1j0j29M04o72L43K06
7545B35k84k14R7n1M80l85J99J73o07L78k31L56j93N6K24n73J69K07q7J03p0j21
$$ plain form
7567 -139 166 76 45 -104 107 -138 92 176 94 181 -41 41 12 4 -55 64 -30 140 240 -45 -101 16 -29 -211
7591 -211 49 110 -51 -6 -149 2 -1 -132 -44 189 -9 21 -51 123 -112 -13 124 -222 -74 -35 -29 -16 -98 -56 -33
7616 -33 35 182 -293 292 142 -109 -106 109 -525 -534 -159 131 -37 150 37 58 261 99 -76 146 -157 -78 -87
7639 -87 15 -372 -702 -181 -201 559 -533 231 -49 208 165 -35 224 -105 333 1 181 -176 -51 -198 -204
7660 -204 -100 275 289 -89 123 70 152 -640 -595 96 7 -65 13 -96 281 333 65 -500 -194 -1047 -1014 13 -554
7683 -554 -513 -102 -21 -321 210 -790 -454 35 622 -150 -220 198 293 -532 102 -122 380 16 -28 -88 -378 237
7705 237 402 49 -334 39 -201 -469 113 71 579 542 484 297 152 -232 -29 -123 -95 563 656 -49 206 354
7727 354 -221 463 381 -268 -18 622 701 -32 -408 -652 290 346 12 294 139 386 70 -3 76 4 215 76
$$ packed form
7567a39L05r0l1j49K11k45K30Q4q2Q7k22Q2k9qn9J19r4J70J00k85n6J17m5j82
7591b11K60O1j61M5j43J51lj31Q8K33j98L0p2J74k35R9J37l46J48L9OJ3q2M2K3
7616c3O8J47m75N85j50k51LK15o34rL75K90j68J87j13K1K03j62j75K22l03P9r
7639h7J02l87l30N21k0P60j092P64k80K57m3k00K59l29M38l32J80l57J25j47o
7660b04J04L75J4l78K12n3Q2p92M5O91q9p2P8j09L77N2k68n65L06q53L3J027n67
7683e54M1M11Q1l00N31j000L36M89N87p72p0M18R5q25O34k24N02l64m4o0k90O15
7705B37J65l53l83L73k40k68N82m2N08l7n8j87j45l84K03r4K8O58R3p05K55J48
7727C54n75O84q2o49K50O40P9p33l76k44R42N6l34K82j55K47l16p3P9p2K11j39
$$ plain form
7749 76 303 37 285 183 38 -318 -56 78 146 88 -217 117 18 -149 73 147 -110 162 -358 -390 -499 -14
7771 -14 -419 287 600 72 -134 270 -207 179 249 399 219 -19 392 -173 307 214 247 153 217 -255 21 -117
7793 -117 216 -472 251 330 223 198 -408 347 41 -479 217 92 -310 112 99 101 2 247 -244 123 91 -173
7815 -173 173 264 -248 -73 117 -143 6 -179 218 32 -220 -261 -292 322 55 84 188 140 36 17 19 -21 -12 -71
7839 -71 44 18 -49 -28 8 59 14 56 -20 6 2 51 93 71 88 -148 36 57 42 7 123 -8 31 46 -31 17 -53 72
7867 72 42 9 -16 -18 65 -66 -58 -11 18 42 -47 -15 21 37 23 37 39 -63 39 30 12 46 -2 -64 85 64 69 77 8 92 4
7898 4 -52 -16 8 -13 94 24 -35 -4 5 39 40 31 -8 -112 16 21 -8 -4 -36 -17 18 -64 41 -21 -1 -22 -35 -24 43 3 28
7929 28 -44 -65 -54 66 49 42 29 -7 -63 12 -62 8 -7 47 -43 -41 -26 -8 58 27 1 -17 11 -28 32 44 57 -8 23 3 50
$$ packed form
7749G6K27k66K48j02j45l56K62J34O8n8l05L34r9j67K22P4k57K72n20l2j09M85
7771a4m05P06L13n28k06M04m77L86P0J50j80k38M11n65M80r3L3r4O4m72K76j38
7793a17L33o88P23P9j07k5o06P55l06n20O96j25m02M22j3Kr9K45m91L67l2k64
7815a73L46R1n12J75J90k60J49j85L97j86k52m1l1O14k67K9J04m8j04j9Km0Rn9
7839g1J15k6o7K1L6N1m5M2p6K6mM9M2k2J7k36J84K1j5l5J16j31L9J5p7M8p0J25
7867G2l0l3k5kQ3j31QM7K9K4q9L2L6J6j4J4Kj02J02rj8L4m8o2J49k1NQo9Q4q8
7898Dn6L6K4k1J07p0n9L1RL4Jrl9j04J28Nk9Ml2J9L5q2J05o2K0k1j3J1O7m0K5
7929B8p2k1J1J20j7pj3l6n6P5p4P0j5N4r0KJ5J8O6l1k6j8K8l9O0J2J3o5L1k0M7
$$ plain form
7960 50 6 -129 -14 -7 17 -29 -2 50 24 69 -46 40 -16 -99 -23 -24 -88 24 56 -35 17 -24 60 -16 -22 -3 -38 -33 -82 1
7990 1 18 -101 4 53 84 -30 -12 -22 47 16 -32 70 -82 52 -37 -55 38 -49 21 -51 -2 38 -44 -58 -11 17 -99
8017 -99 -98 -10 9 86 2 -40 1 -52 -53 -77 -50 -57 -79 -51 30 44 -45 -27 -39 53 -20 -45 32 54 28 -21 -86 -38 6 22 54 -62
8049 -62 25 -46 50 -116 81 -79 -7 103 40 31 -115 66 -53 23 43 -81 14 25 -140 -34 -20 20 22 16 -5 17 44
8076 44 18 24 -64 23 -35 -48 -70 -95 -12 4 -131 1 -56 -27 4 -85 -34 97 37 -53 -35 63 -71 3 -75 -21 -37 -11 4
8105 4 -40 21 17 106 14 68 55 33 55 0 -25 -24 -54 18 38 -72 -52 15 93 49 -36 -1 71 100 -4 79 18 48 86 -70
8135 -70 -57 -109 23 -201 88 130 -3 -52 -215 63 130 273 241 -152 -240 -262 -63 -306 247 281 -239 -132 -280
8158 -280 106 204 113 -122 49 -110 -275 -23 340 31 39 39 80 -75 -68 88 -6 126 46 38 -194 -26 -50 106 170
$$ packed form
7960E0m4j35J15PK4m6K7N2k6M5j15Q6n6q3P6jo4J12L2r1N2m1Q4p6oJ9l5Nm9Q3
7990AJ7j19J05M9L1j14J8j0O9l1m8J02j52J34q9j8R3q7P0p2M9M0q2j4M7K8j16
8017i9JQ8J9P7q4m2M1n3jk4K7pk2K8Q1J4q9J8j2R2p3k5P7K2k6m9o5M8M4J6L2j16
8049f2Q7p1R6j66J97j60P2J10o3rj46J81j19P6K0j24R5J1j65J06J4M0Kok1K2K7
8076D4k6Oq8Q7n8j3k2k5Q3J6j35J32n7K9L1q9N1J31o0r0J8R8j34P4p8N4j6K6J5
8105Dm4O1mQ9r2N4j3k2K2n5k5Jl0P2K0j10K0O7P8m4q5L5P2K9j04Q3o1L0L8j56
8135g0J3n2J32k24K89M2j33m9j63K78O7J43l2l93q8k2J99k43N53L4n20J07j48
8158b80L86R8r1k35J71j59j65K52L63l09Q%M1j55PJ56r4J32q0qk32J68k4J56O4
$$ plain form
8183 170 -54 3 -91 -84 101 -16 42 -88
$$ packed form
8183A70k24N7r4PJ85j17N8j30
8191h8
$$ Imaginary data points
##PAGE= N=2
##DATA TABLE= (X++(I..I)), XYDATA
$$ plain form
0 0 0 0 0 0 0 0 0 0 3 0 8 -8 8 -16 16 -24 32 -32 40 -55 64 -77 88 -104 126 -144 168 -198 227 -262 298 -342
32 -342 386 -437 494 -557 625 -703 785 -878 975 -1086 1204 -1333 1475 -1629 1799 -1984
48 -1984 2186 -2409 2653 -2923 3222 -3553 3925 -4343 4817 -5362 5992 -6731 7618 -8698
62 -8698 10049 -11796 14154 -17526 22777 -32133 53881 -212441 50299 271936 -347854 -182442
74 -182442 157984 59134 -155134 -65840 91760 103876 -138252 -57753 163626 31554 -122523
85 -122523 96924 123349 -44568 71321 119929 -28290 41632 106734 -10978 -28245 47977
96 47977 32663 8428 -53671 31916 102848 -73315 -92220 105431 31230 -143669 -55017 44599
108 44599 4680 -116798 -84535 102098 24166 -153941 -2029 152414 -61121 -118740 87133
$$ packed form
0@%%%%%%%%LlQj6J6k4L2m0N6o4P2r5J19j41J65j92K30k70L12l66M25m89N60o40
32c42P28q23R31j051J182j328J488j663J853k061K290k537K808l104L428l783
48a984M170m595N062n576O145o775P478q268R160j0179J1354j2723J4349j6316
62h698J8747k1845K5950l1680M0303n4910Q6014k66322K62740K21637o19790J65412
74a82442L40426r8850k14268Q9294J57600J2116k42128Q0499K21379j32072j54077
85a22523K19447K6425j67917J15889M8608j48219O9922O5102j17712j7267P6222
96D7977j5314k4235o2099Q5587P0932j76163j8905J97651p4201j74899Q8652R9616
108D4599l9919j21478L2263J86633p7932j78107J51912J54443k13535n7619K05873
$$ plain form
119 87133 59907 -65498 -4236 51503 33609 46267 5084 49925 86105 1476 36072 66053
131 66053 -16176 35797 79436 -62410 16506 136751 -36683 -66020 102444 53480 -84890
142 -84890 -19032 41091 -8133 -68678 -49285 30105 -4232 -85712 -23944 55807 -48440 -70982
154 -70982 18626 -20084 -47634 -10883 -26503 -27179 13261 -11705 -4479 14974 2570 23985 3381
167 3381 -13704 29123 26235 -35037 3502 55589 7412 -14294 18535 47433 16121 -22884
179 -22884 -2152 45858 -8962 -63913 24513 35780 -55047 -31744 47097 -2468 -41633 -6484
191 -6484 3901 -7311 -42031 -23200 9730 -26994 -41210 18522 3303 -37028 16283 14360
203 14360 -25677 -1463 23166 -19419 -19814 22146 8832 -5949 821 24835 24981 1301 2943
$$ packed form
119H7133k7226j25405O1262N5739j7894J2658m1183M4841L6180q4629L4596K9981
131F6053q2229N1973M3639j41846P8916J20245j73434k9337J68464m8964j38370
142h4890O5858O0123m9224o0545J9393P9390l4337q1480O1768P9751j04247k2542
154g0982Q9608l8710k7550L6751j5620o76M0440k4966P226J9453j2404K1415k0604
167C381j7085M2827k888o1272L8539N2087m8177k1706L2829K8898l1312l9005
179b2884K0732M8010n4820n4951Q8426J1267r0827K3303P8841m9565l9165L5149
191f484J0385j1212l4720J8831L2930l6724j4216N9732j5219m0331N3311j923
203A4360m0037K4214K4629m2585l95M1960j3314j4781O770K4014J46k3680J642
$$ plain form
216 2943 32864 8438 -22111 23141 16178 -14877 4228 18237 2992 7743 10161 192 9501
229 9501 -7179 -5169 2592 -13839 -18050 1979 598 -18500 -234 3586 -4713 -8813 -4458 -3963
243 -3963 -9407 -17786 -11774 12247 -14297 -16392 15249 8130 -6212 7480 8356 -3538 7065 -2255
257 -2255 764 6084 2104 5481 7517 12390 13568 10886 -3279 13799 17762 -11145 -10786 15443
271 15443 7614 -19751 4444 14194 -128 -7870 -600 10375 -4535 -21113 -9673 8177 -16574
284 -16574 -17471 -1703 -2192 -1679 -7602 -4741 1976 1822 -16160 -7700 5147 -5164 -12302 -3075 12037
299 12037 3483 761 191 13789 13938 -6651 -479 12444 6159 -7225 3760 11002 13392 -441
313 -441 -2466 22390 10458 -10989 -3611 13438 -2612 -13822 -4483 4418 946 -12125 -1915
$$ packed form
216B943K9921k4426l0549M5252o963l1055J9105J4009j5245M751K418r969R309
229I501j6680K010P761j6431m211K0029j381j9098J8266L820q299m100M355M95
243c963n444q379O012K4021k6544k095L1641p119j4342J3692Q76j1894J0603r320
257b255L019N320l980L377K036M873J178k682j4165J7078L963k8907L59K6229
271A5443p829k7365K4195R750j4322p742P270J0975j4910j6578J1440J7850k4751
284a6574q97J5768m89N13n923K861O717j54j7982Q460J2847j0311p138R227J5112
299A2037q554k722n70J3598J49k0589O172J2923o285j3384J0985P242K390j3833
313d41k025K4856j1932k1447P378J7049j6050j1210R339Q901l472j3071J0210
$$ plain form
326 -1915 5036 243 -14341 -8044 2561 -8992 -14039 -10698 -385 -1375 -5095 -7846 7019 8483
340 8483 -7916 -611 5806 4993 -5780 -2834 8941 11105 -766 920 19177 12576 2996 1568
354 1568 13749 8947 -3833 -530 6519 8341 -5077 -1928 9642 9412 -8767 -5693 8192 -2151
368 -2151 -11698 -12958 1267 -2558 -14662 -8543 5704 -758 -12980 -1491 3286 -470 -12608 -5711
382 -5711 5960 -1361 -8140 -702 12608 3015 -1148 6719 12723 1987 -1648 7610 5203 3391
396 3391 -2443 5395 8847 3583 2185 4659 4360 651 1821 -6865 -2077 -741 -7579 -8916 -1735
411 -1735 1500 -11544 -9207 642 -387 -14910 -11544 -1211 -4599 -13659 -14121 5178 -847 -13962
425 -13962 -3283 11130 -1198 -13080 2626 8242 -2641 -10821 4749 7836 -850 -565 4170
$$ packed form
326a915O951m793j4584O297J0605j1553n047L341J0313r90l720k751J4865J464
340H483j6399P305O417q13j0773K946J1775K164j1871J686J8257o601r580j428
354A568J2181m802j2780L303P049J822j3418L149J1570k30j8179L074J3885j0343
368b151r547j260J4225l825j2104O119J4247o462j2222J1489M777l756j2138O897
382e711J1671p321o779P438J3310r593m163P867O004j0736l635R258k407j812
396C391n834P838L452n264j398K474k99l709J170q686M788J336o838j337P181
411a735L235j3044K337R849j029j4523L366J0333l388r060m62J9299o025j3115
425a3962J0679J4413j2328j1882J5706N616j0883q180J5570L087q686K85M735
$$ plain form
438 4170 12097 2701 -2876 4478 10722 -3669 -6304 5643 2827 -1866 -3090 3635 1832 2433 -2525
453 -2525 -4451 4667 -1054 -10048 -4017 6199 -6147 -6038 2241 2862 3074 -3435 -464 6459 4948
468 4948 -7970 874 10919 233 -2997 7537 12044 1631 6276 6593 6881 9989 938 -428
482 -428 10176 9887 -5410 3583 12877 6014 -1954 2401 10774 2920 -4725 -4756 8737 2717 -13731
497 -13731 -3373 13003 -1991 -16798 6349 8145 -10526 -10320 3309 -190 -10723 -6594 -1887
510 -1887 2023 -5945 -6398 1642 3154 -6141 -5393 4316 -5016 -4401 356 -3119 -3417 4577 -463 -6290
526 -6290 5858 3767 -4624 -4928 4097 1083 -6877 -5465 1394 5628 -8797 -7352 8398 4478 -15199
541 -15199 -4491 11709 -7195 -15042 113 6893 -8789 -9115 2890 4535 -3936 -8307 4528
$$ packed form
438D170P927r396n577P354O244j4391k635J1947k816m693j224O725j803O01m958
453b525j926R118n721q994O031J0216j2346J09Q279O21K12o509K971O923j511
468D948j2918Q844J0045j0686l230J0534M507j0413M645L17K88L108r051j366
482d28J0604k89j5297Q993R294o863p968M355Q373p854p645l1J3493o020j6448
497a3731J0358J6376j4994j4807K3147J796j8671K06J3629l499j0533M129M707
510a887L910p968m53Q040J512r295P48R709r332O15M757l475k98P994n040n827
526f290J2148k091q391l04R025l014p960J412O859M234j4425J445J5750l920j9677
541a5199J0708J6200j8904p847J5155O780j5682l26J2005J645q471m371J2835
$$ plain form
554 4528 4162 -5931 -6929 6188 3079 -7221 1745 6466 1935 248 5414 1410 4018 5042 -1914
569 -1914 1970 6024 2995 -2644 5500 6259 1676 1132 2124 5523 1808 -2520 -2443 6446 -388 -6880
585 -6880 1787 5168 -1496 -5281 3136 2252 -1636 -5524 -1147 3563 -3457 -5818 -108 6312 -3084
600 -3084 -4089 4146 4531 -2177 -2565 3272 1597 1381 -3429 914 6626 1951 -3251 2043 9685 -761
616 -761 -4670 2563 6687 -2764 -6153 2974 4718 -1559 -7369 4045 5908 -5027 -6785 3797 2938
631 2938 -8624 -4169 1477 1224 -5610 -3164 2239 1559 -2237 -4623 2544 1885 -2475 -4403 1855 3048
647 3048 -1632 -1659 1149 6280 -367 -2039 2044 4656 488 -4395 630 4652 1639 -6268 1467 6821
663 6821 188 -5945 -22 7839 -2784 -8272 78 6985 -4835 -8787 3642 5546 -4665 -7412
$$ packed form
554D528l66j0093r98J3117l109j0300Q966M721m531j687N166m004K608J024o956
569a914L884M054l029n639Q144P59m583n44R92L399l715m328P7Q889o834o492
585f880Q667L381o664l785Q417q84l888l888M377M710p020k361N710O420r396
600c084j005Q235L85o708l88N837j675k16m810M343N712m675n202N294P642j0446
616g61l909P233M124r451l389R127J744o277n810J1414J863j0935j758J0582q59
631B938j1562M455N646k53o834K446N403o80l796k386P167o59m360j928O258J193
647C048m680k7K808N131o647j672M083K612m168m883N025M022l013p907P735N354
663F821o633o133N923P861j0623n488Q350O907j1820l952J2429J904j0211k747
$$ plain form
677 -7412 5154 3043 -5338 -5068 2420 2911 -4898 -3529 2362 4119 -3476 -1470 3027 2743 -198 -3334
693 -3334 1843 2958 574 -3590 1649 4943 772 -2081 1028 6206 56 -2849 -523 5428 402
708 402 -6213 1249 5427 -249 -5981 2345 4920 -1158 -5934 572 5387 -4300 -5519 1477 4195
723 4195 -4048 -3639 2912 2143 -1955 -3224 2123 467 -844 -2535 -330 1863 274 -705 -1403 3854
739 3854 1874 -2208 -2067 4444 1664 -5092 -350 3019 1375 -4951 432 4541 86 -4227 258
754 258 4780 -2605 -4042 310 3736 -2975 -3243 2328 1600 -1097 -3133 2015 1078 -2156 -2462 509
770 509 917 -2039 -31 -2 1803 -369 -1211 35 1818 687 -2887 580 1481 1742 -1969 16 3419
787 3419 1101 -1926 63 4928 -544 -2193 230 3625 -438 -2971 2146 1720 -899 -2550 2859
$$ packed form
677g412J2566k111q381K70P488M91p809J369N891J757p595K006M497k84k941l136
693c334N177J115k384m164N239L294m171k853L109N178o150k905K326N951n026
708D02o615P462M178n676n732Q326K575o078m776O506M815r687j219O996K718
723D195q243M09O551p69m098j269N347j656j311j691K205K193j589r79o98N257
739C854j980m082J41O511k780o756M742L369j644o326N383M109m455m313M485
754B58M522p385j437M352L426o711k68N571p28k697k036N148r37l234l06K971
770E09M08k956K008K9J805k172q42J246J783j131l574L467R01K61l711J985L403
787C419k318l027J989M865n472j649K423L395m063k533N117m26k619j651N409
$$ plain form
802 2859 1435 -1969 -1638 1245 706 -3325 -765 -224 729 -1554 -918 555 289 43 -1934 807 149
819 149 -335 -1716 646 1898 -814 -412 674 3531 -666 -1144 1627 2705 -799 -1944 2749 1656
835 1656 -473 -1613 3384 2429 -1678 -790 2450 2236 -3358 -643 2092 1036 -2667 -490 2556 59
851 59 -1169 -1408 2489 -13 -2570 -1120 1797 70 -3229 219 861 835 -1947 -244 1223 160 -1331
868 -1331 -1471 2165 -324 -1692 -991 2190 280 -1862 41 714 1349 -2127 -712 112 646 -1491 -2151
885 -2151 1166 405 -1434 -2714 2020 249 -2658 -2318 352 1257 -3415 -2576 618 1863 -3671 -2226
901 -2226 2668 75 -3200 -1618 2897 -787 -2414 -1164 2017 1583 -2602 -526 2824 1736 -2944
916 -2944 1307 2523 -457 -332 576 1911 717 598 -761 2822 2158 -1047 84 2153 1765 -1420
$$ packed form
802B859j424l404L31K883n39m031K560N41R53k283O36J473k66k46j977K741o58
819A49m84j381K362J252k712M02J086K857m197m78K771J078l504j145M693j093
835A656k129j140M997r55m107Q88L240k14n594K715K735j056l703K177L046k497
851E9j228k39L897k502k557J450K917j727l299L448O42k6k782J703J467j063j491
868a331j40L636k489j368P01L181j910k142J903O73O35l476J415Q24N34k137o60
885b151L317p61j839j280M734j771k907L40K670R05m672Q39L194J245n534J445
901b226M894k593l275J582M515l684j627J250L181m34m185K076L350j088m680
916b944M251J216k980J25R08J335j194j19j359L583o64l205J131K069l88l185
$$ plain form
932 -1420 831 784 1519 -100 -800 2071 1733 -736 -1616 2935 736 -1763 -822 1444 1041 -1680 110
949 110 484 1526 -774 -580 1035 1308 -893 -1812 2280 657 -938 -930 1693 1431 -577 -455 332 2597
967 2597 -1276 -1610 1477 2094 -3006 -1388 3756 -497 -2154 -523 1676 -616 -1626 -1468 570 771
983 771 -3843 -513 1738 -1266 -3309 1136 884 -2670 -405 -493 -278 -700 -142 -1274 532 597 -1168
1000 -1168 977 152 561 -181 283 198 1303 180 -1442 1837 1462 -375 -1601 2406 1519 -1967 -227
1017 -227 1693 551 -2768 404 1445 -186 -2257 -101 1957 -799 -1696 -885 2098 -1597 -2217 908
1033 908 629 -1766 -1175 1594 -629 212 -841 -80 1366 -28 -1024 -94 1920 -593 44 487 957
1050 957 668 -395 190 1291 1511 -2598 378 2472 -306 -1898 213 2131 -631 -1153 -359 2154
$$ packed form
932a420K251m7P35j619p00K871l38k469q80M551k199k499R41K266m03k721J790
949A10L74J042k300J94J615K73k201r19M092j623j595QK623k62k008J22P87K265
967B597l873l34L087O17n100J618N144m253j657J631K199k292j010J58K038K01
983G71m614L330K251l004k043M445k52l554K265q8K15m22N58j132J806O5j765
1000a168K145q25M09p42M64q5J105j123j622L279l75j837j226M007q87l486J740
1017b27J920j142l319L172J041j631k071K156K058k756q97Q11K983l695o20L125
1033I08k79k395N91K769k223Q41j053P61J446j394r96R30K014k513O37M43M70
1050I57k89j063N85J101K20m109K976K094k778j592K111J918k762n22P94K513
$$ plain form
1066 2154 -843 -2332 672 1184 -1007 -2479 1105 931 -446 -1783 450 1482 -663 -778 -16 1752
1082 1752 -629 -477 577 1408 668 -1281 840 1879 1006 -2094 889 2173 -12 -1124 -124 2532
1098 2532 -262 -1462 201 2610 -792 -2315 1105 1369 -938 -2585 866 927 -658 -1926 -3 1538
1114 1538 -1524 -1440 52 1206 -1525 -1192 48 722 61 -2163 498 1246 209 -1927 254 1507
1130 1507 -192 -1055 -582 2280 -208 -1446 74 2533 108 -2316 914 1716 151 -2254 572 1520
1146 1520 -292 -1847 105 2339 -1291 -1213 477 1697 -1121 -1399 754 830 -167 -1759 724 759 -55
1163 -55 -1148 291 1197 -320 -546 -331 1739 -302 -1044 134 1599 361 -1572 554 1110 581 -1663
1180 -1663 197 1488 -42 -1438 89 2049 -1106 -837 174 1231 -335 -1713 86 903 116 -2255
$$ packed form
1066B154k997j489L004N12k191j472L584j74j377j337K233J032k145j15P62J768
1082A752k381J52J054Q31p40j949K121J039q73l100K983J284k185j112J000K656
1098B532k794j200J663K409l402j523L420K64k307j647L451O1j585j268J923J541
1114A538l062Q4J492J154k731L33J240O74o61k224K661P48j037k136K181J253
1130A507j699q63M73K862k488j238J520K459k425k424L230Q02j565k405K826R48
1146A520j812j555J952K234l630P8J690J220k818k78K153P6r97j592K483L5q14
1163e5j093J439R06j517k26K15K070k041p42J178J465j238j933K126N56n29k244
1180a663J860J291j530j396J527J960l155K69J011J057j566j378J799Q17p87k371
$$ plain form
1196 -2255 619 735 -746 -1411 153 1314 -1116 -584 -568 1418 -454 -1254 -318 1213 289 -1600 1059
1213 1059 397 -121 -1403 129 1294 -265 -1051 486 1489 -906 -1287 786 1543 -595 -1495 867
1229 867 1082 335 -1083 1000 1579 -563 -921 71 1674 -273 -971 -164 1226 -699 -953 -63 931 -729
1247 -729 -976 1054 764 -573 -668 351 780 -1387 -926 166 1388 -428 -1079 197 755 -335 -1197
1264 -1197 935 863 207 -1745 1085 1508 -665 -862 361 1456 -1086 -910 32 1597 -393 -1265 1085
1281 1085 981 -226 -1378 1352 667 -346 -810 609 1149 -697 -116 -121 650 -697 -718 544 403 224
1299 224 -836 472 628 -100 -1145 925 995 -166 7 77 1655 -454 -667 880 1123 -447 -858 879
1317 879 879 -57 -1339 1506 1245 -578 -1354 154 1493 -806 -665 261 791 -1362 -968 314 -150 -775
$$ packed form
1196b255K874J16j481o65J564J161k430N32J6J986j872q00R36J531r24j889K659
1213A059o62n18j282J532J165j559p86J537J003k395l81K073P57k138r00K362
1229H67K15p47j418K083N79k142l58R92J603j947o98Q07J390j925k54Q90R94j660
1247g29k47K030k90j337r5J019M29k167M61J092J222j816o51J276N58j090q62
1264a197K132p2o56j952K830M23k173j97J223J095k542J76R42J565j990q72K350
1281A085j04j207j152K730o85j013m64J419N40j846N81nP71j347k1J262j41j79
1299B24j060J308J56p28j045K070P0j161J73P0J578k109k13J547K43j570m11J737
1317H79%r36j282K845k61j823p76J508J339k299J41R26N30k153L94J282m64o25
$$ plain form
1335 -775 -1267 411 -220 -309 -1272 44 468 -800 -798 -469 434 -442 -567 -194 625 -76 -948 403 393 -6
1355 -6 -1623 216 670 -550 -476 374 1288 -981 178 170 1095 -279 -1293 698 359 -335 -1204 871 723
1374 723 -219 -791 298 1027 -626 -504 -257 833 -938 -728 387 805 103 -961 669 392 165 -361
1392 -361 242 512 -69 -366 100 1250 -733 -89 791 849 -505 -502 1113 -87 -166 -636 533 277 -138
1411 -138 -553 -100 635 -1172 13 243 143 -794 -36 184 -558 -117 -750 563 135 -135 -371 -53 618
1430 618 -969 -137 -310 1006 -600 -752 102 760 -106 -923 602 554 -41 -787 992 552 -700 349
1448 349 513 689 -537 -139 716 303 -367 39 890 -459 -528 -570 1033 -369 -554 548 221 39 -278
1467 -278 395 154 588 -552 -341 394 261 -192 -335 666 -291 -72 -508 232 497 -655 -229 303 764
$$ packed form
1335g75m92J678o31q9r63J316M24j268KL29R03q76j25L73Q19p01q72J351j0l99
1355fj617J839M54j220P4Q50R14k269J159qR25j374j014J991l39o94q69K075j48
1374G23r42n72J089P29j653J22K47J090j771K10J115M18p02j064J630k77k27n26
1392c61O03K70n81k97M66J150j983O44Q80N8j354LJ615j200p9m70J169k56m15
1411a38m15M53P35j807J185K30j00r37P58K20p42M41o33J313m28k70k36L18O71
1430F18j587Q32j73J316j606j52Q54O58q66q17J525m8n95p46J779m40j252J049
1448C49J64J76j226L98Q55m13o70M06Q51j349o9m2J603j402j85J102l27j82l17
1467b78O73k41M34j140K11P35j33m53j43J001r57K19m36P40K65j152M26N32M61
$$ plain form
1486 764 -1112 -63 545 184 -524 -318 731 -249 -518 -828 537 218 -792 -102 28 183 -972 112
1504 112 383 243 -758 -281 431 -285 -194 -586 731 -8 -477 -547 441 601 -1027 149 489 739 -1151
1523 -1151 -66 1176 366 -210 -707 1560 -11 -560 -382 1276 11 -340 413 530 543 -1295 -180
1540 -180 654 -92 16 290 800 -160 -687 -893 463 -59 -347 -515 129 1474 -1046 -114 352 21 -677
1559 -677 -800 724 476 -1034 -873 1308 210 -650 -458 1022 -225 -916 -307 483 719 -1106 -84
1576 -84 256 -26 -699 -4 873 -879 -367 -599 1207 579 -950 -28 562 140 -1234 538 641 -90 -658
1595 -658 -466 551 506 127 -306 1008 175 -681 179 551 276 -621 519 505 917 -912 -261 1243 8
1614 8 -469 -244 1357 107 -202 -154 -15 647 -477 129 1101 481 -426 325 702 87 -193 -294 701 -193
$$ packed form
1486G64j876J049O08l61p08K06J049r80k69l10J365l19j010O90J30J55j155J084
1504A12K71j40j001M77P12p16R1l92J317p39m69p0R88J60j628J176L40K50j890
1523a151J085J242q10n76m97K267j571n49J78J658j265l51P53J17J3j838J115
1540a80Q34p46J08K74N10r60n27k06J356n22k88j68O44J345k520R32M66l31o98
1559f77j23J524k48j510J61K181j098q60J92J480j247o91O09P90K36j825J022
1576h4L40k82o73O95Q77j752N12k32J806o28j529R22N90m22j374J772J03p31n68
1595f58J92J017m5l79m33J314q33q56Q60L72k75q97J140j4M12j829O51J504j235
1614Hm77K25J601j250l09M8J39O62j124O06R72o20r07P51L77o15k80j01R95q94
$$ plain form
1634 -193 -123 -642 912 -325 -547 44 347 31 -674 544 -243 169 -884 5 679 -236 -458 -348 560
1653 560 -33 -351 -302 425 374 -785 352 368 249 -620 357 372 -31 -322 -268 691 -256 -387 -245 763 -165
1674 -165 -617 396 289 218 -642 96 410 253 -694 64 555 -344 -225 -164 622 -29 -164 9 524 205
1694 205 -651 192 393 81 -584 218 428 -32 -190 -126 785 -227 -498 -14 608 -141 -545 257 236 171 -711
1715 -711 133 205 -161 -678 -157 506 -402 -349 -386 480 -322 -463 -134 244 76 -899 33 98 -64 -644 18
1736 18 441 -203 -275 -96 666 -288 -223 132 480 103 -609 477 298 253 -486 292 484 -83 -438 149 736
1757 736 -404 -50 -55 499 29 -466 232 262 31 -547 401 244 13 -231 -51 457 -278 -141 -227 604 -251
1778 -251 -251 -212 125 -179 -412 378 68 -190 -434 206 309 -425 -483 -84 353 -407 -218 -20 273 -224 -36
$$ packed form
1634a93P0n19J554j237k22N91L03l16p05J218p87M12j053Q89O74r15k22J10R08
1653E60n93l18M9P27n1j159J137J6j19q69R77J5m03k91N4R59r47j31J42J008r28
1674a65m52J013j07p1q60P38L14j57r47P58M91q99J19O1P86o51j35J73N15l19
1694B05q56Q43K01l12o65Q02K10m60j58O4R11j012k71M84O22p49m04Q02k1o5q82
1715g11Q44P2l66n17N21O63r08N3l7Q66q02j41L29L78j68r75R32O5j62n80O62
1736A8M23o44p2J79P62r54O5L55L48l77p12J086j79m5p39P78J92n67l55N87N87
1757G36j140L54nN54m70m95O98L0k31n78R48j57k31k44J80N08p35J37q6Q31q55
1778b51%L9L37l04k33P90l10k58k44O40J03p34n8L99M37p60J89J98K93m97J88
$$ plain form
1799 -36 255 -205 -171 -268 -77 34 -816 -723 -91 382 -398 -555 -6 292 -226 -610 252 160 -30 -623 261 276
1821 276 10 -366 219 503 -218 -198 74 589 -328 -263 152 420 59 -335 428 240 77 -377 321 328 -168
1842 -168 -254 -35 594 -434 -165 -80 336 -91 -446 261 142 -136 -586 269 224 -192 -371 62 470 -416 -31
1863 -31 -105 519 -210 -417 60 202 28 -572 449 66 -147 -390 168 238 -232 -181 -24 537 -396 -166 9
1884 9 359 -231 -475 472 26 -49 -447 297 132 -299 -279 77 470 -373 -94 78 461 -395 -216 354 90
1905 90 75 -332 444 50 75 -239 252 456 -303 -41 118 518 -416 18 233 169 31 -354 383 88 25 -367
1927 -367 405 268 -249 -183 12 453 -567 10 46 255 -335 -374 225 16 -14 -453 417 28 -265 -168 74
1948 74 162 -380 -12 -109 285 -248 -157 247 230 -91 -416 473 -4 -167 -316 277 182 -226 -55 -40 460 -391
$$ packed form
1799c6K91m60L4r7J91J11q50R3O32M73p80j57N49K98n18l84Q62r2j90n93Q84J5
1821B76k66l76N85K84p21K0K72N15r17O5M15K68l61l94P63j88j63m54O98Pm96
1842a68q6K19O29j028K69Q5M16m27l55P07j19k78m50Q55m5m16j79M33M08q86L85
1863c1p4O24p29k07M77J42j74o00J021l83k13k43N58P0m70N1J57N61r33K30J75
1884IL50n90k44R47m46p5l98P44j65m31K0L56L93q43K79J72L83q56J79N70k64
1905I0j5m07P76l94K5l14M91K04p59K62J59M00r34M34K15o4j38l85P37k95o3l92
1927c67P72j37n17O6J95M41j020N77L6K09n90l9N99k09l0m39Q70l89k93R7K42
1948G4Q8n42L68r7L94n33R1M04j7l21l25Q89m77j63j49N93r5m08J71J5N00q51
$$ plain form
1970 -391 -125 184 211 -180 -425 408 -1 -11 -340 327 45 -151 -119 128 246 -417 49 323 267 -159 418
1991 418 351 613 -34 -425 454 58 -3 -157 328 378 -240 11 63 361 -370 -99 151 167 -206 -306 324 22
2013 22 -36 -411 246 104 -284 -114 36 351 -452 74 -46 167 -306 -164 246 -133 -29 -443 432 -121 -174
2034 -174 -140 8 257 -438 31 -43 371 -282 -82 206 85 -81 -311 342 48 9 -296 367 227 -395 -14
2055 -14 127 290 -430 155 136 137 -119 -192 379 -127 46 -252 339 -2 -115 33 78 160 -271 82 92 299 -298
2078 -298 -53 337 -28 19 -195 298 -85 -105 -201 153 129 -427 43 63 183 -465 -58 53 -9 -228 -323 382
2100 382 -250 -169 -151 161 -61 -203 37 5 278 -475 66 32 131 -246 -180 241 -38 -186 -263 478 -135 -178 -446
2123 -446 -137 135 -556 -346 100 545 -569 561 -422 -228 196 -374 81 -299 -67 54 390 114 -276
$$ packed form
1970c91K66L09K7l91k45Q33m09j0l29O67k82j96L2K47J18o63M66K74n6m26N77
1991D18o7K62o47l91Q79l96o1j54M85N0o18K51N2K98p31K71K50J6l73j00O30l02
2013B2n8l75O57j42l88J70J50L15q03N26j20K13m73J42M10l79J04m14Q75n53n3
2034a74L4J48K49o95M69p4M14o53K00K88j21j66k30O53k94l9l05O63j40o22L81
2055a4J41J63p20N85j9Jk56p3N71n06J73k98N91l41j13J48M5Q2m31L53J0K07n97
2078b98K45L90l65M7k14M93l83k0r6L54k4n56M70K0J20o48M07J11o2k19r5P05
2100C82o32Q1J8L12k22j42K40l2K73p53N41l4R9l77O6M21k79j48p7P41o13m3k68
2123d46L09K72o91K10M46M45j114J130r83J94M24n70M55l80K32J21L36k76l90
$$ plain form
2142 -276 123 145 212 -397 185 336 59 -183 9 362 -219 35 -127 313 11 -326 33 177 160 -339 149
2163 149 -126 118 -362 -86 289 -194 -139 -98 330 -304 -205 -56 180 92 -394 134 54 95 -414 -51 203 -25
2185 -25 -57 -71 265 -231 1 -186 299 -52 -257 186 65 307 -424 51 214 230 -273 21 397 329 -107 -376
2207 -376 148 99 -214 -63 -57 378 -43 -9 32 121 -491 -120 -206 25 224 -305 176 311 -176 56 268 -487
2229 -487 -421 -113 560 -310 -457 -458 -136 404 105 -928 673 -114 -76 -115 1192 -7 -296 119 -686 -263
2249 -263 -759 187 -258 -653 -221 216 537 228 -36 -835 60 -190 -574 552 183 236 -98 752 1338 548
2269 548 -364 -228 -278 -582 -63 -262 509 -523 -28 -52 -135 61 -231 377 454 310 -398 -8 190 36 -532
2290 -532 362 3 -355 128 80 352 -122 -142 49 17 18 -236 217 -116 49 -188 65 140 -91 -74 -58 328 -240
$$ packed form
2142b76L99K2O7o09N82J51k77k42J92L53n81K54j62M40l02l37L59J44j7m99M88
2163A49k75K44m80K76L75m83N5M1M28o34R9J49K36q8m86N28q0M1n09L63K54k28
2185b5l2j4L36m96K32j87M85l51k05M43j21K42p31M75J63J6n03K94L76o8m36k69
2207c76N24m9l13J51OM35m21L4M1Q9o12L71q6K31J99n29M81J35m87K32K12p55
2229d87O6L08O73q70j47jL22N40k99j033J601p87L8l9J307j199k89M15q05M23
2249b63m96R46m45l95M32M37L21l09k64p99Q95k50l84J126l69N3l34Q50N86p90
2269E48r12J36n0l04N19j99P71j032M95k4q3J96k92O08P7j44p08L90J98j54n68
2290e32Q94l59l58M83m8K72m74k0J91l2Jk54M53l33J65k37K53P5k31J7J6L86n68
$$ plain form
2313 -240 -29 -64 186 35 -332 163 -169 54 -326 145 142 -155 -281 -40 280 -214 -45 -83 177 -162 -163 74
2335 74 9 -16 -311 110 -4 -29 -140 -150 418 -53 -22 -83 179 -162 13 80 93 149 -222 292 201 98 -234 197
2359 197 240 -78 -9 -6 326 -149 -7 26 195 -1 -155 246 31 177 -232 180 -4 -43 -123 -46 189 -183 36
2382 36 -199 276 -87 -159 97 32 -65 -275 175 -43 77 -227 129 -26 -220 57 -197 368 -241 -53 64
2403 64 92 -122 -175 160 -52 -6 -261 90 -73 -105 -179 -164 213 -198 148 161 222 -259 -156 104 -11 12 -211
2426 -211 190 67 33 -134 37 229 -173 28 -77 288 -176 144 74 139 -3 -248 239 -54 -97 -261 220
2447 220 308 -62 -18 43 149 -229 -1 1 123 -152 -225 97 -74 -12 -341 112 -101 38 -126 2 211 -162
2469 -162 -155 -80 66 238 -8 92 67 23 -39 527 275 73 114 -28 60 -323 310 -404 -291 235 -425 451 94
$$ packed form
2313b40K11l5K50j51l67M95l32K23l80M71lk97j26K41L20m94J69l8K60l39jK37
2335G4o5k5k95M21j14k5j11j0N68m71L1o1K62l41J75O7J3N6l71N14r1j03l32M31
2359A97M3l18O9LL32m75J42L3J69j96j54M01k15J46m09M12j84l9q0P7K35l72K19
2382C6k35M75l63p2K56o5r7k10M50k18J20l04L56j55j94K77k54N65o09J88J17
2403F4K8k14n3L35k12M6k55L51j63l2p4J5L77m11L46J3O1m81J03K60j15K3k23
2426b11M01j23l4j67J71J92m02K01j05L65m64L20p0O5j42k45M87k93m3j64M81
2447B20Q8l70M4O1J06l78K28KJ22k75p3L22j71O2l29M53k13J39j64J28K09l73
2469a62PP5J46J72k46J00k5m4o2N66k52k02M1j42Q8l83O33p14J13N26o60Q76l57
$$ plain form
2492 94 -132 -602 -122 -52 189 -196 -724 182 307 -529 -329 -649 126 -917 -28 195 366 175 846 936 -833
2513 -833 -737 -96 -1393 -427 1172 -454 463 -250 706 453 58 -1065 -60 579 54 279 -156 429 109
2532 109 -201 -270 -147 151 -452 -589 349 -174 -1103 382 211 -126 -704 -182 153 263 257 -30 -55 705 -160
2553 -160 -732 29 -681 -635 -281 229 999 -1102 -612 712 -160 463 -1014 375 316 329 -58 103 245 -155
2573 -155 104 -155 57 38 173 -211 -15 192 -715 17 398 -46 43 133 50 -147 94 80 131 -390 -323 74
2595 74 307 152 -36 410 -40 167 -216 387 166 111 -460 -232 387 -330 62 37 292 -410 438 456 -270
2616 -270 205 -338 188 -233 -65 56 145 -6 -286 156 -6 141 -19 -100 58 133 -37 -314 199 -59 79
2637 79 -36 109 -89 -12 67 94 171 -126 89 -10 143 -218 28 190 -38 -61 -57 149 -57 47 2 120 8
$$ packed form
2492I4k26m70M80P0K41l85n28R06J25q36K00l20P75j043Q89K23J71j91O71R0j769
2513h33R6O41j297R66J599j626R17p13R56k53l95j123J005O39n25K25m35N85l20
2532A09l10o9J23K98o03j37R38n23r29J485j71l37n78N22L35J10ok87k5P60q65
2553a60n72P61p10M6L54N10P70k101M90J324q72O23j477J389n9J3l87J61J42m00
2573a55K59k59K12j9J35l84J96K07r07P32L81m44Q9R0q3j97K41j4N1n21O7L97
2595G4K33j55j88M46m50K07l83O03k21n5n71K28O19p17L92k5K55p02Q48J8p26
2616b70M75n43N26m21J68J21Q9j51k80M42j62J47j60q1J58P5j70k77N13k58J38
2637G9j15J45j98P7P9K7P7k97K15r9J53l61K46J62k28k3MK06k06J04m5J18j12
$$ plain form
2660 8 -171 27 38 167 -117 72 67 127 -52 -76 235 -196 80 -63 113 -34 -41 -67 55 70 -190 181 -3 88
2684 88 -109 -69 130 6 24 -138 182 -131 10 3 -17 33 -60 189 -10 129 -133 -24 40 -62 -67 -102 160 -212
2708 -212 33 -148 45 -36 -115 8 -51 100 -236 40 -56 66 -179 -10 262 -197 -27 -151 144 0 -25 68
2730 68 159 11 -201 -1 41 67 -31 98 72 -121 -18 -75 615 -101 55 25 88 162 -156 257 -234 231 -96
2753 -96 -119 -88 -5 144 -19 125 183 149 -209 -294 84 -180 -367 -51 187 -157 -86 -41 303 -146 106 -56 153
2776 153 -104 -211 516 -252 -461 33 119 -124 40 84 228 -66 -147 9 153 351 -6 -21 182 115 -75 -137
2798 -137 582 -136 -337 142 44 -210 -247 603 259 116 -380 594 95 -37 303 -161 323 -145 -747 592
2818 592 -86 353 -833 487 113 -58 -387 227 788 27 -12 -70 -200 -303 -277 18 260 180 -488 121 329
$$ packed form
2660Hj79J98J1J29k84J89nO0j79k4L11m31K76j43J76j47pk6J22J5k60L71j84R1
2684H8j97M0J99j24J8j62L20l13J41pk0N0r3K49j99J39k62J09O4j02nl5K62l72
2708b12K45j81J93q1p9J23n9J51l36K76r6J22k45J69K72m59J70j24K95j44k5R3
2730F8R1j48k12K00M2K6r8J29k6j93J03n7O90p16J56l0O3P4l18M13m91M65l27
2753i6k3L1Q3J49j63J44N8l4l58q5L78k64j87L16K38l44P1M5L44m49K52j62K09
2776A53k57j07P27p68k09M94Q6k43J64M4J44k94q1J56J44J98l57j5K03o7j90o2
2798a37P19p18k01M79r8k54l7Q50l44j43m96R74m99j32L40m64M84m68o02J339
2818E92o78M39j186J320l74j71l29O14N61p61l9n8j30j03K6K95K42q0o68O09K08
$$ plain form
2839 329 242 -112 158 -337 -339 -17 -598 104 68 -314 -4 82 -241 348 293 -824 -314 -214 23 -795 25 479
2861 479 381 231 194 570 139 -48 -106 -404 483 407 47 -204 107 -373 -150 383 -43 610 -470 329 138
2882 138 336 144 72 66 826 198 -71 107 36 226 -549 22 120 197 158 -229 -211 -57 -35 108 262 -384 -428
2905 -428 -222 55 110 -300 207 -133 361 -71 -371 -213 -42 369 266 -273 -51 611 213 53 32 -280 196
2926 196 -65 -3 137 295 200 -77 77 -44 -404 83 -44 -79 -14 171 126 -43 47 221 -307 -5 -29 338
2948 338 -224 48 -38 390 79 -146 527 -335 -26 203 -14 146 -353 178 -374 49 -116 -204 415 -179 128
2969 128 -312 245 97 -49 46 408 180 8 80 -162 221 -151 -47 32 -37 -156 -155 -296 170 142 211 18 201
2992 201 -175 -29 537 -28 -213 -297 -211 307 -177 77 -365 18 -5 -237 -226 -164 92 647 220 389 53 -1186
$$ packed form
2839C29q7l54K70m95kL22n81P02l6l82L10Q6l23N89n5j117N10J00K37q18Q20M54
2861D79r8j50l7L76m31j87n8k98Q87p6l60k51L11m80K23N33m26O53j080P99j91
2882A38J98j92p2oP60o28k69J78p1J90p75N71R8P7l9l87J8J54K2J43J54o46m4
2905d28K06K77N5m10N07l40M94m32l00J58J71M11j03n39K22O62l98j60k1l12M76
2926A96k61O2J40J58r5k77J54j21l60M87j27l5O5J85m5j69R0J74n28L02k4L67
2948C38n62K72q6M28l11k25O73q62L09K29k17J60m99N31n52M23j65q8O19n94L07
2969A28m40N57j48j46R5L62k28j72P2k42L83l72J04P9o9j19Jj41M66k8O9j93J83
2992B01l76J46N66n65j85q4Q6N18m84K54m42L83k3k32J1O2K56N55m27J69l36j239
$$ plain form
3014 -1186 112 -207 516 -702 -352 209 253 -753 -43 -451 -50 -361 -145 -633 23 -861 225 287 54
3033 54 651 -14 -311 -98 -194 273 352 -194 92 -241 -640 11 79 -36 -444 -457 -248 -3 -22 -865 97 80
3055 80 -73 -116 62 367 -2 612 -83 177 113 15 127 -54 -290 -104 171 239 -624 -1192 221 -270 -47
3076 -47 -441 -273 172 62 -315 279 319 330 170 -282 362 -244 495 18 752 -183 696 -225 -308 -356 -155 -1
3098 -1 -8 -709 -65 -167 -310 13 -572 -354 270 349 107 134 -2 -123 -97 66 -283 -115 -36 327 107 -110 -88
3121 -88 160 -161 -204 -23 -16 262 -67 72 23 -24 -61 44 29 -82 29 -117 158 44 53 -103 103 78 -145 -29
3145 -29 126 112 -39 151 88 -116 -19 -195 133 -16 41 -208 232 -38 -35 -21 -125 116 -62 98 -53 -4 -107
3168 -107 -114 -57 -44 -122 -60 49 -71 -40 36 54 -3 -210 -149 -4 -57 -131 200 -119 -17 101 -101 28 29 124 165 65
$$ packed form
3014a186J298l19P23j218L50N61M4j006P10m08M01l11K16m88O56q84J086O2k33
3033E4N97o65k97K13r6M67P9n46K86l33l99O51O8j15m08j3K09K45j9q43R62j7
3055H0j53m3J78L05l69O14o95K60o4r8J12j81k36J86K75O8q63n68J413m91K23
3076d7l94J68M45j10l77N94M0J1j60m52O44o06P39m77P34r35Q79r21q3m8K01J54
3098app01O44j02j43L23n85K18O24P9k42K7j36j21K6J63l49J68P9L63k20k17K2
3121h8K48l21m3J81PK78l29J39m9m7l7J05j5j11J11j46K75j14Rj56K06k5k23J16
3145b9J55j4j51J90o3k04R7j76L28j49N7k49M40k70LJ4j04K41j78J60j51M9j03
3168a07pN7J3p8O2J09j20L1P6J8n7k07O1J45n3p4L31l19J02J18k02J29JR5M1j00
$$ plain form
3194 65 -168 -2 -52 -53 -134 -90 -21 -4 52 -33 7 19 -40 -147 -236 219 -94 33 70 -28 55 27 -58 -72 16 -11 95
3221 95 -53 -37 20 -32 202 -73 -44 -96 -81 15 -138 -139 72 -62 -182 157 -9 63 -8 -28 -57 -90 106 35 112 -114
3247 -114 -17 12 -84 -130 -166 116 -60 8 -283 1 27 -43 4 -13 24 -36 -136 42 -102 -31 -5 38 -172 -58 6
3272 6 255 118 345 -311 112 351 -550 -597 -168 -61 -729 -45 -394 -140 -77 68 30 76 16 42 -80 12 -139
3295 -139 14 -57 201 -147 103 -57 3 121 -135 59 -7 60 -126 -38 33 -63 25 -16 38 26 104 -59 52 -57
3319 -57 -84 -59 12 69 -86 129 20 -38 12 6 109 48 -30 -31 118 -76 -8 27 46 141 -113 41 48 8 11 -56 -12 -122
3347 -122 88 21 159 -61 9 -9 44 -13 -160 79 3 67 -88 6 -6 23 8 -94 33 -93 -58 -36 12 -66 -2
3372 -2 44 8 52 -177 83 41 -41 -13 -62 7 -49 37 -58 -8 -98 -18 -69 73 71 -39 93 9 41 -62 -9 12 -52 70
$$ packed form
3194F5k33J66n0jq1M4O9J7N6q5M0J2n9j07q9M55l13J27L7r8Q3k8q5j4Q8k7J06
3221I5j48J6N7n2K34k75K9n2J5R6j53jK11j34j20L39j66P2p1k0k9l3J96p1P7k26
3247a14R7K9r6m6l6K82j76O8k91K84K6p0M7j7L7o0j00J78j44P1K6M3k10J14O4
3272FK49j37K27o56M23K39r01m7M29J07o68O84l49K54O3J45l8M6o0K6j22R2j51
3295a39J53p1K58l48K50j60O0J18k56J94o6O7j86Q8P1r6Q8m1N4j2P8j63J11j09
3319e7k7K5P1N7j55K15j09n8N0oJ03o1p8jJ49j94O8L5J9R5k54J54Pm0Lo7M4j10
3347a22K10o7J38k20P0j8N3n7j47K39p6O4j55R4j2K9j5j02J27j26L5K2M8p8O4
3372bM6l6M4k29K60m2q2K8m9O9n6Q6r5N0r0Q0n1J42kj10J32q4L2j03N3K1o4J22
$$ plain form
3400 70 -56 9 -4 -27 -59 49 -11 -21 84 -23 80 -103 14 -86 27 22 5 440 -27 -7 -103 74 26 18 17 -3
3426 -3 108 -112 125 -129 -42 -9 -45 74 -123 -45 100 167 -41 16 -34 31 1 -11 182 -101 99 -33 45 25 35
3451 35 178 -9 35 321 -276 -150 -113 367 -111 145 363 311 110 36 -594 -471 -45 150 -417 -157 -7 -693
3473 -693 173 -50 155 306 64 98 -146 286 -140 -169 0 48 108 -108 -35 17 60 -119 69 -41 14 105 35
3496 35 89 -31 -5 -94 45 24 -18 -9 3 89 -94 162 -86 -4 77 -8 0 -26 12 -49 86 0 28 -64 89 17 12 11 -13
3525 -13 77 -42 29 -29 25 -13 44 44 3 26 -69 31 9 -14 -7 27 -105 -37 72 -16 72 44 -33 82 9 -19 -78 68
3553 68 6 -69 -8 44 -69 -43 152 -77 33 -56 141 96 58 48 -77 91 -61 11 -64 41 16 -40 -7 -86 117
3578 117 -38 28 130 8 6 -12 63 -54 2 -54 7 57 -48 18 -22 86 -87 83 5 101 -94 13 -64 -52 -20
$$ packed form
3400G0j26O5j3k3l2J08o0j0J05j07J03j83J17j00J13nj7M35m67K0r6J77m8qjk0
3426cJ11k20K37k54Q7L3l6J19j97P8J45O7k08N7n0O5l0j2J93k83K00j32P8k0J0
3451C5J43j87M4K86n97J26L7M80m78K56K18n2k01p4o30J23M26J95n67K60J50o86
3473f93Q66k23K05J51k42L4k44M32m26k9J69M8O0k16P3N2M3j79J88j10N5R1p0
3496C5N4j20K6q9J39k1m2RJ2Q6j83K56k48Q2Q1q5Qk6L8o1J35q6K8r2J53p2njk4
3525a3R0j19P1n8N4l8N7%m1K3r5J00k2k3PL4j32O8J09q8Q8k8p7J15p3k8n9J46
3553F8o2p5O1N2j13K6J95k29J10q9J97m5l8j0j25J68j52P2p5J05k5n6L3p9K03
3578A17j55O6J02j22kj8P5j17N6n6O1N0j05O6m0J08j73J70p8R6j95J07p7J2L2
$$ plain form
3603 -20 -97 11 -29 30 -57 -33 -16 31 -55 10 184 29 -18 -33 -54 37 -105 141 -73 60 51 92 93 -40 -12 -18 26 0
3631 0 -17 29 80 87 24 6 -73 -51 -16 79 -63 -28 26 7 72 66 -21 50 74 -71 12 33 -38 -29 -46 -21 -60 26 24 6 -6 -60
3663 -60 86 -5 58 -31 57 139 56 -62 -142 50 -15 55 -163 147 -144 -120 -81 268 -195 -309 -11 81 -87 -198
3687 -198 -41 136 -360 -39 329 -189 295 217 -341 -12 -189 242 151 -132 109 -63 -26 82 33 -22 -49 30
3709 30 9 -18 -50 4 -2 12 -35 0 59 -30 -15 9 -107 16 -94 35 28 132 -19 -30 -117 -22 89 49 55 -61 42
3736 42 -18 20 -22 -79 126 -50 -45 -64 37 -97 -44 -99 -67 40 3 -2 -9 11 -115 57 1 29 -34 36 -39 -34 -95 -71 34
3765 34 38 -15 -7 97 137 -47 50 -116 -1 -108 -45 10 -101 104 -78 6 -106 17 -18 -39 99 -25 -52 37 81
3790 81 -13 79 98 60 -11 5 33 -93 21 -66 14 -53 5 40 3 84 -172 158 -28 -82 -23 -5 58 -4 44 -50 2 -76
$$ packed form
3603b0p7J08m0N9q7K4J7M7q6O5J74j55m7j5k1R1j42K46k14J33rM1Jj33K8oM4k6
3631@j7M6N1Po3j8p9K2L5R5j42L5N4j9O5oq7P1K4j45Q3K1p1Rj7K5l9Q6kj8j2n4
3663f0J46r1O3q9Q8Q2q3j18q0J92o5P0k18L10k91K4L9L49m63j14K98R2j68j11
3687a98J57J77m96L21L68n18M84p8n58L29j77M31r1k83K41j72L7J08m9n5k7P9
3709C0k1k7l2N4oJ4m7L5N9q9J5K4j16J23j10J29pJ04j51j1q7R5J11m0Oj16J03
3736D2o0L8m2n7K05j76Nj9J01j34N3n5L2J07l7npK0j26J72n6K8o3P0p5No1K4J05
3765C4Mn3QJ04M0j84R7j66J15j07O3N5j11K05j82Q4j12J23l5k1J38j24k7Q9M4
3790H1r4R2J9l8p1J6K8j26J14q7Q0o7N8L5l7Q1k56L30j86n4N9J8O3o2M8r4N2p8
$$ plain form
3818 -76 -15 41 74 24 -24 47 -100 -4 -127 79 37 -61 52 22 99 -22 67 -68 45 -16 35 115 -107 63 -101
3843 -101 95 11 -34 -28 50 -24 -56 15 -107 53 74 122 13 14 -5 11 36 65 -94 -67 -42 100 -154 10 -25 76
3869 76 -58 -86 54 -43 60 -12 16 17 9 -118 -8 115 -68 52 -100 -12 24 28 -30 153 -22 -48 -2 15 88 -98
3895 -98 102 34 -32 -88 125 -30 -110 -38 -42 -74 -23 36 -48 20 77 -171 81 -46 40 22 8 -3 -191 -71 -127 25
3921 25 20 -17 -19 63 -28 26 106 15 20 53 44 -6 5 -80 14 83 51 -15 -60 -34 5 -48 65 6 28 -33 25 -112 14 -50 -5
3952 -5 -4 -7 106 54 69 -13 -39 -99 -88 12 44 34 -34 24 -94 13 -62 -127 52 127 29 105 123 -12 12 30 -39 -30 76
3981 76 19 -15 159 -29 -12 -13 14 -41 91 -56 -2 -49 -124 71 79 48 34 -64 -3 -79 3 37 48 47 -59 -44 -14 -19 108
4010 108 -115 90 25 -59 149 -49 223 13 -212 -24 147 151 115 336 -93 56 -181 184 -250 73 -182 146
$$ packed form
3818g6O1N6L3n0m8P1j47R6j23K06m2r8J13l0P7j21Q9j35J13o1N1Q0k22J70j64
3843a01J96q4m5OP8p4l2P1j22J60K1M8j09Jj9J6K5K9j59K7K5J42k54J64l5J01
3869G6j34k8J40r7J03p2K8Jqj27J10J23j83J20j52Q8L6Mn8J83j75k6M6J7P3j86
3895i8K00o8o6n6K13j55q0P2ml2N1N9q4O8N7k48K52j27Q6j8j4j1j88J20n6J52
3921B5nl7kQ2r1N4Q0r1NL3rn0J1q5R4O9l2o6m5K6L9n3J13n9K2o1N8j37J26o4M5
3952eJlJ13n2J5q2k6o0J1J00L2j0o8N8j18J07p5o5J79P5r8P6J8j35K4J8o9RJ06
3981G6n7l4J74j88J7jK7n5J32j47N4m7p5J95Ql1j4r8O1p6Q2L4J1jj06J5L0nJ27
4010A08k23K05o5q4K08j98K72k10k25J88J71Ml6K21m29J49k37L65m34L23k55L28
$$ plain form
4032 146 -382 -376 308 21 -40 140 -132 -134 15 26 -2 -84 247 -398 81 452 -263 26 -164 97 -354 18 26
4055 26 -32 10 -144 57 156 117 -183 181 167 -45 6 -289 -275 38 229 -286 114 172 38 -127 -82 -176 100 132
4079 132 80 91 -59 -41 33 -74 -171 130 -215 -71 152 210 10 114 457 60 -136 172 52 23 -48 272 21
4102 21 206 -26 1 246 162 149 81 -145 161 373 91 -417 49 -225 15 -162 203 133 -145 253 123 15
4124 15 -33 310 28 -149 156 268 -380 -45 -149 213 131 194 -5 -100 -170 -37 30 -136 139 27 35 -146 61
4147 61 99 9 -90 6 -94 41 19 -49 53 -67 -9 25 9 -70 -5 -51 20 -20 -88 17 76 -136 -71 -158 14 54 50
4174 50 -33 -20 227 -161 -54 203 -51 -131 40 235 48 26 -97 125 -30 -212 13 43 126 72 -122 71 45
4197 45 -156 67 -11 -112 -78 -30 -58 85 -186 -318 150 -11 9 24 196 25 132 227 163 -287 -211 441 328
$$ packed form
4032A46n28OO84k87o1J80k72kJ49J1k8q2L31o45M79L71p15K89j90K61m51L72Q
4055B6n8M2j54K01R9l9l00L64j4k12N1k95J4L13J91n15M00N8j34j65M5r4K76L2
4079A32n2J1j50J8P4j07r7L01l45J44K23N8k00J04L43l97j96L08j20k9p1L20k51
4102B1J85k32K7K45q4j3o8k26L06K12k82n08M66k74K40j77L65p0k78L98j30j08
4124A5m8L43k82j77L05J12o48L35j04L62q2O3j99r5p0J33O7j66K75j12Qj81K07
4147F1L8r0r9R6j00J35k2o8J02j20N8L4j6p9O5m6P1m0o8J05N9k12O5q7J72M0m
4174E0q3J3K47l88J07K57k54q0J71J95j87k2j23K22j55j82K25L0Q3n4j94J93k6
4197D5k01K23p8j01L4M8k8J43k71j32M68j61K0J5J72j71J07R5o4m50P6O52j13
$$ plain form
4220 328 292 -582 296 -96 -520 -270 289 -137 427 -288 -56 436 140 138 -315 -306 -122 26 232 115 135 -3
4242 -3 -27 84 48 -43 -86 34 -38 68 -31 -14 68 -73 35 54 -17 -119 84 -37 -21 -3 -66 50 -54 -30 -72 105
4268 105 -38 -95 -19 -103 -80 -89 29 130 -15 33 -55 12 -17 47 -20 -41 -62 1 -44 28 9 9 109 -100 -4 -59 -4 -12
4296 -12 78 -3 -83 44 16 -8 4 -42 58 0 34 -68 8 -36 69 -58 -37 5 -23 67 -142 64 28 -6 62 16 53
4323 53 45 89 -85 -85 -29 -126 -156 -49 7 -71 106 -57 -43 -126 36 -96 -79 -6 105 42 -33 -70 138 157 19 230
4349 230 90 239 103 -608 -166 413 -285 326 -315 -353 125 87 192 -173 -109 107 77 -34 1 25 19 -21 1
4372 1 40 15 -24 3 85 -31 20 -78 61 12 61 -23 62 -78 -43 -22 -102 26 -70 19 19 -111 29 32 12 -24 8 -46 -13
4401 -13 -16 -62 13 4 -12 8 -49 56 2 58 -53 -15 -30 87 96 64 -81 0 142 -46 -2 -18 -4 -24 15 -41 -38 -68 -39
$$ packed form
4220C28l6q74Q78l92m24K50N59m26N64p15K32M92k96km53RJ84J48K06j17K0j38
4242ck4J11l6r1m3J20p2J06r9J7Q2j41J08J9p1j02K03j21J6J8o3J16j04K4m2J77
4268A05j43n7P6q4K3rJ18J01j45M8q8O7k9O4o7k1k1O3m5P2j9%J00k09R6n5N5q
4296a2R0q1q0J27k8k4J2m6J00n8L4j02P6m4J05j27K1M2k8R0k09K06l6l4O8m6L7
4323E3qM4j74%N6r7l0J07N6p8J77j63J4q3J62j32J7P3J11o3p5l7K08J9j38K11
4349B30j40J49j36p11M42N79o98O11o41l8M78l8J05l65O4K16l0j11L5K4om0K2
4372AL9k5l9K7Q2j16N1r8J39m9M9q4Q5j40L5K1q0J28r6Q9%j30J40Lk0l6L2n4L3
4401a3lm6P5rj6K0n7J05n4N6j11L8j5J17Rl2j45Q1J42j88M4j6J4k0L9n6Ll0K9
$$ plain form
4430 -39 115 54 78 -111 61 -39 -20 1 -46 11 35 151 -31 86 -64 -83 -22 -25 -57 -26 -29 18 13 8 -64 37 -3 52
4458 52 -20 46 56 -65 -49 7 6 -24 81 -51 45 1 40 -6 48 -10 -63 77 -138 51 32 22 57 17 104 3 -17
4485 -17 -61 -17 29 15 -116 20 -2 -91 9 -32 -29 32 -2 -14 -65 -55 -14 -64 -21 -15 -3 4 23 -31 77 57 76 -40 0
4514 0 -47 -82 46 -42 3 -179 53 75 32 44 -6 122 -17 76 112 58 13 -10 -36 -5 23 -35 -132 -129 38 2 -10 -41
4542 -41 1 39 20 16 -65 82 -7 74 61 85 -2 -19 32 28 -26 -66 -53 -87 54 -16 21 -22 54 8 -55 86 2 121 -128
4571 -128 51 41 41 79 -7 100 -37 -203 -9 63 -64 36 123 62 159 201 161 509 -57 235 77 -161 66 273
4595 273 152 143 -42 284 409 -104 281 137 202 -175 -387 83 207 337 284 40 -59 141 -32 -299 -12 -30
4617 -30 230 362 167 325 -15 390 586 301 -873 637 -75 1165 23 115 -346 171 251 546 10 473
$$ packed form
4430c9J54o1K4j89J72j00J9K1m7N7K4J16j82J17j50j9O1ll2L1lM7nnp2J01m0N5
4458E2p2O6J0j21J6N6jl0J05j32R6m4L9m6N4n8n3J40k15J89j9j0L5m0Q7j01k0
4485a7m4M4M6j4j31J36k2q9J00m1LO1l4j2n1J0M1n0M3OJ2PJ9n4J08k0J9j16M0
4514@m7l5J28q8M5j82K32K2m3J2n0J28j39R3L6n4m5k3k6L1K8n8r7LJ67l6j2l1
4542d1M2L8j9mq1J47q9Q1j3K4q7j7N1mn4m0J3l4J41p0L7m3P6m6o3J41q4J19k49
4571a28J79j0%L8q6J07j37j66J94P2j27J00Q7o1R7M2m0L48n66K92j58k38K27K07
4595B73j21rj85L26J25n13L85j44O5l77k12M70J24J30n3k44r9K00j73k67K87j8
4617c0K60J32j95J58l40M05J96k85j174J510p12J240j142R2m61N17Q0K95n36M63
$$ plain form
4637 473 -53 340 435 594 -54 229 247 367 -82 -136 -401 485 379 -305 -252 -225 -72 -32 61 66 -216 355 -553
4660 -553 -424 -471 -660 18 -552 251 -39 11 -63 62 90 114 -12 71 118 10 -196 160 88 -37 58 -48 -51 23
4684 23 -46 -5 59 3 5 14 15 -17 40 2 111 7 -129 82 10 -51 -24 -87 -71 41 -16 -127 -12 3 -22 40 -20 -30
4712 -30 36 -69 22 40 -5 -7 104 -52 -74 34 -39 70 -59 -58 56 6 -70 -98 49 -91 65 -58 13 -42 18 -42
4738 -42 14 62 -108 43 52 77 109 88 -20 -24 86 37 35 1 85 83 -36 -73 -16 119 30 -74 74 -90 -31 -60 74
4765 74 19 66 -71 -23 68 -18 -36 -27 -144 7 -271 -13 -32 -71 119 164 586 127 94 -252 141 -76 476 438 212
4790 212 776 540 736 127 -63 232 -381 -33 120 37 55 228 -97 126 -82 -202 67 26 52 -27 -34 -22 -57
4813 -57 65 -50 -10 -31 38 70 2 -11 7 120 85 3 15 -5 58 -70 -18 -10 5 -18 -4 -46 -20 25 -24 -37 31 -25 -11
$$ packed form
4637D73n26L93R5J59o48K83J8J20m49n4k65Q86j06o84N3K7J53M0R3Nk82N71r08
4660e53J29m7j89O78n70Q03k90N0p4J25K8K4j26Q3M7j08k06L56p2j25R5j06lP4
4684B3o9M1O4n6KRJl2N7l8J09j04j36K11p2o1K7o3J6J12n7j11J15J5k5O2o0j0
4712c0O6j05R1J8m5kJ11j56k2J08p3J09j29JJ14n0p6k8J47j40J56j23P1n5O0o0
4738d2N6M8j70J51RK5L2k1j08mJ10m9kl4Q4kj19l7N7J35q9j04J48j64N9k9J34
4765G4n5M7j37M8R1q6j8Rj17J51k78K58j9l9J90M5M22m59l3l46L93k17N52l8k26
4790B12N64k36J96o09j90K95o13L48J53q3J8J73l25K23k08j20K69m1K6p9pJ2l5
4813e7J22j15M0k1O9L2o8j3J8J13l5q2J2k0O3j28N2QJ5k3J4m2K6M5m9j3O8n6J4
$$ plain form
4842 -11 -12 -57 1 7 77 -25 -26 -31 32 35 83 9 73 -62 37 -48 -38 -15 -19 8 -48 77 44 -63 7 14 40 -6 83 32 21 -95
4874 -95 3 -48 -22 3 43 96 -34 52 75 64 7 34 -135 -15 10 -25 -36 -31 55 -93 -39 54 -80 64 15 -61 12 29
4902 29 44 25 79 7 62 -84 -35 3 15 66 -123 -9 -93 93 43 -19 -68 -42 -59 -15 -8 -61 -21 42 -20 6 -33 -46 4
4931 4 29 -107 -6 -99 8 -39 -48 -35 -20 -109 -41 -8 48 85 -30 -28 24 -26 -3 -12 -39 -41 38 -61 16 3 -38 38 -61 74
4961 74 29 -28 34 -108 -3 -23 -63 -5 54 -3 -60 21 -9 -26 41 30 -10 71 49 -108 -95 -48 172 -60 76 -12 -121
4988 -121 -199 -52 -109 -308 -25 79 -266 -55 231 -22 -483 -36 -110 343 340 -37 151 -276 -41 -331 -257 -82
5010 -82 49 130 111 -291 -175 -698 -574 -16 57 -130 85 -229 -164 -43 455 118 -153 186 -156 -23 86 -58
5032 -58 -23 133 -69 22 -67 119 -68 -46 -18 62 -26 51 -8 -23 49 -116 62 62 12 -77 0 -55 -20 -47 -11 175 -30
$$ packed form
4842a1jm5N8OP0j02jnO3LM8p4O4j35R9q5J0K3mK7n6J25l3j07P0PK6m6Q9n1j1j16
4874i5R8n1K6K5M0N3j30Q6K3j1n7K7j69J20K5l5j1NQ6j48N4R3j34J44m9p6P3J7
4902B9J5j9N4p2N5j46M9L8J2N1j89J14q4J86n0o2m9K6j7M4Pn3M0O3o2K6l9j3N0
4931DK5j36J01r3J07m7rJ3J5q9O8L3N6L7j15KN2n0K3rk7kP9r9P7j3m1P6r9J35
4961G4m5n7O2j42J05k0m0N8N9n7n7Q1l0j7O7j1m0Q1k2j57J3M7K20k32J36q8j09
4988a21p8J47n7j99K83J04l45K11K86k53m61M47p4M53ll77J88m27K35k90P4J75
5010h2J31Q1j9m02J16n23J24N58P3j87K15l14O5J21M98l37k71L39l42J33J09j44
5032e8L5J56k02R1q9J86j87K2K8Q0q8P7n9j5P2j65J78%n0q9P7n5L5k7L6J86k05
$$ plain form
5059 -30 -19 -2 -22 11 -66 -32 6 -49 -86 16 62 -12 44 -34 8 -66 112 31 4 20 52 8 18 34 -40 -2 52 85 2
5088 2 -1 -81 -51 34 -102 -82 -7 18 62 -97 -59 -24 51 -82 7 -20 -5 -9 -16 88 6 49 -80 -13 -10 43 13 30 -2 -10 -35
5119 -35 49 15 -78 5 -39 -81 102 27 -43 31 -20 -17 22 0 33 18 -7 108 104 -19 -19 4 -82 56 91 -38 17 106 -82
5148 -82 3 99 -7 25 -108 -23 34 7 -54 36 -37 22 10 8 -13 152 -18 9 114 44 -15 46 31 -102 67 62 45 -67
5176 -67 -3 30 49 -24 93 120 -57 -7 26 -38 16 -41 93 -46 -64 -35 -37 79 -12 8 26 -16 -27 -20 -37 34 81 -52
5204 -52 44 -13 60 -21 42 1 -18 114 13 -65 -30 -5 16 -51 -122 -52 82 -32 -12 16 116 27 -14 87 -84 11 19
5231 19 -102 -17 -33 74 -11 8 -46 4 3 -38 -81 39 -112 55 26 -36 -10 12 -3 -93 -45 -23 36 -109 -6 -11 72 -15
5259 -15 39 6 19 -33 -30 -65 -33 28 28 3 -82 22 11 58 -74 -63 53 -3 23 -10 61 36 66 -35 -69 7 -7 -20 17
$$ packed form
5059c0J1J7k0L3p7L4L8n5l7J02M6p4N6p8M2p4J78q1k7J6L2m4J0J6p4L8N4L3q3
5088Blq0L0Q5j36K0P5K5M4j59L8L5P5j33Q9k7J5mpJ04q2M3j29O7LN3l0J7l2qk5
5119c5Q4l4r3Q3m4m2J83p5p0P4n1LL9k2L3j5k5J15mj23%K3q6J38L5j29N5Q9j88
5148h2Q5R6j06L2j33Q5N7k7o1R0p3N9j2kk1J65j70K7J05p0n9O1j5j33J69nj7j12
5176f7O4L3J9p3J17K7j77N0L3o4N4n7J34j39j8K9kJ16r1K0J8m2j1Pj7P1M7j33
5204e2R6n7P3q1O3m1j9J32j01p8L5K5K1o7p1P0J34j14K0K8J00q9m1J01j71R5Q
5231A9j21Q5j6J07q5J9n4N0jm1m3J20j51J67k9o2K6K2j5r0M8K2N9j45J03nQ3q7
5259a5N4l3J3n2Ll5L2O1%k5q5J04j1M7j32J1J16n6K6l3P1k5L0j01l4P6j4j3L7
$$ plain form
5288 17 80 8 42 -3 -55 -57 132 23 73 25 23 -110 13 -34 -2 -11 -56 100 10 4 -7 -139 -7 15 -59 0 47 -14 25
5317 25 25 14 97 43 45 31 95 15 -78 -26 -29 -39 30 -24 -4 4 46 -87 104 1 -22 -14 16 72 -8 -89 -15 50 14 -42 20
5348 20 65 -24 64 41 71 -20 -36 83 -148 12 -77 -34 -31 10 3 -24 50 1 -37 105 -6 32 9 5 -9 21 -36 -43 -67 56
5378 56 -11 33 74 -8 49 -46 42 76 -20 38 83 -39 1 74 -81 48 9 69 -36 41 -1 -27 -36 66 72 83 -43 -10
5406 -10 -48 51 23 52 78 9 18 -64 27 96 -36 45 48 -85 40 73 -43 -36 -23 -47 -56 25 129 39 -55 -46 10 73 -77 174
5436 174 -15 -30 66 18 44 -16 -12 -27 -48 -29 -69 -50 -86 -23 -21 -36 46 20 48 27 -54 86 -58 33 53 -37 89 -23
5464 -23 -38 3 4 -61 11 34 35 -72 11 11 -106 61 51 27 -98 53 -70 15 110 68 1 15 16 37 3 -16 51 -63 72
5493 72 -23 -85 62 -34 66 38 -8 -34 25 10 -9 65 47 16 -78 42 5 -6 -17 -31 15 -110 80 15 -55 75 -32
$$ packed form
5288A7O3p2L4m5n2kJ89j09N0m8kj33J23m7L2rm5J56r0oj1j32J32K2p4N9M7o1L9
5317B5%j1Q3n4Kj4O4q0r3N2lj0O9n4K0QM2j33J91j03k3QL0N6q0q1P4O5l6n6O2
5348B0M5q9Q8k3L0r1j6J19k31J60q9M3LM1pk7P4m9l8J42j11L8k3mj4L0n7pk4J23
5378E6o7M4M1q2N7r5Q8L4r6N8M5j22M0P3j55J29l9O0j05P7m2k6rJ02OJ1j26L3
5406a0l8R9k8K9K6o9Rq2R1O9j32Q1Lj33J25L3j16PJ3k4rQ1J04r0r4RN6O3j50K51
5436A74j89j5R6m8K6o0Mj5k1J9m0J9l6O3Kj5Q2k6K8k1q1J40j44R1K0r0J26j12
5464b3j5M1Jo5P2K3Jj07Q3%j17J67j0k4j25J51j23Q5R5m2o7J4JK1l4j9O7j14J35
5493G2r5o2J47r6J00k8m6k6N9j5j9P4j8l1r4J20l7j1j1j4M6j25J90o5p0J30j07
$$ plain form
5520 -32 -46 10 33 -41 -78 -2 28 -44 -36 -1 -15 -47 59 21 -4 28 -34 22 -20 67 26 -32 -8 -50 35 -25 -28 -5 -94 -3 10
5551 10 -50 33 -26 -1 -32 -29 44 43 34 40 30 -59 -25 -88 4 8 35 54 -53 21 -35 -17 -126 -59 31 22 -37 64 -66 20 0
5582 0 27 44 -80 -49 98 336 157 -145 255 98 -89 -90 138 13 6 -270 -18 -114 71 122 -209 9 -69 -159
5606 -159 -206 -11 -31 10 -88 -107 -27 76 17 3 40 -133 244 35 -4 602 -43 -709 523 168 -104 -99 17 60
5630 60 -151 -21 -113 -45 -87 5 -3 82 -78 0 23 2 28 23 77 -71 -36 -104 -27 61 -22 -15 -73 -11 30 -40 -133 -51 10 -44
5660 -44 -53 -14 -86 -49 7 -17 5 83 -4 -35 -18 -1 -21 60 -9 -19 13 36 10 16 58 -95 73 -20 26 25 -67 8 2 -74 -2
5691 -2 89 30 -83 30 27 -53 -37 -8 -37 -71 -63 51 74 31 19 11 74 30 34 -5 61 121 -78 73 -19 -27 -48 87 -126 -20
5721 -20 66 -30 -57 -9 -50 -21 -102 -22 14 28 -8 79 -47 81 -43 -33 32 66 -56 -22 134 -61 -114 18 29 13 89
$$ packed form
5520c2j4N6K3p4l7P6L0p2QL5j4l2J06l8k5L2o2N6m2Q7m1n8K4m2Q5o0lK3q9R1J3
5551A0o0Q3n9K5l1LP3jrOj0q9L4o3R2MK7J9j07P4n6J8j09O7R0rn9J01j30Q6k0
5582@K7J7j24L1J47K38j79l02M00j57j87jK28j25pk76K52r6J85N1l31K18p8r0
5606a59m7J95k0M1r8j9Q0J03n9j4L7j73L77k09l9O06o45o66J232l55k72NJ16M3
5630F0k11J30r2O8m2R2qQ5j60P8K3k1K6nN4j48L5o8P7Q8q3Pn8O2M1p0r3Q2O1n4
5660d4rL9p2L7N6k4K2P8q7l1J7J7k0Q1o9j0L2K3k6OM2j53J68r3M6jr2P5op6P2
5691bR1n9j13J13lq0J6K9k9l4QJ14K3m3j2qO3m4Ml9O6O0j99J51r2qk1J35k13J06
5721b0Q6r6k7M8m1K9q1Q0L6J4l6Q7j26J28j24J0O5L4j22L4J56j95n3J32J1j6P6
$$ plain form
5748 89 27 -39 12 33 61 -52 7 67 41 -6 58 54 38 101 -68 -31 -15 -41 -63 33 75 34 -2 55 -48 -33 45 -28 57
5777 57 10 7 25 -54 -74 -86 -24 -58 25 -15 -1 85 -17 -6 27 28 -7 -18 76 79 34 23 13 -57 -79 -26 -116 -40 30 13 -38
5808 -38 21 -69 -62 9 7 -121 -54 83 12 141 66 13 -24 31 52 -95 -70 -29 -13 118 103 -33 52 -30 2 85 -20 -36
5836 -36 -54 20 -58 29 25 90 21 21 5 59 35 -4 8 53 -36 73 45 -44 6 -44 -49 63 -22 -18 6 -48 -4 52 24 -19 16
5867 16 5 -64 -4 21 -45 42 22 -40 57 37 -23 -83 -5 15 -17 -94 -18 -17 28 22 63 -39 -49 -133 -18 -42 -52 -77 47 -37
5897 -37 -137 26 26 36 12 -26 -61 68 -11 141 -52 -18 -57 9 -4 3 68 -34 -45 -56 54 -102 60 -14 74 -4 -50
5924 -50 -100 64 -49 88 -63 -116 5 -125 194 -294 -96 -202 -713 215 317 -396 -39 -165 89 -42 68
5945 68 68 -55 -106 57 30 -27 43 -22 -31 -40 -13 80 42 -85 44 2 -34 -84 11 -72 -63 26 -74 52 5 94 55 -63 -7
$$ packed form
5748H9o2o6N1K1K8j13N9O0k6m7O4mj6O3j69L7J6k6k2R6M2m1l6N7j03J5P8p3Q5
5777E7m7lJ8p9k0j2O2l4Q3m0J4Q6j02J1L3Jl5j1R4Lm5j1j0p0k2N3r0P6P0j7n1
5808c8N9r0PP1kj28O7J37p1J29p5n3l7N5K1j47K5M1J6J31j5j36Q5q2L2Q3j05j6
5836c6j8P4p8Q7mO5o9%j6N4k4l9J2M5q9J09k8q9N0n0nJ12q5MK4n4M4N6k8m3L5
5867A6j1o9O0K5o6Q7k0o2R7k0o0o0P8K0l2p7P6JM5oM1j02j0q4J15k4j0k5J24q4
5897c7j00J63%J0k4l8l5J29p9J52j93L4l9O6j3PO5j02j1j1J10j56J62p4Q8p8m6
5924e0n0J64j13J37j51n3J21j30L19m88J98j06n11R28J02p13L57j26K54j31J10
5945F8%j23n1J63k7n7P0o5rrK7R3l8j27J29m2l6n0R5q3RQ9j00J26m7Q9l9j18N6
$$ plain form
5974 -7 52 -26 -57 4 13 37 -36 -29 -23 -54 65 40 26 -76 43 -39 34 89 7 -57 -56 -15 18 -110 -44 18 40 39 104 61 75
6005 75 -37 -12 -46 6 1 -30 -51 24 -91 -69 -23 84 235 -20 -101 -8 88 -8 -23 -40 211 296 -92 -52 86 136 -301
6032 -301 -146 -85 118 233 -253 73 90 212 -164 137 -223 247 -94 -213 -30 -34 -97 103 -221 -50 -262 -76
6054 -76 261 -410 -270 -250 -214 61 25 -7 460 -108 153 -153 412 -61 46 532 405 -339 302 -233 485 85
6076 85 544 -172 131 -178 326 730 -813 650 -119 317 -118 32 381 -39 352 -80 -70 -82 -206 182
6096 182 -197 -268 -394 -40 -96 63 -35 41 142 -74 -81 75 -29 -198 -15 158 -93 -17 -39 50 -32 116 -3
$$ packed form
5974gN9p8l1O1RK4p3POl1J19k5j4j02J19q2P3N5q2o4JM1L3j28O6O2K2jO5m3J4
6005G5j12K5l4N2nl1k1P5j15K2M6J07J51k55q1R3R6r6j5j7K51Q5l88M0J38N0m37
6032c01J55O1K03J15m86L26J7J22l76L01l60M70l41j19J83mo3K00l24J71k12J86
6054g6L37o71J40K0L6K75l6l2M67n68K61l06N65m73J07M86j27p44O41n35P18m00
6076H5M59p16L03l09N04M04j543J463p69M36m35J50L49m20L91m32J0j2j24L88
6096A82l79p1j26L54n6J59r8P6J01k16pJ56j04j69J83J73k51P6k2Q9q2J48j19
$$ [...]
8191a7
##END NTUPLES=NMR FID
##END=
