##TITLE=1H_Pr 4939-d
 DMSO, 40 sc, 
 17.12.2019
##JCAMPDX= 6.0         $$ Bruker NMR JCAMP-DX V2.0
##DATA TYPE= NMR FID
##DATA CLASS= NTUPLES
##ORIGIN= UXNMR, Bruker Analytische Messtechnik GmbH
##OWNER= root
$$ XWIN-NMR		Version 3.5
$$ Tue Dec 17 14:16:08 2019 Russian Standard Time (UT+4h)  she@DPX200
##.OBSERVE FREQUENCY= 200.1315
##.OBSERVE NUCLEUS= ^1H
##.DELAY= (6, 6)
##.ACQUISITION MODE= SIMULTANEOUS
##.ACQUISITION SCHEME= undefined
##.AVERAGES= 40
##.DIGITISER RES= 18
##SPECTROMETER/DATA SYSTEM= spect
##.PULSE SEQUENCE= zg30
##.SOLVENT NAME= DMSO
##.SHIFT REFERENCE= (INTERNAL, DMSO, 0, 15.7039)
##AUDIT TRAIL= $$ (NUMBER, WHEN, WHO, WHERE, WHAT)
$$ ##TITLE= Audit trail, XWIN-NMR		Version 3.5
$$ ##JCAMPDX= 5.01
$$ ##ORIGIN= Bruker BioSpin GmbH
$$ ##OWNER= she
$$ F:/spectra/data/she/nmr/H-F/1/audita.txt
$$ ##AUDIT TRAIL=  $$ (NUMBER, WHEN, WHO, WHERE, WHAT)
(   1,<2019-12-17 14:13:55.85 +0400>,<she>,<DPX200>,
      <continue with go, POWCHK disabled, PULCHK disabled
       configuration hash MD5:
       00 E9 B6 7A A2 85 ED C7 34 08 36 98 17 FE 4E 26
       data hash MD5: 16K
       7B EB A7 4B 0E E3 A9 02 D1 24 E6 F9 A8 C9 E0 78>)
$$ ##END=
$$ 
$$ hash MD5
$$ 0B 0E 96 2F 3B 48 FB 4B 0B 9B B4 A6 90 8A 8F CC
##$RELAX= 
##$RELAX= 
##$RELAX= 
##$RELAX= 
##$RELAX= 
##$RELAX= 
$$ Bruker specific parameters
$$ --------------------------
##$DU= <F:/spectra>
##$EXPNO= 1
##$NAME= <H-F>
##$PROCNO= 1
##$TYPE= <nmr>
##$USER= <she>
##$AMP= (0..31)
100 100 100 100 100 100 100 100 100 100 100 100 100 100 100 100 100 100 
100 100 100 100 100 100 100 100 100 100 100 100 100 100 
##$AQSEQ= 0
##$AQ_mod= 1
##$AUNM= <au_zg>
##$AUTOPOS= <>
##$BF1= 200.13
##$BF2= 200.13
##$BF3= 200.13
##$BF4= 200.13
##$BF5= 200.13
##$BF6= 200.13
##$BF7= 200.13
##$BF8= 200.13
##$BYTORDA= 1
##$CFDGTYP= 0
##$CFRGTYP= 5
##$CHEMSTR= <none>
##$CNST= (0..31)
1 1 145 1 1 1 1 1 1 1 1 1 1 1 1 1 1 1 1 1 1 1 1 1 1 1 1 1 1 1 1 1 
##$CPDPRG= <>
##$CPDPRG1= <>
##$CPDPRG2= <>
##$CPDPRG3= <>
##$CPDPRG4= <mlev>
##$CPDPRG5= <mlev>
##$CPDPRG6= <mlev>
##$CPDPRG7= <mlev>
##$CPDPRG8= <mlev>
##$CPDPRGB= <>
##$CPDPRGT= <>
##$D= (0..31)
0 1.2 0 0 0 0 0 0 0 0.06 0 0.03 0 0 0 0 0.0002 0 0 0 0 0 0 0 0 0 0 0 0 
0 0 0 
##$DATE= 1576577467
##$DBL= (0..7)
120 120 120 120 120 120 120 120 
##$DBP= (0..7)
150 150 150 150 150 150 150 150 
##$DBP07= 0
##$DBPNAM0= <>
##$DBPNAM1= <>
##$DBPNAM2= <>
##$DBPNAM3= <>
##$DBPNAM4= <>
##$DBPNAM5= <>
##$DBPNAM6= <>
##$DBPNAM7= <>
##$DBPOAL= (0..7)
0.5 0.5 0.5 0.5 0.5 0.5 0.5 0.5 
##$DBPOFFS= (0..7)
0 0 0 0 0 0 0 0 
##$DE= 6
##$DECBNUC= <off>
##$DECIM= 24
##$DECNUC= <off>
##$DECSTAT= 4
##$DIGMOD= 1
##$DIGTYP= 9
##$DL= (0..7)
0 120 120 120 120 120 120 120 
##$DP= (0..7)
150 150 150 150 150 150 150 150 
##$DP07= 0
##$DPNAME0= <>
##$DPNAME1= <>
##$DPNAME2= <>
##$DPNAME3= <>
##$DPNAME4= <>
##$DPNAME5= <>
##$DPNAME6= <>
##$DPNAME7= <>
##$DPOAL= (0..7)
0.5 0.5 0.5 0.5 0.5 0.5 0.5 0.5 
##$DPOFFS= (0..7)
0 0 0 0 0 0 0 0 
##$DQDMODE= 0
##$DR= 18
##$DS= 0
##$DSLIST= <SSSSSSSSSSSSSSS>
$$ [...]
##$SUBNAM2= <"">
##$SUBNAM3= <"">
##$SUBNAM4= <"">
##$SUBNAM5= <"">
##$SUBNAM6= <"">
##$SUBNAM7= <"">
##$SUBNAM8= <"">
##$SUBNAM9= <"">
##$SW= 24.9337058887773
##$SWIBOX= (0..15)
0 0 2 0 0 0 0 0 0 0 0 0 0 0 0 0 
##$SW_h= 4990.01996007984
##$TD= 16384
##$TD0= 1
##$TE= 0
##$TE2= 300
##$TE3= 300
##$TEG= 300
##$TL= (0..7)
0 120 120 120 120 120 120 120 
##$TP= (0..7)
150 150 150 150 150 150 150 150 
##$TP07= 0
##$TPNAME0= <>
##$TPNAME1= <>
##$TPNAME2= <>
##$TPNAME3= <>
##$TPNAME4= <>
##$TPNAME5= <>
##$TPNAME6= <>
##$TPNAME7= <>
##$TPOAL= (0..7)
0.5 0.5 0.5 0.5 0.5 0.5 0.5 0.5 
##$TPOFFS= (0..7)
0 0 0 0 0 0 0 0 
##$TUNHIN= 0
##$TUNHOUT= 0
##$TUNXOUT= 0
##$USERA1= <user>
##$USERA2= <user>
##$USERA3= <user>
##$USERA4= <user>
##$USERA5= <user>
##$V9= 5
##$VALIST= <valist>
##$VCLIST= <CCCCCCCCCCCCCCC>
##$VD= 0
##$VDLIST= <DDDDDDDDDDDDDDD>
##$VPLIST= <PPPPPPPPPPPPPPP>
##$VTLIST= <TTTTTTTTTTTTTTT>
##$WBST= 1024
##$WBSW= 4
##$XGAIN= (0..3)
0 0 0 0 
##$XL= 0
##$YL= 0
##$YMAX_a= 2014880
##$YMIN_a= -1614805
##$ZGOPTNS= <>
##$ZL1= 120
##$ZL2= 120
##$ZL3= 120
##$ZL4= 120
##$ABSF1= 10
##$ABSF2= 0
##$ABSG= 5
##$ABSL= 3
##$ALPHA= 0
##$AQORDER= 0
##$ASSFAC= 0
##$ASSFACI= 0
##$ASSFACX= 0
##$ASSWID= 0
##$AUNMP= <proc_1d>
##$AZFE= 0.1
##$AZFW= 0.1
##$BCFW= 1
##$BC_mod= 2
##$BYTORDP= 1
##$COROFFS= 0
##$CY= 11.3945322036743
##$DATMOD= 1
##$DC= 2
##$DFILT= <>
##$DTYPP= 0
##$F1P= 16.9975609425685
##$F2P= -3.02152046262296
##$FCOR= 0.5
##$FTSIZE= 0
##$FT_mod= 4
##$GAMMA= 1
##$GB= 0.15
##$INTBC= 1
##$INTSCL= 1
##$ISEN= 128
##$LB= 0.24
##$LEV0= 0
##$LPBIN= 0
##$MAXI= 10000
##$MC2= 0
##$MEAN= 0
##$ME_mod= 0
##$MI= 1.114404
##$NCOEF= 0
##$NC_proc= 0
##$NLEV= 6
##$NOISF1= 3.799351
##$NOISF2= 2.8
##$NSP= 1
##$NTH_PI= 0
##$NZP= 0
##$OFFSET= 15.70392
##$PC= 1
##$PHC0= -9787.906
##$PHC1= 13.60086
##$PH_mod= 1
##$PKNL= yes
##$PPARMOD= 0
##$PSCAL= 0
##$PSIGN= 0
##$REVERSE= no
##$SF= 200.130013532006
##$SI= 16384
##$SIGF1= 3
##$SIGF2= 2
##$SINO= 400
##$SIOLD= 16384
##$SREGLST= <1H.CDCl3>
##$SSB= 0
##$STSI= 0
##$STSR= 0
##$SW_p= 3612.71676300578
##$SYMM= 0
##$S_DEV= 0
##$TDeff= 0
##$TDoff= 0
##$TI= <>
##$TILT= no
##$TM1= 0
##$TM2= 0
##$TOPLEV= 0
##$USERP1= <user>
##$USERP2= <user>
##$USERP3= <user>
##$USERP4= <user>
##$USERP5= <user>
##$WDW= 1
##$XDIM= 8192
##$YMAX_p= 0
##$YMIN_p= 0
$$ End of Bruker specific parameters
$$ ---------------------------------
##NTUPLES= NMR FID
##VAR_NAME=  TIME,          FID/REAL,        FID/IMAG
##SYMBOL=    X,             R,               I
##VAR_TYPE=  INDEPENDENT,   DEPENDENT,       DEPENDENT
##VAR_FORM=  AFFN,          ASDF,            ASDF
##VAR_DIM=   8192,          8192,            8192
##UNITS=     SECONDS,       ARBITRARY UNITS, ARBITRARY UNITS
##FACTOR=    0.0002004,     1,               1
##FIRST=     0,             0,               0
##LAST=      1.6414764,     0,               0
##MIN=       0,             -1614805,        0
##MAX=       1.6414764,     2014880,         0
$$ Real data points
##PAGE= N=1
##DATA TABLE= (X++(R..R)), XYDATA
0 0 0 0 0 0 0 0 0 40 -40 40 -42 80 -80 120 -120 148 -197 201 -241 314 -354 401 -480 546 -627 726 -824
27 -824 932 -1068 1197 -1347 1532 -1707 1909 -2147 2378 -2648 2955 -3270 3625 -4027 4445 -4921
43 -4921 5458 -6037 6693 -7445 8275 -9240 10360 -11655 13221 -15127 17492 -20562
55 -20562 24699 -30587 39763 -56066 93715 -372754 549626 1817966 920263 -663985 -1614805
66 -1614805 -963034 396734 1362585 984294 -328547 -1466677 -1223600 168851 1394756
75 1394756 1166013 -208457 -1370162 -1184963 48679 1166904 1135570 38495 -1128105
84 -1128105 -1221050 -106799 1176010 1317171 154406 -1160220 -1308313 -193598 1080300
93 1080300 1323717 374599 -872536 -1262469 -418845 884368 1358673 482792 -901321
102 -901321 -1404398 -552672 764502 1279370 588253 -599447 -1208645 -709991 471526
111 471526 1261121 852191 -424064 -1280110 -789799 555172 1343333 792651 -458632
120 -458632 -1151766 -701826 378337 1094600 837167 -158537 -989482 -844740 185712 1098190
130 1098190 960201 -100309 -1029547 -939419 51101 999815 1048898 154958 -872505 -1057740
140 -1057740 -174538 945141 1171945 245442 -904620 -1129336 -240273 851965 1101153
149 1101153 307350 -764667 -1115362 -404252 708445 1142188 447866 -681226 -1095166
158 -1095166 -390258 691089 1086219 464019 -541246 -999050 -506420 500508 1097729
167 1097729 677664 -412501 -1105312 -670577 469055 1142419 675843 -427887 -1068496
176 -1068496 -672385 330467 995198 727288 -220206 -973962 -812419 136779 962749 852117
186 852117 -82268 -910850 -841296 24602 846183 859717 58675 -816751 -929504 -138541
196 -138541 811984 967771 149288 -820275 -964455 -162718 766215 926866 203740 -693017
206 -693017 -918761 -258737 671589 975294 337035 -628492 -966356 -355619 578519 929934
216 929934 399397 -481137 -905029 -499990 363087 889836 558104 -355339 -968805 -651511
226 -651511 298284 932561 629043 -286175 -906339 -654091 195130 829227 661234 -145417
236 -145417 -824841 -714644 91527 811596 734771 -60503 -792480 -762201 -20075 715249
246 715249 758792 71171 -703237 -824783 -147235 689455 855571 166818 -699355 -880112
256 -880112 -208113 642123 850372 242242 -584385 -849889 -313111 512786 833132 329952
266 329952 -509513 -863572 -389889 433772 811052 401871 -381176 -800100 -474560 291341
276 291341 780181 515923 -268290 -812168 -559058 258423 825786 582656 -223099 -794848
286 -794848 -588880 175186 758126 609184 -123418 -736895 -636134 86336 725538 656854
296 656854 -46372 -695219 -670437 -15747 639178 686154 90028 -586987 -702267 -132892
306 -132892 581182 738459 170484 -568540 -745273 -190649 542972 744287 234597 -482113
316 -482113 -722826 -266597 444389 724969 301087 -416513 -722411 -318094 398676 731469
326 731469 372320 -322717 -696546 -407146 270746 699729 466710 -218903 -696285 -485607
336 -485607 218505 719677 521605 -179709 -696058 -535137 135351 667925 560363 -76500
346 -76500 -629403 -563790 55622 621987 581248 -20718 -591871 -584401 -18767 561862 614330
357 614330 93422 -512242 -628845 -137317 493482 644890 160852 -486475 -656986 -180567
367 -180567 474663 669694 222902 -432268 -665927 -260030 392788 663274 292714 -355013
377 -355013 -646191 -302511 334446 646281 338750 -285733 -632394 -376870 237383 629860
387 629860 425728 -186436 -618595 -447542 163084 614767 461804 -144921 -608752 -479371
397 -479371 112886 595113 503628 -70386 -573346 -521650 30286 544247 522447 -6530
407 -6530 -525005 -532579 -31287 493083 544989 74938 -468452 -569308 -126044 441561 585187
418 585187 162348 -418924 -590275 -183946 400070 592538 209024 -373851 -592801 -236773
428 -236773 346313 593522 268304 -314430 -588624 -294879 276373 569742 309642 -248155
438 -248155 -566423 -344884 201296 549918 367866 -175734 -559990 -410358 134634 546236
448 546236 421489 -117688 -543851 -444874 79043 517495 448890 -56257 -506906 -466355
458 -466355 23316 487598 476584 5944 -465833 -486915 -43598 434783 494242 82756
468 82756 -404581 -503247 -118080 383908 516469 145717 -372190 -532353 -177354 348703
478 348703 534599 200218 -327352 -538555 -233208 290605 525598 243389 -277299 -528742
488 -528742 -267070 248652 519780 287327 -218384 -513414 -317992 177414 501742 345923
498 345923 -139933 -486183 -356877 125599 490263 383444 -93922 -476360 -393669 73850
508 73850 474271 421421 -29254 -442412 -419039 11856 430298 430312 16766 -406564 -433884
519 -433884 -39825 394107 453513 82088 -366196 -463525 -114865 342943 469999 143002
529 143002 -320154 -469670 -157834 312396 482979 186163 -288053 -480314 -203671 273316
539 273316 490350 239544 -230287 -462749 -234962 224183 469599 265839 -182463 -443674
549 -443674 -271460 168811 452880 313911 -116575 -428831 -324295 95836 426910 348480
559 348480 -64413 -411832 -355943 49667 410591 376226 -20193 -395176 -387356 -5611 378405
570 378405 398469 36935 -355244 -400032 -56689 343129 414106 85356 -321977 -417993 -106538
581 -106538 312589 434156 140908 -282294 -426659 -150455 275059 436774 180014 -244518
591 -244518 -426471 -190989 231095 431617 215661 -208023 -427939 -233724 183027 415442
601 415442 241612 -163961 -410457 -266835 123774 389462 277890 -104597 -393954 -310458
611 -310458 68078 379765 320536 -54591 -383072 -343692 27996 371118 350793 -11910
621 -11910 -362839 -360374 -11684 344732 361565 27071 -332494 -370637 -51297 314288 375566
632 375566 73029 -299489 -383761 -97661 278018 379697 109345 -267229 -384498 -133873
642 -133873 237467 371916 143093 -227372 -385511 -180544 190373 373071 189933 -180537
652 -180537 -379889 -214241 152548 365176 219957 -137418 -361101 -238521 113942 357763
662 357763 264883 -76002 -339865 -275097 58095 340959 299367 -30913 -331276 -304114 25205
673 25205 335667 322641 -2266 -319524 -322209 -11605 308401 330470 39223 -282728 -325053
684 -325053 -51906 272907 335958 76992 -254430 -339916 -94946 244073 350386 122331
694 122331 -216735 -339889 -131008 203791 343784 158002 -173083 -333506 -167303 168704
704 168704 354113 207684 -132717 -337926 -206497 133695 351991 234797 -102556 -330184
714 -330184 -228506 98689 333080 247195 -72369 -320987 -262147 49593 315337 277208
724 277208 -30797 -310447 -287031 16394 300538 287773 -7146 -293960 -294826 -11347 278676
735 278676 296704 30042 -260462 -298378 -52346 238330 297366 70413 -225051 -305758 -93568
746 -93568 209116 307636 107180 -198733 -311967 -127055 175981 304219 138668 -160391
756 -160391 -308358 -163477 135280 300562 170386 -132603 -317522 -199591 105018 299088
766 299088 193381 -108566 -310740 -218248 74996 283392 209999 -71793 -289105 -234094
776 -234094 38291 268926 236592 -27901 -268366 -252241 5136 253751 253633 5702 -248043
787 -248043 -263250 -26612 231541 261639 36696 -223179 -270007 -62412 200161 268118 75888
798 75888 -193177 -280903 -99232 178909 282129 110272 -171649 -287576 -126558 153659
808 153659 283125 135822 -143099 -285834 -154791 125307 282631 166773 -111856 -282943
818 -282943 -179026 99141 283436 191572 -82819 -272730 -191620 76422 271286 205772
828 205772 -51061 -252885 -206515 40643 251853 223212 -17634 -238249 -227247 4232
838 4232 231500 235068 10894 -223485 -241674 -25814 214558 247081 41658 -200271 -248593
849 -248593 -56163 190544 254447 73548 -177223 -255893 -86954 167591 260523 102976
859 102976 -153677 -258984 -112991 142963 259007 124641 -127898 -255446 -135620 113007
869 113007 251199 147218 -97877 -248637 -158581 85190 247442 169196 -72066 -241758
879 -241758 -176363 55266 229704 180460 -44681 -230963 -196959 21960 216059 198928 -12130
890 -12130 -212466 -208917 -5697 200729 213931 19104 -195756 -223493 -36432 183692 225293
901 225293 47282 -175836 -228588 -61310 164401 229771 72676 -155464 -234995 -88838
911 -88838 140275 230837 94731 -136430 -237562 -110452 119340 231718 118568 -108066
921 -108066 -228144 -127671 96142 226852 138087 -85298 -228364 -153447 65423 218851
931 218851 157277 -56943 -216121 -166078 43946 211257 174586 -29901 -206412 -183015 15795
942 15795 197957 186786 -6076 -192369 -194342 -9248 183089 197885 21875 -173882 -199139
953 -199139 -31643 167718 204084 41407 -161480 -210905 -60085 145578 207595 66457
963 66457 -137022 -208194 -75501 129769 212743 90528 -117820 -210980 -100872 105254 208312
974 208312 109217 -96580 -207157 -119384 82859 203741 127665 -70541 -200673 -136047 59772
985 59772 197933 143976 -49963 -196205 -154411 33191 186919 158597 -22692 -181335 -162195
996 -162195 16037 180705 171973 -1414 -172435 -175786 -10394 164172 178565 21016 -155340
1007 -155340 -182074 -32058 149799 187430 46089 -137992 -186928 -52069 132724 192377
1017 192377 65463 -121983 -191007 -76464 111280 191497 86287 -102142 -189887 -92353
1027 -92353 95808 190609 102265 -83876 -188629 -112168 71738 185606 119898 -60248 -180746
1038 -180746 -124642 53811 181931 135942 -39238 -173143 -137744 31445 172396 148250
1048 148250 -16620 -164930 -151295 9121 160910 158661 3372 -153081 -159186 -11157 148612
1059 148612 165935 23239 -140534 -168653 -33784 132638 170353 43373 -124449 -170591
1069 -170591 -52801 116994 171995 61836 -108601 -174285 -71356 99310 174383 81805
1079 81805 -89350 -172578 -87882 81787 173146 97697 -70791 -168673 -102958 63102 168810
1090 168810 111821 -52060 -164840 -118516 42955 161855 124155 -33379 -158853 -130907
1100 -130907 22724 151185 132753 -16139 -150292 -142162 3223 143266 143762 4358 -138658
1111 -138658 -148154 -14808 131505 148922 22212 -126233 -153428 -32971 117173 154234 40852
1122 40852 -110436 -156733 -50040 103320 156928 59043 -95611 -156958 -67528 86104 155882
1133 155882 74006 -80506 -158255 -85569 69767 155251 89693 -62972 -156074 -98583 51452
1144 51452 149130 101915 -46685 -152838 -112249 34185 145823 113734 -28597 -144264 -119415
1155 -119415 20033 138377 124020 -10627 -133861 -127463 1790 129490 131207 6611 -124376
1166 -124376 -134597 -14681 118458 138150 24423 -110344 -138895 -32870 104391 139954
1176 139954 40289 -100020 -144131 -48878 91429 143395 56041 -84069 -143046 -64109 76591
1187 76591 143791 72157 -70110 -144048 -78479 62508 143191 84294 -55508 -140633 -90055
1198 -90055 48951 140657 97666 -37770 -135159 -99004 33681 134820 106098 -23578 -128811
1209 -128811 -108128 17432 126085 113512 -6508 -119430 -115394 515 115576 120015 8089
1220 8089 -109898 -122052 -17082 103868 124782 25488 -98916 -127780 -33203 93620 130527
1231 130527 40890 -87471 -130754 -46892 83161 132441 53794 -75619 -131931 -60242 69511
1242 69511 132478 67537 -62329 -131333 -72291 57069 130607 77527 -50379 -128449 -82224
1253 -82224 41792 125313 86670 -35085 -122992 -92324 25540 119396 96206 -20427 -117800
1264 -117800 -101475 12020 112227 102569 -6230 -109996 -108515 -4279 104108 109890 9969
1275 9969 -100506 -114111 -18376 94486 114713 24725 -89944 -118487 -32800 84705 120123
1286 120123 38380 -81708 -122735 -44449 75596 121470 47833 -70322 -120977 -54727 62120
1297 62120 119519 59724 -57320 -120243 -65699 50743 117249 69546 -45299 -115456 -74493
1308 -74493 37029 112068 78392 -30001 -109981 -84854 21719 106926 88892 -15511 -103874
1319 -103874 -92717 7860 101628 97380 -687 -97250 -99796 -4841 94797 102884 12319 -89351
1331 -89351 -103380 -17180 85683 106260 24687 -79536 -108411 -31406 76429 111482 37986
1342 37986 -72195 -110122 -41507 67537 110358 46503 -61537 -108652 -50757 55155 108084
1353 108084 58478 -47266 -106277 -62506 43113 106701 68308 -35730 -103672 -70239 30315
1364 30315 101956 76012 -22353 -98052 -80109 16447 98822 86349 -8528 -94964 -87861 4957
1376 4957 94709 92296 1653 -89528 -93280 -6151 87312 96171 12710 -83320 -96578 -17228 78966
1389 78966 97647 23635 -72805 -99195 -28428 69069 100650 34974 -64646 -100994 -38278 60333
1401 60333 101242 43149 -54643 -98906 -47556 48410 97255 54118 -41637 -96936 -57276 38379
1413 38379 97346 62987 -32360 -95001 -66127 27065 92856 69909 -20132 -90784 -74601 14042
1425 14042 89303 77301 -8935 -87230 -80454 3816 83903 82932 1645 -81475 -85062 -5749 78176
1438 78176 86758 10973 -74580 -87008 -15299 70084 87391 21983 -64109 -88768 -27168 59733
1450 59733 90818 33251 -55868 -90665 -37382 52633 90721 41356 -47264 -89264 -46539 41415
1462 41415 89253 52026 -36165 -90112 -56157 31551 89233 59055 -27367 -87849 -63230 22578
1474 22578 85857 66164 -17103 -84702 -69728 12072 81915 72571 -7066 -78941 -74444 2134
1486 2134 77653 77879 3286 -73443 -78904 -7040 71216 81161 12489 -67446 -80873 -15719 63835
1499 63835 81891 22103 -58625 -82650 -26167 54355 83575 31794 -50473 -84321 -36768 46923
1511 46923 84344 39155 -43253 -83326 -43105 38693 83370 48455 -32772 -82692 -51242 29050
1523 29050 81910 54680 -25041 -79494 -57339 20903 78595 60158 -15382 -75762 -63419 11379
1535 11379 73965 66291 -5365 -70890 -67822 941 68084 69763 3940 -65202 -71256 -8626 62283
1548 62283 73269 13781 -59416 -74872 -17401 55807 75150 21565 -52641 -75206 -25757 47519
1560 47519 76365 30992 -44612 -76765 -34313 41769 77322 37985 -36835 -76266 -41898 31981
1572 31981 75757 45742 -28882 -74794 -49333 25266 74450 51304 -20734 -72081 -54362 15387
1584 15387 70668 56568 -12117 -68441 -59815 7704 66687 62054 -3752 -64547 -63236 -1423
1596 -1423 62209 64665 5061 -59246 -67015 -10455 56415 68693 13541 -54178 -68876 -17112
1608 -17112 51529 70307 21159 -47111 -69557 -25049 44087 70564 29162 -41722 -70839 -32394
1620 -32394 37366 70338 35243 -33160 -70410 -39471 29080 68618 41100 -24997 -68654 -45185
1632 -45185 21467 67294 47815 -17722 -65909 -49810 13671 65020 52316 -10194 -62002 -55137
1644 -55137 6082 60331 56612 -2054 -59263 -58807 -1947 56066 60510 6207 -54132 -61411 -9714
1657 -9714 50687 62713 14400 -47963 -63603 -17038 45594 64464 20339 -42951 -64460 -24327
1669 -24327 39156 64544 27420 -36356 -65032 -30885 33163 64844 33002 -29207 -63550 -36545
1681 -36545 25882 63126 39308 -21781 -62636 -42190 18354 60919 44820 -14952 -60069 -47467
1693 -47467 10854 58319 48897 -7831 -57249 -51101 3406 55626 53600 -222 -53751 -53842 -2712
1706 -2712 51329 55973 7309 -48265 -56346 -10150 45801 58397 14676 -43530 -58307 -17133
1718 -17133 40735 58524 20666 -37826 -59267 -23343 35125 59962 26639 -31943 -59420 -29567
1730 -29567 28270 59163 31600 -25697 -58698 -34539 22827 58156 37594 -18800 -56416 -39303
1742 -39303 16225 55691 42419 -11810 -54639 -43619 9271 53148 46107 -5107 -51407 -47988
1754 -47988 2398 50766 50232 962 -48180 -50073 -3850 46193 51688 7745 -44233 -52170 -10705
1767 -10705 41833 52659 13337 -38757 -53726 -16531 36204 54276 19803 -33466 -54249 -23014
1779 -23014 31468 55063 26150 -28262 -53986 -27207 25522 54516 30501 -21756 -52874 -32587
1791 -32587 19483 52831 34970 -15982 -52367 -37373 13912 51087 38766 -10523 -50182 -40992
1803 -40992 7106 47556 42849 -4239 -46721 -44278 852 44412 45580 2110 -43740 -47359 -4971
1816 -4971 41881 48298 7640 -39555 -48133 -10059 37921 48928 13751 -34588 -49400 -15500
1828 -15500 33188 50226 18818 -29959 -49824 -21199 27207 49950 24504 -25191 -49553 -25967
1840 -25967 21724 49141 27840 -20560 -49186 -30853 16465 48851 33077 -14068 -47194 -34757
1852 -34757 11418 47330 37085 -8478 -45233 -38584 5749 44249 39929 -2782 -42724 -41362
1864 -41362 596 41260 42846 3534 -39249 -42922 -4588 37820 43408 7493 -35919 -45227 -10728
1877 -10728 33551 45592 12585 -31445 -45064 -15727 28353 45638 17799 -26793 -45904 -21092
1889 -21092 24227 45963 22566 -22217 -45418 -25575 20193 45871 27472 -16833 -45600 -29187
1901 -29187 14118 43515 30204 -12910 -43384 -32393 10010 42307 35079 -7218 -42091 -35149
1913 -35149 4718 40575 36882 -2077 -38392 -37939 -486 37481 38076 2976 -35109 -39524 -5774
1926 -5774 33768 39937 7846 -31590 -41263 -10614 30112 41870 12502 -27498 -41923 -14841
1938 -14841 25886 42658 18054 -23955 -41848 -19965 21966 42260 21963 -19618 -41854 -23548
1950 -23548 17060 42096 25482 -15638 -41183 -27763 12796 40535 28308 -10603 -39494 -30492
1962 -30492 8645 38749 32556 -5419 -37955 -32241 3834 36725 34160 -613 -35031 -34251 -848
1975 -848 33223 35850 4058 -31096 -36140 -6113 29941 37822 9024 -28485 -38158 -11629 26236
1988 26236 39127 13220 -25442 -39591 -15581 24390 39292 16704 -22177 -38755 -18829 19139
2000 19139 38782 20791 -17746 -38287 -22782 15099 37873 24105 -12557 -36968 -25602 11453
2012 11453 37534 27441 -8605 -36530 -28480 5891 34652 29523 -4296 -33713 -31039 2241
2024 2241 33233 32451 57 -31619 -32737 -2977 30513 33714 4518 -28804 -34640 -7838 26945
2037 26945 35068 8965 -25852 -35141 -11498 24752 37225 13158 -22546 -36114 -15248 20998
2049 20998 35391 15331 -19900 -35678 -17430 17767 35936 19071 -15000 -35271 -21056 13071
2061 13071 34177 21705 -11121 -34060 -24161 9039 33658 24978 -7151 -32577 -26633 5000
2073 5000 31635 27495 -3667 -31392 -28991 879 29677 29485 381 -29182 -29946 -2318 27822
2086 27822 31335 4506 -26400 -31435 -7216 24234 31408 7663 -23570 -32957 -10303 21558 32995
2099 32995 12443 -20408 -33585 -13753 19309 33360 15799 -16659 -32926 -17114 14734 32468
2111 32468 18253 -13210 -32054 -19728 11848 31467 21465 -9518 -30528 -22319 7463 30080
2123 30080 23587 -5554 -29703 -24594 4069 29076 26610 -1924 -28396 -26641 532 27259 27367
2136 27367 993 -26109 -28928 -2751 25641 29135 4737 -24281 -29072 -6340 22907 29604 8348
2149 8348 -20516 -29935 -9433 19189 30520 11713 -18102 -30248 -12916 16983 31297 14478
2161 14478 -15290 -30720 -15415 14059 30606 17532 -12249 -29805 -17972 10434 28624 19633
2173 19633 -8312 -27859 -21703 6916 27788 21952 -4366 -26915 -23071 3590 26608 23952 -1867
2186 -1867 -25629 -25312 635 25403 26261 1335 -23544 -25825 -2529 22660 26603 4815 -21763
2199 -21763 -26471 -6167 20281 27061 8196 -18347 -27198 -8991 17313 28486 10947 -16619
2211 -16619 -27578 -13306 14905 27820 14007 -14193 -28040 -15619 11744 28065 16448 -10209
2223 -10209 -27480 -17481 8695 26361 18441 -7547 -25762 -19303 5857 24946 20512 -4059 -25149
2236 -25149 -20854 2565 23892 22749 -1100 -23781 -23684 -1145 22221 24046 1658 -21501 -24709
2249 -24709 -3238 20719 24703 5001 -19284 -25074 -6012 18841 24909 7954 -16530 -25468 -9562
2262 -9562 16175 25686 11329 -14025 -26005 -12416 13431 26327 13717 -12504 -25417 -14872
2274 -14872 10514 25755 15865 -8807 -24842 -17005 7786 24436 17465 -6299 -23874 -18203 5477
2287 5477 23008 19391 -3365 -22298 -20943 1922 21665 21132 -417 -21198 -21683 -2237 20376
2300 20376 22631 2639 -19334 -22667 -3355 19061 22576 5309 -17941 -22995 -6625 16436 23384
2313 23384 7886 -15439 -22661 -9096 14495 23266 10103 -12838 -23409 -11386 11749 23953
2325 23953 13751 -10219 -23866 -13911 9212 23276 14911 -8613 -22958 -15692 7151 22800
2337 22800 16758 -5611 -21295 -17265 4784 21541 17991 -3155 -20032 -18161 1222 20180 19665
2350 19665 1003 -19704 -20573 -1396 17757 20484 3045 -17844 -21351 -3786 17089 21010 5008
2363 5008 -15972 -20556 -6541 14973 21904 8026 -13290 -21953 -8826 12008 20937 10476 -10508
2376 -10508 -21550 -11641 10477 22524 12192 -9468 -22291 -13392 8544 21449 13831 -7268
2388 -7268 -21077 -14512 5971 20473 15127 -5084 -20235 -16725 3109 18921 17290 -1527 -18244
2401 -18244 -17345 751 17942 18076 692 -17751 -19120 -2258 17569 19854 4089 -16761 -20038
2414 -20038 -4106 16037 20135 4506 -14410 -19824 -5698 13074 19904 6897 -12418 -19896 -8487
2427 -8487 11033 19474 9869 -10442 -20226 -10291 9105 20103 11909 -8470 -19926 -12433 7574
2440 7574 19688 13287 -6585 -20175 -14007 4912 19084 14103 -3558 -17933 -14383 2801 17136
2453 17136 15584 -1181 -16772 -15997 -474 15310 17228 1530 -15099 -16920 -2543 15532 18041
2466 18041 2969 -15678 -18632 -3839 14413 18789 4574 -13443 -18487 -5133 12435 18034 6790
2479 6790 -11620 -18405 -8310 9709 18221 9875 -8487 -18115 -10302 7849 19315 10812 -6692
2492 -6692 -18250 -11957 6359 18816 12069 -4960 -17738 -12701 4708 17877 13386 -2992 -16524
2505 -16524 -13848 2085 16090 14111 -119 -14886 -15223 -292 14857 15831 1695 -14636 -16529
2518 -16529 -2349 13749 17069 3093 -13937 -16804 -3534 12558 16597 4545 -12589 -16996 -4671
2531 -4671 11542 16712 5947 -10323 -16673 -7612 8321 16537 8637 -7619 -16306 -9181 7476
2544 7476 16633 10308 -5867 -17196 -11238 5299 17633 12247 -4570 -16886 -13186 3513 16128
2557 16128 12506 -2876 -15563 -12358 2269 14748 13622 93 -14209 -14139 -1448 13185 14406
2570 14406 2111 -13345 -15901 -3166 12269 15391 3940 -11903 -16442 -4321 11593 16005 4056
2583 4056 -10883 -16225 -5717 10250 14771 5767 -9474 -15652 -7359 7755 15231 7464 -6501
2596 -6501 -15144 -9307 5735 15262 9740 -5188 -15557 -10659 4586 15935 11652 -3958 -15691
2609 -15691 -11764 3118 15081 11453 -3092 -14335 -12558 1767 13156 12424 -547 -12704 -13273
2622 -13273 -358 12242 13536 1799 -11659 -14032 -2951 11464 14521 3779 -10594 -14759 -4414
2635 -4414 10648 14791 5259 -9545 -14731 -5535 8575 15187 6350 -8261 -14546 -6926 6589 13608
2649 13608 7390 -5229 -13704 -8051 4822 13756 9152 -4184 -14164 -10155 3976 13718 10894 -3884
2663 -3884 -14306 -12221 2523 14036 11035 -2034 -12781 -10931 1186 12951 11770 -616 -11769
2676 -11769 -11621 -1195 11071 12761 2260 -9973 -12899 -2865 9685 13871 4121 -9769 -14024
2689 -14024 -4435 9433 14355 5016 -8919 -13402 -5825 8465 13569 5557 -7016 -13577 -5964 6547
2703 6547 12815 7498 -4933 -12512 -8021 4382 12424 8822 -3621 -12483 -9640 3376 12957 9710
2717 9710 -2953 -13017 -10523 1964 13136 10562 -1598 -11821 -10665 997 11604 10614 -257
2730 -257 -10881 -11260 -773 10076 11024 1936 -9166 -12251 -2559 8435 12504 3608 -8919 -12181
2744 -12181 -4278 7834 12873 4528 -7736 -13077 -5586 7243 12619 5473 -6463 -12194 -5837 6412
2758 6412 12118 6238 -4966 -12047 -8091 3894 11849 7829 -3654 -10953 -9108 2412 11632 9180
2772 9180 -2497 -11360 -10016 978 10903 9938 -745 -11117 -9870 43 10273 9668 191 -9641
2786 -9641 -10475 -1376 8460 10773 2450 -7677 -10762 -3168 8100 10760 3679 -7965 -11885 -5214
2800 -5214 6873 11925 4504 -7251 -12074 -5082 6699 11754 5818 -6264 -11702 -5550 4995 10511
2814 10511 6019 -4069 -10762 -7212 3598 10218 7766 -1889 -9863 -8582 1933 10499 9138 -1157
2828 -1157 -11088 -9332 227 10654 9246 -159 -10106 -9539 222 9614 9390 -106 -9115 -9661 -891
2843 -891 7949 9978 2234 -7637 -10447 -2583 7356 9832 3386 -6048 -10659 -4496 6365 11052 4452
2858 4452 -5870 -10564 -5260 6305 10934 5341 -5799 -10838 -5296 4680 10989 5808 -3849 -10559
2872 -10559 -6796 2943 9186 7233 -2111 -9256 -7441 1686 9349 8834 -665 -9185 -8632 753 9413
2887 9413 8930 -242 -9077 -9155 -122 9166 9291 195 -8377 -8678 -721 7743 9789 2230 -7265 -9416
2903 -9416 -2706 5948 9650 3498 -6287 -10528 -4187 5391 9978 3928 -5551 -10256 -4832 5655 9922
2918 9922 4851 -4707 -10291 -5260 4504 9273 5386 -3460 -9771 -6291 3606 8804 7163 -1649 -8878
2933 -8878 -7189 1909 8391 7735 -893 -9253 -8243 334 7961 8435 -71 -8794 -8944 -152 7783 7598
2949 7598 367 -7990 -9600 -1372 7970 9281 1581 -6313 -8958 -3086 6006 8256 2773 -4996 -9238
2964 -9238 -4073 4909 8614 4519 -4767 -9694 -4673 4475 8631 5691 -3453 -8448 -5419 3507 8344
2979 8344 4684 -3552 -9392 -6012 1994 8848 6573 -1750 -8139 -6305 1208 8457 7034 -1231 -8163
2994 -8163 -7542 160 7427 7884 358 -7299 -8058 -626 7041 7400 1298 -6265 -7494 -1084 6670 8185
3010 8185 1727 -5790 -8612 -2575 5853 9029 3535 -4624 -7621 -3828 4814 8255 4248 -4728 -8817
3025 -8817 -4372 3834 8757 4648 -3355 -8337 -4875 2764 8071 5588 -2863 -7988 -5359 2301 7670
3040 7670 6185 -1946 -8098 -6497 1335 7324 6855 -476 -6891 -6845 -830 7167 6776 -23 -6533 -7139
3056 -7139 -1163 6846 7662 1039 -6339 -7090 -1321 5555 6984 1460 -6249 -8083 -2336 5587 7684
3071 7684 2725 -5535 -7744 -4641 3439 7648 3698 -3525 -8060 -3985 3352 8132 4735 -3613 -7941
3086 -7941 -5560 3006 7787 4712 -1899 -7338 -5692 1597 6902 4512 -1677 -7694 -5371 545 6179
3101 6179 6032 -460 -7441 -6744 -194 6490 6888 527 -6681 -7105 -683 6255 6959 1303 -6136 -7609
3117 -7609 -1831 4913 7325 2166 -4884 -7120 -2989 4416 6487 2217 -4337 -7108 -3903 4394 6584
3132 6584 3822 -3262 -7062 -4221 3105 6685 4293 -2683 -6800 -4750 2189 6646 4530 -1868 -6651
3147 -6651 -4911 1576 6833 4845 -750 -6473 -5654 337 6373 6047 91 -5960 -5575 -410 5333 6503
3163 6503 255 -5690 -6713 -753 5654 6743 1358 -5394 -6783 -971 4357 6464 1509 -4126 -6162
3178 -6162 -2316 3695 5764 2470 -3307 -7082 -3472 3283 6029 2849 -3280 -7218 -3842 2817 7154
3193 7154 4609 -3132 -6249 -4612 2431 6527 5088 -1782 -6409 -4087 1344 6216 5111 -783 -6347
3208 -6347 -5039 441 5793 5234 -258 -4877 -5487 -253 5193 5823 860 -5067 -6503 -1578 4826 5715
3224 5715 1682 -4705 -5720 -2069 4651 6151 2300 -4607 -6012 -1847 3613 6536 2469 -3069 -6494
3239 -6494 -2830 2680 5593 3220 -2503 -6126 -3641 2840 6406 3766 -1903 -6846 -3275 1664 5659
3254 5659 4595 -1377 -5148 -4871 868 5505 4181 -716 -5074 -4710 575 5507 5833 106 -4579 -5978
3270 -5978 190 4983 5308 422 -3902 -5401 -1213 4484 6013 1749 -4137 -5767 -2086 3344 5681
3285 5681 1979 -3808 -5339 -2737 3095 5673 2648 -3552 -5269 -2699 2113 5660 3051 -2624 -5696
3300 -5696 -3113 2532 5968 3391 -2229 -5705 -3458 1858 5359 3688 -747 -5285 -4478 1223 4542
3315 4542 4368 -431 -5785 -3863 895 4691 4204 -200 -4436 -5750 -946 3925 4940 607 -3664
3330 -3664 -5002 -1341 4002 5708 2120 -3630 -5064 -1846 3945 5563 2308 -3755 -5152 -2618 3038
3345 3038 5213 2446 -2456 -5343 -2646 2608 4359 2948 -1976 -5021 -3483 1568 5371 3576 -961
3360 -961 -5092 -3132 1145 4470 3946 -1068 -5531 -4234 792 4554 4480 150 -4593 -4127 25 4127
3376 4127 4403 340 -3861 -4469 -140 3885 5073 573 -3323 -5306 -920 3509 4956 1548 -3161
3391 -3161 -4417 -996 3418 5229 1321 -3607 -4788 -2619 2885 4911 1461 -2166 -5269 -2242 1744
3406 1744 4351 3061 -2190 -5302 -2995 2100 4980 3467 -1580 -4335 -3931 952 4797 3883 -682
3421 -682 -4254 -3696 420 4782 4078 -359 -4888 -4575 471 3884 4167 129 -4006 -4444 -715 3744
3437 3744 4353 700 -3875 -4474 -1492 2978 3905 1045 -2278 -4506 -1946 2726 4753 1486 -1988 -4565
3453 -4565 -1987 2731 4446 1715 -1489 -3971 -2761 1704 3915 2709 -1758 -4084 -2271 1831 4224
3468 4224 3013 -1300 -3849 -2940 1381 3756 3149 -746 -3988 -4059 813 4064 3525 164 -3773 -3915
3484 -3915 278 4150 3274 -89 -3823 -3363 -365 3469 4097 1008 -2688 -3353 -692 3056 4040 1455
3500 1455 -2706 -3580 -1701 2420 3816 2296 -1958 -4425 -2325 1592 4716 1766 -2835 -4040 -1641
3515 -1641 1528 4429 2703 -1598 -3872 -2956 1506 4181 3163 -590 -3835 -2660 436 3688 3566
3530 3566 -598 -3604 -3200 435 3245 3560 -525 -2868 -4227 66 3423 3398 496 -2897 -3398 -518
3546 -518 3075 4118 587 -3287 -3807 -549 2303 3335 693 -2137 -3279 -1797 2323 3682 1160
3561 1160 -1878 -4083 -2297 1933 4026 2434 -1313 -4034 -2201 1821 3829 2335 -1835 -3551 -2525
3576 -2525 911 3522 2741 -931 -3354 -2423 549 3570 2782 -288 -3280 -2742 255 3473 3386 368
3592 368 -2406 -2611 -429 2743 3411 419 -3075 -3133 -591 3178 3052 876 -3017 -2916 -490 2931 4062
3609 4062 1130 -2838 -3676 -546 2054 3222 1488 -1900 -3917 -1820 1557 3114 1583 -1416 -3749
3624 -3749 -2711 1328 4196 2483 -1511 -3207 -2808 -32 3293 2806 -203 -2559 -2959 116 3191 2963
3640 2963 -611 -2478 -2743 -483 2695 2124 583 -2937 -3062 -153 3594 2878 634 -2486 -3572 -790
3656 -790 2452 3742 1094 -2201 -2924 -1218 1857 2710 1616 -2225 -3397 -978 1679 3140 1686 -1285
3672 -1285 -3280 -1577 1909 2966 1815 -1426 -3476 -2515 485 3119 1812 -920 -3599 -2769 322
3687 322 2662 2100 -1346 -3475 -2460 328 2901 2764 -157 -2977 -3437 -166 2721 2384 -344 -2610
3703 -2610 -2607 -161 2747 2726 881 -2359 -2532 -535 2608 3317 384 -1693 -3559 -885 2294 3277 1132
3720 1132 -2256 -2312 -1176 1734 2652 1271 -1793 -2864 -1874 1928 2650 1674 -728 -3133 -1309 683
3736 683 2480 1576 -586 -2510 -1811 770 2921 2321 -359 -2201 -1924 151 3116 2823 212 -2595
3752 -2595 -3062 -341 2440 2827 -267 -2503 -2356 -174 1913 2992 454 -1999 -2143 -260 1828 3022
3768 3022 460 -1625 -3061 -342 1645 3306 1570 -1770 -2520 -1369 1655 2126 1676 -596 -2706 -1675
3784 -1675 921 2369 1362 -1206 -2291 -1965 769 2569 1996 -1102 -2664 -1276 528 2551 2733 -616
3800 -616 -3137 -2187 875 2871 2227 -63 -2992 -2564 365 2395 1795 -459 -1783 -3009 195 1874
3816 1874 2367 333 -1690 -2069 -940 2117 2852 332 -2030 -2253 -1364 1275 2671 1388 -1102 -3185
3832 -3185 -1357 1008 3069 1053 -560 -2112 -1803 859 2720 1570 -1368 -2163 -2072 361 2117 1885
3848 1885 -257 -2836 -1960 -163 2566 1557 -498 -2869 -1822 96 2471 1871 -362 -2246 -1781 90
3864 90 2009 2150 503 -2552 -1642 12 1894 2283 668 -2025 -2199 -69 2199 1875 685 -1626 -2326
3881 -2326 -790 1464 2686 1504 -1745 -2534 -638 1405 2112 1514 -1324 -2347 -1181 1184 2308 1269
3897 1269 -567 -2539 -1472 63 1694 1512 -619 -2205 -1557 -4 2041 1510 -90 -1956 -1391 -197
3913 -197 2522 2044 35 -1008 -2051 71 2048 1940 450 -1429 -1845 -746 2010 2064 680 -1242
3929 -1242 -1629 -1166 1537 2260 363 -1591 -1634 -542 1312 1962 912 -1411 -2592 -675 1392 1446 1874
3946 1874 -1509 -2444 -2208 750 1997 1687 -967 -2448 -1927 90 2061 2200 -466 -2380 -1504 325
3962 325 2450 1859 -160 -1592 -2366 544 1644 1695 -94 -1753 -2268 67 1768 2323 465 -1742 -2603
3979 -2603 -258 2264 2037 59 -1569 -2188 -915 1990 2546 602 -1352 -1839 -779 1779 2076 570
3995 570 -1205 -1728 -1204 683 2294 890 -353 -2019 -1775 671 1878 1685 -594 -2838 -1205 746
4011 746 1972 1089 -632 -2130 -1385 926 2460 1351 -35 -1024 -1533 678 1516 1645 9 -1607 -1980
4028 -1980 198 1990 2223 220 -2056 -1709 189 2050 1893 311 -1157 -1459 -383 1887 1934 832
4044 832 -1072 -2191 -817 369 1224 1429 -458 -1616 -1127 665 1911 1133 -902 -2064 -1277 732
4060 732 2586 1434 -1039 -1660 -1019 962 1551 1199 52 -1599 -1780 353 1598 1769 154 -1091 -1222
4077 -1222 -439 1883 1916 46 -1519 -2063 50 1819 1769 680 -907 -1499 -869 415 2391 755 -1364
4094 -1364 -2382 -1590 699 1864 1290 -1312 -1344 -758 590 1763 1143 -911 -1856 -1244 1100 1442 691
4111 691 -408 -1641 -495 1064 1808 1353 -836 -1455 -2000 133 1776 1580 25 -1583 -1466 76 1544
4128 1544 1660 -78 -899 -1931 -446 1244 1626 -71 -1583 -1187 -601 1649 1552 353 -1829 -1699 -701
4145 -701 942 610 1150 -203 -1784 -618 1074 1320 618 -887 -2091 -979 634 1596 502 -790
4161 -790 -1769 -585 658 1702 463 -560 -1643 -658 262 1835 920 -26 -1818 -276 243 1519 2171
4178 2171 -672 -1311 -780 -157 1543 1495 -398 -1119 -1921 -214 794 1975 394 -1271 -1836 -1279 1468
4195 1468 1224 690 -1059 -1295 -420 1006 1081 279 -850 -1367 -377 865 2047 631 -733 -1689 -419
4212 -419 56 2001 753 -191 -994 -877 534 1807 817 -379 -1691 -837 -146 1022 970 -366 -1452
4229 -1452 -1363 236 865 1188 285 -1552 -913 -726 1410 863 338 -929 -1566 116 721 1437 27 -1183
4247 -1183 -1598 -186 908 1177 -487 -510 -1554 -86 595 1262 218 -753 -1808 -491 882 1142 755
4264 755 -775 -1027 -729 1563 1956 868 -252 -1101 -729 520 1152 1075 -410 -1060 -1201 430 1710 762
4282 762 31 -1482 -1110 462 1193 2019 877 -1120 -551 563 697 1277 201 -924 -1310 -261 817
4299 817 1082 -122 -942 -1848 -854 487 1661 231 -1399 -866 -265 1147 836 1029 -805 -1096 -459 14
4317 14 1336 215 -383 -1317 -616 158 1836 666 -590 -1416 -1114 612 1077 1136 -560 -2021 -1129 -351
4335 -351 1651 960 -435 -644 -1033 262 923 1038 -59 -863 -485 -475 986 1728 -92 -1616 -607 197
4353 197 1428 1314 416 -330 -806 -940 254 967 594 -366 -1192 -873 994 1010 818 -1293 -768 -49 1063
4372 1063 860 690 -358 -870 -583 463 1167 660 -150 -1362 -466 435 685 643 -214 -1482 -545 -389 910
4391 910 1180 218 -902 -1047 -690 1175 1112 311 -379 -1295 470 1107 1002 3 -703 -2204 -60 887 1149
4410 1149 -377 -1251 -1426 -48 348 1501 315 -177 -1013 -505 232 1541 281 -524 -1039 -548 994
4427 994 1102 548 -1063 -795 -602 728 1099 752 -35 -1278 -777 100 1384 605 58 -457 -1104 -108 904
4446 904 1123 -212 -932 -575 94 973 881 295 -1035 -1131 35 933 1039 -195 -533 -741 -436 913 968
4465 968 694 -1121 -1045 -601 279 1084 244 -1083 -1119 85 423 883 841 -573 -1180 -333 -5 915 906 42
4485 42 -1496 -587 816 563 881 192 -1119 -355 630 1258 1051 -95 -775 -1619 83 1110 790 -383
4503 -383 -1372 -532 -75 1050 769 -337 -286 -435 288 742 1507 25 -593 -502 -205 223 475 4 -746 -967
4523 -967 -373 566 1036 526 -536 -1343 -335 637 1019 556 -913 -793 -164 253 1036 927 -703 -935 -642
4542 -642 632 1567 643 329 -825 -1003 585 484 -105 97 -1178 -1153 366 1008 703 -244 -659 -640 276
4561 276 902 1028 -432 -1450 -1213 -49 642 830 11 -434 -802 468 1103 648 418 -676 -525 -247
4579 -247 148 1547 -153 -956 -1009 -363 1226 1035 -102 -548 -1078 -609 525 900 417 -130 -310 -1270 619
4598 619 998 627 -760 -756 -703 -519 1565 761 -335 -386 -831 194 863 703 -165 -1163 -770 -105 776 333
4618 333 566 -1253 -1078 -16 668 592 684 -91 -414 -170 505 1350 -135 -194 -649 -284 436 1537 235
4637 235 -456 -749 -720 529 -235 1048 -391 -965 -68 -135 854 707 -688 -1002 -450 214 566 -237 124
4656 124 -1024 -78 -318 1109 682 -118 -456 -619 369 1274 673 76 -1221 108 -83 1105 590 -306
4674 -306 -609 -1128 -122 1082 212 464 24 -1072 -112 270 868 144 -718 -1155 -698 133 493 637 -243
4693 -243 -618 -621 176 498 230 -43 -913 -913 457 249 552 -213 -310 -679 106 1540 1079 204 -864 -786 260
4714 260 384 587 223 -683 -415 -239 744 523 -553 -450 -904 -136 353 1084 575 -192 -917 -764 633
4733 633 444 19 -533 -958 -147 839 807 648 -588 -726 -291 626 984 30 -283 -849 -341 240 1011 334
4753 334 -616 -432 -722 751 326 383 -338 -630 -814 -437 219 58 380 -809 -103 -289 -223 375 -225 -270
4773 -270 -588 15 431 477 -471 -354 -281 -126 437 582 -64 -1144 -588 406 413 -303 579 -19 -747 151 -373
4794 -373 851 312 -121 -108 40 260 413 351 -316 -529 -1 -516 376 -33 -646 -848 182 -325 -378 -288 -207
4815 -207 -805 -1114 380 920 171 299 -1380 -395 580 872 739 -16 -337 55 221 210 562 -14 -480 -482
4835 -482 372 1019 806 190 -707 -95 -795 785 225 -196 -252 -391 400 528 910 245 -325 -842 -95 238
4855 238 1261 311 358 -282 -580 881 800 427 -48 -31 -506 20 835 -36 330 -276 -818 250 118 267
4875 267 -56 -579 -478 149 1133 670 824 -499 -118 -125 258 698 55 -203 -366 -803 300 812 379 505
4895 505 -669 120 275 903 226 -909 -547 -775 90 523 155 -397 -71 -303 620 744 250 124 -150
4914 -150 -511 657 1110 18 158 -359 -319 554 453 441 411 -137 -517 162 198 1173 -303 -1119 -227 305
4934 305 336 563 617 -441 -543 456 432 -24 -38 -956 -175 -468 772 140 571 -237 -762 -602 373 858 401
4955 401 -552 -624 146 -245 395 210 -451 -555 39 -134 1245 412 -229 -639 -400 554 848 269 -625 -749
4975 -749 -583 584 235 589 -296 -137 -650 -363 985 629 360 -1279 -726 276 245 436 -319 -147 -555
4994 -555 -505 99 700 352 -807 -28 698 113 660 -193 -256 84 424 49 139 -81 -313 -108 -162 118 809
5015 809 -234 81 108 -172 542 914 719 -429 -120 43 -213 26 63 603 147 -24 -154 666 118 162
5035 162 -969 -264 -41 -515 387 428 54 53 -173 222 706 -201 96 318 284 -63 606 -267 -2 -861 -153
5056 -153 44 362 -201 -331 -556 148 562 -168 256 -673 -185 -282 333 -272 225 -331 -378 343 150 733 -69
5077 -69 298 -252 -213 420 350 -249 -104 -693 -496 7 -107 719 387 -1182 -560 -354 299 9 113 -53 -384
5098 -384 458 621 647 63 195 -829 -475 -70 193 -216 100 -552 208 490 240 276 -112 -316 -430 -74
5118 -74 258 366 -780 -585 -128 -478 418 -125 -479 -388 -27 -374 937 -87 -827 -414 -227 457 363 380
5138 380 175 149 -327 54 -375 500 -55 -407 404 -239 754 43 -455 -512 -275 -246 579 549 469 34 -196 -9
5160 -9 926 205 57 491 -147 291 495 687 -304 -100 -177 624 623 1011 -346 -194 -187 -494 -181 682 196 -628
5182 -628 -348 -273 279 178 658 148 -213 -108 -310 -9 182 -267 214 -564 -331 -7 722 -251 -776 -193
5202 -193 -103 323 569 216 -517 -184 -76 -323 137 106 -764 422 230 528 430 -111 -182 -393 -619 413 -220
5223 -220 384 216 -540 -340 316 956 438 123 -505 -87 682 970 127 166 -13 -515 -49 680 85 -210
5243 -210 -628 -284 240 36 64 572 -442 -130 77 143 -128 -54 87 -1105 59 364 858 -139 -256 9
5263 9 413 191 120 -24 -180 -59 -146 610 321 -569 366 -141 -254 556 27 -11 -375 -444 222 258 582 -49
5285 -49 -61 -390 380 133 395 819 -91 -264 -707 -192 1022 453 -149 -831 -123 -25 -143 434 223 -23 114
5306 114 452 -498 546 -587 135 -457 123 291 66 64 -254 -359 -298 298 -136 348 -399 -611 241 281 89
5327 89 247 307 -657 -69 -92 136 109 -544 -90 16 607 889 86 -695 26 -390 -51 638 579 -57 -189 -708
5349 -708 208 655 -351 -596 236 -381 86 -462 -449 -105 -655 123 -6 410 374 -539 -437 248 548 625 942
5370 942 -335 -603 -412 271 228 -170 259 500 -44 -87 392 778 560 261 -393 -2 372 517 133 -598
5390 -598 -649 47 56 -459 970 81 -470 -281 -840 208 -8 -157 -86 -212 528 81 224 -618 -507 -267 344
5411 344 75 -21 336 431 -689 -278 617 -215 43 -517 -562 -790 376 726 476 -271 -321 -681 -364 -328 -16
5432 -16 -311 -116 -89 358 692 -53 -342 -18 -467 -257 295 28 -243 -225 -738 -97 301 268 69 -727 396
5453 396 -512 -101 205 -35 -614 -100 439 -253 61 529 -484 -79 61 -172 385 117 -248 46 600 351
5473 351 347 251 -356 -348 -120 676 128 595 -478 -322 -161 161 -318 696 60 -346 474 419 1186 37 -461
5494 -461 -478 -190 608 40 -282 -144 -435 -86 78 128 -317 -137 -773 -301 -24 273 -337 336 -856 -1182
5514 -1182 98 521 178 -43 -304 -442 259 540 43 -3 57 -371 104 667 19 -423 -144 -86 -14 -597 -21
5535 -21 -161 -95 29 377 32 180 -533 -72 -184 -394 -259 237 554 86 257 -21 196 87 232 -375 -350
5556 -350 578 290 723 556 412 1 673 403 295 178 -343 -456 87 -318 -101 377 644 -245 -379 214
5576 214 28 502 -263 -366 74 113 567 54 252 -569 -123 113 371 564 -174 474 -545 -346 -257 251
5596 251 -98 -95 294 302 376 242 515 -261 -446 284 372 370 344 -338 -466 110 -390 234 202 -326 245 -177 -713
5619 -713 -125 77 -377 -337 -487 -323 622 292 -416 -275 310 -392 226 178 -385 -398 192 458 204 631 511
5640 511 -418 -20 118 -30 410 195 -312 -735 7 -52 -116 -868 -4 -396 -430 -253 288 333 303 -845 446
5661 446 -165 195 362 -325 -443 -70 466 350 -19 279 -614 585 -880 600 -574 -737 538 47
5679 47 329 -192 -199 142 -315 -74 -406 -289 297 46 68 -295 75 -35 137 -255 134 -409 -140 42 -190
5700 -190 -129 -129 -609 119 259 476 429 456 481 20 817 42 -54 124 -191 -49 446 -134 32 -428 -75 -28 401
5723 401 436 1 -585 -199 -271 239 35 258 67 -182 -257 -375 1 606 -260 -833 -378 38 134 418 -429
5744 -429 294 115 -127 793 -129 -164 -194 -50 230 -116 -395 -272 -423 612 175 242 -279 310 -85 10 -649
5765 -649 237 493 522 209 -256 388 480 353 -501 325 6 468 -145 368 69 116 218 -784 344 -204
5785 -204 650 252 -126 357 -432 327 -311 156 -90 10 -208 -706 -110 91 146 -86 -1183 298 -292 446
5805 446 -796 -396 -387 -124 -252 -87 -641 -742 257 228 202 142 14 -89 330 -178 45 -35 -304 -1044 -53 -303
5827 -303 456 -49 -571 765 -236 171 -112 -366 -281 -365 -253 -301 -788 -56 -299 -277 237 -69 51 -634 -591
5848 -591 -420 -150 259 722 405 662 -470 418 -72 -52 3 -401 -186 -319 571 158 -170 -88 -771 -262 -394
5869 -394 -335 4 935 -364 -168 -294 126 842 245 -374 -487 -46 -62 618 -769 652 -168 -246 36 514
5889 514 -137 -129 -174 -373 40 899 315 -45 -31 40 -466 155 464 103 -203 -541 159 -117 643 190 -68 67
5911 67 -23 555 219 418 -238 -593 -280 55 40 -464 3 60 157 247 50 27 214 -25 29 277 -165 -419 -714
5934 -714 214 175 -378 14 105 -783 -137 419 -7 25 -39 -303 -795 -316 988 424 28 326 -236 -444 3
5955 3 175 210 194 -35 40 -1425 83 6 160 -285 -139 421 -20 -123 11 -600 63 299 201 433 -326 -1050
5977 -1050 -330 27 434 52 694 -811 -35 -253 -504 124 -98 -204 -355 -350 96 -247 -207 -317 -654 368
5997 368 -300 -82 -127 -378 -457 -366 -336 790 -296 36 -319 -207 -190 10 -549 30 222 65 226 518 422
6018 422 152 -625 -457 -66 -323 573 -80 -120 -21 -287 704 299 -495 -170 -37 -206 44 103 594 -176 160
6039 160 -283 84 231 333 -131 -182 -235 -588 281 105 31 66 -737 -4 26 228 -185 814 324 420 503 -11
6061 -11 413 -340 42 -206 177 195 411 -859 -146 -629 -4 -93 566 -75 -75 159 47 129 -257 53 -159 435
6083 435 483 205 17 -51 -414 -485 207 100 -289 -106 192 -203 341 431 -230 188 -359 283 466 -9 206
6104 206 205 174 87 491 478 -76 174 374 -593 -218 -241 125 -73 -470 -430 -297 227 -825 -454 -179 136 311
6126 311 657 319 132 -172 -611 -39 -9 -277 306 -63 -152 -282 -204 -240 -102 -29 -112 -180 -296 252 468 -522
6148 -522 96 -640 -297 -694 -66 170 -1172 702 -448 193 350 -177 204 214 -16 419 92 542 289
6167 289 400 -599 217 840 -673 291 85 -277 546 -724 473 221 -238 -341 87 -4 -248 -361 209
6186 209 -550 65 376 -106 -378 164 -446 211 -222 -138 381 195 384 -16 -179 293 153 -175 -135 -24 89
6207 89 -244 -89 566 -461 185 -307 -100 -129 -31 -46 -238 -120 686 -113 -105 -618 -124 318 -189 -489 -38 27
6229 27 97 -203 289 -17 -11 215 -111 -257 426 -353 -260 631 411 -93 368 192 -335 -19 194 -254 758
6250 758 121 376 706 22 418 232 -54 91 200 181 -374 108 -237 61 369 -60 -420 236 -398 -14
6270 -14 -699 -723 -100 -14 -99 358 -276 -288 84 131 259 -463 16 138 -236 265 -359 -329 27 95 -112 137 -259
6293 -259 -501 6 -149 98 2 156 -150 360 86 863 440 193 77 86 -264 -367 35 258 -106 137 496
6314 496 -234 -230 430 208 166 -497 -109 -201 540 -160 -347 233 -112 423 555 -154 -148 -99 -67 48 268 -326 8
6337 8 46 -411 -376 498 -76 -588 414 231 271 -83 98 20 -350 122 174 253 654 525 48 99 -382 364 -92
6360 -92 -342 308 -454 398 -40 -247 -33 58 -149 150 7 -231 213 -338 324 -332 -69 -9 107 -124 -335
6381 -335 235 384 -140 -421 -433 -41 25 -394 304 169 -411 -64 381 -323 -340 -302 -199 -21 144 -306 -475
6402 -475 -282 570 -85 -107 449 -303 160 -155 -238 80 291 -289 -271 251 442 -301 -799 -128 -348 317 -109
6423 -109 -283 -226 -143 -485 282 -561 -121 59 344 758 634 392 56 82 123 93 48 -481 -12 465 -334 194
6445 194 -146 155 -88 756 -227 -98 465 -348 -226 23 430 51 342 186 656 -315 -301 303 395 112 402
6466 402 -968 224 160 420 -349 -366 261 277 142 -182 -261 -261 -63 -59 -792 292 -135 339 -366 95 214 -68
6488 -68 182 -52 -222 -113 736 240 319 106 25 -31 79 177 146 244 101 -523 -46 98 157 -804 -414 -527 339
6511 339 -668 -750 766 -2 -515 48 -218 292 92 106 126 -368 -795 -14 -31 -464 -833 -345 -321 388 -6
6532 -6 25 253 233 1 74 -569 -66 207 -177 189 19 5 -172 393 436 -282 -316 -85 473 -6 331 -231 48
6555 48 -435 341 -279 322 -260 -3 -573 -3 339 -492 643 14 484 -568 134 158 -240 187 452 321
6575 321 102 89 -68 -173 496 -384 -575 -52 -470 178 486 125 -263 -111 -7 459 -328 -330 -102 -74 310
6596 310 197 -518 255 -317 -405 393 211 -266 -464 48 103 336 274 517 -163 99 -190 137 173 212 68 258
6618 258 11 359 -10 -359 738 -103 -422 -656 -83 -273 32 191 131 440 -261 -435 68 114 282 -424
6638 -424 182 -738 -131 -433 -353 -100 383 -323 -371 674 282 -206 10 279 92 -196 357 56 -282 -140
6658 -140 113 -307 670 122 -327 567 350 -149 -162 -383 -663 -465 445 -13 -142 264 -204 38 -439 139
6678 139 -322 -795 -319 -256 38 35 229 -312 127 485 445 366 -27 -37 -118 221 215 172 -248 45 -19 212 222 129
6702 129 -91 468 -112 56 -296 117 -209 902 533 1 -351 -519 1032 233 -287 702 489 233 246 -330
6722 -330 -207 -210 824 151 70 177 -333 70 -259 225 496 223 -941 -12 -428 -256 -30 -417 -345 694
6742 694 527 -600 237 -262 -545 -792 407 -51 355 -39 -642 562 -20 -204 632 -206 700 534 -57
6761 -57 16 -110 66 -591 106 467 19 -27 179 248 -368 -449 573 146 504 -334 126 558 -182 507 271
6782 271 -195 394 105 354 979 -141 -90 238 247 382 18 -375 296 -339 -966 264 -204 325 23 -473
6802 -473 424 -18 -563 -375 -439 -280 198 -211 -144 -157 -38 402 -355 95 566 -73 440 92 44 -318 -449
6823 -449 34 540 270 610 249 -276 -522 -27 207 -91 234 28 -82 296 235 179 -470 -592 150 -4 294
6844 294 -667 260 -216 258 -324 -172 -96 79 -417 -168 228 407 -18 384 245 -147 -244 -400 20 87 334
6865 334 -194 305 101 -245 164 -935 -100 580 227 693 -387 315 330 368 471 -63 150 418 49 803
6885 803 836 469 286 -615 -105 472 498 -150 -546 -117 241 -117 180 200 -621 210 -337 -89 169 -525 354
6906 354 301 221 -249 144 -84 -407 -232 311 147 234 -13 -923 -158 34 -72 540 -377 108 313 -257 -296
6927 -296 -302 -210 224 -596 292 -291 -187 -31 -252 345 -167 446 634 216 7 470 -1079 68 -616 243
6947 243 215 152 -266 395 -451 431 -292 227 -781 459 124 -210 338 -787 -579 -105 608 -524 158
6966 158 150 -41 -198 150 -249 -32 -44 -1025 340 432 -40 -332 -580 24 -442 468 55 -277 -203 -88 -139 -273
6988 -273 -271 136 290 -199 -214 168 -572 -49 454 -354 -367 -56 -1172 -223 -26 -618 -264 219 -351 -661 801
7009 801 -84 66 -285 -77 -169 -687 -151 625 -348 58 58 599 -376 4 -594 -171 709 156 218 383 1084
7030 1084 702 -330 147 -186 -352 304 -259 -498 680 494 -134 136 -10 627 210 444 -432 -328 233
7049 233 34 420 -84 -537 319 -490 -286 308 -231 11 -323 -409 -1041 687 1013 291 -77 151 -23 -565
7069 -565 313 -269 412 56 415 307 -557 -217 -124 -237 -259 -2 -110 -264 -86 -389 -464 -161 190 227 233 140
7091 140 44 139 307 -461 -141 -113 -297 363 -305 95 -339 -238 -189 64 89 -291 268 57 -174 562 -397 436
7113 436 234 -81 -27 36 -238 -248 19 131 238 63 667 141 193 188 375 -160 -306 -351 54 70 -267 -286 148
7136 148 194 -197 -134 429 29 469 -115 -166 -201 105 283 -4 -386 -107 -839 -292 -151 -53 -416 -137 -396 -245
7158 -245 84 -50 -294 -244 24 -105 -384 -197 299 -149 -144 -533 -232 -421 38 -75 63 105 379 -118 -105 840
7180 840 38 -403 682 -227 -682 460 59 -356 80 185 -471 -241 -377 -91 241 49 129 572 18 -213
7200 -213 -142 -43 283 -294 199 -24 -95 385 108 627 -362 169 -359 -521 102 -306 41 -133 190 119 402
7221 402 159 528 331 308 255 69 -179 223 96 -569 -124 214 -182 286 57 -146 -1 -341 35 -79 -282
7242 -282 -39 -715 55 -43 283 -632 -233 630 -492 751 84 -105 279 -273 373 372 440 720 5 -86 -115
7263 -115 97 -425 69 -624 194 27 381 -701 -157 -37 462 589 -330 525 -170 195 235 -132 128 -123
7283 -123 663 -637 409 -636 226 573 -812 143 442 181 -233 368 339 -299 696 57 71 -337 549
7302 549 420 -132 -575 -512 -393 -378 43 -472 278 587 -1000 187 105 251 273 137 387 -107 -254 -363 212
7323 212 -69 389 477 419 184 61 -765 188 -358 392 268 -419 -99 131 58 124 157 337 168 -456 -244 662
7345 662 215 -290 414 110 745 303 -294 148 298 -394 -66 648 -1100 -57 -149 -132 189 -859 -274 415
7365 415 -450 -5 -351 -277 -454 140 164 -431 -241 249 -471 415 179 156 330 -156 -399 -422 307 -65 -296
7386 -296 216 -600 78 377 -88 -171 -38 115 522 496 323 244 -66 -410 -248 -150 173 168 -276 -8 -887 -117
7408 -117 916 -385 -320 288 -490 -209 -101 1 120 -220 97 246 -711 27 107 309 -331 -86 410 387
7428 387 206 565 -554 -123 381 -111 247 -362 -486 -16 -330 64 244 586 292 -168 344 -86 410 -302
7448 -302 -33 111 472 -252 -320 341 -192 435 -9 -356 -345 15 356 -790 370 -348 -193 365 -106 -73
7468 -73 -59 32 365 -289 144 522 -177 23 -83 -542 -17 -96 151 -214 -689 144 347 -477 -78 528 7
7489 7 294 -13 715 -331 -278 -157 -183 514 -222 50 -467 129 -41 -340 116 -355 532 251 892 -304 270
7510 270 95 -610 237 -125 -105 -771 -107 -244 509 -230 -92 79 85 233 124 80 76 670 -96 -66 7 640 -211
7533 -211 -270 -543 242 -245 892 344 -162 982 -636 5 1004 -57 66 451 -269 546 154 -119 -412
7552 -412 128 544 -417 335 408 277 -242 701 -40 -331 -60 395 126 505 203 -455 252 226 -346 169 175
7573 175 -303 -440 155 -256 -43 524 109 330 -240 120 420 -37 -95 -261 -282 58 -367 283 254 -617 435
7594 435 242 -492 558 -76 647 -167 302 -184 -211 91 -7 116 321 492 -628 79 205 494 479 -242
7614 -242 371 -418 -397 -196 380 249 -662 -167 433 363 373 -38 -729 -145 -411 370 97 -704 -287 767 458
7635 458 58 -213 -209 62 247 442 -68 606 -113 160 195 -116 238 778 313 388 231 -308 -231 43 119 274
7657 274 816 412 87 -162 -223 209 219 -185 305 -460 346 525 -228 155 122 -324 564 93 -421 -141 105
7678 105 60 -139 304 162 -120 -123 -243 234 266 754 -521 -27 -102 -619 -700 -186 -421 432 0 -113 -275 -200
7700 -200 267 412 -481 125 169 409 209 -130 -183 -68 375 582 -265 382 121 -375 -148 55 -618 -165 570
7721 570 -223 102 -1067 -6 -437 -512 -44 184 776 51 -148 179 -301 860 -359 209 1063 -78 2
7740 2 -23 -404 -146 -35 -233 -128 -329 -48 19 88 -131 248 257 -292 -171 213 146 116 -71 -29 -406 124 271
7763 271 56 740 1 317 129 -43 -288 -504 -575 -213 -202 -448 -173 489 -238 -49 -695 -164 -477 -29 101
7784 101 239 -17 -402 -253 460 -416 -272 109 -824 -100 32 193 -341 -201 -315 2 -235 57 -316 313
7804 313 362 872 -328 -388 -295 205 25 -213 77 167 49 86 -119 -417 -209 131 -385 -218 151 -238 -16
7825 -16 170 357 282 -711 195 -516 22 -63 825 175 -258 340 71 -493 -139 -318 291 -66 492 -49 -611
7846 -611 530 4 -205 -321 838 95 -149 41 131 -212 -259 183 -1 319 -417 -214 -331 -18 430 -353
7866 -353 -498 -314 -246 260 -225 -228 156 252 -46 -438 -177 -8 213 -234 -59 -839 83 483 284 -139 348
7887 348 244 628 126 748 613 -472 -310 52 124 545 379 -276 253 -13 451 -317 -142 76 407 480
7907 480 71 -479 -76 417 -207 87 354 555 -300 -209 -434 -79 -128 3 -635 -437 398 -63 -30 -78 -370
7928 -370 -299 111 -364 87 86 96 -241 548 -620 -649 224 -381 -492 -285 -67 -346 -566 -567 -867 -109 144 185
7950 185 -49 89 -118 57 54 282 -57 103 -148 -115 -173 100 350 398 -23 513 261 215 96 -509 -329 -44
7972 -44 352 -385 -214 -73 308 237 457 -169 -183 -31 -376 -415 -100 -103 -89 392 -129 488 -38 -594 -188 297
7994 297 407 16 -165 668 29 -290 239 -423 57 255 -258 -354 -438 381 373 -113 -630 -1 -139 250 375
8015 375 -717 -147 -571 -322 252 825 -494 161 -282 -398 131 144 -103 208 -556 29 639 744 602 -397
8035 -397 -182 -74 146 32 -173 66 -414 43 264 -185 397 -260 -54 -186 -131 -323 -21 -170 -188 578 185
8056 185 647 -207 102 -199 207 -93 -149 -255 211 348 267 -491 -353 -201 -70 503 415 533 -103 406 -103
8077 -103 720 -322 -662 113 14 -390 169 402 -293 -147 -505 -4 145 -12 -96 -292 -388 -279 -134 -580 227
8098 227 -340 -485 -180 570 146 -79 -452 59 758 364 -347 -199 -750 -329 -238 13 374 426 -443 -588 -56
8119 -56 -41 148 1001 -426 16 576 153 396 -91 221 49 -493 24 624 -499 -483 467 -230 -403 138
8139 138 266 282 -86 -392 157 308 -243 -414 621 -921 -267 495 324 -326 202 -297 -36 161 -39 -32
8159 -32 272 195 -316 -178 -334 -251 404 -239 1 663 -291 -137 -513 -513 1065 188 158 23 -246 515 464 204
8181 204 -159 106 -25 -771 -366 153 20 -467 -273 15
8191A5
$$ Imaginary data points
##PAGE= N=2
##DATA TABLE= (X++(I..I)), XYDATA
0 0 0 0 0 0 19 0 40 -40 40 -80 80 -80 120 -160 192 -240 280 -320 400 -451 521 -622 720 -819 956
25 956 -1087 1235 -1414 1593 -1791 2031 -2277 2541 -2858 3186 -3545 3952 -4379 4853 -5389
40 -5389 5961 -6595 7316 -8095 8964 -9956 11060 -12325 13786 -15476 17484 -19905
52 -19905 22872 -26643 31614 -38449 48565 -65067 96678 -179650 859926 2014880 234602
63 234602 -1218760 -1441824 -71530 1209735 1474950 391228 -914958 -1398991 -445287
72 -445287 995801 1586102 617822 -871882 -1448452 -536765 850218 1430925 691187 -594990
82 -594990 -1270504 -664454 658374 1457559 874883 -535336 -1379288 -782370 631026 1476878
92 1476878 973503 -332173 -1225915 -905811 312141 1294157 1062944 -207616 -1283904
101 -1283904 -1065731 231412 1301802 1121994 -52221 -1071275 -1041518 -50850 1004016
110 1004016 1162255 218023 -980527 -1233995 -218685 1037335 1206568 121178 -1063685
119 -1063685 -1167938 -188507 862913 1041948 260802 -751693 -1086612 -410356 677590
128 677590 1118567 437047 -703594 -1160176 -485837 645694 1158002 604765 -485567
137 -485567 -1120071 -699840 415091 1164034 770651 -420049 -1218892 -817495 360647
146 360647 1130159 765746 -336083 -1115551 -857315 189524 1045746 883489 -165154
155 -165154 -1069160 -910631 145431 1017592 848262 -139425 -963017 -871833 12843 878014
165 878014 932234 90755 -888718 -1033484 -142883 915413 1055142 133348 -894515 -1003880
175 -1003880 -132600 835460 1004746 262323 -688065 -975242 -320628 677473 1062484 440437
185 440437 -588994 -1015544 -439546 547750 990926 492216 -461654 -982004 -574681 399931
195 399931 1014948 640214 -384548 -1033560 -644256 383125 1013332 650981 -307664 -928562
205 -928562 -639641 273187 948750 736909 -179884 -918038 -744302 171837 917952 774870
215 774870 -80544 -811947 -756138 196 759787 828367 121596 -719094 -874751 -155634
225 -155634 751337 934876 206774 -698618 -892255 -219303 639959 869081 275638 -570054
235 -570054 -870151 -334507 530806 883977 366979 -516063 -900124 -419916 443917 862833
245 862833 457858 -375574 -852979 -515839 335426 888903 587167 -300038 -897774 -602252
255 -602252 291659 894459 628368 -222842 -834778 -640732 155525 794805 667202 -107658
265 -107658 -784369 -697698 66099 754834 704837 -14988 -699070 -710790 -59771 637017
275 637017 732684 128192 -614013 -770726 -163857 623203 803695 187373 -611846 -805382
285 -805382 -218684 562648 787021 256742 -510889 -782591 -295668 483738 797810 338172
295 338172 -445357 -785210 -361938 402272 777569 422897 -312277 -739486 -458214 269866
305 269866 751980 508932 -239162 -758590 -531654 221687 754289 550637 -175447 -714387
315 -714387 -561991 123038 681583 580707 -80120 -660138 -591319 62306 658793 617280
325 617280 -10864 -615215 -628154 -50188 569519 651645 116975 -534428 -673446 -150282
335 -150282 534637 701664 176061 -524035 -709522 -208089 486390 707858 256301 -428438
345 -428438 -691345 -283614 399874 692265 309224 -370692 -680873 -326981 337918 676759
355 676759 375156 -273288 -661406 -423424 218191 653755 455251 -193549 -655733 -472142
365 -472142 181078 661321 496880 -147110 -645106 -522562 97575 618043 541001 -55298
375 -55298 -590934 -546517 28854 571159 554327 3130 -544906 -568887 -52000 512456 594302
386 594302 113323 -475150 -606959 -149818 457655 621124 177464 -436682 -616944 -189114
396 -189114 427298 632924 232911 -384898 -626963 -264211 351719 623468 290680 -317263
406 -317263 -608381 -305873 287521 600247 336978 -245871 -594801 -377010 200816 592164
416 592164 417029 -162276 -585507 -438185 137191 577521 454501 -108075 -559735 -464438
426 -464438 83427 552149 490285 -40798 -525490 -497091 13941 508869 510862 27087 -472156
437 -472156 -508688 -53709 452204 527873 100321 -423140 -540658 -134233 407698 557872
447 557872 166110 -388310 -565273 -195095 358663 558441 213610 -337561 -560260 -243513
457 -243513 304770 552305 261113 -284061 -554641 -292379 243063 537181 314235 -205955
467 -205955 -526584 -343890 166509 517709 369036 -139864 -517817 -394172 114729 514630
477 514630 415068 -86783 -503504 -435127 49829 479825 439630 -29857 -471177 -454896 -571
488 -571 446046 451443 14191 -439632 -478394 -69011 395627 471993 90396 -383056 -494528
499 -494528 -134651 347761 484667 141893 -348061 -506491 -178961 317836 505011 201875
509 201875 -295750 -507618 -230705 262035 494866 245894 -238836 -486220 -261577 215990
519 215990 485361 289690 -183703 -481610 -320230 144785 470206 340770 -116563 -462440
529 -462440 -359797 91838 452514 369128 -76892 -453421 -392609 46445 438557 404724
539 404724 -18827 -420019 -411414 -5413 399238 412745 28341 -376263 -410652 -46432 364342
550 364342 430771 92374 -326546 -427861 -114720 314744 448022 157813 -276714 -433910
560 -433910 -161106 276621 454549 197304 -245157 -445840 -210383 230807 451506 240301
570 240301 -195987 -438857 -255471 173611 433805 272705 -151034 -430637 -294608 126469
580 126469 427262 316655 -99179 -418101 -330222 78179 409855 344549 -52518 -394590
590 -394590 -350409 33214 386644 366689 -6124 -370775 -373622 -13443 358174 380125 35898
601 35898 -337040 -381860 -62494 310514 381009 86077 -293815 -398844 -125842 263797
611 263797 395055 137098 -263445 -421151 -178957 229223 404572 176478 -235146 -427991
621 -427991 -215664 192819 399293 206669 -194050 -414378 -240657 155610 393905 244090
631 244090 -146614 -400320 -273111 111647 380627 274120 -102173 -382465 -294256 71087
641 71087 356252 289513 -62315 -357413 -317114 18220 328409 315112 -8427 -332910 -343364
652 -343364 -31681 299298 327966 29613 -302789 -349592 -68357 269146 341077 80465
662 80465 -263019 -362768 -124302 225428 353554 135042 -221491 -370012 -161589 205526
672 205526 371941 172531 -196524 -373330 -185309 180653 371161 203907 -153369 -355979
682 -355979 -212547 134402 349195 225941 -115459 -345954 -244879 91789 339220 258129
692 258129 -73952 -335580 -274932 44723 312743 273684 -30137 -305514 -289531 2525
702 2525 293221 303479 20638 -285731 -318179 -42334 276275 327529 60966 -262460 -326820
713 -326820 -71450 251813 329495 90161 -234638 -330690 -107672 220344 340071 134909
723 134909 -199497 -340376 -148013 190139 341094 156844 -180284 -341479 -170496 161044
733 161044 331082 175674 -149960 -331346 -199457 113719 308308 199492 -102627 -309995
743 -309995 -224512 73232 297858 231604 -61768 -297858 -246425 40990 284873 252338 -20466
754 -20466 -270830 -261968 -1499 259310 270612 18047 -255896 -285625 -40991 242991 287471
765 287471 49054 -240983 -297887 -69101 219196 288701 74967 -211945 -296707 -100760
775 -100760 185638 289274 110467 -179814 -300755 -136528 154057 289794 139811 -149753
785 -149753 -297864 -161245 125344 285825 166026 -115532 -284809 -180941 92496 274188
795 274188 192832 -73452 -269987 -208130 54689 267804 220606 -41670 -266849 -233768 22639
806 22639 254582 235250 -14071 -253038 -251622 -11724 234363 249617 19016 -235220 -267278
817 -267278 -44194 219061 265584 50523 -215964 -273721 -66723 199297 267854 73946
827 73946 -189384 -269997 -93128 169717 267038 104976 -159696 -271140 -124363 139954
837 139954 266808 134258 -129037 -268443 -147017 114765 265914 159069 -100927 -263179
847 -263179 -171615 82459 254380 178837 -70718 -255169 -196073 48865 244131 199828 -40668
858 -40668 -244473 -213664 21350 232281 215334 -11788 -227045 -222582 -5039 214039 226868
869 226868 21187 -202804 -230565 -33881 195998 237813 49445 -185304 -238933 -62465
879 -62465 171989 237803 72974 -160479 -240512 -89194 147168 242872 103999 -131954 -239986
890 -239986 -115287 119855 239487 127600 -107270 -239887 -141880 92759 237699 152799
900 152799 -79841 -233947 -160482 68182 229799 170410 -53630 -224734 -180128 39096
910 39096 219758 187073 -26491 -213368 -192231 16658 209586 202631 1818 -195757 -201398
921 -201398 -11817 189148 206328 23442 -183781 -216035 -41150 171096 217932 53985
931 53985 -159961 -217101 -63735 151647 220438 76214 -142008 -222814 -89829 129281 222399
942 222399 99306 -118190 -220523 -109892 107624 220850 121234 -93173 -216696 -130066
952 -130066 81522 212666 135302 -75150 -215240 -150207 58049 207953 157430 -44418
962 -44418 -200048 -160124 35896 197202 167826 -24532 -193696 -177509 9289 184493 180223
973 180223 1505 -177733 -184978 -13702 169625 189109 27320 -159684 -192030 -38578 151495
984 151495 194210 48478 -145443 -200241 -61944 134207 200535 72803 -122631 -198494 -81263
995 -81263 113234 198386 88826 -108969 -204108 -104603 92592 196889 109721 -83561 -195720
1006 -195720 -119135 72478 193247 128230 -60562 -191130 -136049 49882 185309 142559
1016 142559 -39601 -183547 -151071 25500 176773 155429 -14942 -171763 -161773 4812
1026 4812 164667 164135 2143 -162984 -173550 -19486 149611 171794 26443 -145155 -177381
1037 -177381 -39378 134521 177434 46391 -130768 -182725 -60364 117687 179782 67498
1047 67498 -111862 -184641 -79185 100374 182795 87375 -91758 -182053 -94925 82453 180016
1058 180016 103396 -72737 -178462 -112566 61985 175370 119465 -52149 -172414 -126646
1068 -126646 40886 166539 130211 -32611 -164580 -139271 19766 157911 142963 -10894
1078 -10894 -153920 -149074 297 148067 152433 9212 -142536 -155024 -17802 136216 159510
1089 159510 29354 -128163 -159960 -37136 122939 165327 49575 -111528 -163687 -56489
1099 -56489 106510 165803 66005 -96956 -164525 -72350 90669 167432 82768 -80361 -164564
1110 -164564 -89622 71640 162687 95025 -64628 -161734 -102591 53529 158034 109583 -44543
1121 -44543 -154996 -115639 35856 152085 121655 -24628 -146850 -125829 16103 142774
1131 142774 131076 -6208 -136821 -135182 -1602 134798 141592 12426 -127062 -143846 -20780
1142 -20780 120237 143677 27929 -115533 -149124 -38460 107869 149280 44879 -103660
1152 -103660 -151871 -54603 93643 148833 59080 -88800 -152586 -71313 76635 148253 75121
1163 75121 -72598 -150481 -82754 63180 147603 89093 -54951 -145474 -96387 44445 141525
1174 141525 100783 -38061 -141216 -107396 28708 136768 111847 -20904 -132857 -117697
1184 -117697 10093 127226 120203 -4426 -125972 -127460 -6591 118567 126966 10895 -116682
1195 -116682 -132520 -20657 109207 132944 27189 -105087 -136933 -36715 97269 135339
1205 135339 41291 -92132 -137034 -49317 85960 137884 57063 -77175 -135355 -62784 69538
1216 69538 135653 70069 -62046 -133750 -76122 55167 133585 83696 -45101 -129831 -88878
1227 -88878 38466 129608 96175 -30438 -126743 -99511 23424 124553 105156 -17126 -120784
1238 -120784 -108664 9421 117892 113516 -526 -112021 -113998 -4902 110605 120038 14131
1249 14131 -103437 -118907 -17699 101120 123125 27555 -92321 -121414 -32252 88582 125708
1260 125708 42641 -80146 -123554 -45864 76694 125557 54658 -67235 -122580 -58409 61671
1271 61671 124375 67531 -53680 -122484 -71647 48870 121974 78645 -39660 -118978 -82755
1282 -82755 34532 120316 90370 -25753 -117243 -92860 22354 116841 97656 -15218 -110406
1293 -110406 -97363 10281 108437 102455 -1226 -102865 -104119 -4696 99735 107061 11174
1304 11174 -94323 -107967 -17180 88746 108846 24911 -82926 -110672 -32623 76211 111556
1315 111556 38599 -71600 -113054 -45490 64617 112819 51061 -60651 -113758 -57594 54289
1326 54289 112780 62691 -48701 -112814 -68006 42069 110030 71873 -35606 -109491 -78428
1337 -78428 27892 108058 82378 -22087 -105969 -86423 16983 102832 88642 -12594 -99956
1348 -99956 -91690 4984 94915 92012 855 -91213 -96588 -8827 87022 98627 14925 -83370
1360 -83370 -100771 -21637 78159 101047 26849 -73182 -102895 -33741 67093 104777 40943
1371 40943 -62291 -104919 -45437 58295 106629 51957 -53022 -106257 -54938 48936 106201
1382 106201 60914 -43187 -103373 -62157 39285 103265 68038 -31333 -99194 -70276 27388
1393 27388 99151 76352 -19672 -95724 -78348 15307 95229 82088 -9219 -89924 -82517 4451
1405 4451 87097 85222 3483 -81044 -87297 -7859 79444 91811 15528 -74026 -91226 -18245
1417 -18245 72357 93921 26106 -65057 -93284 -30737 62091 95633 37334 -56240 -95524 -41615
1429 -41615 52575 96223 46235 -47998 -95171 -50677 44014 96384 54581 -38879 -93651 -56806
1441 -56806 34427 91575 60493 -28750 -88479 -64707 20807 86630 68788 -15436 -85878 -72667
1453 -72667 11007 83578 75659 -5935 -79569 -76748 -113 76684 79787 6518 -73827 -82116 -10967
1466 -10967 71342 85205 15749 -68271 -86369 -20948 63344 86263 24731 -60646 -88503 -30949
1478 -30949 55748 88226 34273 -52309 -88569 -39865 47631 88662 43748 -43669 -88608 -47832
1490 -47832 39577 87117 51241 -34409 -86351 -54202 30204 84429 57600 -24591 -82335 -60486
1502 -60486 18968 80345 64214 -12828 -78728 -67217 8282 76416 69857 -4433 -73647 -71844
1514 -71844 -176 70094 74241 5332 -68750 -75844 -11158 65281 77982 14603 -62443 -78663
1526 -78663 -19239 58499 79801 23522 -53683 -78549 -27453 50324 80071 32021 -46484 -80303
1538 -80303 -36863 41862 80074 40773 -37582 -78124 -43834 32685 78478 48460 -28239 -77381
1550 -77381 -51459 23891 76785 54375 -20276 -74032 -56381 15368 71641 60332 -9852 -70325
1562 -70325 -62861 6203 69087 65006 -1970 -66499 -66878 -3332 64304 68685 8208 -60111 -70012
1575 -70012 -10782 59124 72139 16394 -54829 -71949 -19094 51193 73087 23852 -48118 -72780
1587 -72780 -27756 43999 73591 31863 -41164 -73487 -35200 37067 72905 37755 -32991 -72842
1599 -72842 -42588 29584 72360 46495 -24661 -71230 -48083 21545 70522 50934 -17290 -68185
1611 -68185 -53775 11915 66498 55996 -9027 -64833 -57500 5495 63329 59765 -988 -60141
1623 -60141 -60784 -3250 57590 63235 7178 -54829 -64510 -11099 52667 65747 15495 -49140 -65984
1636 -65984 -18586 47660 66630 23033 -43275 -67069 -26056 40790 67435 29535 -35848 -67085
1648 -67085 -32983 33407 67629 36915 -28781 -66225 -39285 25600 65823 42583 -21570 -64539
1660 -64539 -45404 17794 63652 47358 -15020 -61659 -49095 10524 60222 52707 -6789 -58975
1672 -58975 -54236 3459 56726 55197 1540 -54907 -56521 -4686 51883 58717 8317 -48926 -59254
1685 -59254 -11908 47509 60601 16203 -44254 -61353 -19208 41367 61656 22698 -38274 -62121
1697 -62121 -25488 35278 62359 29250 -31631 -62402 -31214 29246 61798 34241 -25463 -60640
1709 -60640 -37575 22228 60022 39787 -18274 -58829 -42244 15849 58001 44943 -11248 -55856
1721 -55856 -46581 8323 55102 49120 -4585 -53407 -50364 1962 51497 51472 1802 -49136 -52747
1734 -52747 -4849 47035 54151 8599 -44312 -54779 -12455 41949 55453 15560 -40343 -56437
1746 -56437 -18660 36928 57291 21718 -33675 -55954 -24456 31619 57411 28193 -28367 -56253
1758 -56253 -30505 25900 56664 33020 -21434 -55519 -34376 19311 54433 37676 -16345 -53652
1770 -53652 -38681 12726 53071 41184 -9406 -51176 -43265 6863 50120 44729 -3330 -48325
1782 -48325 -46944 11 46789 47633 3085 -44565 -48986 -5254 42744 50103 9702 -40226 -50460
1795 -50460 -11869 37932 51002 15413 -35112 -52046 -17788 32862 52635 21116 -30418 -51954
1807 -51954 -23834 27856 52576 25959 -25656 -52590 -28674 22342 51940 31068 -20077 -51069
1819 -51069 -32226 17075 49809 35137 -14440 -49539 -36992 11088 47607 38565 -7668 -45809
1831 -45809 -40027 5473 45456 41636 -1963 -42792 -42579 -473 41875 44316 3862 -40469 -45026
1844 -45026 -7053 38506 46325 10760 -36468 -47244 -11650 34153 48004 15068 -32861 -48417
1856 -48417 -17184 30055 47947 19496 -27066 -48105 -21959 25814 48601 24178 -22336 -47515
1868 -47515 -27273 20011 46938 27559 -17686 -46737 -30553 15440 45917 32895 -12430 -44199
1880 -44199 -34689 9098 43500 35859 -6632 -42940 -37488 3418 40772 38616 -1272 -39741 -40655
1893 -40655 -1401 38015 41273 4982 -37058 -42158 -7883 34673 43571 9395 -33605 -44169
1905 -44169 -11292 31529 44189 14203 -28732 -43984 -16935 26788 44659 18460 -24985 -43521
1917 -43521 -20100 23245 43466 22920 -20374 -42848 -24671 17483 42315 27254 -15669 -43324
1929 -43324 -28779 12543 41338 30988 -9980 -40381 -32306 7804 39791 33355 -5224 -38403
1941 -38403 -35441 2659 37294 35916 215 -35941 -37317 -3104 34439 38661 4662 -33048 -39716
1954 -39716 -7543 31148 39389 9284 -29601 -39899 -12010 28127 39389 13945 -25694 -40873
1966 -40873 -15049 24140 39909 17091 -22515 -40039 -19520 19692 40120 21958 -17100 -39428
1978 -39428 -23234 15324 39168 25969 -11534 -37766 -27867 10514 37772 29462 -7877 -37171
1990 -37171 -30183 5613 36530 32140 -3514 -35755 -32352 1180 34097 33530 481 -32832 -33986
2003 -33986 -2767 31276 35574 5524 -29725 -35891 -7547 28034 36211 9541 -27120 -36750 -12171
2016 -12171 25124 37833 13622 -21933 -36920 -14779 21306 37246 16990 -18689 -36957 -19717
2028 -19717 16782 36500 20177 -15264 -36693 -22691 12412 35766 24332 -10463 -35115 -25707
2040 -25707 8257 35209 27051 -7026 -34577 -29128 4072 33100 29933 -2149 -32977 -30581 1509
2053 1509 31807 32063 1223 -29938 -32118 -3170 28305 31942 5124 -27021 -32665 -7753 25370
2066 25370 33524 9412 -24345 -33650 -11580 21173 33769 13080 -19563 -34518 -15972 18411
2078 18411 34643 17082 -18011 -33796 -17986 15245 34603 20531 -13643 -33997 -21852 11040
2090 11040 32298 21866 -9254 -31863 -24139 7446 31697 25061 -4835 -30536 -26824 3781
2102 3781 30653 27627 -1724 -29737 -28761 410 28087 29212 1158 -27099 -28928 -3283 26062
2115 26062 30027 5501 -24111 -30072 -7608 22975 30094 9015 -20479 -31388 -10669 19613
2127 19613 31096 12833 -17766 -31688 -14452 17174 31452 16495 -15094 -31277 -17416 13601
2139 13601 30968 18455 -12200 -30647 -20116 10184 30322 20800 -8139 -29233 -22163 5916
2151 5916 28539 23422 -4915 -28167 -24415 2865 27976 26269 -730 -26842 -26580 -1463 26304
2164 26304 26613 2374 -24488 -27857 -3915 23432 28302 5634 -22123 -28223 -7517 21138 28052
2177 28052 8732 -19551 -29090 -10687 17725 29334 11716 -16530 -29641 -13781 15212 28801
2189 28801 15001 -13944 -29759 -16310 12175 28516 17188 -11429 -27591 -18220 8924 27824
2201 27824 19828 -7243 -26526 -20566 5170 26116 21042 -3640 -26083 -22837 1773 24731 24249
2214 24249 411 -24307 -24847 -1269 23508 24223 2542 -22160 -25575 -4147 21355 25250 6737
2227 6737 -19670 -25911 -7641 18467 26265 8569 -16700 -26214 -10444 16557 26932 12491 -14466
2240 -14466 -26688 -12851 13667 27401 14553 -11498 -26155 -15276 10328 26161 16378 -9431
2252 -9431 -25965 -17380 7215 25677 18491 -5581 -24580 -19145 3960 24018 20834 -2753 -23339
2265 -23339 -21753 898 22725 22162 576 -21435 -22541 -1247 21361 23729 3326 -20160 -23705
2278 -23705 -4166 18858 24365 6395 -18212 -23904 -7269 17185 23655 8100 -15776 -24498 -9020
2291 -9020 13904 24211 11419 -13738 -24578 -12985 11887 24455 14032 -10989 -24212 -14868
2303 -14868 8603 24131 15242 -8314 -23769 -15540 6982 23695 17427 -5002 -22368 -18386 3411
2316 3411 21739 19400 -2651 -21378 -19799 719 20754 21472 982 -20689 -21583 -2322 19463
2329 19463 21602 3151 -18803 -22267 -4875 17234 21760 5393 -16903 -22257 -6983 14886 22019
2342 22019 8015 -13600 -22378 -9614 12062 23268 11179 -10742 -22772 -12103 10652 23459
2354 23459 13249 -9461 -22270 -13570 8637 21820 14579 -7814 -21468 -14501 6294 20926
2366 20926 16605 -4266 -20605 -16972 2467 20049 17531 -1191 -19043 -18557 348 18990 19430
2379 19430 1084 -18504 -19681 -2470 17571 20438 3360 -16268 -19983 -3938 16319 20631 5507
2392 5507 -14937 -20201 -6232 14808 20594 7966 -12646 -21459 -9320 11510 20665 10266 -9501
2405 -9501 -21512 -11468 9268 20951 12036 -7988 -20992 -13029 7231 20907 13813 -6002 -19706
2418 -19706 -13882 5263 19292 15132 -3804 -18477 -15776 1618 18321 16140 -994 -17289 -17704
2431 -17704 -954 17207 17919 1198 -16960 -18758 -2795 16352 18020 3227 -15090 -19336 -3675
2444 -3675 14545 18748 4729 -13685 -18992 -6260 12244 18478 7967 -11638 -19598 -9013 9839
2457 9839 18898 9563 -9115 -19154 -10891 7705 19458 11630 -7081 -19311 -12629 6407 18799
2470 18799 13272 -5809 -19032 -13935 4566 17779 13980 -3548 -17185 -14627 1663 16497 15398
2483 15398 -1010 -15937 -16142 -1064 14965 16241 1930 -14877 -17441 -2327 14785 17813 3775
2496 3775 -13772 -17412 -3806 12877 18636 5593 -12174 -17771 -6318 11334 18264 7406 -9314
2509 -9314 -16725 -8315 8423 17008 9347 -8244 -17620 -10324 6995 18019 11505 -5693 -17768
2522 -17768 -12449 5459 17736 12210 -5087 -17038 -12250 3527 16369 13499 -2845 -15732 -13509
2535 -13509 1186 15548 14929 333 -13957 -14438 -1322 13145 15884 3001 -13884 -16147 -2860
2548 -2860 13461 16180 3818 -11976 -16932 -3870 12074 16494 4930 -11642 -16373 -6931 10244
2561 10244 16285 6963 -8842 -15711 -8412 7484 16062 9014 -6502 -15662 -9645 6038 16771
2574 16771 11192 -5568 -15874 -11040 4696 16195 11888 -3656 -16336 -11905 3241 15163 11790
2587 11790 -2651 -14268 -12430 1167 13148 12498 -241 -12629 -13702 -1737 12447 15136 1943
2600 1943 -12254 -15212 -3569 11244 15450 4655 -11595 -15631 -5213 9984 15322 4714 -9837
2613 -9837 -15236 -6039 9273 14808 6577 -7890 -15022 -7348 6704 14088 8661 -6029 -14650 -9718
2627 -9718 4717 14723 9884 -4476 -14897 -11364 3618 14766 11294 -3168 -14300 -11893 3099
2640 3099 14215 11459 -1808 -13338 -12083 289 12378 12065 744 -11214 -12785 -1860 10950
2653 10950 13665 1981 -11042 -14213 -4079 10110 13667 3669 -9986 -15370 -4973 10025 13962
2666 13962 4762 -8258 -14962 -5300 8552 14490 6182 -7940 -13974 -6869 6330 13724 8258 -4804
2680 -4804 -13401 -8174 4583 13098 9580 -3751 -13368 -10981 3098 13476 10903 -2292 -13210
2693 -13210 -11172 1871 12814 11558 -1602 -12753 -11085 542 11979 12007 836 -10992 -11800
2706 -11800 -1654 10353 12424 2727 -8947 -12471 -2982 10060 12854 4582 -8339 -13909 -4736
2719 -4736 8610 13573 4650 -9189 -13471 -5099 7366 12328 5855 -6494 -13086 -6593 5796 12058
2733 12058 8009 -5184 -12292 -8228 3400 11505 8601 -2752 -11789 -10041 2062 12780 10713
2746 10713 -2011 -12337 -10100 990 11848 10697 -314 -11024 -11170 484 11283 10664 291
2759 291 -9634 -11063 -1547 9252 11191 2576 -8569 -11147 -3123 7822 12022 4369 -8527 -12282
2773 -12282 -5022 7590 11582 4734 -7294 -12363 -5775 6523 12028 5572 -6302 -11526 -5558 4922
2787 4922 11725 6995 -4552 -10691 -7253 3575 11250 7982 -2571 -11133 -8904 1827 11798 9860
2801 9860 -1419 -11022 -10486 739 10411 10098 -903 -10748 -10353 -112 10894 9570 569 -8978
2815 -8978 -10219 -1654 8298 10470 2313 -8046 -10577 -3154 7421 9946 3125 -6519 -10984 -4506
2829 -4506 7203 11358 4863 -6299 -11800 -5690 6524 11088 5909 -5473 -11058 -5685 4487 10997
2843 10997 6658 -4243 -10153 -6923 2426 10390 7572 -1963 -10150 -8429 1926 9818 8946 -981
2857 -981 -10322 -9802 792 9953 10143 -128 -9018 -9198 -274 9156 9289 1598 -8793 -9836 -1652
2872 -1652 7907 9458 2390 -7009 -9549 -2850 7169 11143 4006 -6069 -10221 -4307 5584 10577
2886 10577 4912 -5383 -10742 -4658 5526 10691 5712 -4511 -9863 -5682 3839 9911 6425 -3410
2900 -3410 -9316 -6852 2952 9251 6563 -1807 -8945 -6822 1780 9536 8326 -694 -8921 -8833 -456
2915 -456 8332 7687 -357 -9241 -9367 394 8479 9485 420 -7751 -9332 -1161 6906 8611 2177 -7267
2931 -7267 -9187 -2993 5871 8609 3575 -5605 -9720 -4265 5496 9485 5332 -4469 -9963 -5424 4089
2946 4089 9534 4844 -4147 -9307 -5827 3945 9042 5612 -3071 -9303 -7000 767 8377 6794 -1904
2961 -1904 -8397 -6868 549 8264 7618 -662 -8111 -7835 215 7845 7472 673 -7337 -8230 -1082 6692
2977 6692 7976 588 -7255 -8262 -1728 7020 9087 2365 -5746 -8709 -2792 5486 8603 3230 -5217
2992 -5217 -7999 -3868 4660 9137 4636 -4471 -9045 -5401 3983 8951 5088 -3375 -9493 -5143 2951
3007 2951 8893 5428 -3292 -7719 -6255 2168 8343 6552 -1111 -7275 -7016 835 6519 7421 -177
3022 -177 -7445 -7234 -10 7480 8024 285 -7391 -7649 -905 6412 7579 1359 -5977 -7491 -2340 6172
3038 6172 8184 2174 -5912 -8234 -3017 4983 8053 3416 -4828 -7788 -3496 3720 7510 4431 -3443
3053 -3443 -7641 -5082 4073 8099 5417 -2550 -8016 -4607 2976 7791 5460 -1780 -7723 -5868 1952
3068 1952 7443 5680 -872 -7925 -6239 633 6652 6806 -429 -6445 -6885 -123 6678 6922 341 -6626
3084 -6626 -6839 -558 6484 8144 1457 -5367 -7720 -2071 5196 7468 2021 -4965 -7024 -2709 4858
3099 4858 7320 2798 -4418 -7524 -3872 4420 7474 4276 -3536 -7466 -4526 3229 7053 4294 -2271
3114 -2271 -7311 -4930 2454 7691 4825 -2518 -7313 -5253 2066 6970 5170 -848 -6769 -5469 468
3129 468 6130 5982 -94 -5628 -7011 -929 6207 6869 460 -5516 -6297 -1469 4753 6617 1848 -5258
3145 -5258 -6994 -1492 4996 6570 2611 -4691 -7092 -2986 3850 7424 3355 -3365 -7014 -3237 3345
3160 3345 7067 3669 -3648 -6945 -4335 2678 7461 4613 -1888 -6807 -4759 1765 6100 5066 -1219
3175 -1219 -6416 -5001 1265 5595 4685 -658 -6478 -6188 506 5748 5669 -174 -5368 -6263 -549 6221
3191 6221 6428 1381 -5721 -6579 -1370 4892 6557 1791 -4714 -6310 -1648 4451 6244 2057 -4431
3206 -4431 -5928 -1850 3991 5627 3546 -3101 -5590 -3023 2822 6337 3599 -2028 -6259 -4132 1599
3221 1599 6388 3910 -2002 -6492 -4054 2046 6551 4674 -1678 -6153 -4260 822 5837 5253 -1165
3236 -1165 -4438 -4949 -593 5787 5553 -33 -4890 -5573 -571 4923 5605 928 -4581 -5912 -307 4629
3252 4629 6549 1700 -4265 -5630 -1607 4577 5466 1565 -3857 -6409 -2253 3169 6270 2595 -3634
3267 -3634 -5646 -2921 2305 5718 3861 -2495 -5803 -3417 2146 6463 4625 -2123 -5721 -3761 1854
3282 1854 5964 4823 -1174 -5145 -4532 1144 5167 3916 -835 -4942 -4862 135 4151 4847 253 -4247
3298 -4247 -4848 -724 4455 5256 1101 -4371 -5649 -1277 4299 5046 1875 -3830 -5890 -2006 4010 5254
3314 5254 2267 -2654 -6051 -2309 3046 5055 2669 -2587 -5089 -2792 2474 5592 3138 -1917 -5382
3329 -5382 -3120 1744 5440 3552 -1318 -4860 -4487 1179 4991 4807 5 -4472 -4161 464 5413 4050
3345 4050 -360 -4073 -4277 106 5227 3979 231 -4209 -4162 -295 4205 4727 1170 -3231 -4763 -1041
3361 -1041 3506 5135 958 -2938 -5996 -2018 3313 5476 2669 -2729 -4958 -2678 2745 5687 2675
3376 2675 -2418 -5439 -2806 2179 4633 2873 -2575 -4984 -3036 1388 4665 3199 -1905 -4282 -4374
3391 -4374 1268 4752 3783 -1108 -4234 -3962 771 4171 4276 -403 -4541 -3942 -24 3670 4180 400
3407 400 -3833 -4241 -926 3725 4881 527 -2887 -4782 -1437 3033 4643 1624 -3323 -4357 -2041
3422 -2041 2619 4419 2320 -2958 -4402 -1952 2422 5103 3198 -1571 -4752 -2577 1942 4718 3239
3437 3239 -1782 -4321 -3016 1468 4450 3403 -1437 -4430 -3318 597 4167 3802 -307 -4192 -3270
3452 -3270 284 4194 3555 -364 -3929 -4325 -146 3107 4430 404 -3128 -4009 -734 3748 3813 1323
3468 1323 -3273 -4675 -937 2723 4934 1282 -2678 -5076 -1622 3148 4409 1527 -2565 -4208 -2320
3483 -2320 2122 4413 1796 -1942 -4475 -2668 1750 4250 3317 -1285 -3881 -2576 654 4472 3310
3498 3310 -1259 -3781 -2868 896 4376 3405 -1035 -3315 -3518 677 3193 3386 305 -3616 -3751 -192
3514 -192 3026 3856 1011 -3196 -3770 -866 3764 4516 706 -2665 -3893 -1096 3439 3145 750 -2429
3530 -2429 -3540 -1561 1927 4236 1926 -2351 -4008 -2739 1128 3371 2362 -1516 -3695 -2092 1181
3545 1181 3745 3125 -1193 -4167 -2383 826 3868 2482 -658 -3262 -3158 1214 3925 3034 -120 -3630
3561 -3630 -3423 -105 3601 3716 286 -2911 -3419 -312 3118 3319 633 -2917 -4116 -652 2466 3599
3577 3599 1055 -2478 -3279 -1226 1761 3585 1528 -2271 -3056 -2255 1711 3571 1708 -1846 -3983 -1247
3593 -1247 1828 3893 1927 -1783 -2855 -2708 900 3593 2661 -299 -3920 -2904 1346 3693 3148 -1038
3609 -1038 -3157 -2373 301 3169 2422 -552 -2680 -3152 -450 3213 2630 84 -3034 -3240 -476 2889
3625 2889 2655 573 -2911 -3311 -1561 1912 2887 1286 -1995 -2946 -1318 1714 3254 960 -2041 -3356
3641 -3356 -1525 1565 3652 2016 -2207 -3655 -1959 1209 3235 1673 -1278 -2892 -1751 1226 3916
3656 3916 1302 -1157 -3033 -2008 381 3060 2663 -411 -2963 -2610 401 3009 2846 -682 -2705 -3066
3672 -3066 -170 3114 3068 81 -2752 -3741 -932 2349 3771 549 -2608 -3369 -706 2382 2546 658
3688 658 -2262 -3278 -1081 2485 3385 963 -1587 -3499 -1526 1920 2504 2081 -1517 -3276 -1674 1123
3704 1123 2649 1625 -695 -3381 -2213 1418 2864 2014 -129 -2953 -2193 764 2210 1814 -516 -2918
3720 -2918 -2575 410 2781 2775 -177 -2188 -2738 27 2247 2545 646 -2707 -2855 -524 2543 2178 1053
3737 1053 -2156 -2635 -194 2627 2882 1001 -1692 -2347 -905 2164 3330 1319 -1687 -2839 -1822 1283
3753 1283 2664 1133 -1246 -2487 -1209 1608 3420 1516 -797 -2870 -1699 940 2606 2017 -794
3768 -794 -2459 -1715 486 2489 2362 -20 -2805 -2120 -127 2566 2086 -49 -3094 -2643 -745 2881
3784 2881 3129 -19 -2282 -2679 -435 2380 2211 1162 -1944 -2892 -1342 1956 2400 496 -1447 -2944
3800 -2944 -1358 781 2123 1469 -899 -1985 -1911 1041 3144 873 -768 -2459 -1725 1255 2968 1681
3816 1681 -770 -2129 -1815 1149 1889 1544 -351 -2743 -2349 954 2345 1568 -167 -2407 -1901 896
3832 896 1692 1932 -185 -1886 -2312 -256 2435 2285 326 -2795 -2502 -494 2413 2297 753 -2007 -3107
3849 -3107 -504 1363 2222 929 -967 -1763 -1421 1278 3066 1079 -1795 -2087 -1054 1343 2615 1657
3865 1657 -964 -1909 -1421 828 2696 2352 -752 -2363 -869 540 1845 1643 -457 -2153 -2096 993
3881 993 1645 2093 299 -1700 -2131 -563 2309 2382 468 -1796 -2255 209 1736 2745 207 -1882 -2513
3898 -2513 -378 1890 1838 733 -1536 -1922 -153 1556 1890 231 -1842 -2036 -901 970 2535 874
3914 874 -1314 -1944 -1084 873 2117 1786 -1147 -2745 -1707 928 2440 1542 -1110 -1930 -1512 612 1675
3931 1675 1209 -825 -1794 -2069 416 2001 1266 -576 -1912 -1966 55 2046 1640 273 -1591 -2264 186
3948 186 1644 1720 901 -2151 -2816 -279 1784 2249 66 -2336 -2498 -862 1844 2261 357 -944 -1976
3965 -1976 -794 2028 1888 967 -1220 -2062 -638 917 1909 862 -1067 -1655 -1638 782 2165 1551 -175
3982 -175 -1992 -1959 586 2048 1976 -134 -1328 -1739 -764 1016 1629 76 -1587 -1683 211 1535 1341 -169
4000 -169 -2868 -2366 -331 2256 2667 962 -1493 -1760 -609 1373 1922 762 -839 -1865 -488 1586
4016 1586 2264 1009 -1583 -1760 -677 1484 2326 228 -995 -2316 -1005 710 1340 1124 -716 -2239
4032 -2239 -1275 546 1668 732 -889 -1902 -1417 176 1399 1063 239 -1645 -1641 46 2139 1376 237
4049 237 -1880 -1669 -6 2087 1663 269 -570 -1449 -160 1408 1912 843 -817 -2005 -305 1617
4065 1617 2189 173 -1256 -1862 -922 964 1993 181 -679 -1583 -605 1366 2467 730 -406 -1704
4081 -1704 -1303 524 1430 1321 -1400 -2368 -1481 9 1229 1330 -716 -2143 -1499 681 1563 1547 -689
4098 -689 -1885 -1972 16 1618 1592 501 -1972 -2105 -620 1609 926 320 -1683 -1914 -405 1345 1533
4115 1533 852 -981 -1762 -400 1286 891 496 -874 -2329 -1202 592 1113 703 -895 -1749 -1089 951
4132 951 1263 1135 -407 -1683 -825 557 1970 1119 -978 -1645 -1074 270 1396 1674 -16 -2250 -1577
4149 -1577 -3 1778 1067 -452 -1910 -1234 -235 1187 1431 633 -1939 -1042 -4 1536 1873 -469 -471
4166 -471 -1712 -69 858 941 702 -761 -1799 -460 1252 1855 140 -719 -1142 -790 841 1058 394 -1347
4184 -1347 -1426 -1538 1222 1947 562 -774 -1340 -1023 918 1480 1219 -302 -1197 -819 138 917 1734 -439
4202 -439 -1789 -1044 249 1670 1440 -335 -1885 -1120 445 1210 1512 -198 -1082 -1241 217 720 1507
4219 1507 -46 -1243 -1188 -998 1400 1798 823 -703 -1536 -590 1315 751 121 -953 -1086 -409 611 1157
4237 1157 769 -428 -721 -453 834 856 948 -376 -1514 -232 98 1738 1114 -786 -1127 -919 205 1671
4255 1671 699 -164 -1510 -584 -141 409 1441 -24 -1622 35 -466 975 1303 -484 -1569 -1095 218
4272 218 1394 1300 189 -1033 -1268 175 692 1712 211 -840 -1270 -57 708 1021 259 -655 -1054 -865
4290 -865 1339 711 594 -1160 -1199 -877 584 1362 873 -1056 -1527 -528 -8 1895 1116 -375 -1635 -568
4308 -568 501 1371 936 -466 -1079 -1237 -161 2216 839 141 -862 -1152 -65 784 1287 -204 -569
4325 -569 -1943 -110 1452 934 764 -604 -991 -402 812 1020 222 -799 -936 160 806 1660 923 -488
4343 -488 -1146 -594 1481 464 1285 -17 -789 -681 770 563 1022 -585 -929 -1170 58 603 1269 36
4361 36 -836 -867 373 942 1023 -22 -323 -235 -458 422 790 139 -378 -1086 -477 946 1635 -472 -1357 -704
4381 -704 -556 1033 891 627 -1054 -693 -147 1026 797 355 -716 -1147 -754 514 861 -3 -278 -1267
4399 -1267 -655 -127 891 481 -1089 -1152 -509 414 1191 984 99 -973 -496 18 1110 760 -224 -895 -652
4418 -652 340 1256 330 622 -921 -1029 -153 964 998 -109 -1739 -983 -245 745 950 404 -882 -1009 -443
4437 -443 360 -142 -128 -478 -1149 -220 783 984 -356 -848 -846 -966 1043 1588 236 -503 -995 -487 259 1515
4457 1515 837 -428 -881 -1158 -79 548 1091 -866 -771 -717 -533 1153 1209 -416 -582 -783 472 1293 1229
4476 1229 314 -74 -624 217 460 1405 -351 -724 -1057 -438 790 328 -167 -1095 -1129 66 605 1255 -54
4495 -54 -729 -1060 -438 602 887 -386 -1059 -1373 -799 -362 1559 610 -1067 -1470 -1015 201 993 451 -956
4514 -956 -1195 -818 19 1169 327 -122 -1047 -479 -36 345 588 -204 -891 -793 423 649 517 138 -713 -349
4534 -349 -130 1796 1035 541 -433 -467 -45 802 1336 808 -1319 -1725 -101 668 798 620 -486 -842 -946
4553 -946 431 810 643 -340 -1241 -188 566 1183 482 190 -1021 -651 424 895 531 -397 -814 -697 151
4572 151 454 487 255 -1055 -1037 -12 635 299 172 -1036 -530 -68 869 166 753 -888 -807 640 257
4591 257 760 443 -631 -685 -315 465 1611 430 -1010 -746 39 569 1241 217 -586 -213 -119 624 792
4610 792 199 -25 -1126 436 1196 1076 593 58 -1096 -801 811 624 -50 -725 -487 -549 -195 519 395
4629 395 -319 -835 -349 -46 778 1065 138 -323 -722 255 754 828 -386 -1038 -261 403 1018 773 -212 -433
4649 -433 -818 -561 548 35 11 -827 -923 -272 255 761 -63 -378 -382 -782 1195 870 -49 117 -722 -871 -138
4670 -138 402 605 -180 -500 -755 273 432 959 6 -974 -401 377 269 664 398 -862 -419 -161 425
4689 425 752 646 -440 120 880 545 1242 -211 -774 -601 -280 1013 957 -26 -185 -634 -459 188 468
4708 468 209 -184 -608 -203 479 806 -197 -563 -884 -260 -294 913 -247 -71 -75 -518 379 913 531 -444
4728 -444 -272 -338 566 228 279 188 -830 -452 -294 691 769 125 -1042 -843 -94 737 382 -456 -744 -1124 101
4749 101 560 697 219 -410 -877 69 1397 914 180 -497 -250 -305 1056 1168 -155 -512 -413 204 351 594
4769 594 -103 -466 -363 -709 616 320 1121 567 -586 -329 -197 361 -210 -38 -573 -630 -203 445 930 198
4789 198 -271 96 327 174 624 179 -267 -446 -431 346 692 -380 -182 -765 -228 -303 1125 -285 -125 -589
4809 -589 -230 557 139 610 -719 -249 -85 506 1355 -280 -476 -691 -436 722 940 -325 -737 -657 435
4828 435 -111 738 225 -265 -769 -581 331 737 327 447 -1237 -459 426 337 558 -79 -481 -500 686 -452
4848 -452 380 25 -510 -558 186 -341 281 24 -1054 -642 -72 576 443 773 -310 -622 -370 108 763 374
4868 374 -127 -1014 -228 231 756 64 -260 -624 -489 513 775 327 38 -282 -151 -244 1011 382 -408 -437
4888 -437 -208 572 384 89 -56 -689 -438 119 955 736 -525 -373 -173 488 488 1018 -150 -698 -467 433
4908 433 887 863 -696 -227 -770 -250 253 114 -160 -563 -557 309 459 -22 181 -369 -559 129 324 58 784
4929 784 -659 -1163 -471 403 205 222 102 -715 -168 413 903 -299 -514 41 -13 -185 -98 -89 121 -428 -520
4950 -520 500 56 823 -455 -410 86 457 667 -150 -301 -474 -694 -193 526 799 -223 -161 -571 222 977
4970 977 343 16 -449 -409 -652 442 -187 -144 -510 -664 328 155 522 253 -709 10 -48 213 1158 284 -386
4991 -386 149 -532 584 346 362 20 -29 76 128 774 9 240 -751 -262 608 -114 -18 222 -520 -152 208
5012 208 87 592 40 -721 -566 440 327 560 -318 -792 -1041 -49 149 606 388 -391 -947 -255 -100 1013
5032 1013 208 -653 -395 271 508 90 -53 234 -485 -658 160 343 689 -186 -135 -1171 511 277 -10
5051 -10 -97 -507 63 -418 372 373 -281 -119 -459 -396 -196 935 -756 -455 -39 -147 641 293 709 -604 -240
5072 -240 474 151 587 199 -89 -540 68 417 618 113 -421 176 -115 273 603 -329 -452 -787 -301 694
5092 694 587 762 -64 -341 54 71 -64 45 180 -704 -560 -30 905 -51 -472 -580 -316 83 -532 473
5112 473 -320 -432 -197 139 737 420 272 -97 -713 420 700 645 248 -457 -35 371 463 387 -6 -861 -487
5133 -487 -162 225 124 21 32 -320 -845 200 314 -261 -426 -552 114 458 106 -2 -229 60 -345 -120
5153 -120 487 39 -214 -225 -337 419 -38 154 138 -720 -520 86 150 512 -516 -219 -423 238 479 1015 29
5174 29 -432 -111 -203 760 402 -264 -658 168 -858 -351 335 350 -480 -525 -587 233 -171 556 -234 69 3 64
5196 64 455 104 -61 333 -339 13 594 -414 -622 -297 -509 -143 159 -522 93 344 -208 95 -52 60
5216 60 619 -386 -665 -237 -24 283 -35 -544 -155 476 235 423 166 -419 -589 -154 407 485 -378 440
5236 440 -40 102 18 206 297 408 -122 -226 432 556 838 -651 -237 -556 108 734 407 265 -373 -8
5256 -8 66 -128 443 25 -452 -367 575 382 519 366 -455 -161 230 -467 97 -103 -142 210 -225 289 162 -394
5278 -394 -481 -264 463 875 1020 -699 -917 -640 -80 -125 423 -218 -604 -258 -90 -8 99 -332 -511 -265 31
5299 31 522 780 -135 -122 96 166 33 -36 281 573 21 226 521 -116 468 156 -101 49 46 651 147 -215
5321 -215 -159 -156 1017 204 70 -92 -337 -741 -123 -153 -277 -98 -306 -17 647 40 386 -695 -629 -202 254
5342 254 -168 13 -195 -644 -310 -45 -599 239 14 -41 -464 450 -343 -70 552 -837 118 -166 449 670
5362 670 511 -267 -286 21 -6 205 -160 82 -26 354 425 679 -165 -150 -324 -113 566 173 179 -149 -1023 -923
5384 -923 -253 -375 -800 455 -636 -391 -165 -348 1042 79 7 -279 -314 -29 1222 -658 -99 478 -244
5403 -244 545 305 181 201 566 -376 63 391 172 -327 71 204 295 -18 7 -76 -698 -30 -135 0 128
5424 128 587 -482 -886 -149 428 533 2 413 -90 127 337 295 414 -385 152 202 39 230 93 284
5444 284 -29 -497 -217 379 242 -532 251 515 -351 404 -58 -331 42 -93 756 439 -524 -357 -480 25
5464 25 154 869 714 -77 -540 -331 351 186 989 -274 69 -719 -419 543 205 -179 -606 370 119 200
5484 200 209 -107 -86 -574 -77 -239 281 -117 57 -510 -678 928 599 -243 20 -278 22 496 291 76 -359
5505 -359 177 -305 -313 -248 129 -979 -405 -136 361 435 401 179 4 353 346 16 -19 172 -670 -369 -131 231
5527 231 -143 -152 -625 256 423 536 -220 -35 287 -239 -220 -82 118 -121 -200 -55 132 1010 17 171 -269
5548 -269 -84 -307 256 -80 140 -443 -256 -128 488 481 -543 49 -347 -368 -192 384 330 -12 -394 -8 214
5569 214 449 -469 -309 6 -66 11 857 341 14 25 -240 -77 12 -46 -1181 -92 -171 -8 193 -96 -169 41
5591 41 178 -346 552 43 109 79 580 -380 469 143 -383 -57 -430 -419 -222 173 -302 237 -210 589 435
5612 435 -294 383 -258 409 323 647 211 -61 -37 -299 -443 590 120 392 -312 -439 158 -116 299 -391
5632 -391 -200 -473 -93 105 208 -276 -321 -115 -22 -678 939 81 62 -378 -388 -18 -407 504 186 -776 -466
5653 -466 -868 274 -313 -210 176 -368 -307 -85 -548 527 593 -553 -161 -272 561 -366 41 -525 60 506
5673 506 637 -351 -402 -945 -529 283 570 207 -553 -552 325 341 -97 -126 -269 92 55 76 86 -490 -341 9 -563
5696 -563 -329 -68 -469 -208 -369 -667 117 -385 169 -174 -252 -329 -408 -433 713 402 -898 219 -107 -48 253
5717 253 71 119 174 271 -99 -177 -183 -80 -54 375 145 473 401 132 -164 275 474 -396 -264 -741 -394 352 456
5740 456 117 -50 -98 -301 -591 268 572 71 -417 -294 238 -588 115 285 -258 -443 57 306 514 400
5760 400 175 -615 -395 -343 -10 -359 -119 134 -429 -85 -319 178 432 -158 154 -721 -329 667 281 -111
5780 -111 25 206 826 496 76 397 63 -249 746 -79 -219 591 -70 121 7 136 118 499 -87 -386
5800 -386 -53 218 160 -603 98 23 -265 350 -88 593 -53 -333 263 -142 266 -80 -93 279 84 1376 -295
5821 -295 -244 21 128 -632 241 -81 -392 -209 -640 731 880 -312 33 -945 -281 -557 586 270 -71
5840 -71 -230 -253 -352 -569 287 -157 369 -454 -55 373 -241 -47 -134 126 -339 103 211 -2 -308 -494 156
5861 156 -435 -145 508 299 -106 -41 86 250 779 351 -520 45 -164 530 -15 321 13 -205 35 13 460
5882 460 -262 65 -30 259 -452 117 55 279 635 -591 27 -40 162 -76 -220 407 653 -310 -26 -251 -162
5903 -162 264 -191 -38 441 81 -88 38 799 144 383 -242 -235 -170 553 550 238 309 404 346 443 329 225 -443
5926 -443 -19 -521 -218 343 -398 -464 -146 -468 701 107 -713 -214 -459 286 -584 -42 -218 -368 182 -53
5946 -53 227 228 182 68 -26 59 113 814 194 1156 35 -30 161 146 -183 -238 -254 121 -696 322 53 -68 -232
5969 -232 280 295 -18 719 96 482 -860 -466 27 634 680 543 82 140 -26 -428 -149 451 182 179 202 -632
5991 -632 -108 -490 39 -94 -329 401 -63 -123 -453 -144 232 477 1022 251 -119 -79 -379 -32 -40 82 351
6012 351 -162 -257 476 80 -30 576 493 -177 -17 240 -76 458 88 -404 132 -145 -489 -549 559 -485
6032 -485 -363 421 267 -129 -71 -208 -318 -191 202 49 44 9 -262 456 -149 -290 253 50 188 -159 -186 -1275
6054 -1275 83 -262 25 437 276 590 -262 -96 -53 50 557 1120 523 -780 -173 427 -227 166 207 -422
6074 -422 -167 165 24 -137 -92 74 -373 424 -82 -133 -242 -12 286 281 494 -101 -451 -622 -155 577 -614
6095 -614 -261 -304 -267 -501 53 420 422 283 -191 -27 41 -230 126 394 38 606 -118 186 333 -434 -314 -404
6117 -404 -97 20 -78 -321 -7 -60 128 445 311 -6 642 26 -72 504 285 34 377 410 -507 -187 223
6138 223 -23 -48 -504 -34 -310 137 -307 634 -757 35 290 380 22 205 -364 -181 364 518 -109 411
6158 411 -40 14 -117 -191 -445 122 -510 -99 -437 291 794 -85 -209 -681 -255 47 -74 -209 155 -471 344
6179 344 205 -366 -10 -163 69 574 432 239 244 72 -243 -1 -179 402 77 137 -274 110 186 -435 -154
6200 -154 621 39 779 -163 88 253 99 258 175 420 734 1097 270 117 93 446 827 63 194 -23 594
6221 594 537 -154 445 280 79 -137 142 -65 -442 115 174 792 349 5 470 239 493 49 -259 54 352
6242 352 -69 70 -344 19 277 996 -361 105 76 251 45 826 470 189 812 313 516 -367 324 54
6262 54 -331 -58 314 -435 285 -193 74 -197 67 -22 81 99 -50 6 -106 523 -119 -278 125 137 169 246
6284 246 -434 -599 -126 -321 -692 -123 129 692 788 -363 5 -487 -248 -274 -200 -231 -269 -168 -121 123 -293 -42
6306 -42 -181 280 -1 567 604 175 181 376 -105 -515 133 100 -625 -53 66 12 -242 -382 20 72 401 208
6328 208 376 -175 -613 -50 443 380 -310 -375 729 30 480 -613 208 -392 212 -327 321 344 240 -243
6348 -243 -226 -276 -95 14 -134 217 -552 -421 -415 -65 -410 159 98 -352 174 302 -673 -272 -37 388 -297 47
6370 47 325 405 -409 206 42 -84 399 149 131 -338 -208 26 -803 -264 331 74 147 138 -455 -429 195 -305
6392 -305 209 -53 272 570 -97 197 27 435 271 481 -312 -846 -49 628 360 56 198 -272 -408 -327
6412 -327 108 -670 129 -792 -198 -21 -207 514 399 160 -278 165 -367 -71 -44 281 -37 213 -153 -290
6432 -290 282 -190 -40 -149 -348 530 491 -464 441 -109 4 722 -372 447 474 -579 313 -2 -36 820
6452 820 -618 254 -556 -95 279 -43 -313 -452 -93 -171 225 10 202 -1 50 -793 -252 -230 -33 -18 546
6473 546 -342 488 -67 -496 -263 -56 -402 497 203 523 -54 424 -191 258 216 -61 1 -43 243 -67 295
6494 295 409 200 324 -169 -370 8 -324 168 134 -258 -52 346 -302 -361 -55 -277 -180 96 302 -294 545
6515 545 246 485 163 78 -405 61 740 487 231 299 817 -424 -55 -125 -385 -143 -58 9 686 -308 -730
6536 -730 327 444 -19 -219 182 185 201 171 -155 -11 24 -194 246 -622 106 -515 -88 106 268 258 -53 -107
6558 -107 126 111 793 173 289 204 -670 -44 559 -279 333 450 492 -76 -249 524 -285 -182 276 308 110
6579 110 139 -605 170 591 -171 -278 99 119 -176 -99 203 -370 144 239 -186 360 302 350 29 -503 -135 109
6601 109 -38 331 -138 -229 128 -427 519 357 -532 135 245 -389 -120 705 173 5 -48 -351 -157 -429 -93
6622 -93 -406 -75 -430 -555 298 -655 -239 291 -285 18 -676 15 -754 -467 -190 957 571 -277 175 -184
6642 -184 -524 165 -136 -301 -520 567 -380 -75 35 294 -148 124 -149 89 9 466 -301 -477 -182 104
6662 104 -332 -206 279 -19 -66 -42 177 165 -509 -43 95 221 -188 193 0 131 -519 -100 390 905 75
6683 75 -40 -161 206 -192 360 140 -600 -279 323 -127 -183 594 -103 -309 212 36 -209 -397 -201 -384 283
6704 283 489 203 -162 -281 3 -257 -556 218 -15 126 7 -4 -202 -312 -181 272 -279 747 103 -403
6724 -403 -460 -246 -48 748 252 -232 -228 -478 -14 457 95 -471 42 -126 29 -574 282 139 -185 441 187
6745 187 -60 27 58 363 163 -225 -513 -498 -175 49 -294 -64 320 100 -152 -215 28 -228 210 -946 -361
6766 -361 49 22 230 157 844 -223 -415 27 -184 493 -95 -183 431 465 227 -30 252 -194 685 -279 951
6787 951 164 442 -56 -104 -92 204 -345 176 345 -78 120 248 337 -166 39 -472 291 -375 -4 -165 -815
6808 -815 138 -336 335 14 447 -19 -456 69 1193 260 476 -450 92 -68 -650 -1050 -236 -414 373 -436
6828 -436 -83 -67 -700 -6 14 -110 443 141 -111 94 -144 -72 -38 616 -158 -623 53 -9 470 -166 148 -72
6850 -72 660 391 129 -263 -332 52 271 -6 225 617 331 138 -252 -515 -366 -521 -407 108 540 -375 689
6871 689 -33 38 235 -416 112 -199 -518 37 32 -185 47 -325 -256 -283 -392 270 64 -247 384 313 -353 312
6893 312 93 -303 -208 -380 -403 25 288 205 49 353 86 317 284 -328 540 151 -420 330 246 -87 -293 -193
6915 -193 144 150 280 721 177 12 71 -45 434 330 349 -106 52 -64 -192 -177 -665 668 233 -337 561
6936 561 -45 773 -429 -270 154 -169 -764 739 401 -269 4 -14 90 -48 53 -259 135 -319 -121 433
6956 433 -406 -572 -57 -197 -297 250 -288 205 -62 -5 277 431 79 147 320 -370 260 310 -51 779 -609
6977 -609 -40 -143 -327 -223 -319 434 -839 433 -483 172 -58 425 184 -738 41 -315 354 -186 489 -141
6997 -141 -363 -709 383 58 40 110 60 -102 -442 -546 663 -97 -288 -114 -533 -255 -125 60 -340 271
7017 271 -316 -16 -48 571 545 1 79 -11 106 731 362 -607 440 694 395 -1305 -165 205 638 199
7037 199 -18 -1022 272 94 85 105 334 151 -289 -340 433 108 267 175 475 -456 174 -250 542 69 -239
7058 -239 -207 -126 914 -277 164 -26 732 160 -378 316 366 117 -221 -44 -98 -434 510 -452 -816 -434 -366
7079 -366 592 76 -38 -547 -334 -486 334 179 119 -52 -321 -110 425 381 -163 -378 -261 -823 850 -230
7099 -230 -577 0 138 191 -91 -66 -194 -785 -605 146 -342 178 -399 302 -92 556 64 -170 236 -368 498
7120 498 420 -6 -175 199 -439 -159 -101 243 367 -608 -571 233 -223 266 -211 168 695 286 338 274 984 26
7142 26 -256 -662 86 -229 43 -240 64 -450 385 58 470 -55 -715 -470 548 175 197 -157 -286 -436
7162 -436 -687 -84 -444 192 161 -129 -104 88 -339 -144 -79 -27 438 -66 -8 154 -674 -358 -735 415 -246
7183 -246 405 -258 -311 -103 -444 -362 -54 -9 97 -300 -737 199 -154 -29 388 -548 272 173 169 13 546 219
7205 219 -117 189 -545 361 89 126 -448 -367 78 304 818 -102 -108 -627 63 141 -149 70 175 -170 -274 18
7227 18 -61 274 78 -335 138 -130 255 -182 -349 -428 -246 -509 -539 -259 -437 47 555 -179 217 -79 16 -464
7249 -464 15 531 -33 102 774 -270 289 508 -188 596 -119 399 -316 723 -100 -488 -323 -24 190
7268 190 274 -115 300 -261 914 414 -226 -158 219 50 -167 -394 -54 408 -308 -381 -289 -101 126 536 -74
7289 -74 16 -583 -499 456 -72 -292 73 -340 8 -271 -320 334 374 -326 359 436 312 199 160 207 89 -254 -294
7312 -294 83 -307 377 -462 -5 -218 -326 -36 197 -199 -595 298 -6 53 273 -526 28 -496 50 -194
$$ [...]
8191e90
##END NTUPLES=NMR FID
##END=
