##TITLE=1H_Pr 4939-2
 DMSO-d6, 8 sc, 
 15.11.2019
##JCAMPDX= 6.0         $$ Bruker NMR JCAMP-DX V2.0
##DATA TYPE= NMR FID
##DATA CLASS= NTUPLES
##ORIGIN= UXNMR, Bruker Analytische Messtechnik GmbH
##OWNER= root
$$ XWIN-NMR		Version 3.5
$$ Fri Nov 15 14:58:40 2019 Russian Standard Time (UT+4h)  she@DPX200
##.OBSERVE FREQUENCY= 200.1315
##.OBSERVE NUCLEUS= ^1H
##.DELAY= (6, 6)
##.ACQUISITION MODE= SIMULTANEOUS
##.ACQUISITION SCHEME= undefined
##.AVERAGES= 8
##.DIGITISER RES= 18
##SPECTROMETER/DATA SYSTEM= spect
##.PULSE SEQUENCE= zg30
##.SOLVENT NAME= DMSO
##.SHIFT REFERENCE= (INTERNAL, DMSO, 0, 15.7039)
##AUDIT TRAIL= $$ (NUMBER, WHEN, WHO, WHERE, WHAT)
$$ ##TITLE= Audit trail, XWIN-NMR		Version 3.5
$$ ##JCAMPDX= 5.01
$$ ##ORIGIN= Bruker BioSpin GmbH
$$ ##OWNER= she
$$ F:/spectra/data/she/nmr/H-F/1/audita.txt
$$ ##AUDIT TRAIL=  $$ (NUMBER, WHEN, WHO, WHERE, WHAT)
(   1,<2019-11-15 14:57:40.65 +0400>,<she>,<DPX200>,
      <created by zg, POWCHK disabled, PULCHK disabled
       configuration hash MD5:
       00 E9 B6 7A A2 85 ED C7 34 08 36 98 17 FE 4E 26
       data hash MD5: 16K
       8F CA EA 47 DA 82 25 FD 41 94 99 80 B9 EA 55 3F>)
$$ ##END=
$$ 
$$ hash MD5
$$ E5 D3 E0 2B 50 0A 27 6C CB 44 A4 D4 B9 67 85 AA
##$RELAX= 
##$RELAX= 
##$RELAX= 
##$RELAX= 
##$RELAX= 
##$RELAX= 
$$ Bruker specific parameters
$$ --------------------------
##$DU= <F:/spectra>
##$EXPNO= 1
##$NAME= <H-F>
##$PROCNO= 1
##$TYPE= <nmr>
##$USER= <she>
##$AMP= (0..31)
100 100 100 100 100 100 100 100 100 100 100 100 100 100 100 100 100 100 
100 100 100 100 100 100 100 100 100 100 100 100 100 100 
##$AQSEQ= 0
##$AQ_mod= 1
##$AUNM= <au_zg>
##$AUTOPOS= <>
##$BF1= 200.13
##$BF2= 200.13
##$BF3= 200.13
##$BF4= 200.13
##$BF5= 200.13
##$BF6= 200.13
##$BF7= 200.13
##$BF8= 200.13
##$BYTORDA= 1
##$CFDGTYP= 0
##$CFRGTYP= 5
##$CHEMSTR= <none>
##$CNST= (0..31)
1 1 145 1 1 1 1 1 1 1 1 1 1 1 1 1 1 1 1 1 1 1 1 1 1 1 1 1 1 1 1 1 
##$CPDPRG= <>
##$CPDPRG1= <>
##$CPDPRG2= <>
##$CPDPRG3= <>
##$CPDPRG4= <mlev>
##$CPDPRG5= <mlev>
##$CPDPRG6= <mlev>
##$CPDPRG7= <mlev>
##$CPDPRG8= <mlev>
##$CPDPRGB= <>
##$CPDPRGT= <>
##$D= (0..31)
0 1.2 0 0 0 0 0 0 0 0.06 0 0.03 0 0 0 0 0.0002 0 0 0 0 0 0 0 0 0 0 0 0 
0 0 0 
##$DATE= 1573815460
##$DBL= (0..7)
120 120 120 120 120 120 120 120 
##$DBP= (0..7)
150 150 150 150 150 150 150 150 
##$DBP07= 0
##$DBPNAM0= <>
##$DBPNAM1= <>
##$DBPNAM2= <>
##$DBPNAM3= <>
##$DBPNAM4= <>
##$DBPNAM5= <>
##$DBPNAM6= <>
##$DBPNAM7= <>
##$DBPOAL= (0..7)
0.5 0.5 0.5 0.5 0.5 0.5 0.5 0.5 
##$DBPOFFS= (0..7)
0 0 0 0 0 0 0 0 
##$DE= 6
##$DECBNUC= <off>
##$DECIM= 24
##$DECNUC= <off>
##$DECSTAT= 4
##$DIGMOD= 1
##$DIGTYP= 9
##$DL= (0..7)
0 120 120 120 120 120 120 120 
##$DP= (0..7)
150 150 150 150 150 150 150 150 
##$DP07= 0
##$DPNAME0= <>
##$DPNAME1= <>
##$DPNAME2= <>
##$DPNAME3= <>
##$DPNAME4= <>
##$DPNAME5= <>
##$DPNAME6= <>
##$DPNAME7= <>
##$DPOAL= (0..7)
0.5 0.5 0.5 0.5 0.5 0.5 0.5 0.5 
##$DPOFFS= (0..7)
0 0 0 0 0 0 0 0 
##$DQDMODE= 0
##$DR= 18
##$DS= 0
##$DSLIST= <SSSSSSSSSSSSSSS>
$$ [...]
##$SUBNAM2= <"">
##$SUBNAM3= <"">
##$SUBNAM4= <"">
##$SUBNAM5= <"">
##$SUBNAM6= <"">
##$SUBNAM7= <"">
##$SUBNAM8= <"">
##$SUBNAM9= <"">
##$SW= 24.0689530833862
##$SWIBOX= (0..15)
0 0 2 0 0 0 0 0 0 0 0 0 0 0 0 0 
##$SW_h= 4816.95568400771
##$TD= 16384
##$TD0= 1
##$TE= 0
##$TE2= 300
##$TE3= 300
##$TEG= 300
##$TL= (0..7)
0 120 120 120 120 120 120 120 
##$TP= (0..7)
150 150 150 150 150 150 150 150 
##$TP07= 0
##$TPNAME0= <>
##$TPNAME1= <>
##$TPNAME2= <>
##$TPNAME3= <>
##$TPNAME4= <>
##$TPNAME5= <>
##$TPNAME6= <>
##$TPNAME7= <>
##$TPOAL= (0..7)
0.5 0.5 0.5 0.5 0.5 0.5 0.5 0.5 
##$TPOFFS= (0..7)
0 0 0 0 0 0 0 0 
##$TUNHIN= 0
##$TUNHOUT= 0
##$TUNXOUT= 0
##$USERA1= <user>
##$USERA2= <user>
##$USERA3= <user>
##$USERA4= <user>
##$USERA5= <user>
##$V9= 5
##$VALIST= <valist>
##$VCLIST= <CCCCCCCCCCCCCCC>
##$VD= 0
##$VDLIST= <DDDDDDDDDDDDDDD>
##$VPLIST= <PPPPPPPPPPPPPPP>
##$VTLIST= <TTTTTTTTTTTTTTT>
##$WBST= 1024
##$WBSW= 4
##$XGAIN= (0..3)
0 0 0 0 
##$XL= 0
##$YL= 0
##$YMAX_a= 920932
##$YMIN_a= -524169
##$ZGOPTNS= <>
##$ZL1= 120
##$ZL2= 120
##$ZL3= 120
##$ZL4= 120
##$ABSF1= 10
##$ABSF2= 0
##$ABSG= 5
##$ABSL= 3
##$ALPHA= 0
##$AQORDER= 0
##$ASSFAC= 0
##$ASSFACI= 0
##$ASSFACX= 0
##$ASSWID= 0
##$AUNMP= <proc_1d>
##$AZFE= 0.1
##$AZFW= 0.1
##$BCFW= 1
##$BC_mod= 2
##$BYTORDP= 1
##$COROFFS= 0
##$CY= 11.3945322036743
##$DATMOD= 1
##$DC= 2
##$DFILT= <>
##$DTYPP= 0
##$F1P= 16.9975609425685
##$F2P= -3.02152046262296
##$FCOR= 0.5
##$FTSIZE= 0
##$FT_mod= 4
##$GAMMA= 1
##$GB= 0.15
##$INTBC= 1
##$INTSCL= 1
##$ISEN= 128
##$LB= 0.24
##$LEV0= 0
##$LPBIN= 0
##$MAXI= 10000
##$MC2= 0
##$MEAN= 0
##$ME_mod= 0
##$MI= 1.114404
##$NCOEF= 0
##$NC_proc= 0
##$NLEV= 6
##$NOISF1= 3.799351
##$NOISF2= 2.8
##$NSP= 1
##$NTH_PI= 0
##$NZP= 0
##$OFFSET= 15.70392
##$PC= 1
##$PHC0= -9459.064
##$PHC1= 21.60088
##$PH_mod= 1
##$PKNL= yes
##$PPARMOD= 0
##$PSCAL= 0
##$PSIGN= 0
##$REVERSE= no
##$SF= 200.130013532006
##$SI= 16384
##$SIGF1= 3
##$SIGF2= 2
##$SINO= 400
##$SIOLD= 16384
##$SREGLST= <1H.CDCl3>
##$SSB= 0
##$STSI= 0
##$STSR= 0
##$SW_p= 3612.71676300578
##$SYMM= 0
##$S_DEV= 0
##$TDeff= 0
##$TDoff= 0
##$TI= <>
##$TILT= no
##$TM1= 0
##$TM2= 0
##$TOPLEV= 0
##$USERP1= <user>
##$USERP2= <user>
##$USERP3= <user>
##$USERP4= <user>
##$USERP5= <user>
##$WDW= 1
##$XDIM= 8192
##$YMAX_p= 0
##$YMIN_p= 0
$$ End of Bruker specific parameters
$$ ---------------------------------
##NTUPLES= NMR FID
##VAR_NAME=  TIME,          FID/REAL,        FID/IMAG
##SYMBOL=    X,             R,               I
##VAR_TYPE=  INDEPENDENT,   DEPENDENT,       DEPENDENT
##VAR_FORM=  AFFN,          ASDF,            ASDF
##VAR_DIM=   8192,          8192,            8192
##UNITS=     SECONDS,       ARBITRARY UNITS, ARBITRARY UNITS
##FACTOR=    0.0002076,     1,               1
##FIRST=     0,             0,               0
##LAST=      1.7004516,     0,               0
##MIN=       0,             -524169,         0
##MAX=       1.7004516,     920932,          0
$$ Real data points
##PAGE= N=1
##DATA TABLE= (X++(R..R)), XYDATA
0@%%%%%Qq%qRrJ6j6K4l2L2m4N7o4P9r6J10j26J46j69J97k24K54k93L34l76M25
$$ 0 0 0 0 0 0 8 0 0 -8 1 -8 8 -8 16 -16 16 -28 29 -35 44 -52 58 -68 78 -91 106 -118 136 -157 177 -199 226
32B26m79N37o04O75p54Q43r34J036j153J276j411J564j731J915k121K352k611
$$ 226 -253 284 -320 355 -399 444 -490 546 -607 669 -742 822 -909 1006 -1115 1237 -1374
49a374K907l242L630m089M629n282O083p069Q267r511R027K5985O68651O8036
$$ -1374 1533 -1709 1921 -2168 2461 -2821 3262 -3807 4460 -5051 3976 29961 698612 766648
63G66648p76429m64775J25076L08484J67527J27322o6703l79740l31579K27821
$$ 766648 -9781 -474556 -349480 -40996 126531 253853 187150 -192590 -524169 -296348
73b96348N40853J82613l30949l33405k3126J21520Q8437J28637J32803o2214k45943
$$ -296348 244505 427118 96169 -237236 -260362 -138842 -50405 78232 211035 148821 -97122
84i7122j10039J68247K08250m362j52514j22097k4234R5103K29854J92945j10962
$$ -97122 -207161 -38914 169336 164974 12460 -109637 -133871 -38768 191086 384031 273069
95B73069l59309j88778J84942K52563j1883j73182r0420k0349k1493J05547K52991
$$ 273069 -86240 -275018 -90076 162487 150604 -22578 -112998 -133347 -154840 -49293 203698
106B03698P1926l04903l18016R3163L39763J38936r4536n8069j6392j40035j11248
$$ 203698 275624 -29279 -347295 -254132 85631 224567 130031 71962 55570 -84465 -195713
117a95713J98346L26306j0904l51912k01359J87144K67792M1959j10099r5547
$$ -195713 2633 328939 318035 -33877 -235236 -48092 219700 261659 151560 56013
127E6013r5058j00046K9051J76397J10977r2264j41775q868O9198J7733K196N9280
$$ 56013 -39045 -139091 -110040 66357 177334 85070 -56705 -65573 3625 21358 23554 82834
139H2834K6997j07611j23539M8783J72244P8867q4438j25228o2787J7339J08976
$$ 82834 109831 2220 -121319 -72536 99708 178575 94137 -31091 -93878 -76539 32437
150C2437J44360N418j97692j66825J04280K41046N1843j73214j46624Q937P1779
$$ 32437 176797 182215 -15477 -182302 -78022 163024 214867 41653 -104971 -96034 -24255
161b4255P5848J00236L1549j49169j88744L2795K26228J15387j14826j45078j4528
$$ -24255 51593 151829 183378 34209 -154535 -121740 104488 219875 105049 -40029 -54557
172e4557L2759k313L7046R9099Q663j56778j43097N7000J75870Q5782n3739r3296
$$ -54557 -21798 -24111 12935 112034 120697 -36081 -179178 -122178 53692 139474 85735 -7561
184g561p0853l6386M7441J38269R3374p8687j57622l5140J10911J02019M971m1639
$$ -7561 -78414 -114800 -67359 70910 164284 85597 -72025 -107165 3746 105765 110736 69097
196F9097n0040o7787k7163Q2564J19326J600j17674q7358J7571N5916L9719K6442
$$ 69097 19057 -48730 -75893 6671 125997 127597 9923 -77435 -59864 -3948 35771 62213
208F2213j7353r1153p2403O9314J47718L3628j20678j10027J6224P9474N3343
$$ 62213 44860 -46293 -118696 -49382 98336 131964 11286 -98741 -82517 -3043 50300
219E0300K3016l826n9810p9431Q002J08086P6491n0830j07556m2370L7551N7266
$$ 50300 73316 69490 9680 -69751 -61749 46337 122828 71998 -35558 -77928 -40377 16889
231A6889M6204K8220k4096q7646p3631L1929J09713O5079m0829q8904n2421J4081
$$ 16889 63093 91313 67217 -20429 -94060 -62131 47582 112661 71832 -17072 -69493 -55412
243e5412O9249Q3461K2484q7865j24370k1669J08005J11200J269q4937p4897j6026
$$ -55412 13837 97298 119782 31917 -92453 -114122 -6117 105083 106352 21415 -53482 -69508
255f9508M0190P0565M4164l8780r2893m2670N7726Q7709K8223l5427n1208l7202
$$ -69508 -29318 41247 85411 46631 -46262 -88932 -31206 56503 84726 49299 -1909 -39111
267c9111o268M4728O8384J4134o8081p3213R803P5699N2867j5214n3015m9211
$$ -39111 -45379 -651 67733 81867 13786 -59427 -49624 26075 78942 63728 10713 -38498
279c8498k1082K5195O6010M6347l1226q1132l9502M1249O6907K4695k5339m8373
$$ -38498 -59580 -34385 31625 77972 46746 -34386 -73888 -32639 34268 58963 33624 -14749
291a4749m1802k951N7084P4217J2418o8665p2486l747N0687M6901J2629k0077
$$ -14749 -56551 -59502 -2418 71799 84217 15552 -56934 -60681 -9994 36907 49536 29459
303B9459m5243l8701J5371O7402M6576l1437p2932l7802K2840M8396L6819P428
$$ 29459 -15784 -54485 -39114 28288 74864 43427 -29505 -67307 -44467 3929 40748 48176
315D8176l0879m9210j7652L9020N0550J640m3714l6387Q94K4450L1720K4799n411
$$ 48176 17297 -31913 -49565 -10545 40005 41645 -2069 -38456 -37562 -13112 18608 43407 37996
328C7996m5137m5724O104N0751L5766j3300l7370k2791M290K6718L2567R474l3495
$$ 37996 -7141 -52865 -46761 3990 39756 26456 -10914 -33705 -29415 -2697 29870 39344 5849
341E849m9856j1337L9829M8621J2679k3913l5056k2210N015L3205L2562n953m2866
$$ 5849 -44007 -55344 -15515 33106 45785 21872 -13184 -35394 -30379 2826 35388 29435 -13431
354a3431l3202J2967M3946L1282o367l3730l4936j1386K3360L9502J9270j9628
$$ -13431 -46633 -33666 10280 41562 35195 1465 -33471 -44857 -21497 18005 37275 17647
366A7647l7677j7215J7735L2200J6691j1963l0789k4903M930L4741L3720l32l4281
$$ 17647 -20030 -37245 -19510 12690 29381 17418 -13371 -38274 -33344 1397 35117 34785 504
379E04l4616j565K6910K7090M964j7170k4508j1446J5312L0648J7813j6973l4263
$$ 504 -34112 -35677 -8767 18323 23287 6117 -18391 -29837 -14525 16123 33936 16963 -17300
392a7300j8530J3192L0109K0710l921k4682k5614k031K5086K8385J759k5642k6280
$$ -17300 -35830 -22638 7471 28181 24260 -422 -26036 -28067 -2981 25404 27163 1521 -24759
405b4759k473J9660K3424R697j2405k7054j8578J0059L1044K0851r918k8223j7822
$$ -24759 -27232 -7572 15852 25549 13144 -13910 -32488 -22429 8615 29466 19548 -8675 -26497
418b6497O114K2205K0424J518j9274k3800m769K0267K5400M646j7723k1119p808
$$ -26497 -20383 1822 22246 23764 4490 -19310 -24079 -3812 21588 26234 8511 -12608 -20416
431b0416J0611K1147J6531n776k5277k1056N895K5198J7433n643j9827j5610L88
$$ -20416 -9805 11342 27873 22097 -3180 -24236 -18341 6857 24290 18647 -1180 -16790 -16402
444a6402J6391J9661L913j8271k3454n266J6897K0702P432q970j7029j2980L421
$$ -16402 -11 19650 23563 5292 -18162 -23428 -6531 14171 21603 12633 -4396 -17376 -13955
457a3955J8801J6403m291k0892j4616N551J8916J5563m2j5328j9863o500J3937
$$ -13955 4846 21249 16958 -3934 -18550 -12999 5917 21480 21438 6110 -13753 -20253 -6316
470f316K0706P717j2128j7607p203Q472J5070Q344p290j8083j2392N527J8309
$$ -6316 14390 22107 9979 -7628 -14831 -6359 8711 17055 9765 -8318 -20710 -15183 3126
483C126J3973k357j5101j4550l489J0125J4423O273q329j4778o828R230J6846
$$ 3126 17099 14742 -359 -14909 -18398 -8273 6150 12423 4094 -10684 -17512 -8282 8564
496H564Q691q433j8196j1488N946J8748J4078l155j5969j3609J720J3218J1265
$$ 8564 17255 8822 -9374 -20862 -14916 3832 17910 14755 -1214 -14823 -13103 115 11380
509A1380j406j2475j0911n40J0869J1214L161p446j2218q164K696J2389J0806
$$ 11380 9974 -2501 -13412 -13952 -3083 8131 11292 3846 -8372 -16536 -13840 -1451 9355
522I355j051j1536j0645J173J0919J0750N31r498j2872l043J1414J4818M993r267
$$ 9355 8304 -3232 -13877 -12704 -1785 8965 9496 -2 -12874 -15917 -4503 10315 15308 6041
536F041j4018n283P081J2421P427m494j2492p569N024J1875O519l187q985q146
$$ 6041 -7977 -13260 -6179 6242 13669 9175 -3317 -10886 -5862 6013 12532 9345 360 -7786
550g786j324P286J1109M461q571j2773l899P868J0503M489m482j0610o941L923
$$ -7786 -9110 -1824 9285 13746 5175 -7598 -11497 -3629 6874 11363 6881 -3729 -10670 -6747
564f747J2099Q252m192j2200o664M887J0241O464j509p014o350o86M436O621L822
$$ -6747 5352 13604 9412 -2788 -9452 -4565 5676 12140 10631 3617 -2733 -3419 1017 7638 11460
579A1460k651p181n774J383P657P200j315r909q855J53J0113R635k72q855j0303
$$ 11460 8809 1628 -4146 -2763 4894 12094 10779 870 -7985 -7832 2281 11916 11644 2789 -7514
594g514k140O947J0623L284q552j0312j019R515Q981k26p050o410j908K628N905
$$ -7514 -9654 -2707 7916 11200 2648 -7664 -8683 832 9813 9587 2537 -3873 -5781 -3153 2752
609B752N222k61n805n197p0M286M355J050l622o101k815L612P205M257l160q349
$$ 2752 7974 7713 1908 -3289 -3359 927 5282 6332 2710 -3391 -6206 -2594 4611 8868 5708 -2641
625b641o873J232Q904P151k075q980m881L285O876L097k297n491m195r32M576
$$ -2641 -9514 -8282 622 7773 5698 -3282 -8163 -4878 1998 5095 2798 -2693 -6888 -7820 -3244
640c244P360K974l647o832l047K842N855L814k138n664l734K605N784M960j242
$$ -3244 4116 7090 3443 -3389 -6436 -3594 2261 6075 3937 -1727 -5461 -2856 2928 7888 6646
655F646o942o681K0O764O918l25o360m771J130L560K325p22j963k257j784J064
$$ 6646 -296 -6977 -6957 -193 6725 6400 40 -4731 -3601 -41 2284 1562 -401 -2658 -4442 -3378
671c378L783M523j16l785m018r80K973L798K394l63m626l618J725O303M139k957
$$ -3378 405 4928 4812 1027 -2991 -3971 -998 2800 5194 4831 205 -3413 -1688 4615 8754 5797
687E797p793m137M109P163L621l234o383k914J962M427K340j738l310k134L61
$$ 5797 -1996 -6133 -2024 5139 8760 5526 -857 -3771 -1809 2618 4958 3220 -90 -2224 -1863
702a863L152L304Q04l167m170p87K137L064J366K02k318l714p78L735N131l2n086
$$ -1863 1289 4593 5397 2230 -1940 -2727 -590 2474 3840 4042 1724 -1990 -2768 967 6098 6066 980
719I80m550O93M519L892q0k852m104j222K174L708J781j789l785k059J384L231
$$ 980 -3570 -2877 1642 5534 5454 2602 -1502 -2724 -550 3158 4939 3150 -635 -2694 -1310 1921
735A921K341j247l445l225J134K858K081O96j992l483j324K549M308J311l442
$$ 1921 4262 3015 -430 -3655 -2521 337 2418 3114 1122 -2361 -3685 -1136 3172 4483 1041
750A041l912q29L381L498N74k452k164j186J320K201J357o24k606j525J39J974
$$ 1041 -2871 -3700 -319 3179 3753 1301 -863 -2049 -729 1472 2829 2205 -401 -1926 -1787 187
766A87J466J30j074j717j507K53K108K402M3k385k988k55L237L539k44l266k896
$$ 187 1653 1783 709 -1008 -2515 -2262 -154 2248 2291 -94 -3082 -3337 -100 3439 3195 -71 -2967
783b967J44L072K816j7k249k500j144K113L357Q67k587k444n98J961J832R58p93
$$ -2967 -2823 249 3065 3048 799 -1701 -2845 -732 2625 3492 905 -1539 -2137 -176 1656 2614 1821
800A821k035j401P5K035J560P8j668j543n47J160K561J012j969k937l16J733J727
$$ 1821 -214 -1615 -1540 495 2055 2133 465 -1078 -1625 -465 2096 3108 1139 -1798 -2114 -381 1346
817A346O66n64j774j616M95K211K269r70k087j334L41J485J125O85j139j648j362
$$ 1346 2012 1448 -326 -1942 -1447 764 3033 2063 -24 -1358 -1017 468 1593 2278 1139 -509 -1871
834a871J218K554J095j572k100j448J030K392J073o80k122j110j81J875J654o41
$$ -1871 -653 1901 2996 1424 -676 -2124 -1094 1298 2371 1691 -431 -1541 -1722 153 1807 1166
850A166j228j298M70J176J074N20q81j909m17Q01J322L38j8j179o06j33P97J792
$$ 1166 -62 -1360 -890 286 1360 1880 999 -910 -1327 -526 796 1134 1116 -63 -669 -802 -5 1787
868A787j8j541j482m57J461J298M19p86j690j068R32K110P02m58j858l90M29J427
$$ 1787 1769 228 -1254 -1711 -250 1048 1467 681 -1009 -2077 -1145 965 1667 1209 -649 -1039 -610 817
886H17O06l06j572j353M62J109J322K44q22j075o97M94J888p7q92j341m6N43R19
$$ 817 1423 1117 -455 -1808 -1346 -237 1085 1329 507 -568 -1265 -771 1117 1040 148 -1193 -1239 -696 223
905B23J050j51j508j171O49J294N99L16j078o45j72L13Q00J67o34r53l75P77R54
$$ 223 1273 1122 -386 -1557 -908 386 985 1301 223 -422 -594 -281 519 686 52 -901 -1276 -499 455
924D55O35J76j266p31j3P72R32j49j304n80M56O36Q12J69o97j050k36L27J735
$$ 455 1090 1266 0 -731 -744 28 960 811 -493 -1073 -617 19 831 1000 303 -747 -983 -656 1079
943A079M40j022j298j33J98M85P23j91n80n27n1J219Q24k92o80l64q95N31Q91
$$ 1079 1519 497 -801 -934 -736 -251 472 281 -299 -826 -877 342 1166 874 194 -170 -1065 -534 357
962C57L40j49j143j75N54R37N4k62m53j183J00J160R86k03r62p81l22Q63J057
$$ 357 697 548 -595 -770 -216 721 775 513 60 -1123 -1023 137 1123 920 -42 -823 -1145 -282 775
981G75R0m35j029P1L19O35O81p34r09r5J66N08P61l27m79q90L55M69O90J70p72
$$ 775 865 430 -599 -528 -209 426 1107 373 -536 -631 -465 43 804 477 -2 -892 -537 -68 622 792 20
1002B0l89m09M47N19N44m43r16k30K73Q36M30l32m02p40L65N67M06J2p09o50N
$$ 20 -369 -778 -331 188 732 289 -627 -857 -584 252 682 350 -52 -792 -427 140 546 558 -151 -801 -796
1023g96N32P11K55k33q97k22M66K57O46q0p20l22k64O99K79Ol35q05L97J59N68
$$ -796 -264 447 702 469 -428 -650 -184 73 719 639 -81 -403 -667 32 311 317 -18 -823 -426 -267 301
1044C01n0k83n41J2K07N62P02r43k07q4j28M61L98J61p43p17K82M18P64M7o11
$$ 301 251 -32 -573 -561 -354 208 910 -33 -240 -324 -452 9 407 568 -175 -892 -610 -192 572 619 8
1065Hj66k31K63M39N13o67o18P8J78K52L5J59m84k16J81L28N29J32q02J2j6NK4
$$ 8 -158 -389 -126 313 826 159 -459 -381 -203 49 84 243 -241 -457 -276 52 581 713 -89 -77 -93 -88 -64
1088f4J12k2m39k64J7Q32L47o0o24j46J16J98N28Q3p33j35j27M43J62J45k20l25
$$ -64 48 26 -413 -677 -660 172 519 459 -165 -311 -195 3 531 614 -119 -254 -381 62 224 369 149 -176
1110a76l02L15L29L92l65j92n89L97M12J00L54p12m57K60M48Q3L5k7m40K8r3L78
$$ -176 -478 -163 166 558 193 1 -588 -191 221 321 675 -37 -494 -234 214 297 332 305 -135 -107 -200 178
1132A78K04m97p7k20M91L7K56k32l0j27N5j16M48J95o58j92Qp9K35L07k67kk03
$$ 178 382 -115 -192 -412 79 116 372 140 110 -17 38 -78 370 565 -93 -285 -277 -356 -121 186 -81 -83 -286
1155b86j97O44J52k81n41K96l6L44L8j06N2l89J80k06L76j19N05n55q9J21K71
$$ -286 -483 161 313 32 -509 -213 -249 95 133 27 79 -310 -130 -336 40 -79 426 -129 -218 -97 174
1176A74J75m34J58n99M97J75Q7j21j84j56k34M07M29j97j97j90J9R6J18K17j65
$$ 174 349 -85 73 -526 -29 146 233 112 -72 -228 -462 -55 374 177 -20 -210 -191 -95 23 240 75
1197G5k38mJM96j26j30j85l0j5K38j99M56j89l08N1L43p3N1n0k30p5p6M65Q7j01
$$ 75 -163 -167 -166 330 204 74 -111 -141 -156 82 -117 339 150 -158 -107 236 163 214 164 -66 -141 -217 248 335 234
1222B34m23j1J30L30J83l20k42m9j86L23J97j23j98j00l5L36N5M3o5o0m58J11
$$ 234 -189 -200 -70 260 443 123 -119 -168 -354 -31 166 43 -155 -255 -290 46 101 144 79 19 -439 -328
1244c28N58q3K04k79j92r0J5J38J78k8j35j99J39M56P9q5j76l89L36P0L4n9m20
$$ -328 230 147 351 72 -120 -210 -195 -57 121 93 -42 -241 -102 354 433 348 172 -217 119 189 223 164 -256
1267b56J82O8M07m8l69j1M7k65r8M80j35R7j16j66J16J05N45m88j90M5o3L88k90
$$ -256 -74 -6 401 353 -16 -27 20 -245 -343 137 2 99 -17 -183 -67 38 583 95 -95 -50 -113 275 -15
1290a5J83p8k59n1K90K5J95m66J2j22Q6K5o5K93k64R4j71N06M0j2M5k84j95L99
$$ -15 168 90 -169 -220 70 95 290 -176 -164 -286 -200 -175 -240 53 -211 -117 -288 218 258 246 291 7 -188 211
1314B11k83J74J85k70k27K88r7O6j35K3O2j36J12K97r6J14k07l19L44j15L45l99
$$ 211 -72 102 287 17 -210 78 -19 47 -88 -65 -3 -139 -27 270 174 288 81 -238 106 -9 336 -63
1336f3j3j21J85J33l1qk1k74q1K83m11L92j13Q3j2K56l1R1m50J99q8J1L69l78
$$ -63 -76 -197 -12 121 90 82 61 -213 -294 -11 -422 -30 -143 -60 -72 184 153 244 -206 -7 -95 -84 285 -93
1360i3O8k64j23N21N4M9k06K74k00m3oj6o0K78l76Q0O3L85j91q5N8m20L52j16
$$ -93 -25 -289 -412 109 163 212 6 280 80 37 31 15 -45 233 -143 -63 0 385 194 109 167 -253 99 -17
1384a7j34K02ok05K08k43K02j06J44L6j49J29k55K33q4Q9l35L36l17L29q7jJ69
$$ -17 -151 51 45 -160 48 -195 7 -99 45 81 -68 61 -194 39 -45 44 -291 45 -272 57 -30 -31 138
1407A38l2O9j70N1l79L68j33l1L2q8r1K85N6j73p0J08N1O8l54M07m1Q9j92l5N9
$$ 138 106 175 5 56 -323 45 -88 -119 -87 -175 -266 19 75 -98 -168 -60 -9 59 -295 112 71 160 -32 -67 -8
1432hK41k70L8m4J5j18J51j44L00n0k02j6k19L26K24mm75K96k95J83N3K86k41
$$ -8 233 -37 1 -43 -28 -146 5 -139 161 111 -91 -107 -326 0 224 220 -255 41 -254 -71 -18 268 27
1455B7r9j59l5M72k14kk69J83J20l84Q52l35k12k51J33k93K50L84j64N9Q1q5j45
$$ 27 -72 -231 -266 206 -8 -10 -279 -96 24 -360 492 157 -55 -306 -173 -466 -216 168 4 63 144 59 -86
1478h6k85K95J48j60QpK77l5j0j13K9l5K11l69j1kL53k60J30j89N4P9q8j57L27
$$ -86 -371 -76 72 -88 -80 -87 190 155 145 32 61 26 237 -132 -143 -145 208 -52 78 -111 -57 22 -66 -223 104
1503A04J00o3L7m35M93k69J13j02K5rm7j2J76J53k16k32J54J39q4N9k88N06m42
$$ 104 204 141 178 -257 236 -33 80 -22 3 -6 -53 -65 111 264 48 -184 -30 109 25 84 -204 302 -140
1526a40K56N7r1J9P7k89P9K42l66K10j85J77k20M68l37K55k58J25p5J40P0n76
$$ -140 116 173 82 101 178 -111 -32 210 -156 54 -131 46 -174 294 -43 212 -46 79 4 144 214 -362
1548c62L31Q0j57j28l8M30J4k48p4J52j97K80j82J98q6K10j27J07K90p16L01j03
$$ -362 -31 49 -108 -236 -274 156 170 -78 -152 0 -197 83 -99 99 13 223 96 203 493 -223 78 -25
1570b5j40K6j82K31J31K04m16j28K09j51L81k10j36L4L98j55k8q7P3J20j99k28
$$ -25 -165 -139 -321 -90 41 245 -171 -299 -90 -241 140 -70 -206 -172 226 71 43 -44 29 149 -50 -278
1592b78J91J85K79n18K26m7J5P4j03j5k20R3P8J55j89R5q7J53R4K2l94K44M2k05
$$ -278 -87 98 377 -141 85 38 53 127 24 9 -211 -118 -40 115 -74 21 -66 87 181 203 -191 53 95 -110
1616a10L65l94J34p5Q6j97L28j48QJ46l43K65j41r9L42q9M6p6l17K09Q5l51L20
$$ -110 255 -139 -5 -80 6 -191 137 -11 -3 143 -200 65 -76 -175 167 78 124 48 -269 -60 25 -326 -6
1639fj1M6K7k23J52o9k37M22k8j01j62L6J05Q1Q7J50l28j13P9L20R8m98K64k8
$$ -6 -17 29 56 -167 -15 -84 -321 101 73 -28 -190 -154 -49 32 119 269 -59 -172 -93 227 325 -173 91 63
1663F3lk11J72l0J67j45J73p9j90L24j90J62k09j98M8L66j35N5k2j12l75J09Q6
$$ 63 60 -151 21 -9 158 13 186 107 -83 241 51 213 4 -194 -146 220 85 140 118 6 -369 -260 -174
1686a74K82r5R0n66P52J32l93p6K59l68J15K4m0J50J00k55O0j45K19K60n49M6
$$ -174 108 13 103 -463 289 421 28 -48 211 -157 -42 -18 -58 92 192 -63 -3 -148 71 331 -218 -172
1708a72K71l29M8K58j08j7M8j57j3M05l29K90j21j48j56L02J40m11P3j3M47j04
$$ -172 99 -230 -182 76 -32 -49 -1 -158 -171 234 -95 195 74 -74 -230 72 212 -199 -126 -139 308 204
1730B04o7Ql3K01l35J90n6q9k36J05m0M83k82n7J86k53K96k38L0j66K22j10J77
$$ 204 137 145 112 313 -22 168 112 23 -213 -108 -148 335 53 -4 182 -71 225 -13 17 -149 73 -37 140
1753A40k77R5K18L3k27L9J62j32k71K87Q4m10L09m0M3j66k8K99k34M39n50Q7J32
$$ 140 -137 -42 176 209 -18 21 183 51 -220 67 151 -259 50 10 53 -113 -141 158 -76 363 -187 -100 32
1776C2r3j89J04J71K15k15j16j49L27K3N7ll61M28l22J45j92K80n9q9Lj11K89
$$ 32 -61 -250 -146 25 240 25 -91 -240 87 110 167 164 -197 231 -91 54 -138 142 83 -6 -3 -114 175
1799A75J7o68O86o4q6K0k8p8k46K17l7L7m9K06M3m1o0Q9q3k38J97K2p8Q3N3m6
$$ 175 192 -476 210 146 60 80 52 -26 -272 -55 -92 -55 -104 102 145 104 44 133 50 -188 9 31 -47 36 89 43
1825D3q5j3KJ53m00O53k92Pk78J30J24ol9k7j05K00l79N97n9k45l4j5l0O8L09
$$ 43 -42 -55 -53 100 -300 353 61 68 -210 -80 44 38 -1 -28 -133 67 -312 285 226 -19 -53 -68 -98 -30 279
1850B79j26l36O6J81m5J50m44J54J97l71L75o8j61n9L11m27L4M35j01J83j40J70
$$ 279 153 -183 -117 64 19 169 -275 -121 76 -295 80 12 -149 -208 103 -324 -290 145 44 227 87 257
1872B57j76q2k10Q6J3O0J92j2J3l30K35r5J04Pj18J9j35K00j43K09j29qj31K75
$$ 257 81 -1 -211 -125 -112 -52 140 128 141 -189 46 -49 55 62 -56 -37 -172 28 -115 94 -35 -43 -174 101
1896A01j00j29L11k00J39Q9j1k96j8Q5P2Om47Q9N06L6r7J95p72L89K04j71j04
$$ 101 1 -128 183 -17 122 211 200 -96 -114 -29 43 49 -398 -309 197 233 136 331 -441 -52 152 -19 -123
1919a23K19o8J49j75p6J18P4k36p6J92l4J59j82n0J09kj7o3J30j9R1j30J72k72
$$ -123 96 28 177 2 -74 44 118 -118 -194 -2 -36 123 -59 -109 0 -2 -19 -82 48 29 120 -10 162 -110
1943a10K21j56j31J19Q1M19m83M5J0L6J3Q3j41L17k04j67J64q7n2L72j80j28q7
$$ -110 111 -45 -176 -57 24 443 -40 5 15 51 64 147 6 323 119 -48 116 29 -23 349 169 41 -46
1966d6O7J14q0K7J90k05k40lk9K62kk87J52J44o4j37L51m29K42J7o2l9j28k1j92
$$ -46 21 135 55 82 272 67 -173 -176 -205 57 55 -232 -80 64 0 -137 214 -215 27 44 -18 -57 -185 -206 -398
1991c98M31K05j21l5m19K41J09J14j89j92N13j13L1P2k99J31k68J03L18Q4l03
$$ -398 33 238 117 82 -337 -96 13 127 -62 -254 259 146 177 249 -50 81 -187 -84 234 318 15
2012A5J36k97J92r7N9J32j73J9K99k99J88j54J26R3l93J74j1Q6rj86K14Q7j44
$$ 15 151 -146 46 -51 8 140 -33 -14 285 -14 174 20 146 239 -154 20 9 95 86 -100 114 201 57
2035E7l23K96J14J73k27o5j00j37M28k03K39l50j09J19J37j43j26K18m92O02P0
$$ 57 -266 30 144 317 90 25 -75 -212 216 13 252 -98 -207 -88 49 -94 -220 -2 -494 108 178
2056A78l69J97j49L04J5m40K47L2j91j00M29n2k15K46k47J83or2L53r8j56P6k01
$$ 178 -191 6 -143 161 176 -264 -17 15 -176 -276 153 101 -114 132 -115 68 62 -30 323 225 69 145 -56
2079e6K81j94J54j55J14k66j40J64J54k83K46n7NO6L4J5J90l66K00k75j36L75
$$ -56 225 31 185 30 144 -122 -262 -98 56 -227 19 -38 -33 33 67 82 272 -94 106 -169 -305 70
2101G0j19M1L04K1l16O3k63K28k1J01K0j99m9K01PN4m41M37l07M8L74P8l78Q8
$$ 70 -49 -8 296 317 1 64 -199 29 8 109 129 -70 -119 82 89 143 -298 139 -168 -120 254 332 -46 42
2125D2r0QM7j8J37M4n05K42J15J5k04N3nJ60n1J4j67K50l25L91k56pL14k86k2
$$ 42 -48 -40 7 -11 126 170 -335 -93 22 37 -167 -114 -119 41 -10 4 -163 87 -238 153 -103 -110 204 -82 -104
2150a04J75o2L37m39J84P3l10R1R6n5M9J13pr2r5N9Q3q4K75k92M1M3k15l4MJ45
$$ -104 71 9 346 -93 91 164 -146 -55 41 -14 35 148 141 49 -46 13 96 12 287 -5 36 79 -136 -170 -166 -21
2176b1R1J58k84kO0l6j97l7L62K8k20m5j15K5M60l04L6L29k18j34l57M75j52J82
$$ -21 70 228 -56 -58 2 -34 -231 -268 94 122 -98 -143 -258 -233 227 -77 -41 288 70 -64 -421 54 -98 84
2200H4K4j01j33K12l35J47M5J33K2l0r9l4K14p4k47K27L3l6k01R3j11m2M29l06
$$ 84 108 7 -126 86 -249 -102 -57 76 98 68 -31 -65 149 75 -172 55 88 52 -149 -56 -167 -209 220 -86
2224h6N0j89M59N7n58J30J69J82l06K56j00j06R6l97N26l71L13j53J29j14o0K10
$$ -86 -36 -225 234 291 -267 -137 32 214 -92 164 64 -42 54 -343 183 -188 125 -28 101 -13 -73 137
2246A37j27n2r0L70m01J85J46q7o1J79l21Q9M8p7rr9l7K82j67l9Q9M3J07k1j32
$$ 137 10 -42 -132 238 -163 22 168 81 20 199 -122 -33 15 -62 -71 -170 -207 75 -92 -131 -42 1 108 87 -45
2271d5kK75j3k93k47K20J1l3J28O7p5P2j10j0j07K12j37J58l2l9M1j07J63l11
$$ -45 -47 228 215 -78 -325 -105 -94 -127 1 68 -7 65 -45 -55 -162 50 -87 71 39 0 41 -66 97 -214
2295b14R3K07J85o1j87j2j86K51J56k47j2n2P2j54M7P5L17j95k9k11n7J67OJ30
$$ -214 -121 86 271 210 23 11 -175 76 232 -15 -27 -79 -7 -161 -114 -39 278 83 54 -157 -214 -47 -41 89
2319H9k2P9m8j39o4J20N9J64k21L21k31J11j83j25M38k80n5k26Q5K50J57k08k52
$$ 89 67 146 98 -41 -105 15 74 238 17 338 107 218 35 -90 348 68 13 -213 -128 122 279 71 -181
2342a81J84o4J29k65m1L15k1ll13n8K04m6J48K69k27j68R4p9J94k12L45l24J27
$$ -181 3 -61 68 -197 -238 77 56 53 -260 -318 -114 -160 -12 257 30 -138 -44 -123 71 -141 204 -120 7
2365GN1j31O4K34o1k35nL30k68j28QL75k01m0j14J13l8j64L48j5l02q7K66J99
$$ 7 58 -73 -9 225 164 -71 -76 254 -14 -142 -134 241 40 0 -114 -1 -39 -203 145 130 -172 -259 7 206
2389B06k65L69m08K22q5k2J98j26lj63K00q3J72j81mj05j98K32K20j60P9p6l40
$$ 206 -59 310 -98 124 39 17 215 89 86 -77 123 40 212 31 27 -78 -276 -44 176 16 95 19 -321
2412c21K71R1k55K57p5L5l05J82j44J50K38m68L66k35J70R8j38K98k03k1O6j14
$$ -321 -50 41 -214 43 -32 3 -302 -120 -264 -114 124 -344 22 -213 -43 55 -83 215 12 -9 57 -57
2434e7K16q5j61J02J00j87k20J90K4l20L06J47k06L92j54k10K11j12J47j57Jk49
$$ -57 159 74 -87 15 115 -72 -292 -102 -78 -398 -92 55 -151 241 87 -123 88 -24 123 -34 -33 -282
2456b82K78l5k31J38J52J5M4P0k9j08J83k15Q8q7j4j10L48m2j14J24l13K97j00
$$ -282 -4 -39 -270 -132 20 35 79 149 120 12 195 -20 68 -19 -33 -143 205 163 49 173 -140 157 57
2479E7qk58J37K69j29R6o9M5j64J39N6J69n66K25n3l40M90j39j08J60j26J92m2
$$ 57 49 -209 -72 197 68 164 95 140 -24 115 171 340 -226 -1 -54 -394 96 -43 -151 9 -117 75 33
2502C3J16Kl58K61p8J62k07J27j4k05K15J07q1j35j72L44J0j14j12l2pN3J84q7
$$ 33 149 151 -207 54 -24 138 -69 58 44 -161 54 161 80 -55 -227 117 127 13 -99 -131 -138 -85 99 12
2526A2RK60l59K96k29l8p6j05L42nl60K88o5l2j99L67j32j82J60q4K7P6L1m2M9
$$ 12 21 281 -78 218 -11 -49 -125 -230 112 107 -253 35 -30 -62 -261 106 -26 -208 -48 -132 -105 -29 2 -40 9
2551Ik34P1K18M9k89K55noJ93p4k69K10j61J23l21M29m91M61l51q2k3M21j6o8
$$ 9 -225 -154 64 113 -176 79 74 68 261 187 -82 128 -33 90 -231 198 -293 168 -183 -265 -288 133 117 49
2575D9k3l11K39J59k88J76L5L8L2k83J18P9K8Rk10J16J38j13L8j30K7J19j23n1
$$ 49 26 -285 -46 113 -175 1 36 74 106 -177 -59 20 48 57 -153 -37 101 -12 26 -104 -77 42 -81 -132
2599a32K69l59j2J30K5P2Q2k31p6L3L87l47J17j5j3L7k53J97m6M19q5o9q1J28
$$ -132 137 -222 -234 -104 -79 -7 75 -156 -232 -199 188 -159 -42 -57 -70 -33 -286 -89 -135 284 199 130 49 177
2623A77k3L3j52o0j61K91nk70L6J41j65J93K59l24J78J93k83J3n1R6k49J92j58
$$ 177 154 187 35 -25 -186 105 100 -170 -134 7 -158 35 294 -30 148 341 58 71 20 116 -133 59 -99
2646i9P7J80k04j13l9J34K14m4O6j53l2J10l36N45k81K03l27O5L64l75m9r4L34
$$ -99 -22 158 -46 -159 -198 -64 150 106 172 19 -13 97 -239 306 25 228 -99 -34 330 -45 -94 -188 146
2669A46p7j10K61Pl06m4j2J2K65k82Q6q9J06N1q6k66K05O6JJ26J80j68QP0j71
$$ 146 69 -41 220 227 -79 -123 -135 -123 142 -140 -54 -143 -37 14 -72 -338 -133 -67 -66 60 240 72 80 150 -21
2694b1j42L61r5l09K77J03O2n23K83J98k99R3l48L35j95L51p7k25K02l66L12j75
$$ -21 -163 198 103 -206 71 174 236 -287 -4 194 -105 -12 -360 -25 -220 131 54 -171 31 -335 -23 -198
2716a98J74K62m58L57j34j1J80l15J15m2J10L1o7J66l03J0J45M7j26j49M27P5
$$ -198 -24 238 -220 137 3 -8 172 -143 -28 -70 40 71 4 170 -133 -123 22 69 -57 -206 221 296
2738B96l51K37k37J60Lp1J7J47l01J64q1L8j52RJ76O1K8j40k1l6J42R9k12%J09
$$ 296 -55 182 -55 105 108 37 54 201 -100 64 -17 21 -131 -122 54 115 143 3 -18 -54 88 187 -25 -25 84
2763H4P1l0j89K21k41J94R0q3l33K97n1M5k28K17J20k64J16k13J4L10l14K41j42
$$ 84 155 125 -64 157 -84 110 200 117 -216 81 30 75 -153 64 184 -80 36 -177 -163 147 -167 74 -68
2786f8n3o8L1N7o0K14j32r5L09j97k6k01Q5K17K5j05N5k37J05j48P3K41K82jk78
$$ -68 -121 -189 -158 -101 -161 53 -79 -174 135 -62 -88 -289 -204 13 38 -67 -12 -249 -144 -292 -219 22 304 303 25
2811B5j15j61K87J84o1j83J96k18j32J57L33k76k06Q4o3N8J5J29M5q6J75k31N7
$$ 25 -90 -251 36 220 159 -24 172 -46 -178 -21 312 36 -170 -86 -149 -91 -76 53 98 12 187 -44 13
2834A3O3k02M9L40n08K00J61k86K66P7j97K94k52K04l33K62r7q9o7k4M14m84J66
$$ 13 76 -126 -77 263 -245 -45 116 -170 96 173 -24 270 18 222 -111 151 54 -35 -102 -126 288 -196 -30
2857c0L21k61j44KJ32j05j34j33L60M8k01J57m0J21j78pn9K25J6J47k43n9R8p4
$$ -30 291 30 -114 -112 20 -85 -219 -352 8 56 -145 12 -28 93 -85 -92 -151 74 90 237 -6 -65 33 -41
2881d1j26K64J61o2j65k27K7L07l3J42q1l9K02l21j87k21M29J73k62p6K11O9j07
$$ -41 -167 97 258 196 31 -196 -169 138 105 247 166 127 329 8 -179 -400 29 202 -60 -136 75 144 37
2904C7j52P5m6J4M1O8O5j23J93m03L3L37j6J59k63j98J05J38j14l7J78o7l31L02
$$ 37 -115 -40 -86 -72 -31 37 102 -21 172 -231 -198 139 123 282 19 -179 -74 64 -50 -87 91 24 -307 -5
2928eJ32j80l11M52R3j83J38j13j75J44o3l3M4J80k44K55J09k89j47L06k78K51
$$ -5 127 -53 -364 88 181 -2 136 23 -152 -8 -71 -104 -60 120 -124 131 240 -49 -196 110 -168 83
2950H3n0J43j47j98J37J87k81J21o9R1J16K07n93j3J78p1O2J95j18l03L05j70
$$ 83 33 176 29 -169 -32 155 -126 -5 -74 17 133 340 -253 -266 -88 -159 -97 98 -20 -323 -18 -188
2972a88K30L03j99j39q8l1K62P8j71J09j42j76J85J81k92J1J33j73J63l25K89
$$ -188 42 345 146 7 -81 -112 150 228 57 166 24 -152 33 214 -78 -67 66 -107 56 -269 20
2993B0k70L95p9N9J00m85L61j30q1L63j11j77k01L19j65J59k70J48N6j8l5J40
$$ 20 -250 145 66 125 225 -260 101 -29 -110 253 142 -35 -236 83 -82 77 -193 -45 11 -7 -42 98
3015I8j43J62n82N81l17L43Ll54L0r0L0K27J43j85K59m14j1K16o8k2K48j37k68
$$ 98 -45 117 -465 116 -201 142 145 -209 -179 -269 -239 -12 131 -54 205 -209 -220 -4 -72 -94 154 17 -251
3038b51L38k9p6J97l05q3K85R5k19Rk2R3j64j26L49j27K02O1k95j28L1P0J91P2
$$ -251 87 58 -18 179 -126 -209 76 171 -48 -39 -61 32 -132 -258 91 -36 166 227 -68 -196 -165 -95 96 168
3062A68k13J46q5L14k27o4l36K14J3K21l16J39P1k70J04K03L0K0o5O3M7l04K12
$$ 168 -45 101 16 330 103 39 -297 -83 -70 151 -165 -26 45 -225 -121 82 112 132 67 130 177 -127 85
3085H5k91Q2O5M44m47N4j44M7J16N9j67Q1J2o0m4J22K70j68k85j09J12K74l39
$$ 85 -206 -124 -59 385 -62 -8 -152 -105 11 70 -97 -16 -4 -64 -108 14 284 116 -169 -278 -166 108 -231
3108b31K6J66K25n2n4K18n32L25j3j9k56J92J73k21p0J35K8K6N4O1j65N4J27m72
$$ -231 -205 -39 186 134 80 298 -234 91 78 59 -197 -5 168 -53 -123 12 40 66 120 181 16 70 197 -275
3132b75K80j13J02L20n96K89k33J74Mj67J79j03K41Q9Q3k40r6J15O2L7k2j84j6
$$ -275 5 -108 -6 314 -282 7 -226 -52 -48 -215 -36 -139 102 191 274 34 -62 53 115 152 130 -54 -70
3155g0J02j60l8N3K15J6n13L78J17l14M8Q8M15m33j45J98K70l39J78J1q2m0J71
$$ -70 32 -128 -166 -113 102 118 -395 -17 100 -214 -166 -78 337 -96 -241 -43 227 -112 66 77 -5 -45 126
3178A26j85j7%R3q7J22q8j95K80J33k18m8K06j73K1n8n9Q2l7K95j28N7J05l34
$$ 126 -59 -76 -76 17 -70 52 -36 -231 49 182 -36 -84 122 -51 -30 -88 -147 -65 -102 193 65 122 227 -107
3202a07k1J46K79p3m11n0J52R6J99k27J21R5l82J90J3j35k60M85KL2l38N1K26
$$ -107 -128 18 297 224 -187 -237 -85 11 210 -17 104 199 -183 7 20 -115 -375 110 112 144 -194 -143 83
3225H3j41J42j06j4J95J40j55j84j18K04l16J67L11j90j51K07R9o3l88N33m15
$$ 83 -58 84 -22 -36 159 299 144 -40 -158 46 -270 -103 208 18 -133 74 173 110 -278 255 -160
3246a60K44l19R7J31j81J20m4K04K43l30R6p2j36K13J19l75J32O5l4l37J16J06
$$ -160 84 -235 -138 -7 -188 -68 -112 92 335 5 101 29 -107 106 225 -150 -18 47 13 -324 -208 -102
3268a02j76L02k05O2J23P6K32m63J91o6j46K12j5m7j01lK05K14k73l30N17j92
$$ -102 -278 24 -181 -119 4 80 312 -151 40 -26 -172 40 25 -22 -123 -126 79 293 20 -310 207 15
3290A5j77J86O5j22j72K51K7k02L32j81j9l36M38j92J62k0Q3M0l65K14j24J55
$$ 15 -162 24 89 -33 -205 46 73 -129 203 22 3 -333 105 -87 75 55 138 178 -187 27 -97 58
3312E8l08J73k09J43J71m6j22m2K75k43R4J46j12n5k41J36J55N7Q9n4l62M47p4
$$ 58 -250 -77 -286 -143 28 -18 -140 -182 93 -150 -56 90 -22 -77 -318 -182 -27 30 119 65 -297 150 76
3335G6l22J24J14K01l0l46M29l80L07j00q2j52J81l8k5M7j1K12j75n0l33K82N9
$$ 76 -246 -122 -8 193 163 -183 246 -134 173 73 -9 -161 20 -18 -43 4 -7 205 30 -20 -353 -71 -12
3358a2k75K48L24m45K53j04K00j04Q9j91k43K92J33j60J7K1K06m20K55j50J51
$$ -12 -287 -39 285 -160 93 -11 189 85 174 -17 -260 32 165 5 22 43 249 -171 84 -66 85
3379H5k40K58k28P6p4J3j8K00m1q0r9p5J45L6q3k5J80j63J23l7K6Q0j99kK23k4
$$ 85 -155 103 -125 -49 -123 -110 -128 72 31 -49 -148 -223 -78 -42 -125 -150 30 -133 -10 -47 -21 59 -140 -142 81 57
3405E7k35J96q3j18K20m3Q2N4j30l43O96j68l37L3J49k03L51l12j35K26J03J04
$$ 57 -178 18 -65 -183 37 -6 76 130 0 -343 353 185 -152 -119 30 -173 178 -134 -269 -43 60 164
3427A64k13r2j6J90m8k0J78r5j26J30l4k22P3M1J50R2M1l36L29k58N7lq1P8K13
$$ 164 -49 -141 -157 33 -15 -35 143 48 -78 52 18 -204 -131 -90 60 152 193 -143 186 -72 -15 -18 -99 -21 192
3452A92j26q4L2R2J67M1l79K10j58J49l28J88j75J18L09l46K19k82O3J6J32J84
$$ 192 66 -18 14 106 273 314 -65 145 -13 136 -192 -4 -179 -61 248 -98 121 -161 -98 -82 50 234
3474B34l00J01J39k5J3Mk44P9K01j10p1q3L40n95M10M5j13O4l22O2M28j97k78
$$ 234 -66 35 174 149 162 166 -78 1 202 92 21 -62 278 -317 93 138 25 89 -233 -171 257 60 -218
3497b18K99j98j34K92k64J87l5M20k36j5j7m6q9L5n1j52J34k3M02k25j19j01Q0
$$ -218 81 -117 -251 41 -223 -36 -71 349 113 98 81 35 -54 -19 -70 -222 -88 -111 291 66 -53 -154 -74
3520g4N7O4OL6j66L82k79j17L67k56m6J16K5O2q8q8J0P0j13J08O9j3m1l05L76
$$ -74 -17 47 53 89 -77 305 26 -91 276 20 -26 90 115 177 89 1 11 81 -32 76 145 132 91 -214 162
3545A62M9k15J66l32M84j29k25r5J7Rl9M8j00L68k80K51j80j81K87k55Q6m6J28
$$ 162 211 -4 162 -170 314 185 -40 -135 -118 -109 -148 -100 -200 168 -112 139 -41 -222 65 -190 -104 -150 -22
3568b2j9m7o7L85r9m50L41l5l9K89l8%l07J38r7K58k02nj43J15o7j53j5K47L5
$$ -22 -41 -88 -155 230 131 -319 22 -13 -52 237 199 199 -108 30 -67 191 -11 -16 -159 -44 -111 -264 -279 -32 3
3593Cp4j27j70L13K96l57K41l4j43Q6J0K1l3k6K55o7j67J4Q4l02J09jJ7j37m8
$$ 3 -71 -198 -368 -55 241 -116 125 91 -52 34 44 65 32 6 261 194 27 41 125 -177 -68 -69 -52 -189 -237
3618b37M8J95j56J99J39k90j17L04P8R7k89N1j4j81J25K8O4J28k6j08o9j36M01
$$ -237 -189 6 -150 49 188 -102 -219 85 163 260 -29 22 8 -173 -48 -20 44 172 146 38 -31 -167 234
3641B34l18p5n3K93M1JO6p5k58j23M02n6J10k57N70k25k61j48J72j04j58O29m48
$$ 234 -84 -159 -212 81 122 123 189 114 -144 -267 135 79 189 -68 502 277 16 -132 40 -64 -222 407 -41
3664d1K58m37K23j36m0J10J55j64q8J87j9J68j8l32M6K10k11K41Lk43K67k64J19
$$ -41 217 -220 3 -133 -173 -63 92 -72 -160 27 8 176 158 -174 -128 82 -129 112 115 -128 139 -125 -6
3687fk25K5K95K73l13k97K38J0J33l62L13l4k05R2k29M11O5k70j56K01n8K23r0
$$ -6 -231 -206 89 362 49 -248 -10 0 133 -229 84 50 -155 -63 -292 119 184 -86 -242 -41 -99 124 34
3710C4k8j30J37K1L5m2%k1M0k94J87L2r6O0K85k56R6j22J32J28p1l27K34K37m57
$$ 34 6 -124 13 34 69 27 27 6 46 -248 -61 -29 -125 -65 220 -36 60 -62 70 198 127 -200 34 271 -186
3735a86J07j4RL33o09K36J89j06j9k60J84L50J27L1M1k41K7k16j54J82pj43L32
$$ -186 -79 -93 -84 249 -360 -124 65 -41 -60 -320 -136 214 341 372 413 172 199 -17 -171 11 4 -139 193
3758A93j76j66j7J31J87l24N0q8J25qr6M7J61n9M0J17j33O6j54j9J80K8l17L53
$$ 193 17 -149 -166 -35 152 -172 -122 -210 -85 -93 -189 -142 19 -40 0 117 -16 50 -104 -123 57 85 -232 121
3782A21P3j96nJ08n4j16j02L00k82J62P6N0l15J18L05m30K5L77j05k53L40j22
$$ 121 194 -2 -7 101 47 -69 -171 129 -153 9 85 135 -180 -62 243 -187 -162 215 110 -143 197 75
3804G5k4k28J55J80j95L25j48l16J14J86J3k98r9K95j06K49M8n9j72J14l55m6
$$ 75 51 -177 -22 158 -37 288 140 -176 -62 124 137 -161 -260 35 -71 178 226 167 -5 109 -246 -292
3826b92L28r2J93qJ44l01J14j10q1k5L09J96l38j22j22L97l39M81k86J3p3O1o3
$$ -292 36 -56 137 129 273 -28 86 -24 -105 -130 179 375 37 -85 -207 190 -149 332 46 59 -14 47 -16
3849a6q9o4K1K68k83l1L91j77j21k24M00j93j03J15K21K36k2m41q9K64j4n13O20
$$ -16 -105 -169 -148 120 -163 -194 197 20 -101 -325 75 -118 -221 -106 115 351 329 -112 -201 63 49 -464 156
3872A56j9j54J07k01L71j45q7j87J22K24l17L78j62k64J58j64J16K33oq9N2k13
$$ 156 137 -17 90 -111 260 115 28 -159 -37 187 -130 248 86 -178 -20 -184 -68 165 159 70 122 -91
3894i1J65j74L3M6j28J2j52L14L83l39l69L17n2k32J62J86l8l13K68M1j46J18
$$ -91 74 -100 -67 -21 -149 -137 -289 25 408 69 -300 17 -35 -267 -105 81 43 -270 -2 39 -107 11
3916A1j4J42j54J97j92Q4L3q9k6k3r6mK65q6n0k12o8M08M4m14M8j27K58K65k86
$$ 11 -3 139 -15 182 -10 74 107 18 -8 -31 -127 -131 134 48 -2 -214 -282 126 170 -244 -196 -323 -65 200 -86
3941h6K79j28k9q1Q0J43m77L42j85j7R6K97P4n9m33j90N79m0q6l9j85R7j87K02
$$ -86 193 65 36 -45 35 178 -299 43 -142 -159 -63 234 308 249 -184 -374 205 165 79 40 -145 -48 -235 -33
3965c3P1m0J45k19J2J56j49j83N7J95r2j64M15m29L49J57j97p8q0J77m8k65M70
$$ -33 38 -2 143 -76 -64 92 -57 -240 -183 12 -80 -244 171 -258 91 248 51 -27 -107 70 22 -243 227
3988B27k06j0Q2k04J36O0J30k25m94N07m2J53j92o6K24J17j41p6k2j23K69p1j94
$$ 227 21 11 93 -111 25 85 215 -10 -504 3 -39 114 -78 -144 80 197 56 -20 -42 -165 104 33 -161
4011a61L71m20L38l97K34k56J69J29j08O0pJ52l53J93p4j28N50k30j45J37Rl3
$$ -161 210 -210 128 -269 -35 -291 -122 7 -101 -41 -48 104 -249 -56 -130 -258 292 62 -83 54 63 30
4033C0K18l15k80L20J65j22j52J6j50K73K70j14k67J9K62q6N0j86J42j67J69p2
$$ 30 248 -67 -347 -27 138 16 -136 -120 -270 3 273 159 -108 -89 173 87 137 -49 93 -74 95 23
4055B3J93l35J63mP1K51m38Rj37L22j82m7N3N9R3l84J04M58k59K30k79k14K76
$$ 23 216 -119 44 40 111 362 -76 -67 -204 118 -64 -111 -58 1 94 -290 -186 272 13 243 -36 -250 26
4078B6rJ9k05L10k7j70k3n8L13l87J78K35l11K12q3J8m9o8L7J49k48J49Q1r3Q1
$$ 26 17 36 -169 141 114 -56 -79 -137 176 -211 -33 202 -109 103 20 38 -11 -79 -42 107 -141 8 89 -4 77
4103G7m9j14j58K31k85M36j67j54O11o43K46J49p6L3j51J56k69m4K36j21K17k91
$$ 77 28 -86 -244 -13 -298 138 -29 -183 428 -215 31 180 104 137 -14 142 -127 -171 65 -56 161 -130
4125a30k59K06L1K96m5k89j8K54O5j09k18Q9R0r7L65k98k1J15kk15K6L62J0rj94
$$ -130 -389 -183 -152 144 99 -190 -208 46 111 2 -216 -127 -37 -134 231 -67 -88 27 25 -190 -164 198 208 199 5
4150Ej83j03N07k79l2p3K57p4l12K8K84O0m0l8o9J08J79k62K42m52K77J80l76
$$ 5 -178 -281 226 -53 -85 -158 99 25 -287 -259 25 85 45 7 -62 46 225 -37 205 -247 30 210 -166
4173a66N01j96k94Q7j5L08j43l22J95J83j29L5j24J06K3k31L25k13o9J31K38l23
$$ -166 335 139 -155 -68 -83 225 82 -240 -45 138 9 44 -80 26 49 -182 143 -70 -139 -8 230 -93
4195i3K41k04P0J22pl41n8K88J98j8j99L0k75L54m74M62l8l25M00l57K30J4L2
$$ -93 148 -56 14 136 129 -212 -270 18 216 198 -1 29 -246 108 -366 96 58 -267 133 -224 6 20 52
4218E2k17J9K01Nk46R8qK20P2l38J08J48M8j14J54l58K31n6P6K0k23J63J43j53
$$ 52 -165 -146 55 60 -186 -88 -96 124 196 -142 -34 114 162 48 202 -156 75 19 95 115 -108 55 198 45
4242D5j23k94L72J60k76L08j83q8J59J40k59J96k80J57N9k12J75k9p8j29K84l46
$$ 45 -78 -372 0 160 -116 192 9 -79 80 220 -39 157 -123 34 93 -119 56 27 -51 -180 104 -242
4264b42M5L24l89L82k79lJ36M5j35J12K6J55r8j2m6r4N7j46K42j63J76M7l46K36
$$ -242 -197 127 -262 120 -159 -162 -26 19 -116 -4 22 177 79 67 21 -73 -16 -162 80 -83 93 140 -206 30
4288C0j6l18K34j57M42j48k1J46o2K9p1l47M77j27k52O49p84J83J75j19Q6j57
$$ 30 14 -304 -70 -227 215 67 46 192 130 159 88 -259 218 91 -161 488 -296 -113 62 -57 29 -128
4310a28J29k44J14K3K6K68k33j26Q9L5J69K7l25K51N1p4k15M9N9K03RP7m6k53
$$ -128 1 -243 -129 -106 -80 188 -45 -171 -82 -47 122 149 -176 75 126 52 -163 -114 -55 148 157 234 188 -65
4334f5j00J58ql4L21l60J38n7J4q9m5Q5k4j81J10J99J14lKn4l91K52Nj83J89K71
$$ -65 -165 -7 -15 -49 272 -88 50 -7 7 -82 -127 -42 -66 -247 -137 62 176 173 175 121 -270 -18 -13 -196 -7 264
4360B64j16m0l35K16J63l70J56J64J94l74J59k11J00K62m09P5J37K9k85L46k34
$$ 264 148 108 -227 -11 152 -218 -62 102 296 -78 81 -130 -30 232 -177 -102 35 64 -221 125 -109
4381a09J41j45k0M5j31J68M8pL3q4L2j7Q5p6K39k40o0O6r7M23k36O5k60R3L1J23
$$ -109 32 -113 -133 -88 -219 -51 -3 -10 23 -61 -29 -46 39 -37 202 -38 -98 -32 -129 294 58 123 -137 -44 -13 110
4407A10J33k65p4J07j89L09Pj63K8J27j66J15k75J13N1J37o1P7%k13L75k93P6
$$ 110 243 -22 -96 11 -178 131 138 -25 3 130 -36 79 -196 -83 -32 105 44 121 121 -92 283 -10 66
4430F6m1Q5j32L5J37j34R2k00K5o8K15n5o0j53K86j95J40J39k00K88p4j49Q9m34
$$ 66 25 110 -22 13 150 16 108 -92 -67 -135 80 25 -35 -188 98 -97 43 182 -18 270 196 47 136 -298
4454b98M58Kk72n8Q6J03J34l47N15l41P5j50J31j49l4J87j63K97K9j77j92K30
$$ -298 160 162 -110 -168 -82 21 155 -192 323 -18 57 -93 38 -111 -145 42 -121 176 205 28 -164 66
4476F6j4r8K66l39Q3q4K84k96K42k35J06q2K19o8l8k9N7J6k62L54j30j06J03J75
$$ 66 52 -46 220 -119 -36 -120 164 -132 110 -125 -19 -101 118 50 12 -17 40 56 -206 148 18 -88 15 190
4500A90l66K32K1R1j76r0O4m5K03k32K32j64K0p8j05L01JJ25k12ok16K57o6K56
$$ 190 -176 56 77 168 -8 -98 -34 -79 124 -108 124 -40 -20 -98 -203 98 99 224 12 6 -210 47 -19 237
4524B37k68J10j29j37M43k54q8J45oL75l71qk12K12Q3K7k0j73K9J85l45o1L88
$$ 237 -31 79 -50 -187 256 2 -86 59 53 428 57 49 -163 49 132 159 139 -34 -5 180 -165 -226 162
4547A62r4M3N1jl52K68K04l16j86oJ21k02K24J74O8l79K04j47O3L7M7J82l19L10
$$ 162 68 111 162 161 -191 77 281 -35 -221 -227 -106 -308 -84 90 158 -221 -17 -164 -101 -64 -17 165 -154 156
4571A56k21K1Q1J1j49J08J50l09K00O4j51k2M6M9Q7K12m54K08k18Q7j17L63L1
$$ 156 -65 -44 37 48 -101 7 157 -152 48 112 -39 -61 -15 34 121 333 -121 87 -131 -44 -161 202 233
4594B33m29L07N5j65J69k08J42J03j59j99K60j55K74k13L0K18m57L04l3J3j32
$$ 233 -196 111 166 1 170 -38 104 207 48 -151 109 -46 228 15 45 263 -194 110 77 90 -42
4615d2L96j45r3j56O0r5L56k78K21k06K1j09J75j84JK25p1j41j16L10j19MM8J64
$$ -42 354 209 116 -40 20 -75 281 3 224 18 39 -70 105 -79 -78 147 76 -65 -181 129 10 14 62 226
4639B26k22O3j79M14n59L05k11k34K79q6K07m9K59j14j14K9Qn7K48m64L16o0N0
$$ 226 4 67 -112 302 -257 48 -163 -397 -118 -204 3 -46 213 99 -15 14 22 -35 213 -251 65 5 55
4662E5l85M34j56r0J10n5l78O12l59K03rJ64J21l28K97l44n9N8J58J1M9Q3j84
$$ 55 -330 104 -52 -142 -32 -87 -465 147 -212 -9 -18 146 267 -61 236 -108 -167 -109 49 60 109 192 8
4685Hk22J34M7J92l66kJ09J06j72L16M4l80j38K67n0J58m4m7jJ54k22R5k23J64
$$ 8 -214 -80 -33 159 -207 -209 -100 6 -166 150 194 -186 -324 -57 -107 51 7 -40 -41 113 -109 -14 -237 -73
4709g3J33or5j85Q1L05j46j6O8j5n9J62K5j34j41J97J2k25L11l44o5K85j32J95
$$ -73 60 54 -41 -226 -145 160 14 -2 66 51 -8 154 179 45 -96 101 113 -112 199 -145 -210 75 -57 138
4733A38M0j32J30l2m7k93k2K69M2K6J30q3k51J64k05K42j47K33k06Q3j85j69K09
$$ 138 178 46 176 144 97 -196 -218 51 93 119 249 166 -85 79 -126 116 -31 202 -4 79 -106 -275 -66
4756f6p1k4K24m6K16k28j87K36J25k73o6K05nr8p7J1K9J60j06K59Nk8l67R5K58
$$ -66 -137 -161 63 17 233 5 -182 54 179 -94 -160 45 40 -58 -135 -124 -95 65 -41 218 223 195 -172 -77 181
4781A81k18r8J50J33j75k30L76p4P5Kj10J81q6j78K4K61n36M19L4j23pk02K35
$$ 181 -37 -135 15 148 -27 -257 119 45 120 122 12 193 107 -71 -47 214 -322 97 131 8 1 -201 34
4804C4m02K56J36mJ06j89O9K19k61j08j37M75j60k6K54l60J11Pk14K30J4j49J53
$$ 34 -368 -112 24 20 126 -63 6 225 -36 -144 -281 194 34 8 262 -98 13 20 -194 36 50 -99 54
4827E4J93l75J47J11k06j81M56q8k84K66j73P6QQ1k18J1J66k98N2o8L74j28J16
$$ 54 247 -128 19 130 -76 -257 199 111 -173 93 -80 -4 4 85 -133 -122 44 -254 -202 -270 104 -24 92
4850I2j17R1j18L4J95j61J10Mk23q4M53k03l13K72p4l30K17K00Q2j79M4k7j42
$$ 92 -25 66 -52 -18 177 16 126 130 -93 -177 276 73 -240 32 -42 -372 -155 45 127 -52 -8 -35 -177
4873a77M41l20NL8j22J73M7k22j00O24k29k24j56K78l7j61J23p1K01j98N4N8l64
$$ -177 264 -56 -51 -13 -135 38 85 -137 -237 387 158 -66 -222 56 19 -142 -19 -90 111 -87 -33 25 -339
4896c39K55L5l05L21N8J03j99K6j8J7p8N15k65k74K02q7K90m38K82j30K03m54
$$ -339 -84 -49 -354 -33 25 128 -71 -45 -63 -46 -124 391 126 -148 54 -33 257 -181 101 -29 174 -280
4918b80K93j58p6L85j22j8pJ07p5l5j03j21o1K57j2J82KOJ71q5n11J04K12k5J14
$$ -280 13 -145 -221 164 42 24 17 124 49 14 -89 -210 -271 -14 -26 156 158 164 335 250 -261 -157 55 30 144
4943A44n25M43O9J56k37k56K27j10J6J88l18O14l14r1j33L55k58N4J28j31K3m47
$$ 144 -381 62 131 287 50 -206 21 -89 -73 115 -203 411 97 6 -127 228 -30 24 152 21 44 -403
4965d03N97k43J43m4o6J34K6j79j41L88K05l28k34L19l22K37j47J13o8P9p7J16
$$ -403 194 -49 94 50 -16 118 144 -35 -176 212 417 89 -145 174 -148 89 -58 55 -13 66 -11 105
4987A05k23j94L59k34K26j48J08j18J31n6N15k20L4l24J0R5j58K74l74L93j56
$$ 105 -118 -312 47 -187 39 -109 -1 -119 12 -44 471 251 285 -39 -29 66 -92 182 -192 201 45
5008D5L2p5m5K42l39m3K61p4K06m81K23n6j15M90k65j06j20L92k17K41k3k45J07
$$ 45 77 2 -43 199 -140 -183 78 4 210 -271 -48 -104 -219 271 6 -100 -220 172 -45 196 173 -72 35
5031C5k04L0R2K37l83M44m97L94j6k64J64P0n6o0k58K18J14K06j57k96J84n1K31
$$ 35 -169 -139 -47 190 -193 251 -246 148 132 -132 32 102 46 -14 -272 -54 60 266 109 -187 -3 -54 177
5054A77q2k47J34J26j22K86l02k02N07j95ok9J85m67J15J05j9R6l3J82k01L40
$$ 177 95 -152 -18 108 -14 272 -30 -232 275 80 74 45 230 -237 -122 -17 -36 60 27 209 8 348
5076C48m03j31K40k32n2M80l91J91j0k60J80l7qL6J32k55J45k16K78K31j76K4
$$ 348 -55 -186 54 -178 -230 250 -141 50 40 -220 -40 -77 -85 -49 83 -172 -27 -243 35 266 90 114
5098A14K07l00j51o4j0J26Q3j5R9K3k8M4k83J53O7n2R6r6Pk97J65m5q7J81K4P7
$$ 114 321 21 -130 -194 -204 -78 5 -10 89 112 84 128 -155 -2 65 13 109 13 20 -277 -112 -157 -244 -63 -39 38
5124C8N9k39P1P2r9K14j17p4j18oK19q4J45k11K76j82n0M08l08j78J17j3J58j14
$$ 38 97 -142 -71 1 -98 116 -1 -75 -193 -199 20 -64 81 -130 146 -36 -86 322 14 -164 -47 -60 98 -16
5148a6J83j01J76l05R4Q4j30K69k76j4j00rJ7K04J4l31j5R8J15Nq2L88m62P3J33
$$ -16 167 66 242 -63 31 115 -15 254 -22 -36 -136 -145 -128 76 90 -241 -256 -158 -43 -38 -120 268 -194 -121 12
5173A2l94L44k2O6l2RJ23j08o9Q0k10P3K91o2k38K44j36J84Q9m18K74l09M05k90
$$ 12 -382 -38 -60 6 -26 -17 106 -2 -71 9 -201 -128 163 101 -137 107 -29 155 244 -174 100 -209 196 -94
5197i4J48k8K6j74P9k24L0N21l23J26r3k41K11K5l8K28k41l96N16q7J2l2j92K94
$$ -94 54 26 52 -122 -43 -267 -237 284 -39 87 -6 -247 -36 -11 -49 179 -62 -458 58 -29 -17 -49 -241 53
5221E3j4L4k97J31k3o3K86J39n0m1k34l6L23k95k23J66j19K02m5L13k25J27j91
$$ 53 39 73 -224 -93 -116 -179 107 246 196 155 -79 -115 208 -87 -310 -144 -263 -61 -106 207 -18 109 -82
5244h2K42n1q8k95J12J10O7J07l11K27j44K07Nj20M0k36L65k10j64J50q4J26L05
$$ -82 160 109 21 -274 -162 -52 15 122 -189 38 -106 101 106 -14 26 -210 155 -55 -219 -69 -153 -27 278
5267B78j04j05n2R2M0k84L03k23J02L6J60m09N1m1L59p9l3k06L21j66m9j67J03
$$ 278 174 69 17 109 149 -135 168 -55 47 83 243 -166 -115 -156 203 124 91 -115 206 40 -9 -176 -73
5290g3R9O6J86j92J16K2k90N5K4K2m8j05K78o2r0R9j47j7j63J84J98j48j76K29
$$ -73 26 92 278 86 202 224 -66 -11 13 35 -13 -118 160 98 8 107 -40 -57 -220 -36 162 14 -162 67
5314F7l24k5M71j76K14l04O3q3N8J60q5l2KL09j93k35R4mj66K09L6q3j71K17l4
$$ 67 -257 -282 189 13 227 -77 -14 -97 -39 121 36 4 6 315 122 -113 -19 -23 -189 20 56 -27 -198 19 -15
5339a5M5J79m5N1m16n8L28k46J77K77l22j12j3K39Rl53N38j41r5J3L9O3m0J62
$$ -15 30 209 164 215 -201 -259 69 -177 0 277 -45 -157 -170 69 78 -275 263 122 27 40 79 142 102 264
5363B64j72J18j81rl37M17M9l5l6j86K15k1K42m19O7K2K75l51k15J57j90M56k39
$$ 264 92 210 29 20 -317 100 149 114 78 -108 107 86 328 -91 -24 -2 273 -78 -293 -136 -326 130 -109
5386a09L0J16j03j07L16j14j07o8K73j46QJ86k75J70j65J87l02J90%l1P2k27L84
$$ -109 -79 37 -66 -173 143 29 -78 -146 127 -19 -11 175 -100 70 -95 92 -210 -20 -20 -51 21 -206 178
5409A78j03j91J78j09P8l5l08K62J01K83l62L07k31J61l0R4k30k05J14J8k57J75
$$ 178 75 -116 62 -47 31 -4 -312 -50 51 334 -28 279 48 209 179 273 43 -162 -48 -30 -287 -112
5431a12K11M3m35P51k03k18J4K11r7m42K68l2k4O4p5m4J95j14L08k82mk03K84
$$ -112 99 142 -293 458 255 37 51 262 165 -277 -9 -41 -65 -1 -76 -120 75 -39 269 -13 -17 -220 64
5454F4j3L18n18P7r4M7K6J33l67L66M8k58m8J70j91J18J90k52K19N1K59j64j76
$$ 64 51 369 -149 -72 -166 -119 -93 40 -327 39 87 -171 -219 -49 -240 -122 68 -184 35 86 345 181 5
5477Ek62K80J55o7k49K88k01R9n1J15k71J81j1J28j29q8J52k82L38J4qR8j15o3
$$ 5 -257 23 178 111 -138 150 -51 48 -3 112 -159 22 11 139 10 -78 74 -208 130 144 136 234 119 56
5501E6J53l64K88k38Q4J80j96N3n6k36JL41l93L86O3k18K49k78J43j07m0K21p5
$$ 56 209 -155 133 -105 -21 159 -37 16 -40 -276 -275 66 -327 59 122 -96 153 -125 18 -89 -129 92 17
5524A7Q1l58M25J06m35J37k19oK71J50r6o5J37k90L98l86p9J19K49K5j82r3J46
$$ 17 98 -260 165 271 -164 -27 -246 -252 19 169 73 8 145 -145 253 -133 -212 -93 156 181 -1 -94 52
5547E2O7o9j18j69L33J56k2j43R2m08L68k40K19j98L38j92J19j39k34J75K75m23
$$ 52 119 50 -68 -237 96 252 230 87 179 -229 139 -101 118 -80 258 66 185 46 -188 -13 262 -161
5569a61J86Mj50J78J03j22k97L32j10m7K93j64j4j94M57l70J53L8K5l79Q7O3J77
$$ -161 25 29 -121 57 160 38 -259 73 -37 -84 209 45 31 -163 294 -76 77 115 140 -239 -152 -89 88
5592H8k83K61K9l8o6K29k92K16J29l32P1J01M9K16l87L1K6r0k5l26L40M34l26
$$ 88 -195 66 95 57 -9 220 -72 144 273 -59 12 113 162 378 -9 22 48 -42 -67 -393 -53 381 55
5615E5jP7j37O5jlr8j87rK78j22k9J67J32n33K91J50q4%l4K61n31L84k99j2J68
$$ 55 54 131 -6 59 58 55 -43 -230 -239 39 -83 -112 55 187 -346 -55 95 11 11 -23 238 -293 91 -208 -220 -52
5641e2J57m6L8j96J9O3j31J68R2J36k18Nk22M72q1k19K01j51k48K22M8r0J00k13
$$ -52 105 59 97 -99 -80 -17 -148 20 112 248 30 35 -187 285 204 -15 186 35 -213 9 57 -33 67 -146
5665a46J32P8k29M09k77N1J53k47jK08j26P2k97J51j7j88J67K47ol61M5o1J32
$$ -146 -14 64 -165 244 -33 18 171 -76 -77 131 5 77 -220 -69 -86 -274 -107 140 134 -227 -182 -243 -111
5688a11J48k08K98K0l68O7K97K2n7P4j40J16J01l42L53k59k56L46j25O7j34P7
$$ -111 37 -171 127 147 -221 -154 143 165 108 182 42 158 259 -83 270 11 -245 101 -24 43 -91 -14
5710a4R7j05Q2j91J32m2K0l4K93k80K30Lk30K3j6J8r3J94j76J80k34K24M6k17
$$ -14 83 -22 60 -131 1 -41 -21 -55 238 -42 188 191 -39 -16 -32 -14 -107 87 -89 91 -143 81 127 -90
5734i0J14K71k74k3K08j18P1m14N00j21k6K04l78J65k4k24L15n3Lo6j41N5l2J33
$$ -90 24 295 21 -2 206 88 159 -255 245 124 98 302 -76 89 65 -159 156 103 106 40 -101 -46 -78 55
5758E5N8k8j52N5p5J09J79k41jJ8N9j10j41M45m54K38N6Q5j41k98L92j32M1J38
$$ 55 113 85 -67 -12 -87 22 201 -40 -41 -23 36 -74 -215 230 -224 14 70 155 14 -284 108 -24 17 155
5782A55k65Q8l00L70j64M2K11n4N5O4o4l97M51m60K92J14k61J47r9Q7l5p1L01
$$ 155 -110 -22 -322 48 -116 -74 137 83 138 202 138 -259 192 -268 24 138 -123 24 -75 12 -23 -94 207
5805B07n6p5J05p8Q8k59o7K8J00m0K24l90L36o3j4n7j62R4j86J96j97J33K63l01
$$ 207 151 76 181 103 191 -68 -135 -107 -7 -47 177 -213 123 60 46 -11 -173 -79 -265 -69 -266 -133 130 -171
5829a71K75J4j08mN0n1k81L66J12Mj59J43p2m02J77oK56K12k11O8j01k72j5J39
$$ -171 104 118 10 6 56 5 -276 90 202 206 47 190 118 -284 -107 -113 143 355 144 212 111 -161 -176 -37
5853c7J35n5j30M4p1J93j86j05J26J33q3J10Q0p1l7k88L24J21j45j08j8J52j07
$$ -37 98 43 -87 -43 -114 79 -107 -212 -86 47 -36 74 154 83 46 -242 82 203 58 -50 -68 84 -23
5876b3K25m15J50m1K11R5j69J47j09J7j56L08l94r0M49k17j22J24m2J6j40n0R3
$$ -23 202 -213 -63 -104 107 202 33 180 71 88 -68 240 -154 -244 205 -12 -134 -10 -52 -36 -176 -226 -133
5899a33J58L54m48M6K20j76J85k90L9k12J83K82k25O7k65N1M5J74k2K0N2k8p7
$$ -133 25 379 -69 -23 197 21 206 -84 -45 -257 -74 208 -17 50 -215 -164 -119 55 33 53 105 77 0
5922@J46J24l99q5M69l61K53j03oj65n9K36k79L64j06p5n6R2j0j96J93J00m57
$$ 0 146 270 -129 -214 255 -106 147 44 38 -127 -186 50 -229 135 29 -46 -102 -10 -20 -216 -23 77 -380
5945c80L04L32l81J36j35J8O4J8P3J47j99j1J09o1j00L15l00j33L06k2j22O8l9
$$ -380 -76 256 -125 11 -124 -106 -42 -24 49 196 -3 -14 95 34 -66 249 -51 -184 122 100 -22 46 7
5968Gp9J89k13Q0l37O03j35j63J5p3o3M12k52r4L39l67K60r9m5k64J16M4J77j57
$$ 7 -72 117 -96 -16 -353 250 115 -48 -33 -106 -169 243 -9 -103 236 -131 129 30 -15 -279 -163 -119 58 -99
5992i9L65j97lj09j85K63J28Q7j82j50K22k02K9K17n3K29l18k33J52J07j9R6j66
$$ -99 266 69 66 -43 -228 35 163 250 68 -82 140 -62 -33 184 131 360 42 -191 -39 68 49 145 -21
6015b1L28l73l9M1N5l98L96K86j76J2o4K6p8L1J10q6r7K63k09p0r9j07N01l01
$$ -21 307 -66 -105 -64 -9 -407 -11 275 99 111 47 73 -5 26 136 50 -47 216 7 -63 -162 -269 232 -69
6039f9J66n9o8K3j44j40L26l5j97K14J49k25o8J36j43NQ7K15Q3l37J12j00O3j28
$$ -69 97 38 -30 -7 -151 -291 35 0 -197 17 166 -59 -127 9 -134 -129 -42 173 256 -81 31 -69 -6 -134
6063a34lnK71o9J94k64l13N34j63Kj8N3Q0j95K21j73J8j67o5k89Q7O38l04Q4J34
$$ -134 -137 -142 129 60 254 -10 -323 211 48 50 32 85 165 -30 191 18 36 -131 -196 -485 -398 240 -64 20 154
6088A54k63l82O40m9l15K85J4n2j90J52j78j16K62J74J6j65Q9k72L09j59j0k2
$$ 154 -109 -491 149 100 -215 70 84 32 -158 -6 -184 -300 -38 136 152 -13 76 -196 113 -46 -56 -78
6110g8J02j39m3K6J91j7o5j36K32q0R3l7j39k2K09r9n5j03M7j49N12l25l15O27
$$ -78 24 -115 -158 -132 59 42 -23 -159 73 -7 86 49 -90 -112 97 -2 -57 -160 -113 -262 250 -75 -390 237
6134B37k73J79k72K67j73K48k79J06M1ol8RQ1m91L57Q2p9n5PJ20L17m10K96m82
$$ 237 -36 143 -129 138 -35 213 -66 40 81 75 37 46 127 -364 -7 75 -4 -59 -52 68 385 -25 271 -211
6158b11R8N9j94L66l64O4K45k16O7o6K46k6K8o2M1j51j9K09k29K61l34K6q0J43
$$ -211 -113 -54 -248 118 -246 -182 63 -153 -86 -152 94 68 96 34 75 -76 -95 114 -115 146 -188 -162 -242 -99
6182i9l2K64P9o1j25k05K82j03k08q3J46J4K46o7J43m82R3K2K86Qj62P8j73M19
$$ -99 -131 133 212 151 26 -179 103 0 -208 -291 -145 -131 115 48 191 -291 -198 -176 110 118 -44 34 -139 280
6206B80j25M3n1l58L13j82l4J30nn0oJ42l00J78O0k9R7J12k79n5m5J08N7l3j6
$$ 280 155 198 147 -211 102 -80 -114 16 11 -39 -45 97 -203 -25 35 6 103 215 -64 -119 -164 -56 1 -32 -48
6231d8k5j9k7k03M82l18L90P9l45j34RJ3M7J97k46K28k63M6K75j47k0K7K26J73
$$ -48 -73 -92 -119 -322 160 -158 232 311 -34 -168 -159 -146 -99 98 -148 80 -183 -137 138 -9 -29 -2 224 397
6255C97m13j62j66M84j55m45M84k13K08J56j77j75L89j81J6n0j24r2J87r6J22
$$ 397 -16 -178 -344 140 -15 -460 24 -189 19 175 -2 -177 212 31 47 -3 -127 -219 -32 -128 -6
6276fk3p6P3Q9R3j34N1n5KJ4k85L7r9rM19j44L02n10L52k09L97m38K58o9l6p2
$$ -6 -29 -105 -32 57 150 16 67 12 14 28 -257 -220 -319 -328 91 -53 249 -261 91 -118 279 -159 99 30 -6 -78
6302g8K85j55o2q1K08m6q9O3P5j39K45N5l73k4P9P0K32k77KO0q2j9p6k17K81K15
$$ -78 207 52 -10 -91 117 71 -18 45 120 -19 226 281 -92 -116 -37 33 265 -12 -10 50 -32 -51 -127 -344 -63 152
6328A52j71k51m5K84P6q9M5R5k08N1J70J79l84K87l30J5L00k27j45R1j30K24p4
$$ 152 -19 -270 -315 -31 45 -44 1 96 -112 -61 109 288 -96 191 -139 -124 176 -51 -196 -105 -235 -11 -85
6351h5j02J76j15K65R4k80J25j37L9K98k52k25L30K7k34l0J11J78k59j00l7J0
$$ -85 -187 -11 -126 139 233 -47 78 -59 -20 278 26 -199 131 158 -76 -106 5 183 -76 -176 -213 -203
6373b03l7K59r6p2k10N64k95j5K43k88R4J85j36j91K98l56l1L16K04m17oL62j76
$$ -203 -240 19 -77 -149 -359 205 -90 -105 138 -150 -56 129 -7 -198 100 -256 -287 29 233 -184 -190 172 -4
6396dJ47p8K5q2L3j69K06l10K77J66m46M35j35K11m59K02k76J31J13O9J14j45
$$ -4 143 65 90 8 41 -128 78 -232 45 211 -235 200 65 276 -183 19 -257 -126 -13 56 170 25
6418B5R7J6L9j21J28m63M42j21m4J14j74J95j7k76L7K13M8Mk5j81K08j98Kj06
$$ 25 122 138 177 56 184 -279 163 42 -2 112 -62 133 116 -160 -123 90 138 142 117 -64 144 -54 -52 -158
6442a58J86M9l13J43K8o4Ml9K41j78L3J12l5j72J31J95J6j03l16N3L91k77J01
$$ -158 28 77 -236 -93 -65 -129 -125 -164 77 -101 -68 44 9 -163 -32 163 179 76 -240 -187 204 -73 28
6465B8M6j46L27k1k85j65L28p0l02K61J64l28K79J52m63J2J15Q0M7k97M52k10
$$ 28 74 -72 255 234 -51 -216 112 42 -260 1 165 -163 116 268 -195 -183 -68 12 59 -238 214 4
6487Dk67J17J68J47m47L00o3K61m7j19Q7J21M6k4j69Pj90M62n62J25L48n65r3
$$ 4 -263 -146 22 169 -278 22 -41 220 173 54 141 262 308 284 115 122 -68 394 -168 -43 305 -260 -353
6510c53J12L98l6L4q5l38L36j23N1Q9j35q8J6K54m30O36l21j00K06j16M05k81
$$ -353 -241 157 121 155 70 -268 68 -55 -4 85 -50 -138 -122 132 -298 338 17 -83 123 7 412 131
6532A31J4l08R6O3M4j61k5J57j14J43L49n74K00J31L9O8q8j0j74k54L40j46K77
$$ 131 145 -163 -67 -4 40 -121 -146 11 -103 40 389 -185 15 146 185 253 165 155 -19 -273 67 -79 198
6555A98o7q9m9j24K82k23N4j53KJ58j41k8L96p7k16l13N52J58l35k40O01o68O6
$$ 198 131 42 -7 -131 151 -72 -18 -171 -169 -11 -152 -180 216 139 -77 -390 162 320 -15 -255 346 -322 -256
6578b56J66j01J13J74j58L4k2K13j29r9J64L5N4j29P4m64J49L04j52J47m8p8L67
$$ -256 -90 -191 -78 96 -62 -28 -50 163 34 -65 99 134 188 59 133 -331 -182 122 -30 117 69 -9 358
6601C58m59J73R2k48K12j9j45k04M94l66K1O6K77o1p2k15K18K3l27J35P5j85J6
$$ 358 -101 72 164 -84 128 109 -36 -240 254 -112 -91 -25 252 191 119 -96 122 145 -182 -47 28 -157 -141
6624a41k16N14k82J34L08m66J10j07L47m00K44n4J02Qk14rp6K15k0K31k22L3j64
$$ -141 -357 157 -125 9 317 -149 -39 -146 201 -199 45 -9 93 101 -113 -122 -198 17 -3 228 6 39 -125
6647a25L27l26L71l95R5J17m6L07k69j57O05n27M0k71N16J11m11J07n3M0K3pn6
$$ -125 202 -124 247 -148 -53 64 18 325 56 -101 504 -23 17 -254 262 373 -38 69 16 56 79 72 16
6670A6J00J08j69o7j94J62q2K06r3RR2J60l73q8L55r7k44L92j32k52q2K85k65
$$ 16 116 224 55 -12 -206 -44 -126 80 -13 -4 88 248 -125 -213 142 45 -199 193 61 -191 -273 12 -253
6693b53K67q7L03k12J48l47r5O3K10J00N3%k27j45O2K70k68R5J38m1J51Q9n60
$$ -253 14 -73 230 18 166 -181 -276 -213 -3 97 150 150 -77 -222 -160 110 -158 -63 75 34 185 274 -286
6716b86N7J15J46j04r4K17j05J94j07j86L17j23K8k18L29J07n19L28j99p0k52
$$ -286 -229 -114 32 -72 -166 51 -54 140 33 -153 164 41 69 -149 180 287 -232 96 -103 -173 -425
6737d25L84L33n62K38J6J49j27J95m76N16j86Ol15K99j32k0K75l22J20J52M6J93
$$ -425 -41 292 -270 -32 -16 133 6 201 -275 241 55 61 -254 45 -87 -107 168 -154 -34 118 164 357
6759C57o49M37j42J56r9k96K25l0j09J57j2j84M35l03p0M6k43J55K94j81N4l4
$$ 357 -292 145 3 159 60 -236 -11 -41 -150 7 -5 -189 246 -57 -127 -81 -324 -169 125 -56 -2 -36
6781c6N5j07K11j78J13r8K0P5P1m7j19m10N27J64n40M07Q0k38J84J97n11K59l
$$ -36 19 -88 123 -55 58 -40 -20 55 126 79 -40 -450 77 241 -299 108 188 -50 134 331 -180 79 76
6804G6r3P9o9n4K3l06M54n8k39M6K48n3j91K82j98j12J80R0n3q2K00l95L11k21
$$ 76 -17 62 -7 -61 -38 -344 110 52 -187 -141 107 54 -137 145 -53 -165 15 105 52 -30 170 -225 86 -135
6828a35J27l98L86M5l15K46j57L57j37r6K65j49j05l6J36j18j49L49k2q6O8l13
$$ -135 -8 -406 -20 25 -290 -44 -201 156 19 -77 188 39 -66 -102 34 -84 -233 116 94 8 76 -237
6850b37K96oJ36j46n6J70p0j68K03k28l1K10l15K61j78J91J04l15K22PK09k03
$$ -237 59 53 189 43 -13 157 87 -81 122 -106 -137 73 -242 19 -159 32 136 -179 43 50 259 56
6872E6l82M71j60L1l18L71kj04M2J46o1o0O1j79L9Q2N7j82L8L25l74K89N2n14
$$ 56 -326 145 -15 16 -302 69 67 -37 5 151 90 30 91 -88 -49 33 90 -92 -54 271 -103 186 238 -276
6896b76L48Q8m97M01k34K17j26kL2J35J88q5m33K11K03K7j21k68L14k79R7K8K35
$$ -276 72 160 -337 64 -170 47 -79 -81 -49 86 274 189 -244 -33 170 197 76 -192 122 -157 -60 -32 203
6919B03k75K09k45J4J59j50J75NJ03o8j44m9mM3rL86k11l3j99k0J25M1Mo5O5l6
$$ 203 -72 137 -108 -94 65 -85 90 95 198 130 -14 -63 -67 -24 -33 353 142 109 -90 -110 15 56 60 -5 60 24
6945B4K16l32K33L9J69m91K20j97J44L37l33j3p5q3K57l22J96J57p8j93L32l06
$$ 24 240 -92 141 180 349 -142 78 -119 25 362 29 16 -59 -142 115 -207 -11 146 68 -125 207 -99
6967i9P9j30o5J94K54p3q2Q2j49L3j30K69l87J53j11K30j08K91l42O3j07p4L54
$$ -99 -20 -150 -215 -21 233 160 78 160 11 44 -86 183 -204 -51 -162 68 -40 251 -91 -28 -135 -209 145
6990A45j1j44N1J98n2j6k22m6K60r5Ok98K03O1J40n52O26l21K06J28k64J39l5
$$ 145 134 -10 41 239 187 171 -51 -97 163 68 74 -224 -21 40 180 -372 254 -67 139 267 3 142 107
7013A07L6k31Q0j1j84J89l0r5J16q6J84j87j98K24M00n03L49l07j3l5K33J4k18
$$ 107 143 -88 -8 -19 -203 -14 -44 -139 -23 -109 75 -112 -310 -86 314 -189 160 -147 -160 -195 38 52 -166
7036a66K32j82J1KJ18l58K69j05N46l60j01J7K52k80J27J02j24J08j45J34k59
$$ -166 66 -116 -105 -103 15 -343 -74 -179 367 7 -94 -77 175 -105 22 124 0 108 -37 97 -162
7057a62l19M79N6j4J1p7j78n1K30K01j20J89l24J12k0m7qj61K72Q2r8J09r2m1
$$ -162 -481 -2 54 40 51 -26 -204 -255 -25 176 56 245 -79 33 13 -34 -42 -203 69 151 53 162 70 29
7081B9k63J73n0J13mJ15j4k79M93j74k94M48j25l61R6l00L04Q5k91j2J88q4K17
$$ 29 -234 -61 -111 2 -2 113 99 -180 313 139 -155 293 168 -193 -97 -397 -93 -8 -299 -311 -123 -207 10
7104A0j01J18lm5K6r3o0J9L90l54R6R4k89K95l00M34k20K86j39k65K05R0l49J10
$$ 10 -91 27 24 -21 5 -88 -148 -129 261 -93 3 97 -192 103 -197 237 17 303 164 -101 104 194 -155 -45
7128d5Kn8J79j16N0m0O8m9j07J01J15k42J34r5P6k83L60j37K2L8j26J02k0M3J5
$$ -45 -43 -101 78 -38 12 -28 40 -9 -116 -15 100 -142 -8 -103 -27 -310 50 -87 -65 -27 -153 -51 -71 -28 -13
7153a3Q8l7k05RJ90m1m5J00L91o20O1L59l18J40k92K55j90P9J13N3q8j36J76p
$$ -13 75 38 -167 -158 32 -9 -54 46 437 -183 -122 237 -81 59 -233 22 -168 -89 24 77 -11 -147 29 22
7177B2J6n9J40m72K41L18m60K59J06j94M8q5J99l00j1K21n4j0N9Q8l85N46j87
$$ 22 38 -21 119 -353 -112 206 -254 5 111 -83 -35 -120 79 -221 -232 -11 -65 -75 -16 72 -313 233 46
7200D6p6j09L58j44Q2l18K74J13k04m89P14k93N2k07L08j6k0K22m42J63j88L27
$$ 46 -30 -139 219 75 157 -161 113 226 22 -467 247 -46 6 -201 107 91 71 293 -149 14 -174 153
7222A53l72K54K8j65K06k54K84k51n5J7L73j60k43N0p6K22M7L4n7J35J63l03k82
$$ 153 -219 35 63 -102 104 -150 134 -117 -172 -155 218 58 -185 -135 -211 11 58 92 35 170 333 30 -252
7245b52K24J88n07L62j7M03n87R3J28N3l3K4p5k31J7p2M88k62J92K1k20J93L6
$$ -252 -28 160 -347 15 -2 401 -186 -93 35 88 55 79 4 -227 -210 -282 206 -56 136 157 -63 130 166
7268A66j93j7K46j91p2J83k21L40l76J39M14m57J00m7K6K9j06R6k04L56l17J68
$$ 166 -27 -44 202 11 -61 122 -99 241 -135 4 418 -39 61 14 40 69 -37 59 -145 211 -106 62
7290F2k62P0J04K82n94L78J38Q3l62k2m7l1L34n1j77l8K94l13K39o1k3k93K41
$$ 62 -200 -130 -26 256 -338 40 178 261 -101 -123 -170 -201 133 82 -95 -133 161 -152 87 26 3 -290 -49
7313d9O8n0K59j00k18l9L79j4k69K36k07j7l80M93J4j61j51K96M7j15l57L20J37
$$ -49 19 -31 228 128 -90 -129 250 236 -33 203 -4 -21 -401 92 106 -55 -206 90 137 22 -335 -15 122
7336A22r3L57m07K5k44J94k1N53l00l31J67j59J48K59n23N1K59j12j01j50J72
$$ 122 29 386 -21 4 -240 -46 -67 486 186 -145 22 -137 11 270 -253 -202 57 -55 -156 -306 -134
7357a34R9j18Q6K09q2k20N0q0K52j08N8Oj32K09j38k5M2P5r2l6J0J07k0l07q2
$$ -134 -35 -153 -67 142 60 -160 -110 -190 62 -46 12 18 -114 95 -43 -68 -26 49 -43 -79 -69 38 18 -289 -371
7382c71q3L77K50m81K62Q8j80L84m33K52P8k26K1j34J95J92k51j65J35r6L61k91
$$ -371 -454 -77 173 -308 -46 42 -138 246 -187 65 143 -83 -62 -196 -1 191 -60 -225 -90 -186 175 -116
7404a16J19k50L9J80l1K58j91j25q0L45J9l7M5L2p7j80J35p6Oq0J01K29j07l69
$$ -116 3 -247 -208 -28 -59 199 8 -117 -197 148 167 130 175 207 130 -50 85 9 15 -65 36 265 158 -211
7428b11k6K90k1k2j76l7K18K6k6k9p9K7m8K75l14M5M2K4J80j21j65L3J78n5J05
$$ -211 -237 53 32 10 -166 -203 15 41 15 -14 -93 -66 -114 161 -153 -108 -66 -42 138 17 -148 -115 63 8 113
7453A13j97J2K79l85K92j36J80ol8j27K4L5j42J63k81J53P2m8k6k93J53k70O75
$$ 113 -84 -72 207 -178 114 -22 158 152 114 -13 11 46 -96 67 -214 -61 11 -37 -63 -356 -203 -473 202
7476B02o38O42l39o2M54o57K77J49K74n06M95j53r7n8n8m4K48j17J5J01k46j15
$$ 202 -436 206 -133 -195 259 -398 -121 28 302 -204 291 138 41 -17 -75 -119 129 12 27 128 -118 -233
7498b33Q9J70j03N8r3L33k96O7J5k06K35J10l61M6r3K83l88M20J82j45j77J03
$$ -233 -144 26 -77 -19 -112 221 -75 -8 7 -199 36 146 -215 -169 -262 21 -367 53 235 90 -87 16
7520A6j74J21O5j00L5J92j32k38K22J02o5k26J30m5J69n0j18J27l3j40L40K6k90
$$ 16 -158 -37 28 -72 -37 155 23 -215 7 109 44 -182 -52 -97 72 22 -96 31 -2 -142 198 224 -66
7543f6J72J04k40J2Q9k20K99j07R3M6j38M9O8j22n5J52n6k12o2J32Pj22L0l53
$$ -66 106 210 -30 -18 71 -149 150 43 136 182 44 93 161 39 -16 136 80 -132 -194 -62 -55 -177 -147 -500
7567e00M44p4K18j33K07L3k06K56n87M83k18O4j67MJ96%l9k9r1Q6J21J10j85j67
$$ -500 -56 -130 88 -45 162 195 -11 245 -342 141 -77 -13 -180 -176 20 20 -19 -48 -139 -53 68 178 -7 -174
7591a74R6N2j03K11M9m4k28L26o0k83K58l83J23o3L87j07K43O7l11M9l26K70K5
$$ -174 -78 -26 -129 82 131 87 -141 185 125 -158 100 -283 -160 -223 164 57 300 367 56 105 -221 49 74
7614G4l51L1K28K84l05J34l14J28k07M69l75K14rOq2MM23j36k09mK29k89LO8J01
$$ 74 -277 -246 -18 266 -39 95 -219 -91 -298 171 -204 10 1 7 -75 -71 352 216 7 3 232 -57 -54 14 115
7639A15j3j36L1J15j43J29om3j75O3k94O47m63J68j15O6j03L1n0L01j68j09L25
$$ 115 102 -34 -3 112 -31 98 92 49 -126 -63 -357 290 -173 -5 -120 -54 -157 -126 -176 125 -43 -152 173
7662A73l43l5K05k53L65l53L00k27K61o4r1O4N8J53l16L9K46r5K05j37k2M1j09
$$ 173 -170 -205 0 -253 112 -241 59 -168 93 29 -62 2 60 213 -103 -64 182 87 292 155 133 174 65
7685F5rQj01k83K08jJ62j6m0J6JR8k96L14j12Qk86m8K67j97P6J70P2k32J64l4
$$ 65 56 64 -37 -320 -112 -113 49 33 -7 9 10 108 -188 126 14 22 -264 -312 -45 -242 -166 4 76 -156 8 -26
7711b6J67j48rn9p6R1Q6N8m9j66j31M2M9J72k26J87j53K29m18L08J2K54l23k6
$$ -26 141 -7 -16 -75 -151 -60 26 84 35 -131 -262 -220 -171 1 -225 -38 -191 38 -380 -72 -60 194 -129 -155
7735a55L24j8j55L5Q3j92M5K87k10N6l21K98k89L39J6j02M9l30M21k07j15J10
$$ -155 169 151 -4 31 114 -78 -33 254 44 100 -221 77 -212 127 143 41 90 -240 181 -26 -141 -31
7757c1j0J02l97L4K51l6Q3Q5j66m9J49J53r5k1O1N2l33K44p1j36k09K66j8K09
$$ -31 -41 61 -336 -302 -51 -87 -4 81 -85 -134 15 168 73 52 113 165 -168 76 5 -131 -340 -74 -92 117
7781A17l23J41k47L98j79J58R9l61J63K6r9K13k11K70l8r6j0J65n5j67j00j48
$$ 117 -206 -65 -312 86 -93 65 164 -197 -34 -8 -107 106 -105 165 127 31 21 186 131 -36 -136 -284
7803b84L79k97J01j1K06j3r9M8p2N10l89R8k52K07k76R1J59P0j43J31k93J9n0
$$ -284 95 -202 -101 -112 94 81 -18 30 -42 468 79 177 -75 132 -144 -53 106 176 33 164 -129 -110 -160
7826a60o0k1J94L7J34k38J58k83P3n9K82r6n9j16j22M81j25j10k94K57K9J00K49
$$ -160 -220 -241 -47 -10 124 -114 44 -239 -166 -225 57 -39 -98 -214 -336 145 20 -90 -384 -127 -98 2 251
7849B51m41L7K56j1k70J86J9q0O2m8j0l9J14K40m11L84k97j3L6j49pJ2M01k55
$$ 251 -190 -153 103 92 -178 8 27 -53 9 -39 -49 -88 26 266 -145 239 -58 -71 -35 -184 -191 -179 222 -33
7873c3j39L10k52J77j53R8R0J4J1k39P5K29k32j92L82k5j11r8L71m71N7J20mk72
$$ -33 -172 138 -114 63 -90 8 98 112 123 -116 -41 188 -44 -236 146 121 10 -88 283 -188 -131 -11 -15 -287
7897b87O50n22J54R0k75J13N0n0K9M0Lj7o2n0L63k18J06k12J01r3M9J89j5p6J94
$$ -287 363 -159 -5 85 -190 -77 -27 -77 -48 -8 -5 -22 -84 -134 229 11 117 -95 6 -87 -38 151 136 60 254
7922B54k86J73l65L6M12k87j36M9K42m8o4J71j88O8j8n2j07K66j72J34j18pl2
$$ 254 -32 141 -224 -188 224 -63 -199 -150 92 44 -20 151 -37 31 13 -39 -146 120 -52 82 -36 -43 -75
7945g5M16po09L28J61k11K2L73m20J16k7O8l92M02j07O1j56R8K0Qk3k9k05K77
$$ -75 341 334 -275 53 214 3 25 398 -22 94 67 135 -257 145 38 99 -57 41 61 69 46 17 -188 89
7969H9J52l56J26N0p6J28j6j84L26l46k03L55k33K44k98L65k74L20l94L2K47P7
$$ 89 241 -115 11 61 -15 113 97 -87 239 -107 -310 45 -188 56 -242 123 -151 169 -225 -193 54 131
7991A31k5l15J92K3N6p5K9j72j45M46j67M4K02j95j63l3J64O3J35k86R6k27J52
$$ 131 106 -209 -17 6 62 -13 16 -156 -301 145 -22 22 224 29 -134 -167 -3 60 195 -91 5 -222 -70
8014g0j44M13Q2o6n81N28k64K07k55M20l09N2N1k10m5K20%L18o65K05K84m6k42
$$ -70 -214 199 281 215 -366 162 -102 105 -150 270 -39 13 64 -146 -191 29 29 347 -318 -113 171 125 -117
8037a17J63j52J69k48L14lk35L17k63m0j32K75J07l15P3k9R6j55J17k24M65l74
$$ -117 46 -106 63 -185 129 126 -109 208 -55 -95 -227 48 155 -160 -87 -116 -20 -175 -58 -282 183 -191
8059a91L7R6nJ30k9J29k43K24m11j7L41j02M0k42K20J54k2l06l9L13l8l00P7K22
$$ -191 -154 -58 -63 67 38 167 -76 148 -263 -280 61 -41 -1 -243 -23 131 109 -197 -236 77 39 -261 -184 38
8083C8K5k12K35q2R2m02L98p4P4j55R4l4j19P2j8L67l51J07q1j68L68k66M3P9
$$ 38 63 -149 86 4 96 -306 92 18 92 -63 31 -3 -122 -50 -68 299 -52 55 -26 -194 174 -92 -49 30
8107C0k38Q9J42j54K5K79k42J12K5j4q1m4r8J25q7J16j86K68n8j85J69k95M43
$$ 30 -208 -119 23 -131 -106 173 -69 43 68 54 -27 -71 -169 -44 -131 -15 -201 67 9 -176 -7 -302 141
8130A41n9j41j38J84j39L77J8j37rp6P9j06j2Q3n7p5K5R5R3j91N2j15J19J63k37
$$ 141 82 -59 -197 -13 -152 225 243 106 97 21 100 -6 -18 65 8 -67 -42 53 146 -45 7 -108 11 174 -63
8155f3L04m73K39J31J6m26j29L65l16L39oj41J93L02m94O3N4N4q3k4j4K66m2k24
$$ -63 241 -232 7 138 154 -272 -401 -36 -352 -13 -19 -160 33 335 -159 -96 -42 12 -71 -95 -109 157 115 -109
8179a09lP6J89l50J73K02q3M0Ql62J25N0
$$ -109 -112 -36 153 -197 -24 178 95 135 143 -219 -94 -44
8191d4
$$ Imaginary data points
##PAGE= N=2
##DATA TABLE= (X++(I..I)), XYDATA
0@%%%qK1k1K4m0M8o2Q6j04J28j60J95k41K94l44M08m88N71o65P72q92J028j179
$$ 0 0 0 0 -8 13 -8 16 -24 24 -38 48 -56 72 -88 107 -134 160 -184 224 -264 307 -358 414 -478 550 -629
26f29J346j534J740j966K218k495K798l132L499l899M342m826N353n937O578p282
$$ -629 717 -817 923 -1043 1175 -1320 1478 -1654 1845 -2054 2288 -2538 2815 -3122 3456 -3826
42c826Q064q930R891j0969J2181j3554J5130j6953J9094k1652K4763k8651L3679
$$ -3826 4238 -4692 5199 -5770 6411 -7143 7987 -8966 10128 -11524 13239 -15412 18267
55A8267m0459N0159o5297R2416j55868N63122M58592j084112k67109L65552M84063
$$ 18267 -22192 27967 -37330 55086 -100782 462340 920932 -163180 -430289 -64737 419326
66D19326K2764p4014k10314k84226j56583L65595M58586j5506n04231l04709J24242
$$ 419326 442090 368076 157762 -126464 -283047 82548 541134 525628 21397 -283312 -159070
77a59070K67874R6437M0385N677j21364k20534j6932K25625J85905q6626j88584
$$ -159070 108804 205241 245626 251303 129939 -90595 -107527 118098 304003 217377 28793
88B8793o6540Q7135J41327J48935K6581k21290l28621n5477K87765K45995r6223
$$ 28793 -37747 49388 190715 339650 366231 144941 -183680 -239157 48608 294603 198380
99A98380k32806o2958P6188N6361Q6499J33530n2161l22916k13023K18423L66379
$$ 198380 -34426 -97384 -21196 35165 121664 255194 203033 -119883 -332906 -114483 251896
110B51896M3597k33209j39033L280m6988k2813K00727K28702j23072l66584j02574
$$ 251896 295493 62284 -76749 -73469 -120457 -143270 57457 286159 163087 -203497 -306071
121c06071K90964K64384o3845k11537j01987r262J3119R8520J71763N3356j41749
$$ -306071 -15107 249277 185432 -26105 -128092 -137354 -124235 -25715 146048 199404 57655
132E7655j39663L6086J13196K6821k7594J3113m975r8880p8239Q7684J57222J0708
$$ 57655 -82008 -45922 67274 94095 66501 79614 74639 -24241 -102480 -14796 142426 153134
144A53134j49439j24372N306Q5889J05027O8121o7206j89028q7398J69029K24747
$$ 153134 3695 -120677 -115371 -29482 75545 143666 76460 -112568 -199966 -30937 193810
155A93810k2088k19402j09289J00127J38440O2108K2318l7010j44726j13952J07767
$$ 193810 171722 -47680 -156969 -56842 81598 143706 166024 129014 -15712 -129664 -21897
166b1897K29933M7917j84813j53706L6586R3992K1649J2844M4576l4682j46618
$$ -21897 208036 255953 71140 -82566 -45980 48012 69661 82505 127081 92399 -54219
177e4219p8276J21803J78859K0160j30278j13948k1680L6585Q0968J04190K1188
$$ -54219 -132495 -10692 168167 188327 58049 -55899 -77579 -40994 39974 144164 165352
188A65352j25130j41005K1668J48018Q1950n3218q6418m3820j6474K3366R1177
$$ 165352 40222 -100783 -79115 68903 150853 97635 11217 -32603 -49077 -25711 65466
199F5466Q0070m9011j34231n4912P1374Q4201K0805j7146l9079o7675k4480R1297
$$ 65466 145536 96525 -37706 -92618 -21244 62957 83762 66616 27537 -40138 -64618 26679
211B6679J16460k5375j51146q4957O8971J06069K8766l0726m3511n7766m2813
$$ 26679 143139 117764 -33382 -118339 -49368 56701 85467 54741 11230 -46536 -89349
222h9349M0728J02319L4066q9939j03993J865Q3779O6422J3044j9875m9672o9225
$$ -89349 -48621 53698 87764 -2175 -106168 -104303 -20524 45898 58942 39067 -10605 -79830
234g9830k2191P4419J07104K0451q4342q9842r042O0597P4553L8974l4837j04462
$$ -79830 -102021 -27602 79502 99953 15611 -74231 -83273 -22676 51877 90851 56014 -48448
246d8448q3637L9682J32372P6974n9438j14822n1130L4968O8768N3808J845o4380
$$ -48448 -132085 -92403 39969 116943 57505 -57317 -108447 -73479 -4711 49097 50942 -13438
258a3438p7031N30Q7276P6945j2732p1019n0970m904L0229N2705M2794j8550p6552
$$ -13438 -90469 -89939 -2663 74282 61550 -9469 -60439 -65343 -35114 17591 60385 41835 -34717
271c4717m7642M4520Q4230K5467n1598o3967k3582K0484M8918N3316J0612n7461
$$ -34717 -82359 -37839 46391 71858 20260 -43707 -67289 -46805 2113 55429 66041 8580
283H580p2696n222O8784O1650p153n2813m6040r797L0918O0379M2894k9454q3878
$$ 8580 -64116 -69338 -554 61096 53943 1130 -44910 -54707 -23789 36590 79484 50030 -33848
296c3848n0676L4481P1630L3785j9111m1142l5729r168L7999O0288J5757n7065
$$ -33848 -84524 -50043 21587 55372 36261 -4881 -40610 -49778 -11779 48509 64266 7201
308G201o8652m656N6079N4434J2644k4105m2849l4532P904M9812L8305k0740n3049
$$ 7201 -61451 -66107 -10028 44406 57050 32945 -9904 -44436 -36532 13280 51585 30845 -22204
321b2204k2479K4713L7742K0135j488k6608m2901k2547L0379N5704J8434l4418
$$ -22204 -44683 -19970 17772 37907 36419 9811 -33090 -55637 -25258 30446 48880 14462
333A4462m2238p941K3937K9933J6178j2577l9795l2877J5308N2841L6058j4564
$$ 14462 -27776 -35717 -11780 18153 34331 21754 -18041 -50918 -35610 17231 53289 38725
345C8725m3553l1401j222K4431L3917J5005k2788m2229j4323L2544M4976J0650
$$ 38725 -4828 -36229 -37451 -13020 20897 35902 13114 -29115 -43438 -10894 34082 44732
357D4732k9828m0125j8622J4002L6213L1237j452l4725l4130J304L1264K9092
$$ 44732 14904 -25221 -43843 -29841 6372 37609 36157 1432 -32698 -31394 -130 28962
369B8962n31k6565k8471o682K2169L5150J6054k1524m0652k1079J7824L6145J8354
$$ 28962 28431 1866 -26605 -33287 -11118 24032 40086 18562 -22090 -43169 -25345 10800 29154
382B9154j1373k6043j8297M204K3366K4692J04k7951l0257j371K8595K9465N675
$$ 29154 17781 -8262 -26559 -22355 1011 25703 25807 -2144 -32401 -33772 -5177 24288 29963
395B9963j9774k7346j3405J3729K9655J8271j4198l1119j6793J3321K7053J5740
$$ 29963 10189 -17157 -30562 -16833 12822 31093 16895 -14224 -31017 -17696 9357 25097
407B5097n923k2589k2587k877K2729K8602O283k3860k8686o250J9883K3846R070
$$ 25097 19174 -3415 -26002 -28879 -6150 22452 28735 4875 -23811 -30061 -10178 13668 22738
420B2738j2377k3668j5181Q808K6112J7803q753k4585j5950N599J9911J8631L130
$$ 22738 10361 -13307 -28488 -19680 6432 24235 15482 -9103 -25053 -19454 457 19088 22218
433B2218j6746k4193q457J8439K7194P829j7172k1966o584J2211J9189J1010q230
$$ 22218 5472 -18721 -27178 -8739 18455 26284 9112 -12854 -19438 -7227 11962 22972 14742
446A4742k2267j6310P863K3645J5818n153j8221j5683k899J2326J8797P707j3695
$$ 14742 -7525 -23835 -15972 7673 23491 18338 117 -15566 -18465 -6139 12658 20365 6670
459F670k0927n889J5810J9891O048j1464j8719j1833O359K0717J6636k911j8942
$$ 6670 -14257 -20146 -4336 15555 21603 10139 -8580 -20413 -14054 6663 23299 20388 1446
472A446j4819K377J5169J3209j80j3581j5042k748J4093J8184M793j2503j7913
$$ 1446 -13373 -10996 4173 17382 17202 3621 -11421 -14169 -76 18108 22901 10398 -7515
485g515q687O439J4449J0630j988j3352j2475M30J3820J3262q56j5077j5981j696
$$ -7515 -16202 -9763 4686 15316 13328 -24 -12499 -12069 1751 15013 14157 -920 -16901 -18597
499a8597J4856J8379N048j2815j7441o372J0116J5416O024q280j3164n699P291
$$ -18597 -3741 14638 19686 6871 -10570 -16942 -6826 8590 14614 6334 -6830 -12529 -5238
512e238J3055O982m471j2212r564n72R091J2284M396p733j3821n897O589J2219
$$ -5238 7817 14799 10328 -1884 -11448 -12020 -2929 9355 13751 6018 -7803 -13700 -7111 5108
526E108N512o058j2822p852M538J4083R963l478j4442j1236K490J2337J1250Q76
$$ 5108 10620 4562 -8260 -16112 -11574 2509 12472 8994 -5448 -16684 -14194 -1857 9393 10269
540A0269r909j1005j059J0239J1568J365q526r508k951N146R643P854k386j1718
$$ 10269 360 -10645 -11704 -1465 10103 11468 2942 -6566 -9517 -4371 5272 13126 10740 -978
554i78j0287K797J1628Q714k049r285r223j357Q531J0969K260r540j1813j216
$$ -978 -11265 -8468 3160 11874 9825 540 -8683 -10040 -1509 9460 11720 2180 -9633 -10849
568a0849R604J0280J657o928p906k753L474O895M899Pn598o053j203N000Q330
$$ -10849 -1245 9035 10692 3764 -4142 -6895 -3421 3474 8373 8380 2782 -3271 -4474 526 8856
583H856L497n465r795m484O238J1856M706n670j1627n992L371J0232P370k810
$$ 8856 12353 6888 -2907 -7391 -1153 10703 15409 9739 -1888 -7880 -4509 5723 13093 10283
597A0283j0805p864L819J1230N574n854r649m565K505N729N488J815l861o599
$$ 10283 -522 -8386 -4567 6663 12237 6383 -3266 -7831 -5326 403 5891 7706 3845 -2754
611b754k481K699N775K743j431m723l670O66O141N659K38o462p746k237N922R067
$$ -2754 -5235 -2536 3239 5982 4551 -172 -3842 -3176 2965 8624 8862 2400 -5346 -7583 -1661 7406
627G406L360o348r727j897N584P139k63n903n338j808K595O642L965q14o572o067
$$ 7406 10766 4418 -5309 -7206 -1622 5517 5254 -649 -5987 -7795 -5200 1442 5407 4593 -1979 -8046
643h046K5N778N617P81m335n234o54M509N953J618m452o754k860L849Q412M098
$$ -8046 -8021 -2243 3374 4155 -180 -5414 -6068 -1559 4394 6012 1560 -5194 -8054 -4205 4207 8305
659H305l759p741k912L651M783Q49k328k811j220M37K428L428J454k424n120k616
$$ 8305 4546 -3195 -6107 -2456 2327 3176 848 -1963 -3183 -2746 -318 3110 4564 2140 -2980 -5596
675e596J681M329L323m09k721l705j606L415O167J600n688o561n0P070O653p7
$$ -5596 -3915 414 3737 3328 607 -3098 -4704 -1289 4878 6478 790 -5771 -5821 1249 7902 7825
691G825n542o052j07M735N126j52l643k947l39K166K975J544j625m040l152J171
$$ 7825 2283 -3769 -3876 859 5985 5833 2190 -757 -1096 1070 4045 5589 3964 -76 -3228 -2057
707b057M194K052n49k075k256j841Q14L960L381j726o053k270L549M732K119k557
$$ -2057 2137 4189 3640 1565 -691 -2532 -1718 2242 5623 3897 -2156 -4426 -877 3855 5974 3417
723C417l781k093Q45L361L418l93l295l290j72L206K757M16k915l601q54K539
$$ 3417 -364 -2457 -1612 1749 5167 4774 1479 -1811 -1983 1223 3980 4396 1481 -2120 -2974 -435
739d35L204J025j755k741k671L94L818L043p44m534l329J636L996K693j643l149
$$ -435 2769 3794 2039 -702 -3373 -2979 839 3882 3138 -1396 -4725 -3089 907 3600 1957 -1192
755a192k334J090K340K194k60j710k212o39J765J910Q42j087j447q29j07Q17K431
$$ -1192 -3526 -2436 -96 2098 1838 128 -2084 -2723 -958 952 1794 707 -740 -1569 -1676 -859 1572
772A572O36j042k999j782J500L669J999k179l884k072K497L391J303j497k698
$$ 1572 2208 1166 -1833 -3615 -2115 1554 3553 1374 -2510 -4582 -2085 1306 2609 1112 -1586
787a586j979P98K952K477q64l186j752J239K234J527O1j609j721o39J546K306
$$ -1586 -3565 -2767 185 2662 1798 -1388 -3140 -1901 333 1860 1921 312 -1409 -2048 -502 1804
803A804M75q65j988j385Q01J991J497j19k682k106Q60K163J643l81j294j856k79
$$ 1804 2279 1414 -574 -1959 -1158 833 2330 2211 -471 -2577 -1717 446 2089 1708 414 -1442 -1721
820a721J309K257R14j768k369n14J496J990O70n86j591j284k14K259K016k83k094
$$ -1721 -412 1845 2759 991 -1378 -1892 -396 1594 2264 1678 87 -1197 -1411 848 2864 2581 487
837D87k357L44J615K130k1j664j941n84J629J914O78j220j792m55R53J749O74
$$ 487 -1870 -1526 89 2219 2198 534 -1407 -1991 -362 1552 2230 1010 -782 -1237 -284 1465 2139
854B139j223j251j213j1J744J483m81n17j120l55K68J484P86q08j885q69J001
$$ 2139 916 -335 -1548 -1559 185 1668 1187 670 -450 -805 -537 947 1733 925 -960 -1829 -828
871h28J571O64k54j480j232K35J754J243M61j952j509L9J272J259j70r98j614
$$ -828 743 1407 1153 -327 -1559 -1324 430 1673 2134 182 -1327 -1288 -16 1243 1073 75 -1539
888a539l30J482J508L22o54j311p07K02J235R19k97j384p57R4J228J052k62n14
$$ -1539 -1869 -387 1121 1443 789 -522 -1229 -1027 208 1127 830 -554 -1311 -1217 11 1063 801 287
906B87j140m07Q64J159N39q43q91p77L46P09O43n2r76q01P71J108Q90j10j014
$$ 287 -853 -1260 -396 763 1302 459 -432 -1209 -863 -154 489 437 -539 -1340 -569 539 1429 1319 305
925C05q45o85Q51N39P93m88j354k88P90J130L72o08q69n12K05R91Q06k80j129
$$ 305 -540 -1225 -374 165 958 470 -884 -1172 -382 748 1120 512 -357 -869 -664 327 1133 853 -276
944b76j033K30O78R21J11o59l12n16N28R86M90p50p26j028O26P17O39K79n48j234
$$ -276 -1309 -1079 -401 520 631 -28 -340 -856 -328 658 1148 398 -328 -1356 -730 -13 626 905 357 -877
964h77j65J328O24k4r11p34R9M99P61K15n18q81k95L74Q21M72j49p94n24P9Q53
$$ -877 -1042 286 910 886 -25 -759 -660 -161 600 815 297 -584 -879 -505 316 788 639 -155 -679 -600 253
985B53M60j10r38l90o9Q08N41M16o38m18o10M71Q45O8Q3j217j11J9N66O51q1q17
$$ 253 713 603 -335 -725 -794 14 555 971 333 -85 -695 -224 621 689 772 -445 -556 -537 29 680 599 -218
1007b18o36N25M59M80K70l67p37j80rP52L10m94m22n74O34P54J29k56l82m94o9
$$ -218 -854 -329 130 610 880 513 -224 -404 -413 339 649 155 -267 -841 -207 547 676 420 38 -456 -525
1028e25O53P40n26l98k56K31j62P81J19l06n92k29M03N35K78n02k94k51m62Q07
$$ -525 128 868 342 -56 -312 -81 -243 538 657 351 -241 -470 -67 468 746 244 -50 -301 -763 44
1048D4P36j61k32q33Q6M42M9m8J29n14l37Q9P03L51j98k90l88J4J37P14j71n68
$$ 44 780 619 387 -446 -360 82 131 83 212 -302 -639 -550 153 504 306 16 -372 -358 -221 493 322 -246
1070b46k34K40K98J68j22m06K3J27j65L76K04r1n20k33M33R6N60m44L1n95J49
$$ -246 -480 -240 58 226 104 -302 -279 -152 -317 59 263 172 -348 -581 -148 -52 508 64 95 -500 -351
1091c51L64O28l34j70r67K87L56J12J3M14m52l82N13K15M07o64j58K4K16n4K42
$$ -351 13 641 307 137 -830 -543 -187 -75 -62 352 -100 -482 31 246 653 -11 -169 -145 71 17 259
1112B59J85k65p06K36L80N32n76J96m72K53J84L3k5K67q57NL05K20K83p6l43n29
$$ 259 444 179 -527 -291 89 621 45 241 -231 22 206 239 214 481 -376 -371 -66 154 437 361 18 -511
1134e11L70K82L21Lm18l39K93Q9J38J64n80L10k49q8L27o5J01J68l90j29L14l
$$ -511 -141 141 462 465 47 -292 1 90 228 392 -188 122 -127 -215 112 47 148 316 -74 -203 111 108
1156A08L07o00k18K43K51L63k95j32m3n78N68K78J66k80m19p7K03M94r3p9j94
$$ 108 415 -185 -403 -160 91 454 159 27 -16 -594 -26 252 418 138 -281 -358 -155 339 246 167 -27
1177b7o3l57M63J43O5k20j37r3m4K44L30k99l72o0K18N50j22J20n25j59K09M8
$$ -27 -90 -447 16 159 224 4 -133 -226 -270 -26 304 5 -367 -427 -209 341 219 339 -186 -345 -136 -88
1199h8K76k0j96j99m8J15J28K86k78j17l20L98J13K66p9m98l7K71rL60K0j76l47
$$ -88 188 168 -28 -227 -275 -160 -32 254 -24 -141 -461 -63 50 316 237 -261 -298 -27 -36 324 344 168 -179
1222a79j11L45k1J45n47K26j52M02J17Nm46o6J20J57J32p1L31l93M4LQ0j9N4l77
$$ -179 -290 55 34 179 -368 -142 -294 108 225 230 -216 -282 -162 -5 127 56 387 -6 38 41 121 102 156 -221
1246b21j93K72L0M32m36RK6j19J05P03n03k74j36L79j23j2L93Kl65J27l81M38
$$ -221 -414 -142 -112 320 -116 -107 -81 -200 -95 608 105 -169 -305 74 -49 -61 332 334 -31 96 -285 153
1268A53K6l48M0L2j20l6Q7J05J13j85J26R9l0O2M5k19l64K86L22J57k01k65j07
$$ 153 179 -169 -129 -97 -217 -253 -166 -61 52 -133 -7 92 62 124 169 -50 -414 -128 194 351 150 -115 -222
1291b22n3K20L14j81m3j72L8K35j77j56l5M9k5j42M69lJ17k08j15J38l34M07o0
$$ -222 -275 -55 259 78 35 -137 -99 136 -41 -197 -232 -183 -208 -350 119 116 233 25 -90 48 -286 121 61
1314F1n2j97J61n5R1L9j78j11J26k7K31M06n09k97K70oJ22K5N8j92pj05j34M38
$$ 61 9 -188 -27 -82 9 48 -130 -241 -115 -142 89 495 -14 -311 -41 -47 75 100 158 -34 -41 -146 -280 158
1338A58j05r9J35j26j51K79j63M8O3j0j01P5J25j87M3j91L4L43j70p9L39l29m5
$$ 158 53 -46 89 -37 -188 91 -72 -24 39 29 -72 3 128 -59 -16 -207 -173 170 0 -79 260 -69 -114
1361a14j3J10K14o9n4K1l9j30J46Q2j68rj88K98M1j6k76L7K47k04j14K93k37r6
$$ -114 -127 -17 197 128 74 95 56 -74 72 154 -14 -23 -211 87 128 112 -164 -127 120 -84 -198 95 -142 -238
1385b38l3n4K47L49r5m80K39L0M99n26K50j22K54o37L06L14k25l97M05l5n6kM3
$$ -238 -271 -325 -78 271 176 -304 -65 -35 464 -62 188 66 320 -317 -11 303 78 -319 86 51 -5 -7 36
1408C6J8K13l03J79j58J8J77j51n5o7M91j88k67j27J70J39l78M01j84K37K03n73
$$ 36 54 267 -36 143 -15 3 180 29 -26 -93 398 210 -57 -184 -14 125 -253 148 -36 201 404 -169
1430a69j68O09m96J69J47j48o6OM66j62J2O4k16J12k35R1k91M55r4m32N67l45
$$ -169 -337 272 -224 -55 92 -56 -122 -116 350 188 200 264 48 160 -75 16 -275 180 86 -346 221 -124
1452a24j60M42k61M8J48j38k0K64J5k23o8K02k32J70Lq2M47l15l60J74k16L41
$$ -124 -284 158 -103 -55 93 -45 -65 199 214 -9 -77 125 -107 63 66 -16 431 116 -244 -70 -286 55
1474E5k63K50K07k51L7j13P7L50q6m06J27k4J92k06J48r9o6R2k69J0L16L1k13
$$ 55 -208 42 249 -2 35 -78 -1 349 263 -143 -16 -40 152 -54 94 -5 -71 21 -248 -238 78 109 -104
1497a04Q8n0P2n7QJ11k93L01K18l38J1q8M34j68l60R6J48J10m05L93l4N0r8r7
$$ -104 -16 -66 6 -51 -43 68 -225 76 294 -44 -33 -121 313 145 -215 -119 29 139 -266 127 93 143 45 -52
1521e2N20o96K91j12k12P3j12J41L59k63PK33j5k62k05K81k19l5L38k0J06j50
$$ -52 468 -228 63 -49 -261 -188 -300 -159 200 -63 -56 177 162 -100 -305 -24 -243 -278 60 40 146 -4
1543dj34K07o4l5M2L16k06j07o3o1M44j75k54Q2J0o5K19Mm32L78j86j94O51l73
$$ -4 -138 69 5 -30 12 328 122 15 -48 -109 335 160 -94 -12 -2 -67 152 156 -276 102 -84 -278 373 0
1567@j92J41J29Lp8j22J37q1j00M69l65J54J08n6k84L09Nj19k93L55j76J37j86
$$ 0 -192 -51 78 81 3 -119 18 -63 -163 306 -59 95 203 147 -137 172 177 58 -235 120 -56 81 -105
1590a05O5k06J70J41n15O57k14Jj68L54p2j85j42L10p9q8J53k63K38J41l3k39
$$ -105 -40 -246 -76 65 -450 207 -7 -6 -174 180 108 -77 -219 91 12 -76 77 -186 52 193 160 -79
1612g9J91l88K54M06m92J25NP3KP4j6j50L2j84L81l67K49j39J8j4R6o4J00k72
$$ -79 112 -276 -22 384 -108 17 22 95 97 171 155 5 37 -147 234 -133 116 -23 -5 -19 77 13 113 -159
1636a59K30n4m02L65J77l15L51j53k62P5L50j81j97J91j70K14K76j67k99K7jL06
$$ -159 71 17 -385 -20 157 -158 193 40 -222 -147 203 22 -175 16 -154 60 336 169 -130 -103 -104 202
1658B02o8m28P1J33j7l7m4L95k41k3j90L76J37k25k40M68k52m3o6L4K02j65n3
$$ 202 134 -294 -223 -90 -107 -144 -188 207 -34 -57 -247 129 266 41 -199 269 17 -26 -92 -58 144 -21 -74
1681g4J56l98J62K21p7M0K8K51m52Pk8L33k26n2J0OO8k00K52K00k29o8j38K37
$$ -74 82 -316 -154 67 -10 30 58 309 -143 -136 -164 169 -57 -109 -99 -93 -25 -225 27 227 -2 -70 -208 29
1705B9J57m21M08m2k15j3o9m0K31j7K97j34j13j67L2K87k92J50K37m31K12L8j39
$$ 29 186 -235 173 131 -84 -97 -166 -206 25 8 305 171 58 -109 -77 210 -82 68 305 -126 86 124 -15
1728a5K56m91K02j6j09R5j63L72j24J26q9k69M24l12o5K97l54J19K35j15n3J33
$$ -15 241 -250 -48 -64 -173 -78 -241 131 7 133 44 -225 199 -113 -178 119 -235 -116 119 4 -49 84
1750H4l52M78j49r7K2j16J54M4J13l84J59mK36j74J52k14K15k51J38J43k83K04
$$ 84 -268 210 61 -36 -14 -130 24 68 181 -203 -44 -48 188 14 166 -48 167 -84 54 197 -86 118
1772A18m1l32N43k34j2m30M47Nj08j75K31Q7k4Qk84K20N2l4j10j82L16n5k75l1
$$ 118 77 -255 288 54 42 -388 59 64 -44 -219 12 99 75 83 -201 19 71 37 -73 -255 61 6 -269 -300
1796c00M15K7j87P0M7j2L6q8Q9P1m37O30k39j22RJ6M2P4k01J99P0k57qJ74q8k34
$$ -300 115 142 -45 25 72 60 96 8 97 168 -269 361 122 0 9 25 67 141 -60 139 209 -48 -56 118 30 -204
1822b04J45r6L3J81m16N23l63M19m81M76p9N1l41J76M9k30L78l53K03R8Q1o05
$$ -204 -59 -155 -122 59 -357 166 -197 222 -259 217 138 189 -152 24 73 -157 221 -132 71 169 250 -355
1844c55O27k34J8j2m91M00J23p3j31J18K48m55K09R0k84K17j75L01n7mn6J73l64
$$ -355 272 38 56 44 -447 -47 76 3 -128 -10 238 -217 -8 82 -202 15 -160 141 84 80 24 197 -167
1867a67L39m29Q4K19K26l16J51j15q1K05k3J5j19j15O7j2J02j26N7K21m15L10
$$ -167 172 -257 -173 46 272 -44 107 -8 -89 116 93 108 -11 -126 -59 -71 31 -95 -38 183 -232 78
1889G8k32n3J96J07j36J26J07l6m59lJ22K51rK8k44K06J1K5m32M36j12j06R2q4
$$ 78 -154 -207 -11 96 -40 86 193 157 -302 -305 -183 68 59 87 -157 49 60 85 -347 89 -23 -129 -37 -121
1913a21K9J93Pk99N1Q5J38k18P9J83k29O4j2J49K7l69N45l59qj07K22J00k50k85
$$ -121 -92 101 108 -191 -140 -55 83 -135 -56 127 -102 -38 -50 99 126 -243 302 -57 -65 -172 50 150 -100 -385
1937c85J63M37j59j9J8k73l5K15R2q6O4j46J29j91K5j0J15K23p1j13k58M19l60
$$ -385 -222 215 56 37 55 -218 -253 -38 54 -32 32 -114 15 -176 -151 -161 -46 177 106 -7 -265 154 -206
1960b06Q3P5J53q8j43L28l82K41Q9k12j29J72O6k6J96o0j38j23K1M1J57J3k64
$$ -206 -123 -48 105 17 -126 202 -180 61 150 -62 -191 -19 47 21 217 157 19 -104 -83 -42 115 128 -136
1983a36%rj2L09P6o46N57k32J33j29L05k7m04J94J61k50Q3j48L15j47L04l14q8
$$ -136 -136 -145 -157 152 228 -418 139 -93 40 -89 216 189 -215 -21 140 -110 -27 -175 140 -7 297 -17 -105
2006a05O3P7k66K66Q8j37j62J46K27k20k11J54O1L5J24l86L65j40j33K39k53L15
$$ -105 -42 35 -231 35 123 -14 -176 -30 197 -23 -234 -80 -19 16 140 -246 119 -21 -154 85 -168 147
2028A47j73J32j07L6pK5Q8k95J02o7N9L7N7l21K58k1j68L56q6m1j90J2J61K46
$$ 147 -26 106 -1 35 28 53 141 -154 -52 -119 -60 -23 34 -287 -29 -50 -218 138 52 11 -179 -167 -6 240
2052B40l75J20K20l54r4J49o3K79l04J9J43J00q1J2J76l02j4j55K1N77j50l74
$$ 240 -135 -15 205 -149 -243 -94 -157 122 -182 -163 -20 80 -1 11 187 -115 -129 -284 -263 314 164 -210
2074b10K44J83j48O3k15J54k16k02M17L1l75J69L33n15K66j99J13K35K19j45j29
$$ -210 34 217 69 132 -83 71 -145 -347 70 101 -274 -105 228 -287 -21 -220 -107 128 347 202 73
2095G3k04J30k02L89l89PL20k67J49R7J45m28J17k72j0L26M12m83K41L3l08L34
$$ 73 -131 -1 -203 186 -203 -196 124 -143 6 103 248 -180 -63 -335 -345 -19 393 -90 151 184 -124 210
2117B10m78L01K17k73o5kj5R1j14J26j08K88m09K89p2r2J82J66n48M61j00p3Q0
$$ 210 -268 33 250 -23 -88 -90 -105 -14 -128 -2 -110 178 -231 58 -14 -106 76 242 -306 155 55 -18 62
2140F2j22L03l08P6O9K8J46jp9J2o6m9m5n1L6j61J20J19J63m29N26n26L22J29
$$ 62 -60 243 -65 11 80 108 254 253 174 186 120 71 26 -25 11 -150 -30 89 252 -177 349 -177 145 274
2164B74k5Kl92K51N3k2n91N13lL1J28l71N61l28j05J54j1M2j44j68J90k63N42
$$ 274 249 251 -141 110 163 141 -450 63 60 91 219 -152 409 81 -24 130 119 161 17 -151 39 -224 318
2187C18j57k68K57r3j1m2O9m2k31K97L8K33k80k55P4J72j53l0O0j04J76j52K08
$$ 318 161 -107 150 57 46 4 73 31 -200 97 135 368 88 -167 -93 79 -74 -104 -44 -148 28 -124 84
2210H4o6k23L69k72l6j0L4K26j28j40mN77n65K13j71L10m0m2j74K55n7j70Q1j38
$$ 84 18 -205 164 -108 -144 -154 -120 106 -22 -162 -166 411 -154 59 -112 198 158 116 -58 197 140 -30 51 -87
2234h7J60j16l7j35J25N5j01J81J55j71j43L3J84j47L76m00K0K5K2J43k20K54
$$ -87 73 -43 -80 -215 -90 -35 -136 45 200 29 -114 -81 103 -44 332 -68 -48 -23 -1 142 -78 176
2256A76j01p3L5j07J41j18j11J5J98J07l20o3J22J71M6MpJ0r3J24j57J1p1J98
$$ 176 75 2 37 -70 71 -47 -158 -143 55 162 -158 -221 -99 72 118 122 115 125 32 156 -1 10 -61 137
2280A37m12K23j06K40J52j11m1k63K13j25k3J92j68Q0qN5j97L01k46L74k8k62
$$ 137 -275 -52 -158 82 234 123 82 -181 32 -93 -116 76 -92 -12 -20 35 -162 139 -107 267 239 -23
2302b3J14j07K65l28L89l70l9N9J16m9J31j87k41N15m89J96R1K52p3pl30J79j62
$$ -23 91 -16 249 -79 310 -60 -99 -40 76 27 158 -29 -270 245 -244 -48 43 295 222 215 -115 64 -98
2325i8J55Q2j93k11M29k29k5K25j16o8J0J59j31J56j91J53j16k82L09M4L09o78
$$ -98 57 139 -54 -265 164 -65 -90 135 19 -49 -39 120 -11 145 -46 107 -9 -291 18 62 371 -307
2347c07J41J79P4o1k99L17Jk38N34j87Q6j22l41N26j94k2M1j80r4j81M76m3k0
$$ -307 -166 13 87 26 -273 44 45 -193 341 154 240 118 -223 303 109 87 128 -52 -146 -327 149 106 86
2370H6O4j44n4Q8K07l43J55P3j19J1K11k15k63J28R0J55l30m9M04m67K66m4L64
$$ 86 150 6 -48 40 247 -96 59 132 13 24 235 20 -243 -115 -25 130 -200 -249 155 -312 -46 -90 274
2393B74l27J27p8j6J02k4j0j70K26j49P0j92J70O4j95N7J51j09J11m7M3r8k09
$$ 274 -53 74 -4 -20 82 58 48 -122 104 -45 25 -167 3 67 -128 -71 80 -29 82 35 78 -20 -229
2416b29J94k08M3O07l60L8P5j26O9O4j38j85J9L50J73m94JJ04j14K6K37n3p0K55
$$ -229 -35 -243 -200 407 47 85 160 34 103 167 29 -156 -137 213 386 -108 -107 -3 -117 -91 146 93 23 278
2440B78m80J20lJ98j08K79k65K5M1l66K24j3J67n2k04L6k84M18Q4j30K11l29J41
$$ 278 -202 -82 -85 113 5 284 19 44 85 -281 -57 -70 97 45 -159 -123 -407 11 95 -35 176 -153 -12
2463a2M3K27l37J83Q8j94O2k4R5J66k51J68j87k03q2L2O5K87k00r8L68k56L59
$$ -12 31 258 -79 104 192 -2 60 36 131 297 46 214 27 -176 -258 -226 -161 126 -74 -172 196 -60 299
2486B99Qm0j88j94J93J7j59j70K35O1J63l63K18m6j33P8j60J09j66L59k41n2K44
$$ 299 307 267 79 -115 78 95 -64 -234 1 62 225 -138 80 34 -99 -21 -181 -72 -238 121 -120 -172 72
2509G2k83N8K90p6O8k13K89k34j89J0L36r9n0k58L95pr8kk44M27p2l14J34J84
$$ 72 -211 -153 137 61 129 -84 205 -29 -218 -208 128 29 -21 -279 116 109 11 9 -235 192 120 -194 -60 124
2533A24j55J23l63M74k88M8J85j24J7o1j2L50n75K99p2j96K88l29K83j25L07r8
$$ 124 -31 92 -271 203 -85 -37 148 24 41 -20 -32 318 -257 42 -30 -226 62 -267 16 -109 198 100
2555A00j31o8N6J54L1j34l7K88j79k47J61k12j45J37M0L33j71m8RR4P0P6j54J96
$$ 100 -31 -99 -43 111 142 8 -29 259 80 -167 -6 -218 -363 -226 -186 147 -24 -72 -63 31 101 177 23 219
2579B19J77l53j65L61k53p9J92J64k85J78j14K91l18R4Kj34m2J44j99K28J3m6
$$ 219 396 43 -122 239 -14 -93 99 263 -22 156 42 333 15 109 111 -23 -65 79 -120 108 121 75
2601G5ll76M45R4k38j34L5M9N0RL2Ql5j26O2j78J95J21J08j92M2J31N4j71L3l49
$$ 75 72 -304 141 235 -3 -137 -102 -53 -3 6 38 46 11 -115 -53 -231 -36 85 193 1 43 174 228 57 90 -259
2627b59N65k74Q4J39l02k24K15N5j01M34k67l21K10N8n9r9O3K6K19l8n5J67l24
$$ -259 306 32 116 255 -47 -271 -56 -1 -102 332 65 -256 -46 12 -47 -146 -83 -57 162 124 69 236 -88
2650h8K74k30k2j57J68K25k51M19k88j47K52k71K95m74N9K32Q3n06L94jO2K14
$$ -88 186 -44 -66 -223 -55 170 -81 338 50 -97 155 -116 179 -295 -236 -4 79 -427 -33 -34 28 242
2672B42r0j18J10Ok40P5O7J72k32J90l21K33J5J1P3m53N26m22L11Lj81Q0Q0J13
$$ 242 152 34 144 150 -90 -15 52 224 -8 182 -139 94 109 120 193 -260 266 -156 155 158 -23 57 137 250
2696B50l95R1R5K39l05j62J97J90j60j28j52K64m6L9L6jn4k7J90J48n4m16L01
$$ 250 -145 -54 41 280 -25 -187 10 200 40 -88 -240 24 -22 17 53 52 -2 -29 161 309 255 -161 140
2719A40j75J10k09K43j66J30l05J48K20k07J89M1q7j55K21o5k77M59j36m17Q8
$$ 140 -35 75 -134 109 -57 73 -232 -84 136 -71 118 159 72 -83 138 73 -204 255 119 -298 -210
2740b10L31J40p13L81K5o0K22Qk53P9p4K12k40m5N3M9M08k79J79n09K34J09k15
$$ -210 121 261 -452 -71 -46 -106 116 124 -129 -50 -124 88 -152 -197 -144 -95 313 34 213 -296 -62 47 -168
2763a68K23j37M0l4L01k78j14K27jk6QN4Kl19J56j59J47J97N4l01L9K24p6N9k57
$$ -168 55 -82 -42 -76 225 -53 -167 60 59 33 41 95 97 -222 -66 -225 -78 119 173 -128 -89 135 59 118 -139
2788a39J99J82k42j4r4J29l50K99M9k19K43j28Q0j06m7M23k73k52J06J25L84k50
$$ -139 60 242 0 -14 -108 21 -329 -30 19 -200 43 -85 -5 -111 -158 265 -8 -260 -154 -29 355 105
2810A05J74l81J45j86K33j21J52m06L33l14J02K42J4n2j30J30m8J93n4k20J82
$$ 105 279 -102 43 -143 90 -31 121 -285 48 -266 -164 78 92 40 -90 40 -8 185 131 -89 93
2831I3J71m33M43l24j77j94O25k74J27J49j54o6j21K07N4qj10K3m54L11L19j85
$$ 93 264 -169 274 -50 -227 -421 204 -70 57 206 52 -14 -135 72 126 118 8 31 -423 -112 207 22
2853B2j3Kr0J03M8k8J37j87j05J93j26J72k56J73K5j70O9OJ42N5k84n6j2J25L19
$$ 22 9 11 -79 24 72 44 181 -6 -111 82 -44 128 -128 45 70 -100 -31 -25 117 172 -112 -168 -180 -55 264
2878B64m05j49L95J31p01M05J31j88K25k54M97m04j50L16j37q7K40m10K99oq3
$$ 264 -141 -290 105 236 -465 -60 71 -117 108 -146 351 -53 -203 113 -24 -111 129 -281 18 12 -71
2899g1J0j96L95j45qL8q4n7L52m49L39p3k4P9j13N0N6j22J02j04J69p3K76m98
$$ -71 -61 -257 138 -7 -15 23 -61 -118 234 -215 124 51 27 106 -7 43 99 -23 79 -25 144 71 347 -151
2923a51J47K7K05l08P0j34K70p0K7J47l72K47Ln0M1k32n3J75k70M32J34k10J26
$$ -151 -4 23 228 -80 -10 -144 126 56 83 230 -142 105 108 58 99 -133 -186 -11 -281 151 285 75 201
2946B01j19J49n19j6L95j61J20j24Q6J04j7j09L9j5K35l87K67Ok49l3J7p3L10
$$ 201 82 231 -288 -304 91 -70 50 -74 12 116 99 -10 29 14 249 -138 129 135 -114 -147 -130 -203 107
2969A07n4J29j99J08j75K27l82JN1K45l3j3j87Q6J98n0j79KL51r6k42R7N9l6k0
$$ 107 53 182 -17 91 -84 143 -239 -238 -187 58 25 12 -175 -89 109 59 -120 -118 233 137 -105 -8 51 15 -5
2994en7k1P4J86Pr7j94J73J30O7p7j20j86J57j24r5J80J33j75j79M60l92M75m74
$$ -5 -62 -83 -9 177 184 87 -107 66 196 263 186 66 -120 37 -87 -182 -2 131 -44 -223 237 -155 320 -154
3018a54J54o6K94m04J84l22L36j49J64K34l81J85l34J54O1l2r1J37L16j45k2N7
$$ -154 0 -66 228 -176 8 -314 22 -127 37 271 -110 75 -259 -105 -44 -76 -167 -30 286 141 119 176
3040A76j4j56j37J94k21J32Q8J13k89K68Kj70K42k44J87m25M99p8j83J69k14Q2
$$ 176 162 6 -131 63 -158 -26 62 175 -114 154 156 -14 228 -16 171 -254 245 167 -16 153 -61 21
3062B1L1k7K16m29J20o0J78o0l9M8q8R5J18k43J26O2m27K98K27l20J94j57L8r8
$$ 21 52 25 241 -188 -68 -128 50 -10 -49 -1 -89 6 124 -119 7 69 -358 -60 167 -153 41 -116 -78 -176
3086a76k7j35N02l47J10J72l26J24OJ25L96l70k5N3qj7pj58QK24Q5j77O1k03l0
$$ -176 -203 -338 164 -183 -73 99 -227 -103 -97 28 424 54 29 82 74 57 50 -108 -100 124 209 32 93 -110 -140
3111a40K8J14n1L42k28k43K15k34q5L81J28j07k09K68j18qL7N5m84N25nk52Q8
$$ -140 -112 2 -49 293 65 -178 37 -197 -282 99 227 120 -89 179 61 53 90 145 -339 186 181 -71 17
3134A7j89J93l02K39j76J37j66L06j2m2L33j88m83K19J15K10l48J81Rl53L95o1
$$ 17 -172 21 -281 -42 -218 -81 -247 59 47 5 338 150 -333 -114 1 211 -137 44 53 -300 95 34
3156C4J05p2Q5j34j06n5m7K07K7j90K21KJ36k44P4Pl6j19P7l2N5J20j8r0M7K03
$$ 34 139 67 152 18 -88 -143 -190 17 44 -146 75 77 213 -31 43 50 14 -105 -28 -60 -5 115 97 7 54 257
3182B57l76J96k4L32m22NK17l86J79m9L24r6K2K4N4k63l6N0j99N30m06L7OJ77
$$ 257 -119 77 53 385 -37 -32 185 -201 -22 -71 253 157 179 203 257 -6 -42 8 -191 339 -67 -30 -24 153
3206A53m2k28J46l50K13K5j5L3M7O1j82K1J78N6o9k38J68K50J50l92j5R0Nj12
$$ 153 111 -117 29 -321 -108 -83 -98 -65 -18 43 -139 -118 60 116 47 -191 -23 227 377 -15 -30 60 65 -47
3230d7r9K57kJ44M6m94K18k13K54o3k77R5J01L1q5R6O6J27N3j9j75j78J31K07
$$ -47 -146 111 109 253 299 -195 23 -190 64 1 -276 -181 -80 -49 -134 -38 28 155 208 189 14 -164 -33 174
3254A74m6L6l07L02k61K3J78k54j27N2J87j29K65O7l48M7J82j57J11r8K42j24
$$ 174 128 164 -143 159 -102 -79 99 -155 -282 -230 -43 -172 93 160 -188 -141 41 -116 -5 -103 139 15
3276A5j70O4P3k0M17l52p5K85l16J3J45K50l52q4K00j67J99n17N38j70K08N7j49
$$ 15 -155 -91 -18 -38 379 27 -48 237 -79 -66 79 329 -23 -107 93 -74 125 -392 146 -24 184 241 92
3299I2J09J05Q9l51r5L95k20L2J8P6j80O1l61K49J8j21J89j42j63M23J98m23K71
$$ 92 201 306 395 44 -51 344 124 156 174 250 70 131 -230 19 37 -84 105 -37 -200 223 421 -2 269
3322B69j42j38L5j5o9K52k16J83k25k45J48RJ07N3R8J07k74L23k68K27L0k70J99
$$ 269 127 -11 24 9 -60 192 -24 159 -66 -311 -163 -154 -47 6 104 211 -63 260 -8 219 249 -21 178
3345A78l10L39j83q2M4R1q7r4K66k90r6J4L09j11K66m32K29j41j28L44m1k48L27
$$ 178 -132 207 24 -58 -14 77 -10 -104 162 -128 -224 -210 99 -12 254 -178 51 -90 -218 126 85 -163 164
3368A64j41q9R5%K31n6j08K42m43J87l69K94jo1O6l43M60j97K64m8k39K77j49
$$ 164 23 -66 29 29 260 204 96 338 -105 82 -287 7 6 -55 11 -332 128 -69 195 147 -92 185 36
3391C6K5k00K2l9M98k30J07j00j20R5k01L52k96N4k5l6M7O2J05j61j41mJ22M9
$$ 36 61 -139 -117 -156 342 112 219 119 -1 94 -107 245 -51 3 -22 -58 -11 51 156 -5 -146 -150 -28 21
3415B1j6l33J28M12k85K99k81K08k08K43q6j40j97r3K92K7J56o4o3P4j42j54J36
$$ 21 5 -328 -200 212 -73 226 -55 153 -55 188 102 -38 -235 -328 -36 -9 147 83 20 94 -48 -202 -66
3438f6J57J07j35O0k8k31j07M7J25j4L7J08l9j61M56r3l08J08j35K88k08J11P6
$$ -66 91 198 63 123 95 -136 -243 -196 -71 -85 -48 60 21 -140 316 223 -85 23 -112 176 -32 79 155
3461A55Kj79l18N9M47l40L68j48j3L02k58q0l4K47n17M71om13J50k3L39l24PM5
$$ 155 157 -22 -340 -281 166 -174 194 46 33 335 77 -3 -37 210 -307 164 158 -255 -105 -128 211 -113 -106 -61
3485f1K75k91j08q1J29m6O2Kn2L94k74Qj29m8N23l78j32J61KL32j22Q8j94J37
$$ -61 214 -77 -185 -266 -137 -183 -121 -119 -171 223 -51 -43 -172 -220 303 -75 -207 -46 -44 288 166 254 60 197
3509A97Ql14M0l8K56n3j8K07n5k53o6M31k00j44k94M31l06J28M8J4J25m46M86
$$ 197 205 -109 -69 -107 149 96 78 285 230 -23 -89 342 142 -2 -296 135 -171 -43 5 19 144 -302 184
3532A84j63r1o7j18M74k46J1mj12L53l22j5L25r2r5L09r5k60j8j55M16k60M3R4
$$ 184 21 -70 -137 -255 219 -27 -16 -20 -132 221 -101 -116 209 117 22 331 236 -24 -42 -197 219 -41 2 96
3556I6j54O7l9J75J74j74k75J35J85J48m26L1J79j01J8j48L4N7L9O7J66j8n59
$$ 96 -58 9 -30 145 319 145 -130 5 190 338 -88 -57 122 21 39 -109 -75 -18 21 88 254 236 -323
3579c23K85J55j57n2K3K6J80q5j58J20K45j1j76%q1K12l20K87n2q3K37j05k69
$$ -323 -38 117 -40 -92 -69 -43 137 52 -106 14 259 248 72 72 -9 203 -117 170 118 35 272 167 -102
$$ [...]
8191a68
##END NTUPLES=NMR FID
##END=
