##TITLE=1H_Pr 4925-Van
 CDcl3+DMSO, 8 sc, 
 30.1.2020
##JCAMPDX= 6.0         $$ Bruker NMR JCAMP-DX V2.0
##DATA TYPE= NMR FID
##DATA CLASS= NTUPLES
##ORIGIN= UXNMR, Bruker Analytische Messtechnik GmbH
##OWNER= root
$$ XWIN-NMR		Version 3.5
$$ Thu Jan 30 14:18:05 2020 Russian Standard Time (UT+4h)  she@DPX200
##.OBSERVE FREQUENCY= 200.1315
##.OBSERVE NUCLEUS= ^1H
##.DELAY= (6, 6)
##.ACQUISITION MODE= SIMULTANEOUS
##.ACQUISITION SCHEME= undefined
##.AVERAGES= 8
##.DIGITISER RES= 18
##SPECTROMETER/DATA SYSTEM= spect
##.PULSE SEQUENCE= zg30
##.SOLVENT NAME= CDCl3
##.SHIFT REFERENCE= (INTERNAL, CDCl3, 0, 15.7039)
##AUDIT TRAIL= $$ (NUMBER, WHEN, WHO, WHERE, WHAT)
$$ ##TITLE= Audit trail, XWIN-NMR		Version 3.5
$$ ##JCAMPDX= 5.01
$$ ##ORIGIN= Bruker BioSpin GmbH
$$ ##OWNER= she
$$ F:/spectra/data/she/nmr/H-F/1/audita.txt
$$ ##AUDIT TRAIL=  $$ (NUMBER, WHEN, WHO, WHERE, WHAT)
(   1,<2020-01-30 14:16:57.00 +0400>,<she>,<DPX200>,
      <created by zg, POWCHK disabled, PULCHK disabled
       configuration hash MD5:
       00 E9 B6 7A A2 85 ED C7 34 08 36 98 17 FE 4E 26
       data hash MD5: 16K
       7C 04 D3 67 A7 98 83 4D 93 4A 68 EE F9 00 0E 26>)
$$ ##END=
$$ 
$$ hash MD5
$$ 56 FD C1 61 0C E0 35 43 DF BB A5 EE A2 8E D2 68
##$RELAX= 
##$RELAX= 
##$RELAX= 
##$RELAX= 
##$RELAX= 
##$RELAX= 
$$ Bruker specific parameters
$$ --------------------------
##$DU= <F:/spectra>
##$EXPNO= 1
##$NAME= <H-F>
##$PROCNO= 1
##$TYPE= <nmr>
##$USER= <she>
##$AMP= (0..31)
100 100 100 100 100 100 100 100 100 100 100 100 100 100 100 100 100 100 
100 100 100 100 100 100 100 100 100 100 100 100 100 100 
##$AQSEQ= 0
##$AQ_mod= 1
##$AUNM= <au_zg>
##$AUTOPOS= <>
##$BF1= 200.13
##$BF2= 200.13
##$BF3= 200.13
##$BF4= 200.13
##$BF5= 200.13
##$BF6= 200.13
##$BF7= 200.13
##$BF8= 200.13
##$BYTORDA= 1
##$CFDGTYP= 0
##$CFRGTYP= 5
##$CHEMSTR= <none>
##$CNST= (0..31)
1 1 145 1 1 1 1 1 1 1 1 1 1 1 1 1 1 1 1 1 1 1 1 1 1 1 1 1 1 1 1 1 
##$CPDPRG= <>
##$CPDPRG1= <>
##$CPDPRG2= <>
##$CPDPRG3= <>
##$CPDPRG4= <mlev>
##$CPDPRG5= <mlev>
##$CPDPRG6= <mlev>
##$CPDPRG7= <mlev>
##$CPDPRG8= <mlev>
##$CPDPRGB= <>
##$CPDPRGT= <>
##$D= (0..31)
0 1.2 0 0 0 0 0 0 0 0.06 0 0.03 0 0 0 0 0.0002 0 0 0 0 0 0 0 0 0 0 0 0 
0 0 0 
##$DATE= 1580379416
##$DBL= (0..7)
120 120 120 120 120 120 120 120 
##$DBP= (0..7)
150 150 150 150 150 150 150 150 
##$DBP07= 0
##$DBPNAM0= <>
##$DBPNAM1= <>
##$DBPNAM2= <>
##$DBPNAM3= <>
##$DBPNAM4= <>
##$DBPNAM5= <>
##$DBPNAM6= <>
##$DBPNAM7= <>
##$DBPOAL= (0..7)
0.5 0.5 0.5 0.5 0.5 0.5 0.5 0.5 
##$DBPOFFS= (0..7)
0 0 0 0 0 0 0 0 
##$DE= 6
##$DECBNUC= <off>
##$DECIM= 24
##$DECNUC= <off>
##$DECSTAT= 4
##$DIGMOD= 1
##$DIGTYP= 9
##$DL= (0..7)
0 120 120 120 120 120 120 120 
##$DP= (0..7)
150 150 150 150 150 150 150 150 
##$DP07= 0
##$DPNAME0= <>
##$DPNAME1= <>
##$DPNAME2= <>
##$DPNAME3= <>
##$DPNAME4= <>
##$DPNAME5= <>
##$DPNAME6= <>
##$DPNAME7= <>
##$DPOAL= (0..7)
0.5 0.5 0.5 0.5 0.5 0.5 0.5 0.5 
##$DPOFFS= (0..7)
0 0 0 0 0 0 0 0 
##$DQDMODE= 0
##$DR= 18
##$DS= 0
##$DSLIST= <SSSSSSSSSSSSSSS>
$$ [...]
##$SUBNAM2= <"">
##$SUBNAM3= <"">
##$SUBNAM4= <"">
##$SUBNAM5= <"">
##$SUBNAM6= <"">
##$SUBNAM7= <"">
##$SUBNAM8= <"">
##$SUBNAM9= <"">
##$SW= 24.9337058887773
##$SWIBOX= (0..15)
0 0 2 0 0 0 0 0 0 0 0 0 0 0 0 0 
##$SW_h= 4990.01996007984
##$TD= 16384
##$TD0= 1
##$TE= 0
##$TE2= 300
##$TE3= 300
##$TEG= 300
##$TL= (0..7)
0 120 120 120 120 120 120 120 
##$TP= (0..7)
150 150 150 150 150 150 150 150 
##$TP07= 0
##$TPNAME0= <>
##$TPNAME1= <>
##$TPNAME2= <>
##$TPNAME3= <>
##$TPNAME4= <>
##$TPNAME5= <>
##$TPNAME6= <>
##$TPNAME7= <>
##$TPOAL= (0..7)
0.5 0.5 0.5 0.5 0.5 0.5 0.5 0.5 
##$TPOFFS= (0..7)
0 0 0 0 0 0 0 0 
##$TUNHIN= 0
##$TUNHOUT= 0
##$TUNXOUT= 0
##$USERA1= <user>
##$USERA2= <user>
##$USERA3= <user>
##$USERA4= <user>
##$USERA5= <user>
##$V9= 5
##$VALIST= <valist>
##$VCLIST= <CCCCCCCCCCCCCCC>
##$VD= 0
##$VDLIST= <DDDDDDDDDDDDDDD>
##$VPLIST= <PPPPPPPPPPPPPPP>
##$VTLIST= <TTTTTTTTTTTTTTT>
##$WBST= 1024
##$WBSW= 4
##$XGAIN= (0..3)
0 0 0 0 
##$XL= 0
##$YL= 0
##$YMAX_a= 335288
##$YMIN_a= -128234
##$ZGOPTNS= <>
##$ZL1= 120
##$ZL2= 120
##$ZL3= 120
##$ZL4= 120
##$ABSF1= 10
##$ABSF2= 0
##$ABSG= 5
##$ABSL= 3
##$ALPHA= 0
##$AQORDER= 0
##$ASSFAC= 0
##$ASSFACI= 0
##$ASSFACX= 0
##$ASSWID= 0
##$AUNMP= <proc_1d>
##$AZFE= 0.1
##$AZFW= 0.1
##$BCFW= 1
##$BC_mod= 2
##$BYTORDP= 1
##$COROFFS= 0
##$CY= 11.3945322036743
##$DATMOD= 1
##$DC= 2
##$DFILT= <>
##$DTYPP= 0
##$F1P= 16.9975609425685
##$F2P= -3.02152046262296
##$FCOR= 0.5
##$FTSIZE= 0
##$FT_mod= 4
##$GAMMA= 1
##$GB= 0.15
##$INTBC= 1
##$INTSCL= 1
##$ISEN= 128
##$LB= 0.24
##$LEV0= 0
##$LPBIN= 0
##$MAXI= 10000
##$MC2= 0
##$MEAN= 0
##$ME_mod= 0
##$MI= 1.114404
##$NCOEF= 0
##$NC_proc= 0
##$NLEV= 6
##$NOISF1= 3.799351
##$NOISF2= 2.8
##$NSP= 1
##$NTH_PI= 0
##$NZP= 0
##$OFFSET= 15.70392
##$PC= 1
##$PHC0= -9791.826
##$PHC1= 17.40081
##$PH_mod= 1
##$PKNL= yes
##$PPARMOD= 0
##$PSCAL= 0
##$PSIGN= 0
##$REVERSE= no
##$SF= 200.130013532006
##$SI= 16384
##$SIGF1= 3
##$SIGF2= 2
##$SINO= 400
##$SIOLD= 16384
##$SREGLST= <1H.CDCl3>
##$SSB= 0
##$STSI= 0
##$STSR= 0
##$SW_p= 3612.71676300578
##$SYMM= 0
##$S_DEV= 0
##$TDeff= 0
##$TDoff= 0
##$TI= <>
##$TILT= no
##$TM1= 0
##$TM2= 0
##$TOPLEV= 0
##$USERP1= <user>
##$USERP2= <user>
##$USERP3= <user>
##$USERP4= <user>
##$USERP5= <user>
##$WDW= 1
##$XDIM= 8192
##$YMAX_p= 0
##$YMIN_p= 0
$$ End of Bruker specific parameters
$$ ---------------------------------
##NTUPLES= NMR FID
##VAR_NAME=  TIME,          FID/REAL,        FID/IMAG
##SYMBOL=    X,             R,               I
##VAR_TYPE=  INDEPENDENT,   DEPENDENT,       DEPENDENT
##VAR_FORM=  AFFN,          ASDF,            ASDF
##VAR_DIM=   8192,          8192,            8192
##UNITS=     SECONDS,       ARBITRARY UNITS, ARBITRARY UNITS
##FACTOR=    0.0002004,     1,               1
##FIRST=     0,             0,               0
##LAST=      1.6414764,     0,               0
##MIN=       0,             -128234,         0
##MAX=       1.6414764,     335288,          0
$$ Real data points
##PAGE= N=1
##DATA TABLE= (X++(R..R)), XYDATA
0 0 0 0 0 0 0 0 0 5 -8 8 -8 9 -16 16 -24 24 -32 40 -45 53 -64 73 -85 97 -113 130 -148 166 -190 215 -242
31 -242 274 -306 344 -383 426 -475 528 -586 651 -720 797 -881 978 -1081 1201 -1333 1484
48 1484 -1655 1854 -2089 2369 -2711 3137 -3688 4431 -5494 7152 -10122 17115 -71037 32894
62 32894 146842 -43168 -128234 -35519 80310 54886 30199 50020 48973 -17649 -27401 29706
74 29706 67712 41722 34209 51795 57088 53476 88054 114165 87126 52039 65421 67774 14345
87 14345 -24499 20574 70199 27431 -61696 -73933 -2834 54725 39965 -15932 -54294 -36862
99 -36862 16939 37471 -11366 -58813 -37216 -821 -27237 -69796 -44418 7937 -6981 -55558
111 -55558 -40331 19681 27465 -12974 -12132 30311 33747 -5703 -19284 3123 12850 9662 18171
124 18171 19558 -3403 -6418 36495 68618 42071 5731 17292 41880 27621 3390 16730
136 16730 40640 22467 -20571 -32060 -1537 30142 25043 -18321 -53397 -32790 18730 22250
148 22250 -31690 -55575 -10040 19785 -28784 -77669 -40235 21782 5242 -58517 -64593 -13378
160 -13378 12831 -607 -5556 2126 -6675 -15029 1180 19294 13425 5659 9852 644 -15845 9254
174 9254 62080 56498 -11855 -32818 34093 81495 33067 -24447 3621 61823 50343 -4344
186 -4344 -13640 27229 52018 30737 -3008 -14341 1569 27572 32071 5695 -14167 36 16723
199 16723 -246 -20498 -3021 19421 -6311 -50220 -40757 7634 19671 -16832 -39415 -20982
211 -20982 589 -3135 -15169 -15865 -9372 -3136 -4681 -18092 -24482 899 33364 19460 -28514
224 -28514 -35367 15493 47302 13822 -27132 -13173 22850 21771 -3288 -4926 14265 15974 -3985
237 -3985 -16987 -8776 6629 10397 -3805 -22873 -20595 4165 16204 -5442 -26924 -13096 10843
250 10843 506 -26985 -22770 10307 19144 -8747 -26644 -4930 25243 25084 -1801 -18126 -3344
263 -3344 23779 28030 4091 -13437 4901 34254 27573 -4663 -9580 21154 34053 5349 -18457
276 -18457 339 28758 21572 -7711 -12803 10493 22771 6619 -14034 -12711 4756 11771 -3827
289 -3827 -22481 -14392 11897 16061 -12505 -32093 -11511 16314 5333 -28841 -33981 -4772 11196
302 11196 -8997 -29978 -18405 5563 4651 -18587 -29702 -13623 6096 1187 -20608 -26448 -4771
315 -4771 13899 2307 -19510 -13926 10488 14235 -10295 -24146 -1993 24551 16771 -11300 -16367
328 -16367 8625 27379 16099 -5731 -7183 9177 15809 2638 -7049 5972 22956 15253 -10107
341 -10107 -14837 10691 30478 13285 -19128 -21764 5592 21033 4985 -12864 -6160 10772 8362
354 8362 -11261 -16175 4118 18993 3264 -23749 -21944 7689 24766 8489 -15881 -13175 9092
367 9092 14684 -3231 -13019 3615 19982 8249 -15365 -12960 16298 32916 12810 -15854 -13826
380 -13826 11438 22061 5664 -7997 1167 15348 9126 -8765 -7579 15635 25705 2320 -25820
393 -25820 -20747 9680 22786 3891 -19327 -15822 4403 6991 -8997 -14269 -562 6821 -10086
406 -10086 -29683 -21167 7753 17920 -4594 -28547 -21759 2656 9549 -6399 -17958 -8667 2659
419 2659 -4320 -17976 -10953 13280 20655 -2413 -24529 -14897 12836 21848 3405 -13235 -5913
432 -5913 10270 10512 -688 1194 17570 19769 -1823 -19298 -5493 23840 29226 2464 -18870
445 -18870 -7248 17404 20249 4119 -4372 4061 9179 -3009 -14236 -2903 19428 19377 -6388
458 -6388 -24087 -9288 17161 19088 -4518 -19839 -8772 4919 -1658 -13348 -5308 11867 9534
471 9534 -14386 -26741 -8912 16160 14717 -10982 -26566 -13627 8051 9970 -3830 -8118 3696
484 3696 8954 -5822 -17303 -2379 21867 19560 -7891 -20774 -1205 23690 22178 3327 -4971
497 -4971 3112 9013 3089 -2212 5592 17109 13228 -7218 -18104 -147 24730 20283 -10092 -25485
511 -25485 -8085 11067 4598 -11069 -7803 6170 2945 -14193 -17259 912 15947 6920 -15239
524 -15239 -23148 -6747 14450 16169 -1462 -10857 704 12031 3481 -7995 2901 21002 12384
537 12384 -13470 -16832 10578 28703 15370 -6818 -8939 4055 10307 5393 -322 1793 6537
550 6537 4255 -6608 -10684 4705 22161 11832 -17459 -25368 -347 18408 3640 -17852 -12806
563 -12806 4375 2336 -13613 -14839 358 6089 -6337 -21689 -22732 -8776 6057 3943 -14639
576 -14639 -23724 -9043 6468 -1030 -15904 -9126 7022 781 -18872 -14997 11578 20914 1900
589 1900 -13246 -4142 10133 10233 3433 752 1792 4762 6359 847 -4436 6718 22256 12769
603 12769 -16948 -22922 8055 29190 7604 -22268 -16411 9444 13597 -1515 -6469 1428 3274
616 3274 -2542 -5100 -3121 1016 6137 5874 -3817 -8867 4077 15966 5070 -10542 -2279 15018
630 15018 6325 -15807 -9698 19020 22485 -5532 -20467 -1988 17618 13348 -3927 -12827 -8335
643 -8335 4101 12137 3329 -13153 -10086 11381 15330 -9191 -22276 -1512 16305 -247 -20845
656 -20845 -11121 7419 1387 -14298 -8660 4150 -1098 -16589 -17123 -5029 1113 -3389 -12195 -17581
670 -17581 -12469 3965 10053 -8593 -25514 -9494 16098 8420 -18990 -16798 12270 21371 728
683 728 -10975 3355 17541 14129 5253 2930 4863 9828 17029 15286 3786 3679 18643 20497
697 20497 1779 -4461 14134 21594 -418 -15186 3187 20675 6052 -14740 -8126 8750 4140
710 4140 -11587 -11846 -4162 -4981 -8903 -8764 -10122 -11555 -3582 2197 -11221 -25226 -11109 12237 4021
725 4021 -24821 -26198 3267 17048 -1250 -16440 -6431 6608 5641 1325 768 -417 1435 9596
739 9596 10981 2530 2304 16451 19961 4321 -1861 14570 22720 5054 -5127 13277 27625 7712
753 7712 -12369 2033 25510 18555 -6290 -13734 -2077 7373 7270 -264 -12285 -15532 -1058 10368
767 10368 -3509 -24333 -16267 7811 4406 -22092 -25681 -808 10866 -4984 -15798 -5152 2810
780 2810 -2819 -4521 3284 6898 -94 -4252 232 6680 13628 17521 7960 -6480 -1442 21659 26760
795 26760 2789 -10495 8564 25743 11367 -6808 2680 21670 17420 -2206 -8767 604 8832
808 8832 10015 4795 -6847 -13650 -3572 9962 4551 -12642 -12885 -1516 -5236 -19432 -15001 2784
822 2784 1528 -19790 -25653 -7960 2038 -7606 -17200 -12413 -6946 -9768 -12259 -9258 -4928 492 3434
837 3434 -3898 -14753 -7553 15014 20031 -2467 -16747 261 21611 16017 -160 2794 16055
850 16055 16075 4713 2316 9639 14009 12085 7477 978 -392 8307 15711 8200 -4212 -1966 6343
865 6343 272 -11469 -4803 11075 5721 -16586 -20754 -1264 11788 478 -14516 -13837 -5967 -3532
879 -3532 -5528 -6562 -5273 -1876 -3 -5835 -13098 -6186 11425 12411 -8308 -20636 -4829 14752
893 14752 11023 -2801 -3066 5796 5706 -1125 1088 10204 11781 3170 -3993 -2742 5302 14534 13833 2113
909 2113 -6312 724 10911 6316 -4203 -1005 9345 5383 -10603 -11134 6635 15604 2650 -14312
923 -14312 -13661 -2221 4062 -329 -7425 -9238 -5061 -1651 -4647 -8998 -4486 4601 1464 -13648 -18197
938 -18197 -3057 10842 4025 -10258 -8724 1912 4444 -1431 -2151 4110 5619 -1460 -7113 -3043
952 -3043 7959 13735 7335 -4824 -6893 4406 13223 6699 -4434 -2404 6964 6071 -4585 -4892
966 -4892 7531 13594 2420 -10499 -9078 2922 8910 2402 -6885 -7979 -1995 1818 -639 -3682
980 -3682 -591 3011 -2495 -12566 -11411 3188 9991 -1160 -13874 -10283 3108 7031 -385 -6262
994 -6262 -2187 1775 -1644 -6440 -3314 5573 8754 1072 -7887 -5220 6937 12820 3159 -7172 -3920
1009 -3920 6426 7124 -676 -2059 6677 11191 2780 -6359 -2596 8908 11054 920 -7136 -3164
1023 -3164 5282 7454 1260 -2647 1452 5080 -46 -7357 -4643 5171 7552 -2407 -11448 -6322 5875
1038 5875 8010 -1721 -8416 -4065 2331 328 -5269 -4659 2200 4822 -2145 -8380 -3326 7064 7537
1053 7537 -2508 -9430 -3969 5016 5149 -2828 -4912 2177 6727 576 -5945 -2365 6125 6836 -2483
1068 -2483 -8681 -2646 6812 6577 -1911 -5330 890 5473 1608 -5452 -3635 3807 4994 -3475 -9336
1083 -9336 -2263 7099 5845 -4456 -8754 -2338 4463 1317 -7064 -7163 508 3505 -2263 -7516 -3043
1098 -3043 4623 3795 -5160 -9314 -2280 5653 2831 -5702 -5955 2915 7417 1888 -4342 -1575 6179
1113 6179 5976 -1599 -4986 1359 8201 5605 -1863 -2952 4219 8827 3507 -4458 -3552 4317 6595
1128 6595 -875 -5990 -900 6843 4795 -3274 -5251 1451 6482 640 -6048 -4375 3546 5759 -3
1143 -3 -4960 -1309 5895 5570 -2250 -5642 1055 6528 2143 -6060 -4791 5261 8613 624 -6969 -3453
1159 -3453 4775 4568 -2507 -5948 -1576 2778 519 -4258 -3386 2827 5351 -1117 -8142 -4629 5026
1174 5026 6195 -2711 -8086 -1764 6625 4550 -3146 -3569 3583 5674 -1286 -6333 -2600 4953 5685
1189 5685 -1163 -6265 -2849 4555 6065 -856 -6229 -2084 3089 681 -5510 -2931 5466 6089 -2695
1204 -2695 -7156 41 7478 4745 -2884 -4773 181 3563 2255 -763 -264 3684 4694 -529 -6616
1219 -6616 -2425 6823 7310 -4492 -11682 -3818 7205 4949 -4664 -6417 -526 657 -4433 -6160 -1669
1234 -1669 1535 -835 -5305 -6677 -2680 3882 4595 -2479 -7610 -3477 3433 1282 -4724 -2383 6079
1249 6079 4771 -5426 -7405 3508 10930 4440 -6007 -6217 401 5240 4194 641 -776 969
1263 969 3065 1600 -2279 -243 7354 6692 -4856 -10015 225 11610 7023 -3827 -4833 1936
1277 1936 3034 -880 -1014 2392 1621 -2618 -4536 -2073 1746 4791 3989 -2843 -7942 -2620 6017 3870
1293 3870 -4401 -3127 5057 4621 -4036 -4024 7760 12466 2432 -7374 -3652 5613 9010 5883 1357
1308 1357 -1696 -95 5336 6322 434 -1891 3335 4124 -4641 -9278 80 9348 2539 -8982 -8113
1323 -8113 -105 380 -4731 -4273 -867 -4094 -9200 -7938 -1663 1897 978 -2521 -8515 -9836 -472 7966
1339 7966 2298 -9958 -8783 3964 7068 -3065 -6398 3758 9587 739 -7924 -3750 4577 6307
1353 6307 3734 476 -3136 -2219 4665 8953 4314 -1498 447 2950 -504 -1189 7025 11248 979
1368 979 -8416 -1246 10721 7972 -2647 -3640 2227 2630 -2000 -2648 880 2843 2372 -623 -6002 -8156
1384 -8156 -287 8417 2158 -12357 -12241 1513 6688 -2569 -6841 -267 3041 -3629 -6695 19 4692
1399 4692 647 -2308 -1217 410 897 3974 6127 2733 -1146 1653 4227 219 -1006 7100 10780
1414 10780 -985 -9181 516 13098 9230 -4084 -6517 1156 4037 445 -1367 87 -206 -123 591
1429 591 -1862 -5156 -684 5838 1031 -10560 -10205 2092 6418 -2179 -6798 -1559 1222 -4329 -5288
1444 -5288 1880 3780 -3501 -7474 -2645 2213 2272 1644 509 -2458 -2176 3304 5182 -1821 -4149 3774
1460 3774 9281 605 -7899 588 12770 9463 -3496 -5873 2089 5906 3227 1107 235 -858 -348
1475 -348 2517 2036 -2319 -1293 2136 -696 -7046 -5544 2909 2968 -6041 -7098 568 2440 -4954 -7679
1491 -7679 -289 2725 -3804 -8786 -4820 1257 2066 -508 -2896 -5274 -2576 3594 4023 -3946 -7363
1506 -7363 590 6970 775 -6570 -1319 7899 5610 -3219 -3970 2723 4682 1064 295 1711 864 884
1522 884 3307 3753 1701 1375 3043 1106 -2211 745 6670 4227 -4164 -3462 5835 8212 -1413 -5925
1538 -5925 200 5096 1037 -4640 -2998 881 2186 814 -1416 -3577 -1873 2864 2849 -4077 -6827
1553 -6827 -799 5272 249 -5794 -2181 5153 2806 -2855 -2593 2362 2195 -2073 -1934 1716 3018 1315
1569 1315 40 -137 1144 2889 3147 -726 -4056 -404 5244 2818 -4613 -3613 4443 6005 -1543
1584 -1543 -6289 -821 4006 1360 -3731 -4438 -959 746 367 -928 -2578 -2213 73 -408 -3861 -4459
1600 -4459 165 2000 -2535 -6373 -1573 4040 1673 -4272 -4028 766 1449 -2256 -3346 367 2295
1615 2295 672 -1967 -1364 1039 3757 3568 -1292 -4559 -647 4918 3657 -1796 -2040 3932 5257 98
1631 98 -2878 1750 5480 2657 -2745 -2926 1057 4038 2830 307 -1274 -172 1207 862 -1109 -1281
1647 -1281 1469 636 -4008 -4987 594 5500 1515 -5162 -5134 -122 2316 -673 -3309 -1544 271 -384
1663 -384 -2227 -1467 1829 3824 1397 -3138 -4325 353 4639 3334 -1555 -2347 2353 4316 1050 -571
1679 -571 2201 4182 979 -2832 -2056 2572 5225 2587 -1433 -1622 1225 3155 1607 -420 -105 985
1695 985 398 -2620 -2462 2795 5395 763 -4972 -4422 1358 3712 670 -3200 -3443 -212 -58 -1378
1711 -1378 -1078 1543 1622 -1691 -5225 -4392 1015 3732 -225 -4899 -4053 657 2482 442 -1455 206
1727 206 1217 -967 -3602 -1278 3420 4508 150 -3420 -2208 2617 5019 2217 -1082 -1267 273
1742 273 528 -1167 -73 2980 3197 -1006 -4353 -2448 2636 4222 -301 -4628 -3788 -401 983 -151
1758 -151 -669 427 297 -2060 -3898 -1466 2664 2965 -1958 -5441 -3231 2202 3999 1167 -1719 -708
1774 -708 704 -161 -1582 -63 2756 2100 -1385 -3567 -568 4239 4510 806 -2812 -1423 1541 2032
1790 2032 554 283 2318 2939 -80 -2245 814 5295 4645 -566 -3843 -1644 2513 3722 1285 -312
1806 -312 376 939 -175 -1073 500 2906 1430 -2906 -4692 -1223 3820 3815 -602 -3551 -1488 1166 396
1823 396 -1127 -448 1080 371 -2287 -2667 578 3747 2525 -1611 -3787 -1873 1784 1683 -1033 -2093
1839 -2093 -246 428 -1362 -2658 41 2888 1142 -3599 -4924 -1263 2536 1790 -1290 -2487 -960
1854 -960 768 786 161 385 1514 568 -1986 -3028 311 4615 3834 -1575 -3439 170 2784 1431 -1020
1871 -1020 -829 172 -554 -1950 -1299 1267 2306 -124 -2885 -3765 -1008 1601 957 -2812 -3901 -443
1887 -443 1783 -99 -2265 -87 2842 1094 -3060 -2951 691 3038 1059 -1349 -1020 401 1729 1787
1903 1787 972 4 21 484 -697 -1208 940 4012 2037 -2451 -2272 2667 4360 796 -2405 -662 2229
1920 2229 1118 -616 -159 1740 2291 1171 -318 -798 61 2598 1974 -1628 -3249 354 3393 1076
1936 1076 -1945 -983 2048 750 -2723 -2357 985 1246 -1669 -2525 -414 481 -160 -88 -317 -712 -273 594
1954 594 -952 -2301 95 3323 2080 -3075 -2383 3272 5024 76 -3293 -207 2971 1593 -767
1969 -767 -311 1097 1565 988 1192 15 -627 1070 1561 -722 -2646 -142 2461 66 -2630 -399 3062
1986 3062 557 -3728 -2218 1405 402 -2901 -2665 198 829 -1257 -1787 -992 -1101 -615 -15 -2034 -4491
2003 -4491 -2226 2444 1813 -3634 -4340 1292 3344 -993 -3718 -510 2010 253 -1490 -169 1260
2018 1260 1078 1290 2138 913 -830 951 2929 1179 -969 883 2329 204 -1605 2028 4804 959
2034 959 -4085 -1657 3522 2584 -2395 -2401 970 1474 -434 -313 243 -415 163 1297 -725 -3622 -1783
2051 -1783 3475 3670 -2465 -3858 1099 4036 859 -1717 555 1405 -1517 -1872 1838 2843 173 -1027
2067 -1027 548 1251 -202 475 1843 95 -1442 556 2212 -303 -2284 1965 5591 468 -4849
2082 -4849 -2234 4278 4234 -1229 -2600 -443 925 793 1756 1105 -1017 -1571 526 541 -2474 -1907 1631
2099 1631 1494 -3136 -4079 168 1972 -1210 -2995 -407 -104 -3601 -3371 1089 2920 -1298 -3824 -1671
2115 -1671 551 931 845 132 -2285 -3026 396 3529 493 -2972 720 4590 1194 -4055 -1576 3922
2131 3922 3724 -873 -2653 -121 1101 1133 2691 2624 -1144 -2764 318 2448 428 -678 661 -69
2147 -69 -2740 -1133 3066 3460 -1716 -3294 524 1764 -1973 -2704 812 2803 -912 -3404 -1542 656
2163 656 1097 1089 -596 -3194 -4048 148 3768 617 -3510 -1995 2088 810 -2407 -916 2703 1160
2179 1160 -2658 -2334 692 1565 840 1254 1814 -527 -1966 688 2617 1449 298 459 -319 -1829 769
2196 769 5325 4025 -1955 -3567 829 4088 1620 -1075 122 1881 -78 -965 777 1938 1723 1040
2212 1040 205 -1776 -2641 906 3630 900 -3144 -1812 1498 878 -758 -304 1328 -1072 -3634 -2331
2228 -2331 1490 1525 -1547 -1508 -301 -609 -1149 -57 268 -754 -1613 -712 -1449 -2328 -239 2860 1978 -2941
2246 -2941 -4479 248 3351 1118 -2043 -1884 -34 -262 227 1455 1220 -385 -1015 -211 -648 -623 789
2263 789 1560 -353 -2254 -617 1842 897 -948 -175 1330 -433 -3334 -1327 1953 2147 -836 -2192
2279 -2192 -778 605 1255 703 5 -1439 -1042 -10 487 -772 37 2465 1806 -1799 -2389 852 3086
2296 3086 1006 -1529 -1169 202 937 936 1522 1079 157 -634 171 911 719 1294 864 -654 -1137 1049 2615
2315 2615 1391 -375 9 1326 952 -796 -462 1897 2080 -154 -794 192 1499 1832 520 -150 -1888
2332 -1888 -1262 573 565 -619 -652 558 216 -1785 -1530 392 1114 -1006 -2525 -1541 189 267 -399 -359 327
2351 327 0 -488 -604 143 279 201 -516 -1389 -733 910 1527 427 -1190 -761 1172 868 -773 -1119 343
2370 343 930 -443 -966 -67 969 1044 217 -611 -611 533 437 -251 -524 -192 875 684 -837 -702 761
2389 761 959 -352 -1590 -662 471 427 -532 -559 229 276 -8 -388 -485 -116 74 -666 -1453 -1186 254 965
2409 965 -338 -1192 -702 795 262 -1154 -1068 88 675 -45 -788 -369 896 802 159 -461 115 -71 25
2428 25 -739 -600 431 1127 577 -761 -65 948 1490 449 -970 -582 709 921 192 593 1463 1573
2446 1573 665 -193 305 1189 1414 742 -69 76 856 1126 486 306 530 982 -177 -1143 -906 270 928
2465 928 -152 -1548 -711 539 1052 216 -977 -471 -45 -393 -580 -44 414 1032 -11 -981 -322 1385
2483 1385 1997 153 -1089 -912 161 503 -170 -16 726 220 -663 -756 0 734 353 -897 -1998 -1455
2501 -1455 292 890 107 -784 -414 -184 -93 -1161 -531 622 104 -800 -1477 -515 1052 1414 561 -525
2519 -525 -1211 -588 -136 252 88 -106 -155 -930 -1237 -184 1397 1072 -910 -2310 -1458 482 605 -74 -314
2538 -314 -466 -864 -636 -65 697 449 -397 -1197 -1256 -406 982 1610 593 -524 -517 994 599 100 624 960
2558 960 83 -1048 -378 1114 2169 1574 587 -113 -179 710 1389 1510 674 372 -69 282 114 1536 2699
2577 2699 1433 -1064 -2116 437 2268 1189 -580 -616 -258 149 126 832 505 -32 -1008 -1482 -1482 -803 741
2596 741 1078 -939 -2475 -1209 1173 935 -389 -769 -415 -913 -1670 -544 1185 1490 -472 -1048 -730
2613 -730 -157 288 585 432 -1360 -1696 -621 196 -240 125 1079 373 -2203 -2340 569 2011 630 -1736
2631 -1736 -1660 -276 261 1259 1454 649 -1167 -1012 266 592 -244 725 863 -344 -1391 36 1809 1255
2649 1255 -783 -868 283 -1001 -1419 -70 1504 743 -1957 -1708 73 827 -5 144 -737 -2143 -1423
2666 -1423 1062 1293 -46 -513 445 1104 -1077 -1449 1249 2018 178 -1653 -652 848 730 917 1995
2683 1995 490 -1743 -1453 891 1610 22 -794 -528 -858 -1194 550 2048 343 -2185 -1182 565
2699 565 175 -1922 -930 1743 375 -1469 -1053 729 1070 274 182 -478 -1906 -1224 1703 2784 93
2716 93 -1401 624 1835 459 -432 1258 1529 -430 -1070 1135 1723 791 160 1543 1523 -550 -593 1725
2734 1725 2183 646 -381 320 52 -387 1614 2879 315 -2577 -972 2199 1358 -1413 -1419 330 38
2751 38 -1077 -652 616 -87 -1265 -313 -304 -1706 -2318 202 1054 -1050 -2401 -1098 325 -240 -1497 64
2769 64 -260 -2735 -2229 361 1136 -999 -1848 -280 717 -624 -1317 38 166 -1059 -628 -6 -516 -1273
2787 -1273 761 2698 308 -2533 -1195 2201 1590 -639 -1034 631 750 83 1156 1713 39 -902
2803 -902 642 1809 164 -950 380 1535 438 -256 835 1242 -433 -326 1367 1625 -1096 -1994
2819 -1994 686 2023 -97 -1424 -73 1121 195 -343 361 58 -1306 -78 1434 214 -1446 17
2835 17 2203 1141 -1218 -1304 839 1066 -700 -458 626 220 -1062 468 1628 406 -1388 250 1440
2852 1440 194 -1438 -207 650 316 -45 662 813 -1125 -891 1613 1715 -985 -2116 40 1724 448
2869 448 -831 -74 431 -267 -293 920 91 -1655 -1046 530 15 -1561 -893 1550 718 -1517 -1129 218
2887 218 -117 -1609 -777 697 -881 -2109 -516 1108 576 -750 -748 -170 -60 -631 -220 450 -384 -609
2905 -609 953 1051 -589 -646 1465 1762 -850 -1845 -134 2012 1075 -202 184 242 -108 54 1538 759
2923 759 -972 -1351 62 579 -203 -213 771 413 -1177 -618 557 231 -1043 -691 441 -684 -1472 -574
2941 -574 1275 927 -700 -1298 -809 -690 -617 384 179 -1234 -1729 30 908 112 -606 207 282 -736 -1365
2960 -1365 336 1171 463 -346 16 353 77 792 1920 1353 -286 -1139 407 1297 1180 1125 1021 328 -321
2979 -321 802 2124 1275 -288 -478 396 430 -196 456 1301 809 -401 -646 -150 -108 210 -126 -185 -1033 -1367
2999 -1367 -175 745 377 -472 -314 -444 -1335 -1237 43 582 -587 -1591 -670 93 228 278 378 -293 -1333
3018 -1333 -1257 -246 578 200 170 -60 -547 -627 892 1511 1013 -835 -1455 -579 331 571 316 476 135 -572
3038 -572 -336 366 441 366 -290 -863 -997 -821 494 1123 240 -619 -749 -563 -248 -301 258 0 -1045 -1415
3058 -1415 -803 229 926 438 -158 -659 -981 -448 651 490 202 -117 -278 -525 530 1399 1313 373 -923
3077 -923 -542 415 886 840 470 323 39 239 795 1320 1321 735 -207 98 54 735 1496 1099 468 -101 575
3098 575 744 785 695 788 400 -135 -553 401 804 1234 149 -719 -787 -623 14 170 -567 -852 -1240 -585 -556
3119 -556 -71 683 -31 -1080 -1285 -1260 79 594 -179 -902 -827 -597 -68 355 320 220 -617 -719 -472 248
3139 248 405 490 -45 -739 -448 540 471 447 -348 -427 -196 -513 -352 122 738 435 -297 -427 -789 3 197
3160 197 7 -274 -767 -543 -316 299 820 305 84 -561 -433 -574 469 294 -544 -928 -473 413 597 384
3180 384 138 -214 -715 -662 -41 32 16 23 -319 -125 -281 357 484 223 -89 -38 115 -2 68 764 830 331 -63
3203 -63 113 672 384 520 295 -531 -573 -324 339 568 310 -397 -132 -382 -455 62 384 -8 -407 -695 -68
3224 -68 594 103 216 207 60 -304 -150 549 73 -297 322 394 352 105 563 648 -80 -4 19 635 38 -519 367
3247 367 794 475 -119 95 435 453 319 576 184 -592 -370 692 680 -87 452 559 77 -271 -239 208 194
3268 194 -332 -260 -157 412 -493 -8 449 -382 -1098 -579 -268 -555 -853 -554 -370 -985 -829 -326 38 -848
3288 -848 -913 -334 -39 -865 -1135 -68 303 -300 -594 -191 -288 -463 -225 532 -246 -965 -863 322 466 215
3308 215 -86 216 88 -333 -260 452 368 -581 -229 515 443 -316 695 964 679 -188 -154 440 709 206 752
3329 752 698 -252 -480 805 1355 -68 -569 159 467 -254 -498 244 878 -4 -347 230 433 52 83 935
3349 935 657 -1333 -1148 472 1045 88 -12 234 61 -420 342 1386 374 -1144 -1225 615 677 -158 -84
3368 -84 740 330 -878 -151 557 -31 -257 172 623 -140 -846 572 1435 307 -1169 -694 192 -188 -204
3387 -204 174 78 -851 -1117 751 1018 -338 -240 216 371 -990 -821 440 776 -331 -474 -5 -554 -808
3406 -808 213 1576 75 -1845 -1564 420 1065 -98 -308 -44 -693 -647 532 1002 -37 -1280 -376
3423 -376 303 -316 -1008 347 1351 343 -1387 -576 108 -492 -90 581 434 -1310 -1181 542 1749 112
3441 112 -860 -414 76 -464 -225 765 242 -936 -565 843 617 -499 29 1004 32 -1579 -1276 750
3459 750 1397 122 -211 38 -513 -278 1026 1509 -174 -1526 -881 979 836 -32 466 639 120 -692
3477 -692 397 1265 -261 -533 577 750 -557 -1153 1172 1977 318 -902 -598 344 12 496 1423 482
3495 482 -1662 -660 1466 1765 -89 -358 603 299 -900 -432 749 697 -305 -439 291 -127 -619 384
3513 384 1456 -127 -1607 -1128 766 949 -37 -72 174 -808 -611 755 1457 -433 -1337 -274 692 -406
3531 -406 -473 331 1101 -34 -978 -367 -140 -626 -297 365 -299 -1946 -1294 946 990 -305 -1176 -691 -834
3550 -834 -909 -386 440 -394 -1343 -1077 451 418 -544 139 487 -505 -1262 -470 290 332 -267 135 428 -215 -417
3571 -417 871 1086 -174 -1282 -350 846 639 2 662 556 -121 -362 909 1186 10 -229 629 439
3589 439 -498 -418 1454 1478 154 -247 587 165 240 466 944 72 -934 -360 1042 1064 260 -124 -17 -377
3609 -377 -285 -293 555 188 -499 -72 262 -47 -635 212 730 -507 -1204 -388 189 438 -18 273 220 -236 120
3630 120 1005 874 -176 -858 310 453 -98 -209 556 965 256 -200 353 290 -259 136 967 177 -656 -360
3650 -360 747 1006 222 -135 -17 -232 -544 369 278 -384 -947 -314 408 -46 -667 -210 -45 -740 -1023 -819
3670 -819 -287 -484 -765 -136 -22 -436 -327 270 197 -682 -889 -63 33 -231 -153 298 272 -152 21 505 389
3691 389 -443 -209 563 424 -336 -411 423 552 342 177 39 -265 -517 148 367 90 -603 -81 518 500 83
3712 83 231 269 -192 -520 -232 95 -378 -131 49 94 -99 -390 81 389 -157 -484 -99 -216 -519 -74 5
3733 5 241 -192 68 77 101 -413 -236 355 87 -363 -202 320 966 743 402 290 90 -61 218 815 624 250
3755 250 66 256 1008 937 582 863 461 40 53 295 216 78 220 120 -158 -130 97 251 -41 -177 -431
3776 -431 -444 -694 -167 49 103 -128 -482 -222 -348 -96 -471 -101 -502 -753 -643 -153 214 -215 -87 -276 -389
3797 -389 -487 -259 -90 -475 -1166 -841 -96 60 37 324 -154 -484 -439 -67 312 186 96 -231 -65 -99 197 346
3819 346 592 235 -725 -206 -417 -59 324 353 -49 -364 -497 -179 540 245 -141 -423 -820 -465 -106 781
3839 781 401 -53 -509 -489 -122 417 219 258 -495 -590 -435 221 842 556 186 151 -221 -254 196 754 185 -552
3861 -552 -78 83 248 536 795 786 -15 -187 228 115 266 741 315 63 194 238 722 758 702 -122 -372 -456
3883 -456 -84 133 786 190 -259 -329 -136 225 128 -75 -405 -591 -692 -297 219 609 -184 -730 -537 -241 -280
3904 -280 272 -64 -621 -905 -284 130 70 250 370 16 -453 -329 190 532 114 28 -11 8 73 571 600 983
3926 983 22 -532 -104 -196 46 325 305 -122 -394 -157 490 268 -29 -113 -426 -571 -613 62 744 149 -513
3947 -513 -880 -629 -239 -136 38 -175 -932 -1282 -394 24 345 88 -382 -388 -833 -519 103 128 -574 -1071 -95
3968 -95 12 -10 31 829 392 -257 -340 -23 -11 142 295 535 -123 -815 98 916 1186 81 64 146 -9 321
3990 321 611 669 407 -201 32 604 429 -22 429 579 -383 -298 304 1079 549 -55 313 137 -226 -137 927
4011 927 488 -488 -729 62 669 369 45 185 277 -362 -167 245 173 -181 -335 55 98 -478 -272 819 739
4032 739 -587 -245 284 -112 -88 557 603 -136 -597 26 1089 522 -550 -183 4 -296 -482 124 561 -26
4052 -26 -811 58 399 -458 -601 73 353 -929 -1241 -407 521 -449 -669 -100 -54 -808 -534 -27 -266 -946
4072 -946 -1068 31 124 -692 -484 374 267 -515 -381 -43 -293 -804 13 640 -176 -1095 12 1010 791 -284
4092 -284 -244 383 -289 -36 460 890 -119 -370 595 996 166 -39 243 927 -312 -402 172 597 133 92
4112 92 910 782 -87 -75 877 632 -771 -603 391 465 -265 100 564 446 -3 -94 451 -30 -780 -207 730
4133 730 354 -955 -481 1148 467 -410 -276 -215 -363 -487 460 323 -227 -739 330 790 -380 -636 141
4152 141 429 -151 -574 112 92 -417 -143 376 587 -519 -342 117 633 -380 -623 -97 169 -179 70 533
4172 533 258 -375 -318 220 -237 -777 -310 657 178 -862 -441 467 331 -147 -201 -148 -449 -1064 176 788
4192 788 -138 -980 -106 478 -71 -412 11 177 -804 -444 164 298 -413 -559 256 417 -560 -744 118 553
4212 553 -173 -679 -197 -406 -637 335 802 -120 -1059 -552 457 459 -623 -856 73 -161 -548 -70 660 68
4232 68 -402 -3 335 -208 -615 534 914 17 -315 -236 725 488 398 343 198 -622 -459 517 1044 31 -673
4253 -673 372 694 29 27 581 649 -76 -331 385 407 -312 403 1295 355 -600 -371 831 886 187 -159 237
4274 237 -84 -294 433 1202 849 -497 -251 432 241 -24 172 481 -441 -787 -217 374 235 52 -74 -88
4294 -88 -720 -582 583 561 -261 -866 -540 524 572 -111 456 58 -653 -508 437 110 -174 -249 76 298 -419
4315 -419 -378 473 386 37 -805 -648 -424 -351 340 447 -125 -876 -604 -136 111 -170 -234 -407 -684 -724 7 429
4337 429 108 -249 -438 -384 -482 -197 515 99 -289 -707 -514 430 363 198 184 -70 -779 -406 373 681 -198
4358 -198 -180 234 537 226 168 833 625 -128 -3 493 325 268 928 637 229 -514 -154 886 344 296 -121
4379 -121 -252 -373 -121 754 618 92 -372 -32 -370 161 -78 274 -154 -452 -419 4 589 456 158 -160
4399 -160 -136 -98 -390 37 195 -365 -549 12 409 173 265 84 192 -442 -480 82 194 97 322 103 347 -75
4421 -75 -82 576 755 -22 -255 -284 -42 288 575 637 56 -197 -249 172 500 208 -204 -175 -472 -290 178 717
4443 717 161 -315 -147 -117 -330 -90 -157 -290 -188 -293 -419 -109 108 347 -158 -525 -368 -162 -18 30 6
4464 6 -411 11 30 -211 -38 369 124 -110 -343 81 -104 132 130 207 -82 23 154 629 62 -66 -118 -274
4486 -274 11 -131 135 357 172 -226 263 67 117 71 -97 -66 -49 -298 337 246 256 55 276 6 -180 -511
4508 -511 115 -107 -167 -63 -74 3 -28 -51 548 247 -93 -215 -194 6 200 343 72 75 197 492 629 450 369
4531 369 64 103 324 365 402 469 372 -279 249 549 390 68 7 -87 -337 214 97 257 80 25 297 341 -201
4554 -201 -381 220 196 -263 -566 -176 -267 -357 -234 69 29 -408 -375 -538 -607 -247 -94 -56 -213 -400 -294 -12
4576 -12 -15 -317 -292 -681 -649 -550 -50 -16 -235 -411 88 -97 -20 181 105 -283 -155 -173 -8 281 43 350 322 211
4600 211 -124 -70 396 315 -123 -61 205 -95 -235 -15 418 184 -179 -426 149 161 -163 92 212 -72 -230
4621 -230 52 588 60 -126 82 -257 -230 -24 303 507 152 -372 259 509 298 262 135 -73 15 -52 252
4642 252 623 102 195 193 347 -269 -189 689 336 -190 -118 -59 207 77 288 534 -53 -247 -197 133 154 203 -107
4665 -107 172 -282 -247 180 421 179 -472 106 -118 -204 -160 352 245 -452 -617 167 459 319 22 -324 -280
4686 -280 -442 -405 436 153 -98 -129 -3 210 -156 -152 255 379 -389 -370 73 85 169 512 400 -196 -669 -399
4708 -399 557 342 -17 -139 -186 -374 -598 93 297 -304 -512 -67 419 85 -367 156 50 -404 -582 47
4728 47 349 -96 -271 -377 -442 -605 -480 -105 310 -693 -400 -46 178 -186 -286 209 -3 -614 -527 301 -40
4749 -40 -165 221 579 301 -340 155 691 507 -36 -485 54 67 266 732 612 -243 -485 71 755 285 -111
4770 -111 118 227 98 -181 468 908 -112 -20 100 -38 -94 32 803 438 -385 -430 452 479 549 45 507
4791 507 -96 -588 102 676 450 -19 -441 700 341 -93 41 430 250 -366 -334 82 -253 268 175 531
4811 531 -404 -776 83 469 337 -571 -314 -514 -320 -122 518 155 -493 -615 35 377 -450 -546 -41 -100 -330
4832 -330 -571 47 291 -227 -12 173 -153 -646 -196 322 -69 -638 -544 -66 299 -35 -63 248 -453 -732 -155
4853 -155 329 76 -340 -3 586 188 -301 -279 273 104 -281 192 60 -310 -116 566 498 -165 -825 513
4873 513 390 89 181 -142 -184 -367 -24 364 260 -401 -120 241 46 -624 -320 413 300 -528 -164 197 385
4894 385 73 33 234 -149 -660 -298 851 277 -347 -204 469 106 52 366 611 -13 -169 292 -117 -34 -117
4915 -117 704 685 251 -220 371 695 241 94 -169 179 -117 232 603 637 -137 -95 640 436 -29 -171 167
4936 167 166 -134 -12 292 121 -432 135 213 -296 -789 -567 301 -237 -563 -199 -79 -14 -44 184 -57 -265 -690
4958 -690 -253 -87 -195 -411 40 373 -40 -479 17 189 -11 -222 -120 -21 -233 -95 373 338 -128 -423 247
4979 247 381 -6 -281 110 -27 -209 115 257 -37 -409 139 217 -62 -400 -311 144 133 -125 192 -134 -390
5000 -390 -117 190 65 -231 -422 -311 239 -331 -480 -121 302 142 -220 -160 328 55 -283 90 -54 -231
5020 -231 15 434 675 33 -209 290 427 254 65 325 243 -55 349 437 383 10 332 390 466 192 -114 169
5042 169 34 269 257 266 159 363 420 470 125 90 67 363 18 -128 45 202 -330 -320 182 465 -460 -211 -268
5065 -268 -243 -286 -393 289 71 -146 -553 -162 -163 190 -247 4 -405 -390 -99 -18 232 65 172 110 132 -299 20
5088 20 64 214 -132 -194 56 -47 152 199 149 -72 -472 -153 -244 76 -247 -145 -11 -388 -178 86 50 -153
5110 -153 -474 -563 -215 -358 -243 -66 -119 -374 -468 -31 87 -254 -161 -105 -152 -490 -187 304 524 -311 -200 100
5132 100 59 -80 276 293 218 32 -262 -41 40 515 489 505 101 -216 -14 157 433 251 25 99 179 606 668
5155 668 641 -75 -64 -250 129 135 446 113 92 -76 190 206 286 206 -210 -252 -373 -225 4 349 416 -372 -190
5178 -190 -117 -25 2 23 204 -220 -379 -175 -262 401 262 264 -92 -238 -98 77 443 177 -27 -41 41 131 132 480
5202 480 226 146 -84 -335 485 290 117 -27 -187 77 -95 197 200 -117 -211 -212 -255 -209 39 94 -19 -397 -145
5225 -145 -234 69 -32 -239 -330 -250 -308 -157 -4 -118 -136 -150 -412 -222 -150 -116 70 -379 -416 -487 -227 116 14
5248 14 -171 -49 -403 -469 34 210 -75 -138 -409 -138 -56 42 366 365 33 -55 -104 182 181 239 266 -75 -55 -60 285
5273 285 407 -209 -83 -163 -351 -84 166 296 205 -113 -202 -86 -79 -192 320 -135 105 -190 113 155 81 1 249
5296 249 260 182 34 195 -121 296 -18 -251 96 365 431 752 319 -315 -120 368 542 160 175 201 479 -55
5318 -55 387 541 281 39 -134 184 101 -250 -222 79 248 189 -44 -114 78 9 -171 -437 -52 -459 -473 -153
5340 -153 -270 -392 -201 -22 -280 -468 30 -100 -199 -544 -378 -103 -46 -89 94 168 -69 -303 -160 -18 -259
5361 -259 -276 -68 90 51 50 65 -195 -230 36 339 23 -172 -157 358 131 -174 1 229 98 117 253 339 -76
5384 -76 -402 149 38 402 -133 -207 252 -201 -32 -23 310 -148 -296 -199 229 128 -6 36 276 -54 -401 -41
5406 -41 62 -87 -130 109 -88 -32 69 187 143 -343 -618 251 339 -92 -270 208 159 264 90 415 -89 -85 323
5429 323 402 152 -152 -55 366 435 -23 193 201 81 -172 339 341 -232 -304 -54 457 26 -501 -73 260 258 -149
5452 -149 -28 -229 64 -238 196 72 -86 -249 549 93 -415 -225 80 -105 -107 139 378 60 -429 75 172
5473 172 148 -321 -257 358 -57 -684 -233 32 183 14 109 -192 -151 -143 256 362 -211 -442 -207 47 56 -429 95
5496 95 141 -290 -419 135 188 -68 -418 -35 80 -312 -155 227 -140 -46 -153 -319 -60 -228 -58 64 -85
5517 -85 -706 -106 154 482 -219 -276 69 -90 -291 -72 170 -555 -195 88 80 -43 -41 262 476 -71 -443 136
5539 136 539 399 211 188 128 265 470 551 491 -102 -91 70 289 117 169 431 -124 -107 -151 318 407 -321 -69
5562 -69 184 120 -397 -160 409 192 -260 -330 -38 41 -191 -94 -78 -161 -319 -245 188 188 -43 371 -13 -245 -333 88
5586 88 243 324 -2 98 275 11 51 438 506 -290 -405 3 422 -88 234 134 -205 -224 165 206 20 -328
5608 -328 -413 -90 270 -428 -141 229 200 -314 -318 -45 -226 -260 -100 -284 -308 -558 -362 414 74 83 -92 -127 -513
5631 -513 -383 281 98 24 -196 -5 149 -209 -6 184 13 122 -479 -196 204 186 119 138 -286 -112 -161 423
5653 423 322 -455 -425 86 280 -2 -70 114 191 16 295 28 78 -393 75 44 -9 10 231 214 150 -122 -1
5676 -1 -148 73 -151 137 608 -233 -116 -153 327 154 -124 156 210 69 -342 43 8 93 -76 -17 -153 -28
5698 -28 340 780 125 -148 -119 31 458 -52 32 184 210 10 229 375 283 -299 -236 329 -158 -197 124 305
5720 305 134 212 299 -71 -191 -45 60 38 -222 -264 211 -40 -18 -386 -248 -81 -183 102 -142 300 -158 -352
5742 -352 -314 -13 -42 87 171 -125 -307 -277 -255 -284 -300 -437 -178 -200 58 -135 138 237 -106 -147 -268 21 133
5765 133 48 -95 18 -101 47 -150 -323 -327 -220 -22 -297 -267 119 27 269 -40 164 -19 46 -172 -99 61
5787 61 -235 -123 -211 -50 -328 43 24 -160 -351 76 470 112 -96 -189 -30 371 57 298 249 356 -17 73
5809 73 342 327 286 -123 48 303 223 105 437 223 436 208 245 86 -254 224 559 362 23 152 427 261
5831 261 -194 189 146 110 -181 -95 14 123 306 170 11 -284 -124 -124 -228 -47 -336 -229 -172 -283 117 -330
5853 -330 -98 -347 -62 35 -80 -126 162 30 -156 190 178 -155 66 -191 15 73 -387 -220 -218 402 -77 -113
5875 -113 142 -82 131 -210 -171 -291 -158 -15 -75 43 55 32 -140 -135 -236 -215 -69 -58 29 -531 12 59 -130
5898 -130 -212 77 127 -80 -153 -97 185 -300 -10 -227 19 -2 27 260 -69 144 -76 52 -96 26 47 197
5920 197 220 165 -84 -98 285 225 226 -69 44 52 24 365 302 -20 310 137 -144 4 256 63 -40 -29 51 9
5944 9 -117 82 111 -26 -53 -21 -8 54 -9 -275 -183 26 -79 276 191 132 -96 -131 -129 -380 -57 -3 459 115 77
5969 77 -108 236 71 107 534 198 55 105 -92 552 303 164 177 148 281 131 405 120 -410 -385 49 184
5991 184 -49 89 103 -173 -319 -80 -187 -31 -205 -319 -386 -587 -222 -46 -111 -374 -227 -260 -288 -22 -162 -303
6013 -303 -19 -475 -464 -94 244 333 -111 -235 40 92 -350 207 53 -191 -143 -107 -423 207 331 212 -34 -264
6035 -264 -298 140 89 -210 -100 -78 -215 90 -112 413 323 -40 -126 112 -146 -101 134 41 24 -276 -64 -90 -127
6058 -127 -176 303 130 -20 -232 144 725 114 49 47 137 159 166 290 149 195 345 68 162 45 264 487 -122
6081 -122 -192 -290 521 346 95 -205 204 155 -234 114 0 53 -429 -346 201 347 0 -70 -91 -58 -139 186 -121
6104 -121 -276 -41 38 27 -164 -511 -56 342 -22 -78 -201 37 -159 50 -92 72 -301 -41 182 299 -283
6125 -283 137 209 -201 -250 -332 240 92 -39 52 207 -72 -103 366 454 94 -551 -155 235 -69 -194 -278 -201 15
6148 15 18 3 297 -518 -225 18 110 20 -140 29 37 -74 73 59 -9 79 -54 226 47 -21 -133 36 341 -162
6172 -162 97 195 72 -263 316 454 -35 -354 -79 285 182 -178 16 203 118 -156 -158 149 203 20 15 250
6194 250 272 7 137 75 -226 -205 -33 108 -46 -312 25 388 302 -252 67 471 73 8 54 373 131 -212
6216 -212 163 442 24 39 -319 -154 -26 47 516 235 -107 -47 389 262 58 175 209 227 -332 221 216 198 -101
6239 -101 -467 -150 -118 -67 -81 158 12 -299 114 117 -107 -265 -154 91 55 -328 103 131 -54 -152 -209 192 202
6262 202 -422 78 136 -65 138 -296 132 -307 45 181 -149 -287 -126 338 193 -361 -346 -159 72 -298 -200
6283 -200 -254 -217 -281 -284 -33 -108 -284 -288 -12 -71 -132 -436 42 -209 -182 254 -100 -145 -457 -169 567 101 -43 168
6307 168 170 47 -87 -324 121 40 -37 17 78 198 331 328 139 -139 1 532 344 94 300 195 335 -240 391
6330 391 279 133 25 450 268 303 163 119 -112 -51 144 90 -57 -234 -63 1 112 -112 -82 -40 25 -97 13
6353 13 25 236 2 -420 -71 171 194 68 -32 98 -90 -107 344 -140 -12 -57 421 398 111 139 159 75 2
6376 2 91 -44 385 -149 -185 169 385 -128 -62 -107 -182 -52 -92 -31 39 -210 -61 126 -364 -557 -61 12 -224 -316
6400 -316 -118 -287 -239 -420 -199 5 -186 -230 -213 -91 330 82 79 -131 -215 -78 325 625 -147 -141 51 -6 121
6423 121 9 -57 261 63 -210 62 272 -35 58 108 -152 -15 174 -36 -55 -33 15 9 28 -58 343 234 113
6446 113 29 -129 147 -76 -75 54 0 193 -114 147 -27 -191 516 -62 -99 -129 -14 218 123 92 -52 36 383
6469 383 43 165 252 182 33 -24 70 295 300 156 -261 111 176 492 308 410 -69 -160 -115 -32 -53 248 56 100
6493 100 -266 108 -153 -27 -174 55 152 -100 -180 -129 83 42 -10 -224 -298 -217 -100 404 -173 -482 -339 -243 -237
6516 -237 -153 -266 119 -18 -327 -359 -297 235 193 -178 -53 -113 100 38 -136 -185 57 -265 166 -41 -219 32
6538 32 61 58 -365 -32 189 -78 -125 -226 -100 -9 90 -204 91 -226 -140 -351 -479 -25 17 93 -183 11 224
6561 224 -255 304 16 -128 36 29 -6 182 52 134 258 229 -67 -161 106 176 359 150 -205 109 -15 134
6583 134 99 19 155 114 223 186 301 46 151 -130 187 96 122 -47 233 297 -9 170 -188 -165 385 92 -266
6606 -266 -30 -81 -53 319 -201 -456 330 -35 25 -156 -171 -51 -165 -188 149 -101 -119 70 -24 -256 -158 285 -39
6629 -39 -209 -307 109 -19 21 16 -173 103 277 96 -176 40 93 115 49 -67 63 310 124 143 74 138 -280 -57
6653 -57 -248 -249 48 118 -14 -141 -173 279 -145 -219 206 176 -124 -647 -57 -181 -315 -93 -266 -326 -320 6 -57 -74
6677 -74 -352 -178 219 -122 -195 -48 234 -286 -196 -119 -97 -12 -13 -246 -52 408 127 52 -3 6 362 346 210 99
6701 99 92 459 292 -181 -49 38 40 41 124 -107 95 245 56 -33 -61 162 -20 -228 203 146 -187 -112 -58 81 277
6726 277 37 372 -176 -114 47 75 -192 -182 78 170 114 181 166 262 -52 38 -315 44 167 380 80 -104 -64
6749 -64 339 383 118 -65 339 -145 23 248 -28 341 -82 -274 -172 163 287 9 -139 -134 -186 125 104 131
6771 131 -213 -466 200 -186 -407 -21 -113 -209 -454 -213 -162 -289 -209 -428 227 3 -108 -184 -59 -150 -169 188
6793 188 -172 -212 -66 -58 389 -263 -192 -226 115 108 -395 195 5 68 143 -101 33 309 30 -50 -522 -405 148
6816 148 -57 -307 -393 -133 82 204 -436 8 341 -169 -355 -263 -113 57 -106 116 -167 -64 -131 -164 56
6837 56 218 94 116 -54 224 271 295 267 -192 31 702 221 183 193 292 165 146 48 74 99 19 71 154 27 -107
6862 -107 192 -20 -107 -100 197 209 -147 -17 131 199 -169 -245 -172 195 -302 -257 45 42 56 -176 162 43 -124 -246
6886 -246 2 25 -355 -133 563 16 -147 32 50 525 16 -52 -125 75 -409 6 115 269 247 -73 101 51
6908 51 91 -12 245 -87 -249 -165 139 -248 -56 -176 -67 -464 -291 -219 79 -214 -500 -607 -31 180 103 -326
6930 -326 -223 -128 45 -2 -122 -284 232 323 -200 -429 -51 184 124 265 50 -5 80 255 -74 229 40 -26
6952 -26 -175 -226 161 106 -162 84 -259 -158 66 307 -113 -179 -120 288 -119 -220 -267 -13 63 -339 25 310
6974 310 175 128 13 -272 -213 -163 201 60 -235 6 341 217 -156 -159 356 511 35 -112 227 413 -49 180
6996 180 723 463 -49 -192 229 292 350 35 -198 -168 65 99 130 3 -68 -294 291 230 -398 73 -26 -286 -167
7019 -167 -418 13 -76 -52 -145 -270 -77 -269 -122 -88 33 -163 11 22 -97 -60 349 -78 -275 15 252 111
7041 111 -188 91 -118 122 3 -430 213 118 253 -94 66 -55 -249 168 249 204 -354 220 176 52 -297
7062 -297 -160 10 -363 -335 -187 217 -67 37 -107 -80 -90 -99 45 -29 -14 -190 67 -264 -220 253 -46 -171 41
7085 41 39 -149 40 1 -159 153 144 273 -16 249 392 184 -82 441 85 71 163 307 -18 115 313 318 605
7108 605 -147 -110 64 146 0 347 130 173 -257 -25 152 267 -78 -138 -231 -242 -251 -142 -137 -83 288 -323 239 -306
7132 -306 70 251 -151 -79 -152 -34 7 28 -135 225 275 136 -108 -80 -168 -42 228 143 -98 -12 -35 233 -7
7155 -7 -67 -21 -68 190 -163 -144 49 161 -220 -160 16 -216 -212 -636 -239 -189 147 -66 -373 -420 -285 134 -111 -268
7179 -268 -445 -306 -144 14 -225 -288 2 -6 -212 -300 363 49 133 -88 52 148 31 -149 -2 69 -121 338
7201 338 337 59 -26 62 -176 77 42 267 175 192 -86 -237 -48 15 -76 -375 -246 93 -2 -233 -214 171 41 -245
7225 -245 -481 -416 11 135 78 -143 47 -56 -9 -41 83 374 -151 -139 -317 -11 112 237 23 227 127 307
7247 307 426 364 -81 59 342 105 270 11 423 251 287 13 389 292 353 148 -64 -147 261 -61 -67 -233
7269 -233 1 78 -100 210 -205 132 101 -255 -308 -286 -171 133 -122 -28 -102 17 151 -336 -155 -77 -90 -74 -55
7292 -55 -195 -6 250 -175 -136 -55 100 67 -205 68 95 -96 5 -173 -192 435 165 -179 -156 -147 79 21 81 158
7316 158 -128 157 -213 41 -446 1 262 -96 -297 -153 215 113 -196 -23 -249 95 -424 -150 175 141
7336 141 82 20 -238 -143 247 164 -141 -18 -149 255 -57 -38 -178 357 270 20 37 409 201 -106 37 -204
7358 -204 65 19 141 47 -16 20 358 282 369 -14 400 496 -105 145 -40 185 -134 -60 108 231 255 -340 -177
7381 -177 81 -24 -217 -32 -217 50 95 323 -32 -136 366 241 112 78 -198 -248 15 -333 33 104 467
7402 467 85 -68 -20 -182 204 270 -49 45 -40 203 -45 64 115 452 -28 -198 -72 103 -70 -149 -123 -292
7424 -292 -13 -55 -173 -69 -187 157 -218 -219 -439 36 370 -2 70 -327 1 52 242 40 -127 -225 -147 -274
7446 -274 20 71 -72 -444 -308 -38 -144 1 -180 -209 -509 -123 133 -112 32 154 -224 208 -178 -57 212
7467 212 226 231 138 145 383 86 46 -68 48 80 -105 -276 168 43 143 123 -17 -299 201 358 34 -263 62
7490 62 -109 -31 157 133 333 -140 -215 -48 95 151 121 290 247 175 139 367 258 -182 70 381 398 188 -507
7513 -507 301 6 45 112 395 283 103 112 17 60 -124 58 38 129 -63 120 -41 -84 -103 171 43 60 -420 155
7537 155 330 -43 -184 230 210 -54 -61 -155 -128 -8 183 -133 -199 -230 53 105 -158 -241 -72 -32 143 -145 -76 -97
7561 -97 93 -55 -385 157 238 -95 33 10 -1 -244 -42 -429 -65 80 32 280 -46 6 154 79 101 -79 -67
7584 -67 118 -299 -373 -286 -123 -283 -102 -73 118 -119 -68 -218 -228 -160 108 -28 13 -297 10 271 255 -84 116
7607 116 419 385 -98 91 50 240 48 24 54 53 161 316 -154 -62 364 -142 435 81 -66 130 513 -112
7629 -112 -382 100 446 -124 -59 54 279 172 -106 113 172 -24 -38 147 -179 -199 182 232 -205 113 137 30
7651 30 382 0 41 -78 180 -273 -319 207 325 -209 -116 123 60 131 211 -79 -24 45 235 -227 -419 -66 36
7674 36 132 -43 -275 -166 113 75 76 111 177 0 -292 -45 130 277 -387 -442 -226 -221 -14 22 56 -25 -224 -59
7698 -59 -91 7 -151 208 56 -192 -293 -50 40 -157 -135 -258 -88 100 65 -358 -223 -131 75 -7 -172 -68 262
7721 262 -50 -71 -258 191 9 -123 -79 -56 164 -50 -150 236 398 95 51 -126 -150 -47 -1 227 -160 -274
7743 -274 -57 75 80 -155 -29 195 -44 4 -44 -79 20 334 -158 -156 60 -10 151 9 -8 114 217 -25 506
7766 506 117 99 335 81 -336 233 152 399 88 -21 148 193 238 -46 190 239 -260 -88 60 -2 354 -59
7788 -59 -32 -59 137 259 240 -198 -373 10 -278 -166 -465 229 144 -75 -209 -276 134 -125 -95 179 46 58 -78
7811 -78 -202 2 -200 143 74 -179 163 -34 393 -15 -179 -138 -99 -28 -150 -156 18 162 137 10 58 166 -131
7834 -131 -39 -241 16 183 -2 -366 -345 -286 -235 -17 -81 2 47 -47 -77 -77 -358 -84 128 1 -38 -156 71 0
7858 0 -64 -109 97 -12 -55 -79 -237 -1 152 -63 127 -30 254 96 -133 -154 210 106 225 -51 159 286
7880 286 194 26 16 -185 32 369 109 -250 -93 65 -146 6 -106 -82 125 -124 9 214 35 -65 -241
7901 -241 89 148 34 -54 34 -157 58 226 130 147 15 -49 106 278 -153 138 40 156 42 149 -248 24
7923 24 290 82 141 220 -162 -28 -274 76 274 249 106 167 -147 -76 -5 -347 83 -371 -173 -353 -350 -203 96
7946 96 -45 -359 -210 -94 -62 -235 -33 34 -114 -29 116 42 34 -27 -53 -28 71 -355 443 273 -182 -113 -14 89
7970 89 -199 -68 -125 -41 205 -407 -399 -102 55 -4 -60 -127 -5 198 130 -177 -14 78 -67 -142 67 240 92 -62
7994 -62 -143 -124 71 -119 -169 -243 -74 59 -133 -67 -227 -167 -48 273 -133 35 -5 228 198 -275 11 248 130
8017 130 63 260 196 204 181 151 -54 -74 254 212 62 77 130 387 315 28 -5 -10 -88 -55 -18 228 196 79 107 -39
8043 -39 157 -189 19 -134 24 255 -19 35 -284 -82 -124 71 -207 -355 -466 24 -76 -253 -78 -254 -190
8064 -190 -399 -230 6 -57 -538 -72 -3 5 126 254 177 -207 285 68 -95 44 160 -226 87 -127 -109 209
8086 209 -162 -230 -17 225 -85 120 10 -201 24 276 -155 -104 -102 -126 -122 -106 -163 -185 -166 45 63 -210 -238 -1
8110 -1 2 55 -10 3 -101 -385 -313 -165 -141 -67 43 -15 -235 57 185 102 7 39 299 -115 31 63 174 195 -245
8135 -245 -111 321 -12 -12 99 459 216 23 -3 177 31 66 22 55 -85 75 126 223 -214 94 -126 78 70
8158 70 186 174 58 -154 -183 -178 95 91 277 -2 -354 86 102 280 176 202 -136 102 3 33 -90 436 231 330
8182 330 20 -101 96 94 -63 182 34 -40 -45
8191d5
$$ Imaginary data points
##PAGE= N=2
##DATA TABLE= (X++(I..I)), XYDATA
0 0 0 0 0 0 0 0 8 -8 8 -8 16 -16 24 -27 32 -40 49 -58 72 -82 97 -113 130 -150 173 -199 224 -256 289 -328
30 -328 369 -415 465 -519 578 -647 719 -797 886 -982 1086 -1202 1331 -1474 1631 -1813 2013
47 2013 -2244 2510 -2817 3183 -3621 4163 -4848 5748 -6989 8819 -11798 17483 -32302 152574
61 152574 335288 57506 -20322 87677 204989 129310 60239 57002 63201 5632 6723 63788
73 63788 91003 39566 12312 22657 27663 10253 23234 27783 -11891 -56651 -47129 -40086 -77772
86 -77772 -101781 -51241 -8944 -53672 -121272 -95865 -2254 43396 1313 -58965 -73826 -35130
98 -35130 14042 16082 -37939 -72977 -35158 14617 -12 -30267 4076 57019 40324 -8069
110 -8069 8374 64456 61144 10149 5793 46183 46577 4303 -4724 26016 38093 23637 19454
123 19454 18203 1226 653 35769 53255 14780 -23855 -9145 17555 1974 -26261 -17206 1924
136 1924 -17789 -51499 -44524 -1504 24081 6280 -33463 -49213 -15397 29149 19106 -36250
148 -36250 -52091 -884 28071 -15689 -50480 -2507 56522 30103 -34467 -28740 31982 52163
160 52163 21101 4737 13809 13441 8463 23779 38281 25306 8251 9578 7785 -883 18686
173 18686 53784 36309 -26103 -33681 35677 69505 7319 -50536 -16592 37744 14789 -43335
185 -43335 -43039 5610 24533 -7363 -40259 -37408 -11784 6339 -2705 -33395 -48802 -29709 -9368
198 -9368 -22240 -38135 -19751 1278 -21424 -54233 -33998 15149 17348 -25093 -41448 -10474
210 -10474 16897 10829 -2516 634 10381 14136 10175 997 1063 23094 43136 23182 -16047 -9865
224 -9865 43016 63072 18040 -23750 -3133 33549 24602 -7588 -9524 11751 12485 -7586 -15181
237 -15181 -1701 11748 6687 -12190 -25956 -18399 4352 10122 -12316 -28669 -9882 14025 2645
250 2645 -23377 -16161 13617 14505 -16192 -28592 -1817 25630 16476 -12154 -20529 1038 23046
263 23046 16303 -11822 -24273 -3218 21220 9381 -20382 -18483 14251 22878 -7703 -27425 -4833
276 -4833 20519 5188 -24688 -23232 4322 14438 -3898 -20417 -11636 7338 9005 -9457 -23630
289 -23630 -12119 10632 8932 -18435 -28884 -1823 23164 6877 -25478 -23830 7749 17824
301 17824 -7412 -26598 -8977 15927 11462 -11179 -15195 5774 21791 9980 -12812 -13925 8691
314 8691 22084 6465 -12343 -2279 22048 22277 -2316 -11730 11027 30367 13571 -15821 -13965
327 -13965 14888 28405 11037 -9604 -5491 13616 17232 1093 -8415 2933 15443 4289 -16625
340 -16625 -13047 14498 27467 4672 -23571 -17431 12610 21618 -1329 -19887 -8775 10006 6457
353 6457 -10215 -9731 10353 19170 -1700 -24398 -15657 13177 21777 -2077 -23301 -13142 12401
366 12401 15370 -4726 -13643 2750 13530 -2520 -23143 -14721 13326 21182 -4095 -27190 -15462
379 -15462 13110 17962 -4836 -19829 -8511 5069 -2707 -17282 -11066 10943 15350 -9435 -29513
392 -29513 -14152 16213 20014 -7295 -27535 -15894 7526 9961 -5374 -9026 5843 11193 -4983
405 -4983 -18626 -5205 19621 19989 -6789 -23953 -7159 20641 22839 2866 -7904 3518 13761
418 13761 4753 -7645 906 20397 19918 -4133 -18372 -3 26381 26083 39 -15998 -5499
431 -5499 10921 8018 -5111 -3768 9944 9038 -10381 -20121 -1639 21624 15153 -15975 -31365
444 -31365 -11856 13452 11644 -8453 -14286 -2177 4285 -5755 -13262 -1722 13949 7074 -18061
457 -18061 -26203 -2846 22411 17424 -8802 -18886 -1970 12404 3607 -9162 -2382 12313 6525
470 6525 -13737 -16722 7337 27101 16216 -12248 -20955 -1569 18006 13656 -4417 -7781 5178
483 5178 10782 -1382 -8513 7056 24200 12607 -16564 -22820 2550 23214 13215 -9010 -13211
496 -13211 179 7920 1549 -4328 1023 7817 -75 -17003 -18493 3470 23499 12225 -16660
509 -16660 -23088 1693 20009 8033 -10934 -6938 7149 4000 -9519 -7655 12265 21285 5861
522 5861 -14704 -15645 3939 18976 10931 -10720 -17085 -1988 10253 1230 -10045 -628 11843
535 11843 -378 -24401 -21587 6438 17787 -2848 -24115 -18335 1005 6733 -2071 -8640 -7350
548 -7350 -2971 -6103 -13566 -12808 2196 13791 885 -23069 -21218 7883 21157 128 -21629
561 -21629 -12799 7045 4494 -9967 -7876 8712 12426 -1493 -12750 -6720 9087 17410 8012
574 8012 -9403 -12147 6149 21236 11987 -3000 4091 18453 10966 -7621 -2213 21300 23531
587 23531 -341 -12695 1977 18347 14457 2693 -931 1278 2309 664 -3721 -7145 1438 11308
601 11308 105 -23047 -20572 11062 23866 -4730 -32606 -20028 9217 10004 -9866 -13914 -1925
614 -1925 2342 -3488 -5109 -813 2239 3401 624 -7105 -8314 4887 14673 4199 -9302 374
628 374 16336 7061 -12852 -5810 19614 17374 -11723 -20928 4357 23795 11968 -7991 -11493
641 -11493 -1295 9339 10221 -2099 -15312 -9019 10644 11305 -11276 -20110 2673 17344 -2976
654 -2976 -23965 -11621 7966 159 -16124 -9761 5244 411 -12816 -9853 4846 8018 -1333
667 -1333 -8641 -8318 445 13573 15332 -456 -10548 8328 31169 19035 -8128 -3104 25544
680 25544 29055 4139 -5993 12176 25958 17109 4361 3486 7377 9193 10040 4887 -6630 -6966
694 -6966 5174 6161 -11279 -16293 1754 6991 -15458 -28172 -8555 7004 -10268 -29651 -18042
707 -18042 2092 -1723 -17188 -15091 -3178 -2708 -8755 -7682 -5459 -5019 1511 6240 -2503 -10190 5775
722 5775 25335 13559 -12625 -8783 21808 30256 6535 -7800 7080 23447 19015 10644 9441
735 9441 10344 10670 14010 12625 3278 2036 13090 14843 -626 -6402 8737 14739 -3887 -15194
749 -15194 896 11202 -9830 -27788 -10313 12106 1301 -23989 -24975 -6422 2453 -4345 -14585
762 -14585 -21172 -18179 -3271 5859 -7334 -22066 -9908 13882 9362 -16413 -16359 10449 19430 -777
776 -777 -11678 2550 14186 7973 3922 10915 12526 4011 -258 5183 10392 12054 9485 272 -8032
791 -8032 -59 19253 18286 -7310 -18423 1847 16089 -1017 -19637 -7766 11162 4000 -16244
804 -16244 -17662 -2961 4671 -491 -9898 -17995 -18828 -6843 4746 -2788 -18175 -15400 -874 -2092
818 -2092 -14338 -9905 5340 1585 -17473 -18838 2630 12950 710 -8801 -1040 7092 3724 619
832 619 3909 7939 9323 9002 2676 -2403 7203 24897 23493 -654 -11619 8134 25890 13998
846 13998 -5772 -2538 12149 10298 -1771 -2852 5345 7664 1155 -5621 -9092 -8356 -445 4188
860 4188 -4410 -14538 -9809 673 -3260 -13053 -7026 5713 -1716 -21191 -19658 3393 13851 -1007
874 -1007 -15131 -9661 3205 5129 709 -1533 -616 1562 2304 -1594 -4272 4239 17202 13503 -6768
889 -6768 -14029 4944 21513 11402 -6391 -5560 5892 7230 256 2344 9662 8061 -2438 -7967
903 -7967 -3283 4545 8177 3547 -8080 -11955 -2026 7815 2272 -8681 -6244 2749 -2033 -15491
917 -15491 -12856 4688 10232 -5677 -18785 -11142 4437 7682 -977 -8506 -8332 -2852 1033 -1452
931 -1452 -4058 1101 7958 3922 -8587 -8555 7355 16625 4847 -10201 -6468 6798 9243 2087
945 2087 1102 6636 6483 -1155 -4871 831 9283 9566 -531 -9627 -6864 6326 12205 3286 -8084
960 -8084 -5096 4316 2633 -7448 -6920 4730 7858 -4090 -13662 -6273 7228 9890 -807 -9500
974 -9500 -8020 -572 3040 -220 -3211 77 3707 -661 -7437 -2965 9508 11565 -2466 -13263
988 -13263 -5270 9434 10926 298 -4116 1674 6387 2481 -2111 1570 7862 7031 -2141 -8085 -1629
1003 -1629 10155 12340 913 -8219 -2378 7476 6273 -3085 -4872 2919 5988 -2465 -8801 -1838
1017 -1838 8880 7213 -5135 -11080 -4747 3941 3217 -4429 -7117 -1503 2483 -1803 -6806 -2817 5478
1032 5478 4471 -6240 -12864 -4278 7206 6479 -4145 -8697 -891 6246 2966 -3479 -2048 3668
1046 3668 3623 -3697 -7458 65 9025 6877 -3428 -7554 54 7944 4640 -4609 -5879 1457 4584
1061 4584 -1524 -6304 -902 7064 4923 -4836 -9046 -1383 6605 3134 -5806 -7469 805 5115 1080
1076 1080 -4942 -1806 5087 4205 -4533 -8407 -23 7829 4162 -5620 -6545 2665 8585 3790 -4289
1091 -4289 -3128 3797 5737 -1251 -5158 1060 7883 5926 -2610 -4086 4100 9990 3882 -4789 -3835
1106 -3835 4709 7543 560 -4843 -209 7108 5068 -3176 -5541 895 5307 432 -7312 -6157 1742
1121 1742 5216 -926 -7137 -3927 4138 4285 -4120 -8000 -1928 5194 2048 -5131 -5068 3802 7248 1333
1137 1333 -4858 -1611 6089 5861 -1364 -5025 215 6728 5016 -2113 -3572 3517 7136 861 -6895
1152 -6895 -4210 4775 5603 -3234 -8857 -2670 5739 4226 -3893 -6082 -1040 2761 -584 -5089 -3507
1167 -3507 2462 3574 -2251 -6356 -1046 7362 5978 -4135 -8385 -798 6474 2860 -5348 -4441 3499
1182 3499 5084 -1880 -5970 -595 5191 3190 -4692 -8028 -2330 5037 4777 -2689 -5740 -394 4816
1197 4816 1274 -4717 -2449 4931 3809 -4956 -6871 2190 8881 3944 -4312 -4612 1450 3296 628
1212 628 -2758 -2261 1321 1800 -2791 -5533 -210 7038 4547 -6920 -11770 -1515 8009 3563 -6869
1227 -6869 -6661 1573 3834 -1232 -2294 1778 3530 342 -4229 -3636 1631 6775 5335 -1296 -4137
1242 -4137 1756 7749 4579 -2338 -580 6330 3883 -5149 -4739 6852 11989 2814 -6751 -3560 4612
1257 4612 7325 2846 -1878 -2603 151 2500 1681 -1256 851 6281 4200 -6434 -9027 2376 10510
1272 10510 2558 -9116 -7266 1983 4168 -693 -1904 1245 279 -4261 -5320 -1195 2286 2739 583
1287 583 -4560 -5680 1089 8287 4315 -4555 -4028 4370 3746 -4287 -3219 7749 10016 -1585 -8888
1302 -8888 -2145 7492 6978 -310 -5357 -5709 -2405 2636 2585 -2956 -4809 -171 998 -6568 -9322 -207
1318 -207 6310 -1967 -12543 -8711 2208 3479 -2502 -2444 1011 -1611 -5913 -3183 3498 5002 1611
1333 1611 -2231 -4405 -2079 6959 11746 3381 -7838 -4635 8182 9029 -1996 -4843 5391 10171
1347 10171 607 -6307 275 8796 7037 651 -3027 -3759 -1000 5222 7440 1471 -3872 -1428 2627
1362 2627 158 -1229 3720 5228 -4724 -11387 -2138 9338 4753 -7009 -6777 882 1583 -4054 -4730
1377 -4730 -602 692 -1427 -3815 -5898 -4343 3339 8986 764 -11130 -8128 6641 9955 -1485
1391 -1485 -6197 1918 6164 541 -1862 5148 8777 2662 -2106 -64 2628 2475 3263 4202 872 -2514
1407 -2514 847 3405 -214 -2131 3613 3812 -6741 -12190 -1150 10068 3160 -10276 -9976 598
1421 598 3618 -2140 -5326 -3220 -2847 -3333 -2299 -3000 -3843 500 4988 -159 -9437 -6831 5820 7980
1437 7980 -2915 -7739 -199 4189 -322 -1225 5114 6107 -1701 -4953 1313 5485 3665 866 28
1452 28 -554 661 5261 5794 -561 -3349 3599 6935 -2547 -9089 -387 10272 4257 -8808 -8100 2220
1468 2220 5426 -350 -4409 -3921 -3982 -3148 -305 -757 -3777 -3373 646 -1012 -6071 -4098 3471 2265
1484 2265 -6366 -6777 2030 4722 -2716 -3996 3367 6395 -1205 -5440 522 5475 3940 260 -1368
1499 -1368 -983 2347 7114 5882 -1819 -3763 3900 8447 926 -6001 124 8939 5144 -3567 -2860
1514 -2860 4746 6086 543 -1416 358 -27 -440 1063 1679 -505 -726 861 199 -2398 -502 3700
1530 3700 258 -7149 -5206 3860 4712 -4380 -7582 58 5196 -581 -5895 -3637 1295 1248 -1207 -2996
1546 -2996 -2693 -87 3666 3019 -2721 -4469 2025 6427 396 -5846 -1564 5453 3168 -3240 -1506
1561 -1506 3972 3303 -1848 -1890 1680 1959 -1038 -2763 -1136 672 1180 1063 -2223 -4174 -869 3687
1577 3687 -173 -6921 -5419 2397 3665 -4244 -7066 -559 4738 553 -4826 -3827 -84 1119 -773
1592 -773 -1911 -1889 -729 1439 1386 -887 -1001 2648 3325 -1817 -4583 993 5825 2738 -2986 -1458 4204
1609 4204 4482 264 -887 2703 3420 643 -1209 -374 2614 4162 3040 -1195 -2548 1345 5763 2473
1625 2473 -3386 -3224 2548 3428 -1618 -3515 1285 4925 680 -4586 -3558 930 2281 -794 -3209
1640 -3209 -3197 -1116 596 235 -1461 -905 563 -188 -4085 -4097 1496 4752 230 -5604 -3382 3499 5131
1657 5131 924 -1948 349 2084 713 -793 498 3255 3906 1621 -1579 -819 3614 6112 2643
1672 2643 -2821 -2786 1946 3552 37 -1601 1796 3162 -507 -3887 -1803 2595 3198 -1530 -4946 -3696
1688 -3696 271 1993 254 -1948 -1757 -318 -980 -3761 -2943 1488 2129 -2547 -6711 -3775 2708 4049
1704 4049 -678 -4410 -3058 -65 584 -1338 -1249 1034 1234 -1601 -3087 -348 4418 4816 -390 -4477
1720 -4477 -2278 2640 4099 814 -756 778 2362 1173 -1080 1047 4793 3284 -1659 -4274 -1452
1735 -1452 3291 4281 599 -2501 -1635 831 349 -1216 -1134 686 183 -3155 -4798 -1258 3949 3699 -1646
1752 -1646 -5008 -2551 1588 1834 -366 -1598 174 371 -997 -1065 1797 4577 2993 -1880 -3926 -698
1768 -698 4506 4185 346 -2310 -282 2546 2142 777 1099 3033 1872 -2042 -3086 1080 4501 3811
1784 3811 -704 -2635 -107 3012 2433 -160 -926 594 562 -2064 -2771 777 4466 2227 -2900 -5059
1800 -5059 -1184 2815 1963 -1910 -3531 -2209 -592 -1150 -1303 751 1782 -156 -3708 -4347 -457 3617
1816 3617 1768 -3070 -4433 -761 2645 1547 -377 -429 666 -283 -2641 -2075 1067 3146 830 -2902
1832 -2902 -3352 311 3280 2177 -1205 -2413 -788 351 -966 -1962 737 3048 792 -3037 -2695 1792
1848 1792 3995 1433 -2045 -2470 -70 1729 1350 589 559 1386 489 -1701 -1973 1154 3489 932 -4074
1865 -4074 -3961 545 3512 832 -2068 -1250 35 -576 -2258 -1348 1086 1159 -876 -2756 -1679 1510
1881 1510 3812 1701 -2007 -2387 1004 3110 508 -1465 994 3889 1726 -1387 -486 3275 4216 793
1897 793 -2028 -1057 1040 2009 1535 616 -23 333 873 38 -781 717 2408 -470 -3619 -2282 2577
1914 2577 3838 -202 -2955 -531 2110 687 -1614 -1270 714 363 -810 -1660 -1451 326 1872 836
1930 836 -2979 -3524 -79 2178 -556 -3687 -1819 1694 621 -2308 -1415 2018 1383 -1756 -2089 -88
1946 -88 1032 32 -76 154 878 1354 1550 165 -728 875 2747 546 -3418 -2125 3251 4278 -770
1963 -770 -3646 320 3430 911 -2339 -1925 -107 -194 -693 -965 -952 -1133 96 1007 -1814 -3100 -861
1980 -861 1301 -1315 -4032 -1128 2227 -105 -3667 -1641 2337 871 -3067 -2502 625 727 -1426 -1476
1996 -1476 89 618 844 1159 150 -2077 222 3822 1964 -2901 -2489 3481 5082 483 -1946 2090
2012 2090 4326 1730 -915 545 2078 1257 884 1412 684 -516 844 2565 1065 -1640 -232 1066
2028 1066 -1165 -2519 656 2735 -954 -4637 -1396 3881 1937 -3375 -3281 671 1068 -1584 -1244 222
2044 222 234 446 1209 -215 -2373 -258 3611 2394 -3364 -4223 1558 4617 554 -2084 479 1933
2060 1933 -538 -1355 1216 2215 -1328 -2481 223 1628 -328 235 1269 202 -1244 -22 1131 -1219
2076 -1219 -2874 757 3824 -997 -5649 -1472 4846 3405 -3601 -4787 -963 378 -598 -625 -694 -2377
2092 -2377 -2459 239 506 -2062 -2300 826 459 -3901 -4193 939 3347 -465 -2425 315 1607 -1390
2108 -1390 -1381 2875 3316 -1203 -3334 50 3283 2563 1532 764 -385 -630 2083 3963 586 -2519 390
2125 390 4147 922 -3247 -106 4766 3561 -2359 -3520 90 1587 376 795 263 -2175 -2762 685
2141 685 2586 561 -1721 -994 -691 -2455 -1249 2209 1988 -2615 -3705 602 2557 -1298 -2321 1220
2157 1220 1901 -1858 -4048 -699 2124 1937 449 -313 -1698 -1676 2341 4590 536 -3663 -1434 3052
2173 3052 2280 -1220 317 3607 1862 -1979 -1158 2213 2420 527 421 1257 -641 -1029 1829 3477
2189 3477 1403 -802 -429 -422 -1421 544 3562 1455 -3698 -3656 1763 4173 584 -2914 -1172 362 -1270
2206 -1270 -2346 -389 960 -55 -1133 -1405 -1429 -1779 976 2117 -1542 -4867 -3312 906 700 -1272
2222 -1272 -944 689 -1139 -2941 -1075 2243 1183 -2377 -2321 -608 315 3 730 1463 87 -482 -130
2239 -130 -93 -724 489 3006 955 -2927 -2752 2305 4999 1414 -2314 -1337 732 527 -25 853 954
2256 954 -284 -800 256 290 521 1061 969 -982 -2371 -792 1962 1001 -1192 -324 1455 -152 -1594
2273 -1594 -130 2794 1940 -1850 -2348 -26 1839 1536 1066 334 -316 -9 1395 1349 -302 -233 1588 933
2291 933 -1651 -1415 2558 3545 663 -1995 -1021 1051 983 370 363 345 -634 -447 661 1487 1087 651 -12
2310 -12 -1205 -1172 525 1943 -21 -1772 -950 898 684 -1174 -395 795 387 -1877 -2946 -762 165
2327 165 247 -825 -1427 -1919 -926 495 -110 -1531 -1545 -838 -651 -1494 -1134 1200 1615 -736 -1920 -260
2345 -260 1413 652 -515 -570 254 351 -173 517 874 1396 777 -457 -683 -503 1195 1136 -230 -1169 -140
2364 -140 1875 1326 -245 -826 641 801 -676 -1669 -194 832 516 -397 -500 -393 708 676 -94 -481
2382 -481 -576 75 -168 -1089 -559 605 1360 -342 -1261 -135 741 360 -1227 -1059 -400 242 282 -472 -256
2401 -256 730 594 -336 -1001 -392 731 531 -239 -998 290 1466 924 -324 -318 911 971 185 -580 -480
2420 -480 559 1049 215 57 476 696 570 -233 133 643 1022 -31 -978 -159 1507 1863 551 -754
2438 -754 497 1005 812 63 -355 598 627 -219 -344 439 796 934 -276 -978 -737 -53 -35 -576 -1247 -330
2458 -330 200 -436 -1395 -532 422 176 -860 -2004 -1012 461 333 -163 -619 -307 108 316 -77 -78 270 112
2478 112 -738 -1295 -268 1305 1122 -644 -1073 -812 666 378 -850 -1229 -827 -932 -914 -795 -82 956
2496 956 204 -1155 -1633 -864 492 869 -736 -1315 -593 614 245 118 443 991 802 -1009 -1191 -50
2514 -50 1410 890 -24 -635 -401 354 1239 670 156 -270 -636 -878 -871 463 1808 926 -846 -1533 293
2533 293 1893 1227 99 -346 -550 75 61 749 1751 1205 391 -20 103 739 1856 1302 -203 -1294
2551 -1294 -152 1360 1574 783 305 738 -44 -792 -370 828 1156 141 -879 -538 25 1023 1472 895
2569 895 -309 -1323 -1048 -749 -189 380 1137 -395 -2297 -2013 561 1839 32 -2265 -1788 -1028 -859
2586 -859 -550 49 163 -783 -935 -1046 -399 -46 745 305 -1671 -2303 -571 1487 1381 -144 -420 7 -77
2605 -77 -822 359 1542 691 -1076 -1600 -94 1103 950 1261 243 -1028 -1191 30 723 391 273 717
2623 717 318 -1352 -693 2023 2885 435 -1977 -1350 714 1055 938 701 176 -1199 -547 931 1111 260
2641 260 -283 -201 -956 -1699 -275 1698 772 -1299 -1173 208 -242 -1162 48 1474 -279 -2553 -1344
2658 -1344 1301 1808 893 -76 -35 -675 56 1506 1458 -497 -639 920 945 -409 -310 1940 2320 -324 -2066
2677 -2066 -425 1190 747 219 576 -537 -1877 -905 1307 1686 -407 -1373 -723 -798 -796 239 1544 -180
2695 -180 -1977 -742 1793 1072 -1030 -121 1201 420 -1407 -892 1408 1805 739 303 309 -803 -247 1996
2713 1996 2143 -1106 -2241 427 2081 444 -329 666 1426 -347 -1115 581 1222 -505 -860 162 201
2730 201 -968 -955 1403 1510 -1051 -1847 -768 -633 -1281 299 1040 -1308 -3280 -1342 1842 1045 -1955
2747 -1955 -2266 -285 -245 -1591 -1214 -12 -154 -1447 -527 19 -1047 -1519 531 1380 -1142 -2333 -395
2764 -395 1331 246 -312 336 708 -1011 -554 1675 1890 -848 -1418 928 1871 294 -203 1518 1620
2781 1620 521 17 863 215 -186 1310 2233 263 -1478 207 3198 2328 -862 -1187 792 1075 -25
2798 -25 271 818 -147 -1040 480 1880 252 -1217 -1 1060 -70 -1248 70 706 -420 -750 1171
2815 1171 962 -1219 -1639 1100 1800 -732 -2241 -430 1164 75 -475 138 188 -512 -1 736 9 -1934
2833 -1934 -457 1584 949 -1712 -1367 1635 1433 -990 -828 384 -281 -1244 -327 838 -360 -1504 -36
2850 -36 1532 235 -1390 -361 832 -151 -997 -270 325 -820 -822 1532 1551 -1386 -2072 -20 1789 -756
2868 -756 -1735 -791 138 -284 -91 563 286 -1314 -886 669 67 -1623 -1216 753 283 -1362 -891 1065
2886 1065 922 -631 -138 888 7 -1648 -142 1335 946 -853 -433 1134 1240 193 437 1072 28
2903 28 -198 489 765 -599 -50 1802 1642 -506 -1278 377 1905 519 -1297 -871 -221 -484 86 1286
2921 1286 467 -1498 -1085 239 621 -891 -756 -195 -405 -1166 -425 934 377 -638 -276 433 -314 -1104
2939 -1104 -587 1207 638 -916 -950 378 793 398 929 676 -999 -1118 855 1415 793 -240 679 1456
2957 1456 408 -78 1236 1944 840 -259 -288 650 650 975 1527 1188 -800 -782 553 1397 317 -366 -435
2976 -435 -880 -955 292 1251 295 -1264 -1100 -464 -355 -905 -799 -269 -748 -1579 -1573 -166 308 -43 -502 -923
2996 -923 -1750 -1298 154 849 -268 -1344 -822 -169 34 -158 891 633 -941 -1387 -450 487 531 456 487
3015 487 -17 -462 -129 696 1194 432 -359 -503 -405 47 906 1606 495 -1035 -603 558 1207 474 -272
3034 -272 -336 -274 -474 22 916 969 66 -1 -537 -700 -64 702 495 -528 -955 -270 309 540 337 567 238
3055 238 -411 -1017 -1 1079 1260 345 -34 -36 298 827 1258 1027 -51 -274 -648 217 731 1343 1369 71
3075 71 -722 -359 745 1204 488 -364 -631 -513 37 527 1080 492 -27 -598 -247 265 455 524 -409 -877
3095 -877 -904 -379 166 126 -251 85 -699 -1048 -1416 -604 -114 -164 -1106 -1650 -929 -286 206 -72 -548 -1655 -1263
3116 -1263 -1513 -372 504 590 -260 -494 -385 193 966 1208 -235 -1109 -545 -10 723 461 638 396 -206
3135 -206 -365 326 689 477 220 -425 -616 -352 518 596 777 1 -293 -205 -116 -244 310 319 30 -523 -613 7
3157 7 400 626 222 -585 -361 -523 193 243 298 -348 -348 -511 104 542 859 546 -626 -871 -376 287 383 468
3179 468 154 -27 18 255 784 843 301 -326 -106 -191 56 438 674 448 44 179 293 126 108 -96 239
3200 239 -432 -484 -360 307 601 480 115 -563 -276 -148 155 418 -208 -357 70 -32 286 709 674 7 -592
3221 -592 -364 416 426 270 -336 3 -159 541 278 927 373 -364 -432 -351 -103 -114 404 138 61 140 465 551
3243 551 -49 -357 -169 191 -240 -622 165 395 120 151 170 -312 -725 -125 34 -273 -1162 -767 -234 -384 -516
3264 -516 -674 227 265 -672 -861 -215 -409 -970 -432 -203 -245 -653 -395 386 185 -355 -199 -182 -384 -747 312
3285 312 340 96 -150 746 925 -56 -555 136 755 128 -536 40 505 425 493 794 590 -152 -32 646 807
3306 807 -83 -150 453 735 39 715 957 754 -265 47 641 453 -261 193 961 650 -314 -35 516 752
3326 752 417 -37 -147 -646 -561 688 997 -197 -860 -73 820 -85 -615 -74 220 -566 -718 -437 418 -226
3346 -226 -61 551 328 -954 -962 647 771 -448 -1004 -388 -128 -120 237 1019 269 -1438 -869 430 535 -886
3366 -886 -810 264 -92 -591 -85 589 225 -374 -106 88 -584 -1339 385 1220 -84 -1405 -430 853 155
3385 155 -118 170 112 -1124 -1062 449 1057 -375 -580 359 25 -830 -828 613 727 -908 -1163 -15 -98 -165
3405 -165 688 1352 161 -1859 -778 1022 1302 -537 -913 108 -386 280 813 885 -33 -914 -519 756
3423 756 -229 -810 160 1059 29 -1263 -86 1090 638 -63 137 149 -1282 -769 1144 1449 -127 -1113
3441 -1113 91 841 330 271 585 380 -790 -577 744 695 -135 412 1399 584 -1274 -446 1462 1442 -295
3460 -295 -916 -423 15 230 1218 1429 -346 -1643 -271 1418 541 -619 -540 209 -483 -535 552 1178 129
3479 129 -441 420 266 -1022 -772 739 1108 -356 -1276 -622 574 486 527 532 -483 -1545 -920 1163 1162 -627
3499 -627 -1103 353 393 -632 -12 910 348 -827 -1066 75 -45 -484 455 866 -397 -1847 -476 1199
3517 1199 740 -529 -767 -567 -797 -435 1240 841 -881 -1556 -436 703 -368 -1164 83 264 -668
3534 -668 -1116 -461 452 -237 -429 453 -643 -1613 -559 1168 1404 -706 -1222 -85 609 273 293 1001 159
3553 159 -1272 -241 1063 549 -233 126 1285 497 -639 68 1309 798 -133 70 288 -59 281 1195
3571 1195 1219 108 -1017 268 1159 670 -265 -115 443 77 15 845 932 -107 -82 655 479 -775 -761 626
3591 626 424 -678 -691 -63 375 -249 201 139 -613 -1582 -448 539 417 -795 -893 -121 -253 -257 75 809 34
3612 34 -746 -408 303 -75 -489 668 782 -88 -819 14 1192 131 -200 -255 75 -246 -104 726 415 -131
3632 -131 -567 482 731 -309 -657 -40 460 -626 -270 -4 351 -112 -295 278 -124 -1357 -895 351
3650 351 186 -393 -999 -263 -182 -436 -148 278 -682 -1123 -768 293 -307 -600 -359 115 -28 -386 29 236
3670 236 73 -383 -57 246 15 52 514 886 95 -317 536 717 32 -215 480 354 -167 430 549 586 309
3691 309 491 759 161 -317 -441 89 557 -51 -89 17 79 -250 468 282 -145 -594 -266 75 -54 -42 -138
3712 -138 113 261 -243 154 243 -48 -586 -181 -145 -310 -396 -62 384 424 -289 145 155 -196 -97 159 379 -39
3734 -39 -242 28 609 371 819 541 189 -173 7 582 712 167 56 -153 225 231 462 753 -92 -424 -448
3755 -448 -93 -75 -32 -283 -266 -308 -535 -144 97 -463 -779 -643 -434 -838 -707 -456 -8 -319 -549 -537 -316 -208
3777 -208 -309 -445 -496 -693 -819 -396 226 61 195 -166 -420 -304 -312 217 -64 -61 -631 -5 223 437 597 511
3799 511 -59 -369 -355 160 150 464 35 84 317 93 776 779 508 -151 -78 99 -270 261 366 72 173 -114
3821 -114 -203 351 288 -29 112 -277 -604 -468 239 611 374 146 -230 -520 100 565 695 398 -200 -146 197
3842 197 496 1001 1096 156 -232 -349 375 425 541 375 9 50 151 484 701 596 345 -344 -286 -40 314
3863 314 264 26 31 -326 -264 645 460 374 -117 -330 -585 -570 -161 80 176 -722 -758 -757 -125 8 -7 -3 -675 -985
3887 -985 -825 -375 269 -32 -82 -261 -797 -630 32 466 108 -243 -813 -272 294 383 602 304 -120 -429 -180
3908 -180 437 512 -262 130 102 -428 46 528 381 213 -131 -293 -330 -329 65 152 261 -543 -458 95 502 193
3930 193 -139 7 -645 -969 -622 199 449 -131 -436 -378 -104 -402 -306 704 -204 -1279 -908 -205 159 25
3950 25 104 51 -250 -724 290 1018 257 -284 -430 -52 274 372 654 863 93 -374 510 673 77 355 570
3971 570 449 129 -72 650 933 625 207 282 -390 -358 190 843 885 -70 -346 250 175 96 363 349 -420 -647
3993 -647 -226 490 75 -127 -78 254 -694 -828 240 754 -246 -868 -351 -47 -306 -79 619 25 -568 -630
4013 -630 -170 424 -596 -377 -367 -49 -460 -344 435 433 -155 -46 213 -119 -827 -199 667 344 -626 -648 36
4034 36 342 -185 171 170 -576 -1055 -232 610 -135 -749 -477 91 -112 -318 -62 53 -269 -852 -280 339 -57
4055 -57 -358 321 477 -689 -878 254 411 -159 -704 -22 43 -125 32 724 480 -295 -144 768 427 -228
4075 -228 -479 500 876 -220 116 634 525 138 567 816 -365 -621 102 1023 747 -100 -106 763 477 312
4095 312 656 681 -502 -814 532 571 -143 -648 398 814 38 -304 -303 316 -88 -387 144 18 -344 -401 619
4116 619 675 -466 -686 499 142 -472 -555 100 77 -402 92 383 -10 -499 -80 738 -354 -1377 -544 798
4136 798 168 -614 -260 89 -18 -224 97 489 -246 -1036 233 788 113 -804 -94 882 40 -379 -52 60
4156 60 -432 -784 506 26 -747 -535 350 1024 -33 -681 58 283 -467 -346 284 182 -902 -292 696
4175 696 147 -712 -190 513 -111 -586 -702 328 259 -96 -63 293 -245 -413 720 699 -246 -1382 -267 469
4195 469 138 -284 14 361 -27 -188 538 448 -669 -654 283 334 -240 -623 504 1018 36 -699 199 380
4215 380 -183 170 165 -402 -852 -151 1068 750 -25 38 444 78 -14 135 897 583 -59 255 745 325 -19
4236 -19 935 907 -3 -761 -68 704 555 58 300 153 -168 -67 597 778 -574 -895 -134 367 -278 -260 229
4257 229 216 -151 -613 248 50 -308 -44 363 -311 -858 -321 831 734 -208 -547 -255 -90 -437 176 20
4277 20 -504 -1234 -475 265 98 -422 -324 17 -623 -988 -342 341 -170 -304 -475 128 -283 -187 790 349 -445
4298 -445 -861 -516 256 245 183 129 -75 -187 0 797 462 -470 -54 114 -424 -588 -391 647 368 -294 -424
4319 -424 -138 -68 -515 229 208 -305 -915 -100 806 623 15 -43 -240 -114 -143 436 643 -170 -238 12 430 -49
4341 -49 477 357 494 -334 -279 348 615 262 45 312 277 176 129 1056 526 108 -329 184 145 223 50 698
4363 698 710 -26 94 301 479 97 402 424 -454 -631 -146 654 661 -247 -359 51 -400 -92 169 114 -659 -1039
4385 -1039 -294 675 -3 29 166 51 -490 -400 268 375 -71 -404 -231 16 284 317 322 351 -178 -339 1 120
4407 120 -174 167 405 153 -388 8 258 257 -128 -124 -144 -403 -334 122 449 434 -33 -293 -65 49 305 278 -241
4430 -241 -716 -524 -258 247 -94 -74 -437 -197 -464 -561 -106 88 -345 -583 -377 -270 106 85 -40 -53 -228
4451 -228 -222 -213 10 -31 -149 140 -27 128 452 389 483 -5 -447 -48 -19 130 172 259 747 492 206 -11 429
4474 429 195 160 -91 182 -126 27 512 77 133 252 476 -101 111 97 -327 -292 -416 21 89 287 250 62
4496 62 -269 -193 -83 209 223 -214 23 -47 84 104 274 404 330 312 -82 -430 66 25 400 327 298 330 -22 148
4520 148 455 338 498 227 -77 100 453 484 256 121 -124 -94 239 -154 -345 -7 -322 -488 -253 -203 -188
4541 -188 -237 -202 -89 -202 -198 -377 -228 -501 -755 -48 -190 -261 -306 -358 121 -392 -318 -159 -417 -415 -310 -225 -244 -416
4565 -416 48 -319 -80 10 65 -350 -529 -95 -230 65 284 -51 -68 44 83 -28 312 400 -178 -93 334 266
4587 266 638 288 27 192 253 -56 112 151 143 113 -203 252 -175 342 590 400 -168 62 -142 -315 -121 147
4609 147 128 340 -115 -31 425 146 3 -119 -4 -345 -378 141 554 276 81 -38 481 149 534 575 200
4630 200 -617 -433 -213 588 512 30 106 470 -244 -148 295 361 129 -115 39 -138 -150 -117 601 34 -52 -308
4652 -308 -341 -27 -100 -177 249 -176 -421 -134 180 179 6 41 -208 -570 -401 261 152 -236 -347 -270 152 -14
4674 -14 -347 247 -29 -682 -647 -9 749 340 -317 70 -84 -434 -139 471 348 -259 -546 -28 276 -172 139
4695 139 593 432 -183 -342 -115 81 131 -123 187 -425 -617 89 697 204 -86 -441 -98 -510 -275 422
4715 422 192 -677 -747 77 389 119 -272 68 360 -529 -723 164 398 198 -248 249 125 -16 20 336 248
4736 248 -299 -393 150 215 375 111 600 307 -355 113 920 517 -171 59 616 346 -231 465 1066 624 128
4757 128 -296 -102 100 64 387 476 -705 -585 405 788 284 -220 -369 22 -339 -328 309 486 -433 -387 94
4778 94 349 -213 -40 419 100 -635 -689 101 542 -43 -122 147 -378 -497 87 631 134 -660 -783 -58 193
4799 193 -84 -127 382 -133 -353 -555 -64 -37 -531 131 360 -381 -982 152 1041 188 -777 -590 -200 -453
4819 -453 9 442 -256 -738 -879 450 561 128 -294 137 -24 -494 -357 81 208 -103 -130 -223 120 -667
4839 -667 -142 606 51 -644 -272 300 524 126 184 227 46 -315 2 740 548 -425 150 255 -93 -148 121
4860 121 839 301 -305 29 352 14 -285 469 586 -512 -858 166 934 227 -277 -136 -82 44 -15 369
4880 369 98 -308 -255 517 226 -436 -23 680 239 -225 -335 444 245 -57 -119 447 -113 -135 378 575 363
4901 363 -213 -504 319 598 -182 177 489 -212 -41 203 284 15 -100 217 426 -277 -365 227 612 195 -329
4922 -329 -193 28 -8 -112 196 -257 -667 -512 363 332 -529 -232 90 30 -447 -269 -152 -147 -434 37 170 20
4944 20 -549 -294 265 -184 -619 -597 -124 -210 -409 82 184 131 -413 107 363 18 -484 231 171 -229 -371 359
4966 359 288 6 45 -93 -28 -290 -146 294 407 -344 -288 376 835 -53 15 -310 -85 -218 -356 -11 -79 -217
4988 -217 -33 420 156 -227 154 234 -40 -118 -34 -236 -45 -404 255 566 296 -381 137 566 82 -269 -83
5009 -83 324 152 262 408 399 485 -1 401 450 317 -49 449 494 214 85 428 459 -56 451 186 290 -82
5031 -82 60 409 186 -118 203 217 113 -470 -26 -21 148 -248 -289 18 -176 -61 65 105 -188 -703 -277 0
5053 0 -165 -518 -347 -294 -561 -197 87 -168 -217 -351 -241 146 -107 -399 91 -174 -255 92 -74 346 -252 174
5075 174 270 -114 -291 -150 175 331 -337 -187 142 266 -13 -56 55 204 -630 -192 -214 25 206 -32 122
5096 122 -211 -235 -138 540 -196 -172 -787 -261 -66 -212 306 -49 139 -400 -492 49 315 12 191 -145 -428
5117 -428 -83 267 213 97 63 -73 430 143 140 133 412 -18 -212 466 401 235 635 155 521 110 -71 285
5139 285 563 341 134 -123 180 33 280 207 69 68 -249 -380 -78 119 -23 170 -545 -451 -191 244 158 -463
5161 -463 -401 -325 -494 -79 -63 63 -251 -233 -391 170 -77 -323 201 -80 -569 -472 120 32 203 279 -152 -30
5183 -30 170 -180 -44 432 132 158 130 125 133 183 423 255 -82 -293 200 -72 142 -14 -127 -267 -74 91 257
5206 257 11 -409 -363 -180 -631 -304 136 -153 -128 -372 -461 -322 -153 -133 -419 -635 -726 -597 352 310 -287 110
5228 110 -321 -301 -51 -260 225 -85 -298 -243 80 160 85 224 82 148 -194 -227 53 29 349 -24 235 -40
5250 -40 129 297 773 190 -51 -13 233 -44 297 198 63 -342 173 210 78 367 -107 152 -85 21 -122
5271 -122 247 194 -76 -114 -195 163 -94 291 228 57 -305 22 -27 351 92 117 -28 9 -57 100 41 -176 -141
5294 -141 -21 -34 83 -326 129 506 326 -160 3 143 -183 175 -7 -73 -511 -39 130 378 -193 -178 -104
5315 -104 -181 -341 -384 -177 -140 -448 -537 -200 -25 -362 -278 -210 -34 -529 -526 -228 8 -300 -246 84 -118 -161 -173 43
5339 43 -152 -84 -297 -102 -314 -115 29 -8 29 -226 -47 -107 -210 70 -75 87 -118 124 464 343 27 -1
5361 -1 42 -22 91 -76 149 174 -175 -50 489 265 182 -113 291 -3 -156 -219 146 427 -5 129 203 -236 -184
5384 -184 -137 416 26 -537 16 259 -191 -127 156 200 -331 -24 207 96 -176 -31 150 194 -1 -250 199
5405 199 326 111 -272 -25 56 -10 269 363 345 246 -92 319 315 -210 -184 254 532 106 85 -47 14 -270 174
5428 174 397 58 -142 77 415 386 -616 -242 -122 -60 -247 141 450 -513 -383 188 147 -362 -465 -311 149
5449 149 -354 -338 -48 7 -61 -145 145 31 -508 -86 -33 48 -456 -223 98 -99 165 -10 -33 -346 -338 -217 -10
5472 -10 165 -173 89 432 124 -421 -30 213 0 -180 57 -284 -333 -15 254 235 -437 -314 111 221 -99
5493 -99 -469 -471 -132 -366 -299 99 407 -132 41 145 14 -307 -185 631 -1 -318 -178 220 125 146 482 281
5515 281 -79 -257 -380 397 113 -213 -136 643 605 -38 343 196 267 -100 225 372 124 -126 307 608 132
5536 132 -368 340 470 183 -340 -16 -59 -163 -19 376 490 -286 -300 178 67 -148 -196 -120 -155 -241 -213 187
5558 187 88 -587 -46 -67 -356 -499 -148 186 -264 -442 -305 120 231 -2 196 267 0 -286 30 252 -126
5579 -126 -42 41 132 9 -130 14 279 9 -392 -208 -11 -385 50 540 268 -288 -576 33 121 -131 -154 -412
5601 -412 -309 -456 -87 44 103 -348 -19 -8 71 -356 -330 -16 -65 -392 -98 -1 -66 -124 0 194 -489 -406 86
5624 86 102 151 -343 64 248 -27 274 471 473 -257 -57 72 187 143 406 136 151 58 -158 286 892 209 -259
5647 -259 125 -6 5 96 328 355 94 -472 329 508 -287 -194 43 96 70 145 219 206 86 281 241 154 -101 94
5671 94 189 -297 43 36 223 -61 76 449 400 -446 0 -75 195 428 -201 9 267 196 295 226 126 -375 -308
5694 -308 -10 48 57 129 -54 384 -321 150 290 112 -34 91 11 -95 47 -65 462 -14 -39 -28 28 30 -135
5717 -135 -86 -151 182 -216 -35 -96 45 -98 95 203 -357 -527 -146 -217 -63 -44 -357 -140 -281 11 96 9
5739 9 -451 -116 -192 18 -246 -174 191 132 -126 61 553 304 215 -46 -54 34 85 -84 223 255 -88 -265 190 196
5763 196 -154 -206 -196 131 94 58 47 22 -120 394 231 -190 126 -129 233 -139 -132 -138 51 242 204 346 343 79
5787 79 -7 -186 343 21 185 89 -60 -43 9 196 170 269 178 77 319 62 355 267 90 283 247 292 345 -112
5811 -112 -203 181 -186 136 37 4 177 -69 173 75 47 -209 -112 34 -79 -201 -70 -189 -284 -165 -23 -99 -263
5834 -263 -426 -671 -187 -113 -159 -367 -395 -243 -368 398 128 -325 -553 -83 -200 -340 -116 -90 -22 -262 169 204
5856 204 -9 224 -29 107 26 141 -170 393 1 603 904 111 -152 -364 -73 -113 -106 248 165 -212 140 154
5878 154 160 -163 -12 -62 -487 -171 188 -242 -382 -301 64 111 1 53 -227 -225 193 -26 -40 -14 274 209 -21 -266
5902 -266 67 -72 634 -160 120 23 -42 55 93 157 453 266 201 110 204 266 189 171 -5 -125 -207 108 225 131
5926 131 174 -73 -266 -85 100 36 33 -53 -159 -150 -124 218 -140 -33 -58 149 80 170 73 -137 -182 -134 18 200 462
5951 462 25 50 -302 74 -164 -127 224 -10 -67 77 -25 -223 -34 574 460 -324 -278 80 289 -82 -3 273
5973 273 310 -286 -228 -399 30 161 -147 -111 -287 -94 67 -189 48 -445 -138 -444 -18 -222 -296 -68 -248
5994 -248 -156 -520 -164 11 -40 111 -175 -135 174 -122 5 174 -203 -18 -68 12 -51 258 164 -15 -438 147
6016 147 373 111 -91 99 169 -22 -105 264 450 292 -169 -243 199 125 474 173 -259 -206 94 232 230 -16
6038 -16 -356 -82 -16 68 168 508 308 150 -124 280 208 -165 203 -9 117 32 36 333 -53 176 483 165
6060 165 -102 -52 301 226 -114 -47 -19 432 139 26 235 76 -56 -319 33 -98 -281 190 362 -13 -251
6081 -251 -140 306 223 -2 -352 -296 -178 -25 50 166 -64 -299 -229 -18 -86 -188 191 -297 -231 -36 151 -279
6103 -279 289 -175 41 5 -289 -551 -192 98 -338 -501 -311 231 392 62 71 -5 -26 -303 205 322 179 -29
6125 -29 211 -98 -449 241 365 65 -446 -346 33 145 -153 -179 137 201 -172 -356 77 -12 -334 -200 -83
6146 -83 -109 -236 140 3 -301 -139 325 271 -171 -161 196 72 118 73 15 37 240 -137 234 112 91 -282 256
6169 256 293 144 312 -172 40 116 261 385 -168 -501 -52 307 149 -16 -171 346 315 -440 -212 -124 297
6190 297 -239 -134 -160 -215 227 137 373 28 -304 260 373 28 -298 123 350 32 -46 -243 53 119 -193 164
6212 164 436 -227 -183 152 195 -74 -163 23 -291 63 9 210 38 -631 -282 269 297 -337 -155 133 -207 -235
6234 -235 -214 209 -125 -87 -249 -71 11 -274 39 75 -194 -272 68 -9 59 -211 -97 -68 193 -136 215 229 18
6257 18 -404 -126 379 -98 -207 -42 359 81 -60 59 -184 -117 411 298 35 -385 106 137 116 -266 -325 -107
6279 -107 306 -210 -136 199 -221 -247 -293 83 193 -93 80 204 198 35 92 72 191 278 325 222 68 -105 338
6302 338 440 152 201 43 438 43 30 173 186 287 128 176 126 208 367 479 117 247 152 254 301 -173 -224
6325 -224 49 -3 63 -96 116 64 -233 -353 -37 -156 -64 43 -37 -144 -76 -327 62 -180 138 57 177 -118
6347 -118 -349 7 40 291 -11 376 -53 -20 -270 92 -122 67 -139 49 -226 21 114 12 55 -327 -110
6368 -110 -156 187 -317 -168 -67 -207 -155 -353 275 -246 -514 66 -369 225 146 -478 -89 -347 -319 368 -67
6389 -67 -204 -179 -131 39 -485 -172 -90 69 -89 -115 -128 164 34 -101 73 189 -16 -178 125 286 451 39
6411 39 10 314 -70 199 219 391 17 -234 135 83 -48 195 391 367 78 -343 -12 240 -127 -1 -61 -256
6433 -256 28 364 460 -185 -67 128 57 -145 -228 -157 238 -259 -302 -55 426 -37 105 49 102 26 -445 -9 65
6456 65 287 228 19 -34 234 372 531 -5 -56 168 277 -4 241 253 -33 -49 -197 30 -87 187 310 -162
6478 -162 -153 -46 72 241 33 3 -214 -183 -191 -344 -205 -409 -258 -89 -298 -218 -29 -162 -153 -457 -136 -173 -425
6501 -425 -157 -166 164 -292 -99 -234 -367 36 42 -47 -289 -219 154 151 -207 -36 -55 76 -226 -208 78 236 -78
6524 -78 30 172 148 115 286 217 61 -140 -2 172 -85 48 3 320 -90 -182 153 -7 287 69 -5 6 29
6547 29 -125 -191 -300 199 -67 -232 -260 163 190 164 -18 -129 156 231 190 -48 140 164 301 -35 143 155 114
6570 114 181 -91 183 157 416 303 358 -43 1 -7 333 219 43 -113 260 43 -143 -283 387 -41 -54 -383
6592 -383 -304 197 -107 -263 8 -89 46 -104 -132 37 -143 -205 -248 -275 -103 97 -2 -53 -30 -306 -226 -50 -39 62
6616 62 183 306 -217 -488 26 10 91 207 3 113 19 36 -109 -230 -182 199 72 -51 65 216 107 -15
6638 -15 -145 -24 261 114 -149 67 134 105 -271 62 80 -23 102 -329 -280 -9 262 160 -457 -102 36 16
6660 16 6 -278 63 -102 -122 -293 -68 242 83 -46 -131 -3 -249 437 252 -166 -40 -32 226 73 105 211
6682 211 273 248 60 78 206 319 -40 -122 29 178 249 197 310 171 14 187 257 -188 -4 -83 104 -259 -46
6705 -46 208 -172 -1 -177 -130 -177 -277 -42 -31 168 52 61 180 -231 101 204 -37 -293 38 -40 48 -242 -145
6728 -145 -207 185 229 49 -90 344 265 -86 -132 -139 -130 -3 240 43 2 180 130 -43 -87 -122 322 56 -13 4 -95
6753 -95 80 234 -426 -97 -181 -593 -587 -97 -89 101 -95 -171 -250 93 233 155 -313 -240 -48 59 -342 -67 71
6776 71 116 -176 -70 88 69 46 -118 -77 170 262 1 263 -35 82 9 230 82 163 67 266 37 -224 -18
6799 -18 274 396 9 -87 92 18 -472 -358 313 100 57 -200 1 170 123 85 199 -317 -199 285 30 144
6821 144 19 -299 -214 172 -35 313 188 -89 66 71 165 307 17 -111 43 322 299 -196 117 -44 404 582
6843 582 -133 -162 -257 135 185 -118 -466 35 49 -212 -93 238 210 132 -220 -199 -225 -203 23 212 -128 -466 -317
6866 -317 180 -137 -321 -183 21 -113 -281 151 111 -247 -250 -113 86 76 -112 -79 -54 136 -19 286 230 -203
6888 -203 47 429 112 -350 -240 150 305 -39 -364 -61 330 -196 -109 231 -137 -397 -89 -229 -80 269
6908 269 145 -125 -328 -404 31 -253 -150 -44 -220 102 44 -423 -122 98 -146 -47 28 238 368 21 35 89
6930 89 395 -83 144 209 -21 189 336 255 59 -39 617 433 -204 206 166 133 40 -71 199 -10 -92 -93 204
6953 204 256 -80 70 -28 -21 -23 -158 31 48 -406 -67 313 12 -295 71 188 42 -210 -70 117 81 179 -259
6976 -259 -129 98 17 177 290 15 -121 203 121 -75 -48 112 286 -161 209 79 191 -70 49 -70 -45
6997 -45 -141 -371 60 183 -98 -303 -158 -265 -231 -22 -68 -175 -430 -4 -73 -242 -542 -25 -73 -267 -450 -392
7019 -392 -149 -100 -366 -131 57 291 -237 -79 -173 45 225 175 48 -15 302 65 17 15 364 401 429 58 -104
7042 -104 132 208 -160 137 17 -193 -32 -189 -310 -231 -154 94 170 -470 -294 104 -134 77 -354 46 155
7063 155 -20 -187 -23 145 69 -145 -93 -210 -11 106 -168 179 -70 -247 71 83 106 196 537 228 24 423
7085 423 367 455 233 357 366 216 194 180 100 352 563 -23 -169 204 144 322 -33 -215 -287 -41 335 -334 -415
7108 -415 35 146 -84 -66 -346 -70 123 -302 -371 -209 188 56 39 52 47 247 -9 46 87 59 284 98 -235
7131 -235 -97 71 79 175 -237 50 389 113 -69 -83 112 240 -35 117 -47 9 125 -78 -575 -259 -303 78
7153 78 -228 14 -224 -200 31 -465 -219 243 -171 -325 -408 233 107 -103 -108 -485 -33 -1 -240 -61 -332 -21
7175 -21 6 -104 -285 -298 375 146 -51 -199 37 42 289 240 223 382 208 63 357 442 112 253 134 71 11
7198 11 95 259 214 -89 -24 142 223 141 -119 218 129 -59 -292 85 38 -91 -140 -102 -34 -71 -106 188 -304 -154
7222 -154 -62 329 177 -133 212 145 138 8 177 96 -19 75 401 567 307 -130 22 135 432 266 -8 -47
7244 -47 62 163 91 162 114 4 193 -31 -186 67 109 -113 -302 -14 -270 -250 -360 -265 -118 -236 48 -401
7266 -401 -129 3 -57 1 -528 -202 -276 -42 -169 -204 -282 -290 -57 -119 -263 -298 -63 15 185 -284 228 268 125 -193
7290 -193 -237 -70 408 169 -36 -182 121 160 191 30 -149 8 -331 -215 -137 44 296 -174 -133 174 -81 12
7312 12 39 -81 -108 -40 -270 15 -54 124 210 -71 36 -317 43 125 58 -78 -115 133 69 29 237 154 226 226 45
7337 45 61 13 277 21 218 -46 83 389 205 130 -119 67 169 103 211 -9 129 -67 -46 109 -15 249
7359 249 92 335 214 61 -117 147 -127 -179 149 69 149 19 -99 -17 -168 100 -319 -82 -26 -268 3 285
7381 285 52 -73 -14 -326 63 95 61 -23 -222 67 357 -9 -211 -143 154 64 11 -10 326 166 -86 -74 122
7404 122 239 145 -283 -60 -390 54 128 -86 -73 -211 391 -220 -225 -138 288 -24 -337 -14 -33 73 10 -261 -105
7427 -105 -112 -210 -42 -151 -113 85 -63 36 -302 -297 -28 -6 -256 -44 -363 218 -191 -119 161 54 241 -49 36
7450 36 129 247 39 -64 -56 1 -10 105 183 48 -42 122 357 -239 165 195 338 -143 -78 -142 53 -75 -161 26
7474 26 293 209 71 84 42 273 29 -17 -393 -312 280 230 -99 -409 175 227 -143 -137 180 -105 -171 -329 -23 7
7498 7 409 -126 164 194 68 12 290 72 104 356 21 381 -27 -310 -9 78 -64 -469 -305 -248 -174 -87 44
7521 44 -135 -141 -44 122 -34 -107 135 67 -268 -363 -162 127 146 -110 -23 316 -349 -276 -47 189 19 -198 -237 -173
7545 -173 -71 -155 -232 85 -118 -39 0 -288 -215 -77 453 -34 -199 24 -69 32 284 -13 231 72 36 132 110
7568 110 182 -170 78 -338 70 56 -124 -29 -30 -311 116 17 -117 -131 86 198 243 10 46 29 1 -322 -79 352
7592 352 -21 71 60 218 506 6 352 57 151 7 266 425 -244 -6 385 422 -190 125 314 437 81
7613 81 48 21 78 406 177 -22 -41 119 -355 -5 -238 231 112 -58 2 -142 -114 249 -76 -436 -146 33
7635 33 -169 -198 50 64 -143 171 -94 -483 154 -207 175 34 -133 -197 200 18 -291 -78 -93 -99 -245 -487
7657 -487 125 283 -225 188 60 45 -310 -132 -56 2 -34 -299 -116 -273 -496 131 94 -64 -309 20 179 301
7679 301 -137 -106 206 -382 -152 -239 49 -239 -450 -262 221 -35 -10 -155 -218 16 -331 67 5 -156 23 165
7701 165 -88 -147 -220 -88 -3 86 -165 187 153 335 25 125 317 395 61 16 -51 -243 138 195 -169 -119 -36 246
7725 246 299 -96 105 211 59 82 -15 163 -108 -64 -202 394 -91 -8 -26 9 -546 -47 252 -189 49 327
7747 327 351 381 96 11 86 276 58 -12 190 131 81 39 100 466 51 120 -8 108 248 -2 158 -394 -18
7770 -18 -74 19 -98 -55 -33 26 30 -277 8 165 9 -252 -201 -226 -101 -174 -335 -231 52 -183 134 62 -63 -342
7794 -342 -109 28 -254 -235 -63 -45 68 -59 -130 116 192 -96 203 159 31 167 -88 252 211 -258 -168 49
7816 49 57 162 232 -61 16 -164 252 169 -194 -53 -77 36 -182 -331 157 -245 6 -109 -44 -190 86 141 24
7839 24 -93 202 200 291 -211 -228 363 243 219 -59 204 111 126 -124 296 -3 173 -44 81 348 203 343 190
7862 190 357 -79 233 417 -4 -6 140 -46 165 -128 68 312 93 93 -124 -39 223 -248 147 -176 -2 -14
7884 -14 -5 274 -155 -99 40 380 -61 -109 -193 73 -129 -86 97 -340 -77 -204 39 179 -266 64 392 -46
7906 -46 194 66 17 137 226 98 290 156 -114 48 252 -62 -147 -186 -270 24 -394 -328 126 166 99 80 -152
7929 -152 -417 22 -201 -299 -122 -68 -94 64 -91 57 401 -16 123 131 -215 193 128 -174 -79 -192 17 46 -55
7952 -55 42 150 -192 -105 170 106 144 99 35 59 52 77 31 43 -112 8 30 149 -233 184 17 -44 -36 20 75 27 -80
7979 -80 -119 -150 22 -29 190 303 -264 -73 212 101 -65 -108 265 10 91 1 -56 66 -77 91 48 205 334
8002 334 168 -305 29 204 238 -433 -344 178 128 411 30 -274 -148 16 127 -145 258 234 74 -98 14
8023 14 -64 76 23 77 -33 -322 12 -109 -232 107 -92 143 -22 41 -389 -16 -251 -587 -57 -253 -208 -313
8045 -313 -280 -166 -111 136 -102 -356 -262 -28 114 92 -318 -137 -84 165 -232 -22 -4 -133 208 -246 208 291
8067 291 -83 -256 288 55 136 -25 97 -126 27 175 92 97 -350 237 -73 372 -64 -33 -71 -51 -158 -241 57
8090 57 118 -376 -152 165 -82 140 28 -189 -146 184 114 -194 41 222 -73 319 -278 -203 -1 -40 6 198
8112 198 249 48 85 94 145 119 -210 139 -152 -161 17 543 207 168 -92 -130 331 -8 316 -54 249 -39 -36 259
8136 259 -42 -89 160 35 -36 136 280 -373 -89 6 -110 68 9 -96 66 102 -217 -421 7 114 107 -139
8158 -139 64 6 169 -9 200 -99 136 109 200 -54 310 -243 -264 113 -352 -332 122 124 -80 -193 -127 89 -181
8181 -181 -321 -36 78 -89 48 -23 -337 -355 -194 -196
8191a96
##END NTUPLES=NMR FID
##END=
