##TITLE=1H_Pr 4925-Van
 CDCl3+DMSO, 24 sc, 
 31.1.2020
##JCAMPDX= 6.0         $$ Bruker NMR JCAMP-DX V2.0
##DATA TYPE= NMR FID
##DATA CLASS= NTUPLES
##ORIGIN= UXNMR, Bruker Analytische Messtechnik GmbH
##OWNER= root
$$ XWIN-NMR		Version 3.5
$$ Fri Jan 31 16:06:30 2020 Russian Standard Time (UT+4h)  she@DPX200
##.OBSERVE FREQUENCY= 200.1315
##.OBSERVE NUCLEUS= ^1H
##.DELAY= (6, 6)
##.ACQUISITION MODE= SIMULTANEOUS
##.ACQUISITION SCHEME= undefined
##.AVERAGES= 24
##.DIGITISER RES= 18
##SPECTROMETER/DATA SYSTEM= spect
##.PULSE SEQUENCE= zg30
##.SOLVENT NAME= D2O
##.SHIFT REFERENCE= (INTERNAL, D2O, 0, 15.7039)
##AUDIT TRAIL= $$ (NUMBER, WHEN, WHO, WHERE, WHAT)
$$ ##TITLE= Audit trail, XWIN-NMR		Version 3.5
$$ ##JCAMPDX= 5.01
$$ ##ORIGIN= Bruker BioSpin GmbH
$$ ##OWNER= she
$$ F:/spectra/data/she/nmr/H-F/1/audita.txt
$$ ##AUDIT TRAIL=  $$ (NUMBER, WHEN, WHO, WHERE, WHAT)
(   1,<2020-01-31 16:05:34.32 +0400>,<she>,<DPX200>,
      <continue with go, POWCHK disabled, PULCHK disabled
       configuration hash MD5:
       00 E9 B6 7A A2 85 ED C7 34 08 36 98 17 FE 4E 26
       data hash MD5: 16K
       79 15 A5 7A 3B 1A 48 9D 7F 78 50 D5 8F 9F 9D D2>)
$$ ##END=
$$ 
$$ hash MD5
$$ 6E D4 0B A4 88 CE 7B E0 69 17 39 88 1A 85 14 64
##$RELAX= 
##$RELAX= 
##$RELAX= 
##$RELAX= 
##$RELAX= 
##$RELAX= 
$$ Bruker specific parameters
$$ --------------------------
##$DU= <F:/spectra>
##$EXPNO= 1
##$NAME= <H-F>
##$PROCNO= 1
##$TYPE= <nmr>
##$USER= <she>
##$AMP= (0..31)
100 100 100 100 100 100 100 100 100 100 100 100 100 100 100 100 100 100 
100 100 100 100 100 100 100 100 100 100 100 100 100 100 
##$AQSEQ= 0
##$AQ_mod= 1
##$AUNM= <au_zg>
##$AUTOPOS= <>
##$BF1= 200.13
##$BF2= 200.13
##$BF3= 200.13
##$BF4= 200.13
##$BF5= 200.13
##$BF6= 200.13
##$BF7= 200.13
##$BF8= 200.13
##$BYTORDA= 1
##$CFDGTYP= 0
##$CFRGTYP= 5
##$CHEMSTR= <none>
##$CNST= (0..31)
1 1 145 1 1 1 1 1 1 1 1 1 1 1 1 1 1 1 1 1 1 1 1 1 1 1 1 1 1 1 1 1 
##$CPDPRG= <>
##$CPDPRG1= <>
##$CPDPRG2= <>
##$CPDPRG3= <>
##$CPDPRG4= <mlev>
##$CPDPRG5= <mlev>
##$CPDPRG6= <mlev>
##$CPDPRG7= <mlev>
##$CPDPRG8= <mlev>
##$CPDPRGB= <>
##$CPDPRGT= <>
##$D= (0..31)
0 1.2 0 0 0 0 0 0 0 0.06 0 0.03 0 0 0 0 0.0002 0 0 0 0 0 0 0 0 0 0 0 0 
0 0 0 
##$DATE= 1580472240
##$DBL= (0..7)
120 120 120 120 120 120 120 120 
##$DBP= (0..7)
150 150 150 150 150 150 150 150 
##$DBP07= 0
##$DBPNAM0= <>
##$DBPNAM1= <>
##$DBPNAM2= <>
##$DBPNAM3= <>
##$DBPNAM4= <>
##$DBPNAM5= <>
##$DBPNAM6= <>
##$DBPNAM7= <>
##$DBPOAL= (0..7)
0.5 0.5 0.5 0.5 0.5 0.5 0.5 0.5 
##$DBPOFFS= (0..7)
0 0 0 0 0 0 0 0 
##$DE= 6
##$DECBNUC= <off>
##$DECIM= 24
##$DECNUC= <off>
##$DECSTAT= 4
##$DIGMOD= 1
##$DIGTYP= 9
##$DL= (0..7)
0 120 120 120 120 120 120 120 
##$DP= (0..7)
150 150 150 150 150 150 150 150 
##$DP07= 0
##$DPNAME0= <>
##$DPNAME1= <>
##$DPNAME2= <>
##$DPNAME3= <>
##$DPNAME4= <>
##$DPNAME5= <>
##$DPNAME6= <>
##$DPNAME7= <>
##$DPOAL= (0..7)
0.5 0.5 0.5 0.5 0.5 0.5 0.5 0.5 
##$DPOFFS= (0..7)
0 0 0 0 0 0 0 0 
##$DQDMODE= 0
##$DR= 18
##$DS= 0
##$DSLIST= <SSSSSSSSSSSSSSS>
$$ [...]
##$SUBNAM2= <"">
##$SUBNAM3= <"">
##$SUBNAM4= <"">
##$SUBNAM5= <"">
##$SUBNAM6= <"">
##$SUBNAM7= <"">
##$SUBNAM8= <"">
##$SUBNAM9= <"">
##$SW= 24.9337058887773
##$SWIBOX= (0..15)
0 0 2 0 0 0 0 0 0 0 0 0 0 0 0 0 
##$SW_h= 4990.01996007984
##$TD= 16384
##$TD0= 1
##$TE= 0
##$TE2= 300
##$TE3= 300
##$TEG= 300
##$TL= (0..7)
0 120 120 120 120 120 120 120 
##$TP= (0..7)
150 150 150 150 150 150 150 150 
##$TP07= 0
##$TPNAME0= <>
##$TPNAME1= <>
##$TPNAME2= <>
##$TPNAME3= <>
##$TPNAME4= <>
##$TPNAME5= <>
##$TPNAME6= <>
##$TPNAME7= <>
##$TPOAL= (0..7)
0.5 0.5 0.5 0.5 0.5 0.5 0.5 0.5 
##$TPOFFS= (0..7)
0 0 0 0 0 0 0 0 
##$TUNHIN= 0
##$TUNHOUT= 0
##$TUNXOUT= 0
##$USERA1= <user>
##$USERA2= <user>
##$USERA3= <user>
##$USERA4= <user>
##$USERA5= <user>
##$V9= 5
##$VALIST= <valist>
##$VCLIST= <CCCCCCCCCCCCCCC>
##$VD= 0
##$VDLIST= <DDDDDDDDDDDDDDD>
##$VPLIST= <PPPPPPPPPPPPPPP>
##$VTLIST= <TTTTTTTTTTTTTTT>
##$WBST= 1024
##$WBSW= 4
##$XGAIN= (0..3)
0 0 0 0 
##$XL= 0
##$YL= 0
##$YMAX_a= 792620
##$YMIN_a= -310988
##$ZGOPTNS= <>
##$ZL1= 120
##$ZL2= 120
##$ZL3= 120
##$ZL4= 120
##$ABSF1= 10
##$ABSF2= 0
##$ABSG= 5
##$ABSL= 3
##$ALPHA= 0
##$AQORDER= 0
##$ASSFAC= 0
##$ASSFACI= 0
##$ASSFACX= 0
##$ASSWID= 0
##$AUNMP= <proc_1d>
##$AZFE= 0.1
##$AZFW= 0.1
##$BCFW= 1
##$BC_mod= 2
##$BYTORDP= 1
##$COROFFS= 0
##$CY= 11.3945322036743
##$DATMOD= 1
##$DC= 2
##$DFILT= <>
##$DTYPP= 0
##$F1P= 16.9975609425685
##$F2P= -3.02152046262296
##$FCOR= 0.5
##$FTSIZE= 0
##$FT_mod= 4
##$GAMMA= 1
##$GB= 0.15
##$INTBC= 1
##$INTSCL= 1
##$ISEN= 128
##$LB= 0.24
##$LEV0= 0
##$LPBIN= 0
##$MAXI= 10000
##$MC2= 0
##$MEAN= 0
##$ME_mod= 0
##$MI= 1.114404
##$NCOEF= 0
##$NC_proc= 0
##$NLEV= 6
##$NOISF1= 3.799351
##$NOISF2= 2.8
##$NSP= 1
##$NTH_PI= 0
##$NZP= 0
##$OFFSET= 15.70392
##$PC= 1
##$PHC0= -9798.292
##$PHC1= 30.40081
##$PH_mod= 1
##$PKNL= yes
##$PPARMOD= 0
##$PSCAL= 0
##$PSIGN= 0
##$REVERSE= no
##$SF= 200.130013532006
##$SI= 16384
##$SIGF1= 3
##$SIGF2= 2
##$SINO= 400
##$SIOLD= 16384
##$SREGLST= <1H.CDCl3>
##$SSB= 0
##$STSI= 0
##$STSR= 0
##$SW_p= 3612.71676300578
##$SYMM= 0
##$S_DEV= 0
##$TDeff= 0
##$TDoff= 0
##$TI= <>
##$TILT= no
##$TM1= 0
##$TM2= 0
##$TOPLEV= 0
##$USERP1= <user>
##$USERP2= <user>
##$USERP3= <user>
##$USERP4= <user>
##$USERP5= <user>
##$WDW= 1
##$XDIM= 8192
##$YMAX_p= 0
##$YMIN_p= 0
$$ End of Bruker specific parameters
$$ ---------------------------------
##NTUPLES= NMR FID
##VAR_NAME=  TIME,          FID/REAL,        FID/IMAG
##SYMBOL=    X,             R,               I
##VAR_TYPE=  INDEPENDENT,   DEPENDENT,       DEPENDENT
##VAR_FORM=  AFFN,          ASDF,            ASDF
##VAR_DIM=   8192,          8192,            8192
##UNITS=     SECONDS,       ARBITRARY UNITS, ARBITRARY UNITS
##FACTOR=    0.0002004,     1,               1
##FIRST=     0,             0,               0
##LAST=      1.6414764,     0,               0
##MIN=       0,             -310988,         0
##MAX=       1.6414764,     792620,          0
$$ Real data points
##PAGE= N=1
##DATA TABLE= (X++(R..R)), XYDATA
$$ [...]
2200c34J88o7K47n3R5q9K5o51n8N44K96m3P9l10l08R99j71r3q06M09K01l14J67
2223d7M73q28P3P09M03k59n10n5k08m2P03p12o9N91o3k16j5K32N7K43n67l1M98
2246C60j65J65Mn86m89O13K96K67n96j45L10P3J4O82p35l10L99J38J24l3n81N8
2268a37Q8L27j78J01m6k02o37R6O41N8j39m24j7N66R8K45r07Q54m28l68K09r1
2290b91P25n44m48L18m10R35o76K4J45l73J19N12J82k90p33O05o14J042M67r17
2310b22J71n61N78L23k26m33N77l72l58MM54j81L3l37M32k62L86m1l39Q67l99
2331I4j54k78J131o05Pl35K8L48j92L4o2m53M87n39P70o31j8K00n00M13O17M80
2353H42j115o1J2R95l88p7j91K35jl71M65k53J12j20M81n20l23P83r46N0K26J83
$$ y = [-334, -146, -213, 34, -19, 76, -13, 12, -639, -697, -153, 143, 100, 179, -131, -439, 560, 389, 296, -510, -101, 100, -214, -47, 426, -402, -329, 380, 783, 524, 14, -41, -249, -291, 412, -300, -369, 222, 159, -57, -72, 160, 217, 460, -107, -138, 360, 195, 360, 364, -222, -711, -98, 198, 465, -131, -276, 34, 107, 121, 803, 68, -242, 157, 295, 419, 386, -195, -137, -49, 278, 100, 201, 155, -47, -684, -588, 53, 111, -28, -452, -469, 97, 195, 440, -467, 387, -41, -409, -200, -291, 434, -110, -558, -240, -650, 285, -391, -367, -222, -595, -476, 36, 218, -72, -805, -200, -814, 228, 695, -222, -51, -612, -34, 289, 63, -370, 207, -165, -523, -519, -65, -246, -213, -550, -118, -380, 6, -35, -374, 493, 94, -60, -338, 793, 188, 195, -140, -112, 236, 44, 78, 16, -437, 50, -489, 281, -350, -368, -168, -668, -255, 362, 842, -273, -334, -322, 673, 285, 208, 17, 252, 251, -120, 345, 92, 204, 84, 565, 45, -278, 505, -441, -391, -165, 18]
2375A8K93J11m88K24l0L14L67j70j96k86o93P77J63j16L17q15K06M20N57p40k40
2396gL20j77J09n1J66L96o74j3j81J79l8J40l21l54O31J00m72P7O1K61o12J42
2418c18N2K58q52P53m78N71L09l24O85r34l9L27l37P73n41pn0M22k42m6K03j002
2440h17M85L98J66l3l81j08J70J92J89l09m39J05R13q35l1M5n2r2M93rk78K2L7
2463a69J52p6k19J59N36p01M71k31k14J51M08l09k46N2M01m41L22K86m60L19j66
2484B5q43M52l10O00L9K36J42k19J06n39M03j43J30p0k77K02J25k57J15j96L38
2505E9k75K80k63N2R0n03R5P47N5l12K76k12J82L39n63N8K37l12K21K32n95K29
2527A17J06n97O69m73j84P21p3n34J77ML24p4o5J44l93K4J44k90M00r4M26m82
$$ y = [18, 311, 422, -66, 158, 128, 442, 809, 639, 443, 157, -536, 241, 404, 288, 605, -210, -4, 416, 973, 233, -7, 313, 136, 245, 194, 360, 756, 82, 69, -112, 67, 29, 169, -152, -506, 125, 225, -247, -170, -109, 152, -460, -318, -266, -8, -860, -107, -585, -14, 295, -29, 656, -278, -317, 10, -327, 446, -95, -102, -152, 270, 28, -18, 185, -817, -332, 66, 232, 199, -182, -290, -120, 72, 261, -48, -487, -382, 531, -304, -335, -290, -342, -434, 59, 50, -228, -206, -169, -17, -93, -312, -153, 383, -318, 153, -78, -292, -141, 267, -42, -288, -236, 165, -276, 46, 332, -128, 191, 25, -818, -366, -676, -76, -37, 199, 341, 122, 228, -311, 92, -51, 79, 9, -268, -66, 59, -198, -83, -279, 59, -216, 64, -199, -147, -57, -560, -465, 282, 337, 25, 301, 89, 271, 610, 47, 105, 342, 30, 251, 483, -112, 117, 223, -374, 295, -178, -362, 359, 286, -248, -71, -67, 257, 183, 118, 262, -131, -107, 37, -253, 147, 53, 479, -3]
2549cN93q67L04J44r41P48mK41j38j75L95k34j07j81l09N52K80L74q48K99m60
2570c37O50k19Q9K5l8j83m69J25R1j51N87J34q84K02L08k48P7k26M47K25o93k61
2592g49M09P45m08j38j02L38J52o75R31l70r9j68J28J19K09k81l6p5K25r7P3l11
2614a80k0J44p2M45l23J76k36m70M45L92J82M09j105RK40O33k71l46j51K42KL73
2636E18n71K11k96J30J19J38M22q98J6j11J57P06o82J035n69m61N15m36k01K46
2656a2j31K24l2k02L49n73N11K0l18J43J9j16M14Mp15L46L69n24P13p45N03K8
2678B75k17J42j58M29q64J31K80r4O11r25N97l06J71N78q49r7J21M09Oo97N13
2699E6N19q43J26o6K92NJ02o02J39K53p3j68J08o6J08J42k61K93L6j49k69J12
$$ y = [-3, 590, -277, 27, 171, -770, -22, -26, 215, 77, -98, 297, 63, -44, -225, -534, 18, 298, 672, -176, 123, -337, 313, 94, 183, 208, 170, -13, -482, -357, -266, -417, 170, 304, -580, -378, -70, -318, -241, -467, -20, 205, -488, -749, -340, 405, -3, -141, -243, 95, 247, -428, 503, 133, 34, -134, -6, 113, 322, 41, 5, -70, 155, 58, 131, -180, -200, -56, -128, 317, -6, 170, -66, -536, -91, 301, 483, 892, -213, -204, 36, 669, 398, 52, -99, 143, 145, 518, -53, 158, -138, -8, 111, 249, 671, -227, -211, -322, -165, 541, -141, 894, 325, -136, 379, -57, -258, -12, -143, 81, 49, -153, 196, -377, 134, 154, -164, -21, -2, -118, 296, 300, -415, -69, 300, -224, 489, -256, 247, 275, 58, 200, 42, 471, -393, -262, 18, -76, 535, -390, 207, -99, 72, 650, -199, -296, -175, 234, 240, -457, 56, 575, -268, -142, -208, 84, 89, 191, -411, -272, -19, -92, -260, -152, -218, -110, 32, -229, 64, 100, -49, -318, -206]
2721b06M65N18j041J19j28JM54K5k95N7p01L73L15p28L38J130o33l30Q01l72l90
2742b28L2k54J02L50K38k88k25K5L6R8oN08k46r7k32j32j34O22J9p48N45J03L04
2765C92j68N2R9m99P26o25Q6j07j25N51J5m12M72o65L57n7Q7k17k95Q83p02o7
2787b19J46n2L78l89j90M67o7J76m22q9o9P01k24o1j8J87j15J63n72N99K42j87
2809C85j57j34J86n10M36K45j81l99l0q8K30N22o89k39K03L39k78J43j37J89l57
2830c21O92p49O04k17j03J1l21K98J76l44P07o56l25O30j86P05r00M64Q4l40K03
2851A12K02l54J12o60J07O78n20J07l59j9N63J49k61m8l44M39J92k0k10n4N02
2872C14m10l19P5M69k71M49k51jK11Pj24L3q2j77K89j51k32L35R1O9o95L11K99
$$ y = [-206, 259, 777, -264, -145, -273, -272, 182, 207, -88, -31, -732, -359, -44, -772, -434, 696, 63, -267, 534, 162, -228, -196, -450, -348, 2, 240, -48, -273, -248, -212, -114, -120, 388, 142, 45, -187, -319, -453, 169, 188, -560, -15, 88, 392, 224, 276, 375, -124, 602, -23, 63, -44, -169, 382, 397, -15, 457, -208, 149, 92, 179, -38, -333, 550, -152, -219, -73, -125, 253, -136, -326, 141, 74, 250, -172, -261, -330, 371, 147, 86, 68, 255, 140, 303, -269, 330, 572, 385, 228, 94, 280, -230, 206, 451, 270, -129, -159, -247, -17, 505, -184, -423, -220, 119, -159, -16, -153, 36, -321, 371, -378, 226, 9, -94, -83, -404, -106, 70, -274, 433, -223, -548, 82, -104, 601, -299, 165, 249, -91, 112, 314, -40, 72, -588, -481, 197, -323, -216, -575, -594, -31, 118, -143, -191, -535, -96, 96, 76, -134, -188, 314, -96, -415, -340, 129, -142, 307, 56, 55, 266, 273, 149, 182, 100, -77, 212, 61, -171, 164, 255, 324, -371, -60, 239]
2895B39l08K97m1j33J0K3K55m24J24P06q88L48j90k17l2m12N87k38P79k57r9m18
2917b89K98J71L0r1m6L8k5m1j06J06p0J17j33L20J50k6m21l7J36n6L06J30j30
2940C31k36k94J107r60k1L03p31Q63o2l87M11k99n73L45M43m37k02J62L46J98
2960C07L2m6m44M07l19r5l00K69k90J83K29m0j72m1K84P1p0J63l22M84p6K59k14
2983B59r0K47q41K5M93l22k63p4N54J14J6j84l86j4P4k08P57J65q7l81J65j65
3005a46L14j67j29l08M8L24m47O76l75r6j15j12M39M71j7j77k03J84k27qj20M64
3027B73o4l14O18n43J42k66m01K84L93k35n06O47M46p85K10M0l04N39l22J7J73
3048D2j29J80N93l68j78M76m84K52m17k1qk23J12M32m63R5L04l74L76j51L3J5
$$ y = [239, -69, 228, 187, 54, 64, 87, 342, -82, 42, 748, -140, 208, 18, -199, -231, -643, -56, -294, 485, 228, 129, -289, 9, 180, 210, 119, 73, 111, 86, 45, -61, 45, -25, 92, -41, 279, 429, 403, -18, -55, 81, 25, 331, 461, 331, 95, -199, 908, -52, -73, 230, -501, 362, 300, -87, 324, 25, -548, -203, 240, -197, -399, -237, 109, 307, 339, 293, -151, 256, -63, -158, -458, -189, -479, -296, -67, -107, -279, -320, -36, 35, -35, 128, -194, 290, 214, 473, 259, 169, 416, -425, -400, 93, -229, -492, -566, -12, 102, 118, -66, -452, -466, -392, -600, 157, 322, 235, -146, 19, -146, 168, 1, -128, -436, -388, -64, -511, 165, -210, -306, -421, -533, -94, 377, 360, 183, -20, 164, -63, -71, -191, 273, 209, -105, 513, -30, 112, -154, -555, -271, 122, -113, -619, 28, 474, -311, -101, -61, -365, 174, -148, -131, 42, -87, 93, 686, 318, 140, 616, 132, 384, -33, -54, -62, -285, -173, 259, -204, -109, 195, -179, 197, 46, 79, 94]
3070I4l58O7K95Q5m0j05j07Q3K41Q0l09J04o2n8O3J11l89K75j81K48k86M0K0J55
3094F6M6m7K29n76k3N65j73K98m21K03n94R07o5m52P4m18j96M86J74j79J81k91
3116b06j80J003p37K25o08O24L33n25k22L01j64K98j55k14J75o24R34M9l29N41
3136E19k90k13p79M04N73l74L44j75R4k11L04j05M98o81Kk73J13O80o64j38J41
3157b31n47O17J98n7m31O75k04l33O34l80P8R1j47r1K49rO3j08J84l77O62p65
3179b29o5P69n38K82j45N85k63P3p08j4Q28o23r7M59o89N44k44M2K18l73l17N23
3201A8L47J25o77O51n61j91L74k29M18o1l4j0o5K27k81Q9K29m8k62j76L19k79
3223g7p4l23M68l38M77J93j8n22M3L8K03m3M2j25K52j13L81m89P7j15n77P35j62
$$ y = [94, -264, -197, 98, 183, 143, 38, -69, 14, 255, 335, 26, 130, 68, 10, 73, 184, -205, 70, -111, 137, -149, -109, -89, 66, 112, 65, 294, -282, -305, 260, 87, 385, -36, 167, -427, 480, 415, -37, 37, -381, -577, -91, 83, -96, 85, -206, -386, 617, -120, 105, -503, 121, 454, -71, -293, 8, -156, 142, -13, -227, -52, -676, 258, 307, -22, 519, 229, 16, -763, -359, 214, -160, 184, 9, 103, -108, 196, 91, 589, -92, -90, -363, -250, 430, -234, -372, -231, -778, -161, 37, -20, -451, 224, 20, -313, 321, -59, 19, 110, -37, -128, 121, 112, 175, 67, 251, -126, 536, -229, -294, 475, -63, 219, 74, 659, 396, 469, -239, -253, 575, -48, -145, 314, -375, 169, -75, -33, 185, -188, -505, 18, 365, 490, -187, 464, -97, -288, 86, -143, 275, 214, 180, 170, 105, 332, 51, 140, 369, 321, 59, -117, 202, -77, -151, -474, -6, -344, 133, 326, 308, -214, -171, -133, 70, 27, 69, -56, 196, 83, 464, -25, 52, -63, -640, 95, -67]
3246f7R6M7j47n6J36J15l3n58J19L61J25rm13L98L19k92m46k9M6K0O32l79L08
3269B93n52L9K79L80l50l00L12j01j5j72j94M7lM55Lk73O9k09L64L64j54m16K88
3292A54n14M37J89k28l43P83o88J83JL19o65O52k40m99J57N39n3j1k36K5m58J93
3314c03J97J22l41M15l14N19o5l80R8J93n79P51m95l54M74k9j68M30l29N4R5M80
3336D71j078M45J63m21M20M03n43K38k92K41l4J05L98p46j05J73L08k61J08j16
3356a23R1m0J29K7l72K69L35P3j44l15K39N15k50m58nJ62oj37J58k18K18j04k26
3379a82j96M31q3K75R7q68L58M69n26j21j30p9O27J91j76k42M18J83q3j55n72
3400c64l7N26l92O1r5pO25o55k10L12k25L96J24Q2o46Q44k98j82k47K83M6o39
$$ y = [-67, 29, 76, -71, -127, 9, 124, 91, -467, -348, 13, 138, 129, -284, 114, 433, 141, -305, -334, -288, -268, 364, -15, 293, -259, -220, 59, 439, 89, -211, 101, 0, -15, -187, -381, -334, -337, 118, 121, -152, -83, -292, 72, 436, 282, -134, 154, -360, 77, 266, 38, -305, 478, -210, -27, -26, 293, -372, 280, 40, -459, -302, 237, 184, 173, -63, -38, -496, -303, -106, 16, -325, 90, -224, 295, 230, -150, -52, 141, -438, 313, -182, -536, -62, -91, -259, 171, -158, -104, -9, 471, -607, -162, 1, -420, 0, 403, -140, 98, -194, 47, 13, 118, 516, -230, -335, -162, 146, -115, -7, -123, -32, -72, 57, 84, -288, -19, 316, 389, 245, -70, 169, 684, 434, -24, -29, 133, 127, -10, 148, -70, 148, 44, -182, -378, 53, -30, 245, 342, -526, -168, 301, -225, -346, -476, -555, 72, 263, 87, -155, 263, 446, 363, 208, -364, -401, 125, -267, -206, -301, -308, 317, -338, -548, -236, -461, -65, 59, 141, -505, 339, 41, -141, -388, -105, -59, -698]
3422f98P54k32R2L96n56K67j3L01l96L23m22j13J29Q6l9M22n71N32r53P63k36
3443a64L99J3p17N37LJ24l45L38k92o6p2K85l95O25k63l12k8j97N94K40j84k02
3465g9k14j01J17P2M6j4J3L42k59M83j71k85J36n63K99j17Q27n05l85Q08n75n7
3487a82L99pJ56l51k76K86n57M52J06L0j45J20j73J94n64J082l30n33N51k31L63
3508C90q5l29q0J82K2j0m78K52l89j91Q63l59k5L7l19M02K75J60p22R3N65q09
3530e55M41R0L23k22K90m47N88p02L15k48M24j50j93J65k8l33M37R8r2m05n3P74
3552E17o48J04N05k39k6l39J57K78m10P1m8J67ol26j16L57k33j57L76K88J77l30
3574A19m83N71j43k20N1K26n92K26L46L07o35M06K81l45j45K55L45k57L69o38
$$ y = [-698, 56, -176, -84, 312, -244, 23, 10, 311, -85, 238, -184, -297, -168, -82, -121, 301, -270, 262, -691, 72, -164, 235, 248, -469, 68, 71, 195, -150, 188, -104, -170, -242, 43, -352, 273, 10, -302, -330, -527, 67, 307, 123, -79, -293, -394, -277, -205, -159, -173, -160, 182, -77, 406, 235, -50, 86, -477, -178, -295, 532, 27, -358, 450, -125, -182, 217, 210, 366, 15, -261, 25, -532, -80, 26, 56, -89, 31, -142, 52, -512, 570, 240, -293, 258, 27, 390, 305, -24, -104, 78, 100, 90, -388, -136, -525, -716, 147, -212, -237, -200, -519, -117, 158, 318, -404, -311, 254, -555, -114, -24, 299, 77, 367, -80, 508, -194, 121, -127, 297, 147, -46, 119, 91, -242, 195, 293, 201, -204, -257, 517, -131, -27, 478, 239, 213, -126, 31, 309, -101, -30, -78, 89, 83, -243, -359, -2, -235, -392, -16, 272, 449, 119, -364, 207, 64, -156, -105, 121, -471, -245, 101, 408, -227, 179, 460, 115, -30, 225, 570, 313, 682, 44]
3594D4Q6J23km61J38L85J1R4j19q08P11l07J02p7j77N1o2k4J07N11j47L6l32J04
3618a3m26K35N42q18O24N49m69k45J12j09k10M2J61j12K43J47k54k14M73Q4l73
3639c1l86N72K61m51p6M32j70m29O15o46K8J73M41j28J78n41O96q24Q4L10M94
3660F02l12m6k98j26L07p25O01J00k10QK84Q4l64k41K22l30P59m15j80J34L59
3681B13Mr20L37L80k64j44j0N06p18O00J94l66K17l3j57p7jN76o51K35l72O00
3703A49j61J17j89kl24N67l65K76M00p90K66L39o93P55n85M42k48r6L05n69J94
3724b12l31N11K76l96K59J98J78l05j33J14l20k24O32K11n85m4K65K30p10O84
3744B98j49k6J61l10j53L53o86M00r3M69n19k41M65J64j17o42O18N0p4l05L63
$$ y = [44, 130, 253, 251, -210, -72, 313, 324, 418, 299, -509, 202, -105, -3, -80, -257, -206, -268, -292, -185, 326, 179, 215, -117, -13, -439, -204, 338, -480, 144, 693, 224, -21, 91, -18, -228, -186, -25, -137, 106, 253, -1, -215, 258, 342, -31, -417, 155, 416, -35, -111, 321, 151, -278, 337, -309, -281, -108, 333, 205, 383, -158, 538, -286, -202, 108, 602, 290, 244, -54, -180, 127, -598, 3, 103, -107, -99, 185, 269, -95, -336, -114, -444, 315, -100, -280, -146, 213, 217, -703, -366, 14, -250, -394, -404, 102, -616, -16, 178, -188, 29, -4, -161, -238, -239, 337, -314, -79, -451, 149, -12, 105, -84, -86, -410, 157, -208, 68, 468, -322, -56, 283, -410, 345, -240, 202, -46, -142, 163, -406, -212, -543, -32, 244, -152, 107, 305, 483, 178, 45, 159, -161, -385, 247, 458, -127, -171, 94, 324, -386, 298, 149, 123, 284, -26, -179, 174, -512, -112, -205, 264, -255, -496, -31, 133, 16, -626, -8, 42, -32, -337, 26]
3765B6K19m45L88K29o42Q64p10J04o2M80q80O0K65P60r01P7P53l68K4k79M80n47
3787a05Q6j4J84k83J50k02j08m0L23j96p6l01N24M4O6M43o23P9N4J50o55M93P5
3810F8l07K51k44J64L32j77n6l71k1M34l54p2O33o59k19N33N70l57M44m63l85
3831b56M2L86M4l69R6M69k51p7j33O1J67k95K74k26PJ40K77m06l68N97l43K63
3853I9j26m38NJ14L73J91l08J91jk99j06J66L06j04j05l01M3J09m45M36l89P02
3875A13P9L44j96o15M95k26j14J92L46p98Q6L06M0L8l29k8j9J29N20o01N61n15
3897a92L93K27o03l69L02O22m63M5J15n44N99k52Lj04M72K77n26j14M17l14N0
3918D1N39r95J79M66l33l75N32L8n84O16k98l8K97M53o93M73j90J13%k01N10j143
$$ y = [26, 245, -200, 188, 417, -225, 639, -71, 33, -29, 451, -429, -369, -104, 656, -245, -168, 585, 217, 241, -38, 442, -105, -19, -33, 151, -132, 18, -184, -292, -332, -9, -205, -281, -582, -58, -14, 52, 495, -128, -49, 5, 155, -500, -7, 68, -239, 12, -232, -68, 264, 87, 31, -340, -361, 73, -281, -353, 280, -379, -598, -65, 505, 148, 592, 129, -256, -214, 172, 216, -153, -57, 412, 161, 84, -49, 12, 179, -116, 158, -68, -61, 79, 356, -50, -418, 179, -164, 99, -27, -465, -460, -346, 27, 218, -90, 101, 100, -199, -305, -139, 167, 63, -42, -343, -300, -191, -636, -200, -589, 113, 192, 536, 340, -275, 220, -6, -120, 72, 418, -380, -294, 12, 52, 90, -239, -267, -286, -157, 363, -238, 323, -192, 201, 428, -175, -544, -242, 380, -83, -38, 77, -467, 132, -120, -117, -221, 251, 528, 2, -112, 305, -9, 41, 580, -415, -236, 230, -103, -478, 54, 92, -492, 124, -174, -212, 85, 538, -155, 318, 128, 241, 241, 40, 550, -593]
3940e93N16L3k68p1K55J60M71r50M71O0j45j80K45l36N14J65J72o04k55K33J19
3961A2k21J57L05o36N50m08N29m55J19q9J96m89Q95q54L33J12j23K58m5K46n16
3982a24l6K45n20K9J41L28nn8j94M58k60L12k18o6M8n48O57M1l80O30m37p4j23
4005a54J78q4K80o4M2Lj23M87j097O33n0K9m43P51J21o69J39K74o45L05OK3L1
4028b7N6M13l95J03k51J48N2J10r8j21l47M03k30M79o43N35m94N8J77k69K62Q3
4050Dl91J93N8m2J69K10o57K47k64L51K67n28P6LL78L8k63P6J44N5q7m50J56M59
4074B02j98l46J78Q8k03l3M58m71N43j40l57P15l01K81j39k64j93K09RK31k77
4095hR2j60j17J17pl11L07K00k43J73m14N49k34j99K91k1M73m09j98j41N55m88
$$ y = [-593, -77, -44, -312, -383, -128, 32, 503, -447, 24, 84, -61, -241, 4, -332, 182, 347, 519, -85, -340, -107, 12, -209, -52, 253, -383, 167, -241, 288, -167, -48, -137, 59, -430, 465, -389, -56, 56, -67, 191, 146, 392, -124, -160, 85, -435, -406, -265, 63, 58, 0, -194, 264, 4, 316, 98, 32, 80, -468, 189, 230, -150, 480, 43, -31, -154, 24, -60, 220, 156, 198, 201, 78, 565, -532, 101, 51, 80, -363, 388, 509, -160, -21, 253, -392, -87, -81, -58, -27, 29, 442, 47, 150, -101, 47, 99, 209, 111, -10, -357, 46, -184, 295, -348, 187, -307, -249, -72, -341, -79, 4, -387, -194, -136, -178, -9, 201, -456, -209, -473, -122, 145, -383, -307, -304, 74, 112, -151, -75, 69, 124, 37, -413, -257, 202, 4, -342, -164, -76, -279, -312, 146, -325, 218, 78, -279, 436, 135, 416, 277, 13, -180, 29, 38, 269, -8, 84, -76, -193, -76, -83, -394, -87, 113, -130, 43, -371, 178, -56, -255, 36, 15, 488, 79, -119, -260, 295, -193]
4117a93K42K72n65K40K35P8l00o93N51l9M89n67L90j36K08j08Q0k46m00N74R9
4138B11N8o8j09J89L61q00K60M9k60P0j2L1l13O9MN2O63q01N38l02k18N17L5L01
4162E25p17N93j7j9m33J77M6n1J48k96m1o5K02j81O6J43K20l63j3oM01J78o38
4185a41J19N22o21R9m12J28L96J05l73J48p3j62M11k45L08j53j65L57k57K28p76
4206e57M98j44L49j40k41J6J71l3M77Pp4n07K63M3k17J89o79P06J07k45K54j18
4228A25p61Q54k85L23l83n9p6L52n65J53Q5j19N58j94l23J78L81m10k23K85j56
4249b60N46m00R5L4k39J19J61O3m47L55J43J24J0K76n48L57l94q4j3J48j00p8
4271a32k0J24K5J25j06K34o5m11O5K42M2L65n67o1L95o11O43l04n5k68M15m97
$$ y = [-193, 49, 321, -244, -4, 231, 309, 9, -684, -133, -172, 317, -250, 140, 4, 212, 104, 184, -62, -462, 112, 211, 269, 201, 92, 281, 642, -158, 102, 151, -109, -39, -51, -20, -333, -264, -260, -208, 455, -346, 192, -110, -328, 189, 224, 525, -192, 401, 384, 365, -68, 109, 155, 104, 252, -44, -85, -150, 52, -129, -63, 80, 300, -63, -76, -82, 319, 497, -141, -22, 500, -121, -22, -434, -306, 90, 195, -178, -30, -103, -265, 146, -99, 209, 56, -109, 248, -9, 219, -557, -59, -203, 146, 6, -235, -219, -48, -81, 396, 403, 329, -178, 85, 128, -89, 100, -579, 127, 234, -11, 243, 125, -636, 218, -67, 256, -127, -186, -262, 90, -475, -322, -237, -356, 202, 8, -315, -137, 244, -166, -389, -104, -260, 286, -114, -19, 15, -224, -105, 56, 119, -328, 27, 170, 294, 304, 580, 32, 389, -5, -89, -102, 46, -54, -132, -152, -28, -3, 122, 16, 250, 185, -226, -161, 81, 123, 488, -79, -140, 255, -356, 287, -17, -72, -340, 75, -422]
4293d22PK65K20k82L51J61n19N02k60Pl09K30K29l74R6om69k52J075R1J30n23
4315e2q1P39m70n6k67n8L64n17J67L56O7k18L92o0m81J6L28l48Q71p82RJ64lk43
4339a63pK20l65K78O3L92p24N77o63JL16r0N05m53j44J14K45K32k09m47J77L47
4361B02j34r1j63L69l84j23j43P32J41l5q3J12k09k37l02O53p06J75K66Mm34N57
4383A67M58m77k32j2O29m89M4r9M45l97O7q4L5L29K60q01M8L27l19J84N29j067
4405d55O27L05m10j87L61K16j69n16J78L86l59O78m56o27o6P17l88K3q4K70l06
4426b62p0L38o3L89j49k14nj08L57qo08N51R0j03n04J96K14m24M61m63P14m02
4448g3l08O45j78m58M08N1J4j40P57q41j41K39m8K38p10M37J88N6J4p7m51K76
$$ y = [-422, -415, -150, 70, -212, 139, 300, -219, 283, 23, 30, -279, -49, 180, -194, -98, -104, -573, -825, 250, 341, 471, -52, -133, 606, 136, 80, -187, -245, 119, -398, -231, 125, 192, -26, 366, 306, -175, -159, 169, -179, 692, -90, -81, 83, 80, -163, -170, 50, -315, -37, 26, 418, -306, 271, -392, -391, -75, -165, 340, -113, -257, -143, 102, 334, 125, -322, -145, 202, 68, -23, -186, 183, -201, -324, -467, 265, 406, 371, 288, 400, 191, -46, -348, 305, -401, -226, 40, 44, -390, 167, 625, 148, -84, -96, 533, 44, 88, -11, 434, 37, 104, 20, 55, 384, 644, -157, -109, 218, -101, 83, 612, -455, 172, 477, 67, -120, 241, 457, 288, -228, -50, 336, -23, 655, 199, -428, -494, 223, -165, -142, -226, 44, -262, -332, 6, -57, 332, 183, -31, -36, -144, 213, 205, -403, 148, 238, 135, -369, -173, 41, -383, 78, -385, 329, -73, -381, 264, 86, -372, 36, 87, 101, -39, 718, -123, -264, -25, -73, 165, -545, -108, 80, 136, 150, 73, -378, -102]
4470a02J34o4K7n15K36M49k41L22j99p5J51J73l52l57N38R2n6j27L23l17jK22
4492B61k17K1l13L89l57O54m06k96K88Nk78M07N2k48K26l35J73K40m88O9L64k16
4514ej29N4J48l58M35n39R8N1%K68j23J56J11k1k63Q7N30m38J09l71L44L01l63
4537H2K41l8n46K6L37p4j23M9k36L03k41J53J28l8Q1j13R8j96J91j17N05n11L09
4560B70j61J89j01j38l3J52n20j32M51j1P8J49m13L92j18n1q7j67L06k48K27j13
4582g9k31O52M0r52Q84k57l6P5r1l20J27J7L77k47j1mM27m74Pk66J74M31k8m98
4606b83J49O1l22O87k10m83O5O49m70K73q7l47N06j96n06P18P8k25j36k96P76
4627D01m20j25j54n0J23J88K20J6n2j0k22K24P6p10J44J14L83q59J145k11J58
$$ y = [-102, 32, -32, -5, -520, -284, 165, -76, 246, 47, -28, 123, 296, -56, -413, 125, 217, 161, 34, 357, 40, 39, 261, 44, 65, -248, 141, -216, 438, 32, -264, 24, 29, -249, 158, 210, -38, 188, -147, 26, 266, -222, -153, 211, -5, -134, -80, 68, -290, 145, -394, -296, -245, -245, 23, -100, 56, 167, 146, -117, -30, 500, 62, 171, -200, 144, 445, 82, 323, 285, -261, -235, 102, 28, -95, -46, -282, 21, -220, -67, 61, 23, 104, -9, 89, -107, 84, -33, 472, -39, 270, 109, 298, 197, 59, 26, 178, -342, -474, -23, -34, 44, 193, -220, 172, 54, 3, -84, -251, 55, -193, 34, -79, -310, 342, 382, -570, 314, 57, 21, 96, 5, -315, -188, -171, 206, -41, -52, -56, 371, -103, -96, -362, -188, 243, 215, -283, -134, -73, -395, 292, 82, -401, -336, 313, -157, 116, 29, -318, 188, -8, -514, 204, 282, 57, -79, -375, 401, -19, -144, -298, -348, -225, -37, 183, 199, 147, 137, -85, 139, 215, -495, -351, -237, 146, -713, 432, 221, 379]
4648C79o3l10jn90K32R8N66j16m2k66j39n47R91j03P3q57M52P15l70R8m39L10
4670G1j37R0J72j84K91p2k89K34q97Q44r1l73N78l26K20j09N06n00L79n05J9K90
4692B11q8K3K76m83m21O23l25K66l23N67r3k71L31r6R3k87m1K24k14Q9n13O53
4714B01m13O09m52k74R40o38p7k16O6J04j23J38M21q8n26L91J67m13M30m07k87
4735d47K20L3O67j43k86M44k37k14K54j58m76j22Q99l42k17j3K10m06L54j79n45
4756g04R86o47M29K59n25j03L30k03N16k87n88P32J76n31J30J74l29M26N5l35
4776c9K01j21n08M47M6l14Q18n05J34j87k21K13Q4J46p9j88J55k09k89K80l30
4797d66N61N6l79O28p52M27J09l95J37o5M00m13K57r2K34l14J59r7o9m1j16K95
$$ y = [379, 316, 6, 5, -585, -353, -255, 311, 195, 153, -113, -252, -799, 192, 89, 162, -695, -243, 472, 102, 200, -239, 71, -66, 24, 196, 12, 303, 231, -58, 176, -721, 123, 32, -341, 237, -89, 131, 22, 528, 28, 407, -98, -79, 211, 123, 146, 422, -61, -482, 141, -184, 82, -241, 326, 233, -38, 293, 197, 290, 3, -38, 186, -28, 61, -452, 201, -212, 397, -55, -329, 611, -27, -104, -320, -254, -150, -273, -135, 286, 198, -328, 63, 230, -183, 247, -160, -447, -227, -194, 473, 330, 44, 488, 251, 37, 291, 133, -343, -465, 434, 92, -125, -138, 72, -334, 20, -159, -704, 282, -365, 64, 323, -202, -305, 25, -178, 338, 51, -537, 195, 371, -160, -30, 144, -185, 241, 296, -39, 162, 41, -467, -20, 26, -288, 530, 25, 159, -28, -249, -36, 48, 194, 115, -73, 82, -127, -416, -136, -466, 95, 151, -228, 400, -352, 75, 184, -211, -74, -139, 261, -152, 105, 13, 247, -67, 92, -5, -74, -115, -231, 64]
4819F4Q0m44k05P44M4Jo4K60q07R41j042N69j49j61O21n76L03j31j1j7Q4m6l18
4842b60J4J98P58p93M1L3k03N79m79L57j90j41K18m63M1K55o6L39L2j61j22J64
4864A51O1k72K13k83L87r67R11n58K67J81j1k40q0k79J84N12n03J08j37M95o80
4885e40O50K3k43J25NK70j76k83M55l76O2M67k66m84K26O8P4N5k18J4j8m17N09
4908a8k49M68k95N16n98q2M47m30M94m47K61M7o5K03k67j19M8J43J71m81O27l44
4930C0L81k42L03p29M82j40j78L72o88O22l75M6M87m72k95K64q6L61k51j20J41
4951h7J24j46k14j39Q34o7K32o65M71k54J29J71l19l37L46j53l71K74Q7L1l06
4972c59N89o04O41k65m70M31J89op91N98M0K48K31n81L13j78k21M25m41L08J71
$$ y = [64, 144, -300, -505, 239, 283, 284, 220, 480, -327, 614, -428, 141, -8, -169, 452, -124, 179, 48, 37, 20, 104, 58, -260, -246, -48, 710, -83, -42, -9, -212, 367, -112, 245, 55, -86, 132, -331, -290, -35, -101, 238, 270, 109, -13, 151, 212, -60, 153, -130, 257, -710, 201, -357, -90, 91, 80, -160, -240, -519, -335, 177, -326, -218, -355, 140, -540, 110, 133, -110, 15, 20, 290, 114, -169, 286, -90, -28, 439, 173, -311, -85, -17, 57, 112, -106, -92, -110, -527, -18, -267, 201, -94, 422, -176, -258, 189, -241, 253, -194, 67, 114, 49, 252, -15, -134, -86, 57, 228, -253, 374, 30, 411, 169, 472, -257, 225, 85, -93, 279, -409, 213, -162, -116, 371, -101, -396, -132, -218, 143, -108, -228, -87, 37, -109, -323, -462, 372, 305, 537, -128, 343, 89, 218, 389, 70, -267, 79, -74, -445, -171, -84, -53, -359, 230, -374, 267, 2, -468, -37, 152, 146, -645, -47, -7, 241, 472, -109, 204, 26, -195, 230, -211, 97, 268]
4993B68n04J17N64m90k95K53M9K06j94r9j21q1k8J52%K17k25m2K00J011p30l79
5015a51L2J64L68n13m71N17J70J30l79j23O46Pm37k27K90q2J37k44n5k97O81J9
5037A82K13p15N02l7n06L58O3N52j41l01J4L19q04J76K2J67n4L72M3m34k20K5
5059b04K26J69k73J13MK35L03l44qk9K11q08M68k79P0M9N44o36j07Q06k13M0k12
5082A25j90j47k14Q25j16k02k15k3K95o02M43J82J52l03J7N4j1j61M7K3j39K17
5104E7j79k36L78M31k40l56K42j26p07J349j095K87K1LL5L07P1O5k4j31k27P7
5126BO3J49n64K57j72j27J005q40l95N48p04M93K70m9m7l5P9M73m92J87n05L26
5148g8K05l00L55m05n8j10M93k18L60o42O91j90r2J94m6j47L79q11N92n31N21
$$ y = [268, -236, -119, 445, -45, -340, -87, -38, 168, -26, -125, -246, -327, -355, -203, -203, 14, -211, -253, -53, 958, 228, -151, -119, 45, 413, -100, -571, -54, 116, 246, -133, -256, 390, 397, -40, -267, 23, -59, 78, -166, -221, -518, 163, 182, 395, -320, 182, 145, -361, -3, 60, 612, 471, 170, 184, 503, -301, -125, -103, 64, 10, 382, 425, -9, -229, -204, 22, 191, -82, 31, 35, 270, 573, 229, 221, 192, 403, -405, 63, -216, -146, -97, 447, -189, -296, 510, 297, 337, 125, -65, -212, -426, 399, 283, 81, -134, -157, 138, -464, -21, 161, 313, 10, 27, 81, 70, -91, -44, -21, -160, 57, -122, -358, 20, 451, 211, -145, 97, -29, -736, 613, -482, -195, -174, -171, -136, 171, 242, 307, 283, 152, -75, 2, 65, 214, -350, -93, -265, -392, 613, -227, -622, -74, -778, -285, -15, -64, -111, -146, -67, 406, -86, 101, -404, -78, 127, -173, 182, -223, -281, -391, 102, -116, 244, -398, 293, 103, 11, 205, 159, 12, 391, -420, 172, -359, 162]
5169A62J92n63r4M97n51M66n39N03k18L56j88m63M92J45p9l05J87K73j66J70m1
5190B36K47j53o50k5K59p1M49j28j81m38K88K47j25k27K57L52m28j63J81J97j39
5211a5J63r7j6J18k07L66J6o95Q03qm08rL27j94m49L95j56m3L02k43q3N65P6n56
5235d8L42j29l27O2O5j65J40K56N1j56J69k21j9k34K91L1l91L62K87o26K18n7
5257i9K87k24L95l35Q3k45M63n78L27l30Q06o80L10k02l4K24l22m6J47k29O7M45
5279B30m68N07k83l02J4K68o5k57J58o7L3M30m45O16l04m38J47K84n69N38J77
5300B04j54n4j07J72L13p81K64M24k74K67n68j64P17o6k57k12J68j26N96k41j84
5321f3J53o0J82m45K80QK36m71J8L5j98k7K21L85l26N50l74J27m73N07q0k92m4
$$ y = [162, 354, -209, -303, 194, -357, 109, -430, 73, -145, 211, 23, -440, 52, 197, 118, -187, 0, 273, 107, 277, 236, 483, 330, -320, -345, -86, -157, 292, 164, -17, -455, -167, 80, -45, -272, -15, 337, -91, -254, -73, 124, -15, 148, 51, 35, 153, -54, 312, 328, -367, 436, 428, 20, 11, 338, 144, -305, 90, -66, -109, 193, -50, -133, 432, 508, -48, 294, 165, -162, -100, -35, -200, -60, 196, 247, 91, 260, 39, 20, -214, 77, 108, -283, 79, 366, -260, -42, -99, 188, -36, 359, 24, 107, -138, 325, -253, 74, -256, 550, -130, 180, -22, -56, 168, -154, -200, -53, -282, -215, 230, -238, 269, -14, -316, -302, -34, -99, -356, -198, -265, -232, 198, -247, 369, 65, -373, -226, 58, -511, 27, 204, 50, -4, -111, 61, 374, -407, -143, 281, 7, 274, -294, -458, 259, 193, -64, -276, -108, -234, 362, 121, -63, 90, 30, 212, -233, 47, 55, 291, -180, -162, -127, -325, -352, -131, 254, -72, 478, 104, 231, -242, 265, 185, -107, -151]
5344a51J40N82p53N1J92pO78r49J82k97J03J40N17l21l78M00r9M8k3M4L41o9j13
5367B58m31N14k04n03R4L66j73N62k01k60k77M99Np3L92l05j8m92K52J05l42K72
5389D0p7k76L74l39L23j32l31MN08m10M59l78L64R5p84N99M7j43K11j47l6l05
5411c34P18L6p55k3K07J68Q4J22l93J8Q1k0j37L41j41p0j00o0L29J11P2k46L99
5434D07J17j46p20J81M49m31J45K42o6J81o28J36K09K91L48r07O4P2L67o66J52
5455b03L2j86J60J79j41J08l57M29o9J47M22m23l41M57j72k48K34k77J032r69
5475a86J88K17Nl67K14k34N32k38j50M1K56n26L51k37K63l17L2Q0Q6K76l46K55
5497A95l34K05l56M19l3m86M20J8J65k27K13m86M97l03j05K60l70L6m9o0K04L16
$$ y = [-151, -11, 571, -182, -131, 61, 54, 732, -217, -35, -332, -229, -89, 428, 107, -271, 129, 30, 78, 55, 99, 440, 371, 258, -173, 341, 137, -366, -272, 94, -79, 483, 282, 22, -255, 244, 249, 176, 568, 263, 245, -247, 5, 110, -232, 40, -37, -313, 61, -278, 45, -87, -418, -414, 94, -316, 143, -235, 129, 224, -560, 39, 86, -57, 154, 7, -29, -334, 384, 420, -335, -358, -151, 17, 101, 223, -170, -152, -71, -91, -228, 113, -28, -98, -198, -258, 71, 182, 254, 8, 407, 524, 378, -342, -161, 288, -143, 2, 244, 178, 359, -269, -133, 76, 367, 715, -192, -128, -56, 311, -355, -203, -171, -357, -197, -18, -159, -51, -408, 21, -48, 99, 521, 98, -243, 214, 42, -206, 28, -249, 783, -186, 2, 219, 224, -143, 71, -163, 369, 131, -19, 22, 278, -248, 103, -134, 129, -188, -156, -76, 10, 286, -60, 195, -139, 66, -290, 129, 96, -390, 30, 48, 213, -14, 199, -287, 210, -93, -198, 62, -308, -272, -321, -381, -177, 139]
5519A39p69P53p0m0J4l91O8O39n29M15j88l3l66O9j34L60J02Nk72J81m60P21j88
5542B6m34K29L46k13J13oj09J60K07p61J45J5M3L21j22l9N1Q4J60J06k81k26L99
5565B14n7k98M02m73L0J55p7J01P19p20l25M88j01m25M30j33M45m97N88l61m39
5586c34Q11l45j28k67m8M08K59q45O32q14Q88j58Q7l39M19m89j45L89Q4J36J75
5607C76m40M16j14J46j65O4N20o99n82N51n28N3M70P1l49N8Q0J06j11J75m4r3
5629c9M85l36k75M05l12N11O4q43K89Mk42J95J55l60M43k01P4l48M42J72n69L78
5651I2j4j2m34Q8J39j20J0m7L82O8j39m88M05k75JM78j55j45K28J21j39Q8j76
5674d4m31M58l7m52K82K13j79J63n99K59N29O0o1o09P15k69K7m41M63J08l20L23
$$ y = [139, -630, 123, 53, 13, 27, -364, -296, 343, -186, 229, 41, 8, -358, -289, -423, -63, 39, 44, -228, -47, -507, 214, 26, -408, -179, 167, -46, 67, 61, -48, 112, 319, -442, -297, -282, -239, 82, -40, -79, -28, 56, 216, 322, 41, -185, 214, 157, -141, 261, -212, -182, -27, -104, -3, 716, -4, -329, 159, 58, -367, 63, -70, 375, -122, 466, 105, -334, 477, 132, 4, -263, -311, 97, 356, -489, 143, -671, 217, 59, 146, -193, 226, -263, -408, -19, 65, 201, 376, -64, 352, 238, 384, 219, 283, 803, 104, -478, 73, -455, -402, 68, 139, -210, -152, -72, 34, -77, 98, 54, -39, 446, 110, -165, 240, -72, 439, 503, -340, -51, -47, -289, -94, 61, -299, 144, -57, 17, -331, 111, 283, -286, 92, 78, 66, -368, -280, -141, -261, -251, -298, 84, 152, 13, -475, -70, -345, -344, 134, -21, -166, 62, 183, 44, 132, -44, -475, -17, -54, -506, -224, -11, -190, -27, -626, -367, 162, 222, 161, -448, 267, -2, 25, -416, 47, 155, -165, 158]
5696A58J43m15J86k00N76k34n74K45%l05L70J72J70m57Q3L34k1k54j63K15p23
5717f94O18l14Q19k4m71L50K3j22j50m1J18j6j54j25m6j90J0J9M18l06K75j50
5739a53k70K59Q8O59k88j78P3m83P48q44J79p0L13l03O6N6Q0l73M16O0K75r8l27
5762a15q8N6km1K23K54M50n16k81L72l28O49l09m03M8P8p6J96Pk16J30l0n26N49
5786H1K90p70O70l63L13l82n3N36n32L63L28o33m65P66n52O09l75m43K24L67l43
5807c64M60J26p36R9L95K52l2m80P2L49n54K60L0K55k09K14L11k65j36op1j5L4
5830a1j73rN58o53J6L07k7K62n74N42k21p9K00l45M84j41k82l6J85L0k04k58L51
5853g8M79l10j89K53j18j68M53P9o92j97M85M38p99j92J189j028J77k11M40l34
$$ y = [158, 301, -114, 72, -128, 448, 214, -360, -115, -115, -420, -50, 122, 292, -165, -82, 252, 231, -23, -186, 29, -694, -76, -390, 429, 405, -66, 284, 307, 185, 35, -6, 112, 96, -58, -183, -229, -419, -409, -390, 28, -278, -3, -153, -423, -164, -76, 583, 295, 117, 190, -293, 455, -389, -210, -280, 33, -270, -204, -148, -68, -441, -25, 35, 310, 212, -115, -203, -147, -149, -190, 33, 287, 737, 221, -60, 312, -16, 633, 324, -79, -31, 47, -29, 167, 174, -42, 88, 58, -468, 81, 371, -399, 271, -92, 221, -161, -214, 322, -210, 153, 481, -152, -617, 149, -403, 206, -169, -612, -388, -21, -364, 96, 222, -514, -415, -20, 232, 200, -280, -208, 141, -413, -153, -123, 132, -77, 137, 448, 183, 47, 41, -30, -45, -11, -184, -193, 365, -288, -272, 35, 8, 270, -304, 238, 17, -62, 138, -207, 277, 136, -146, -182, 3, 33, -171, -429, -78, 401, 91, -98, 155, 37, -131, 322, 401, -291, -488, -3, 435, -364, -556, 633, -395, -218, -429, 11, -323]
5873c23M54M2p03J011l51j66j61J78q5O47j56k86J08j79K40n55K05j7J78K96q3
5894B94j29o48K67j2M42k37k22L67j87L83n35K94R7o02O31K38k25l28n56O64L75
5915C71n85L06n7J06j94K95p21K62k79L13J21K15m74L39n25J43K14L83j92L85
5935D26j50n2j73K00m49P53n99J68K4Q5Q8m07k39J13L07m2O2k35J61l29K30k02
5957b60N49l80k22L09l5R0j57q1M80m12k37K91k41O00l16k48M82l8m51N39l6l76
5979a50J15J81J04n09N41j75l3L15j40j1JJ94N3n49K5m23Q19k90j61l1j20L33
6001H9O5j27j01m27J34N61J67j18n10L41j66O48r97L88NJ14m02K07M04p06O38
6022B07n62L74Q7l94K33L79j36l41K57jRK1j95K02JM31n96r4j86M38p4J62k41
$$ y = [-323, 131, 173, -530, 481, 130, -36, -197, -19, -104, 543, 387, 101, 209, 30, 270, -285, -80, -97, 81, 377, 294, 165, -483, -216, -228, 214, -23, -245, 122, -65, 318, -217, 77, 174, -428, 203, 441, 216, -112, -668, -4, 371, -214, 92, 35, 141, -53, 242, -479, -217, -496, -183, -62, 153, -321, 18, -507, -364, -150, 233, 41, 426, 276, 224, 51, 251, -198, 555, -44, 124, 148, 233, 321, -86, -325, -212, 95, 53, 115, -120, 41, -288, -58, -260, 289, -91, -313, -4, -39, 51, -106, -187, 293, -119, -356, -65, -306, 294, -22, -270, 212, 174, -277, 262, 226, -150, -35, 146, 250, -259, 282, 107, 74, 389, 249, 238, 239, 433, 486, -63, -38, -461, 358, 68, -93, -124, -244, 89, 154, 27, -74, -501, -367, 194, 361, 243, -267, 74, -92, 556, -441, -53, -48, 66, -336, -129, 275, -431, 207, -355, 19, 106, -288, -55, 324, 188, -153, 104, 103, 112, 133, -62, 140, 141, 572, -24, -118, -304, 134, 60, 222, -19]
6045a9k05N31j91m48O23m8l91r3p3O23p97L52K43k42L22j09j24k32J63k08L66
6066D3l77j18M64o7M37l58j92J32J26l4J30j96k05K54j10n83M43N0M97o67L09
6087b2N9K8m6O1K18Km18j50K02L33p14K08L32N0k42O2o7J69n44M90j81J9N36j036
6111f51J511o62J13l65J51K14j58k47q0j25L26P3m06k6M11m43R74o74N61j82J88
6132E03p04L4K41j19L50p4n2M8L03k44l09Qj97Q1K84n80k8P65k73k0m17L44K49
6155A93k61L98m16M4J2J66k9q47Q36q9J49j94l65K58K18k26J09J22k87N08l66
6176f7j99J57O38n78J60j42K46L08o29l68J25k11R10l06R1k43J23Q5L1p1j4J69
6198B15l11J84J59l23J66m13K73k42J58j36N48m96j02O62l51J53o67L97M08p6
$$ y = [-19, -224, 307, 116, -332, 291, 243, -148, -241, -314, 309, -488, -136, 107, -135, 187, 78, -46, -278, -115, -323, 43, -334, -452, 12, -55, 382, 24, -168, -36, 90, 56, 186, -10, -215, 39, -71, -654, -211, -161, 336, -331, -22, 37, 65, 19, 80, 298, 300, -118, -268, -66, 267, -447, -239, 93, 143, -99, -37, -104, 65, -479, 11, -170, -151, 385, -651, 860, 198, 311, -54, 97, 311, 153, -94, -174, -299, 27, 100, -306, -332, 79, -364, 610, -64, 497, 315, 503, -201, -167, 74, -45, 305, 231, 179, 227, 530, 286, -23, -15, -212, -131, 153, -427, -455, 310, 37, 17, -400, -56, 193, -68, 330, -86, -42, -30, 136, 107, -740, 96, 7, 156, -38, -403, -145, 73, -153, -44, 78, -209, 299, -67, -266, -109, 529, -49, 111, -31, 215, 523, -106, -474, -349, -560, 350, 44, 135, -108, 15, 100, 131, 60, 46, 215, -96, 88, 247, -76, 90, -323, -50, -292, -134, -270, 278, -218, -320, 342, -9, 144, -523, -126, 282, 206]
6218B06J77n96K43P2J79r20J57P66p07L39M07l17M7o44N70j90P4J02jk07K49m14
6240d08O19l72J05K7m9j03j21N29q64N58K90m33K3J10q5P20p42J52M45k42k13
6261e4m98Q7J091n34K82K22p52P5J42q0K12j33J18j81K75m32K71p7O8L62m00P0
6283A34K8j38J84N0k26k56P1Q1P18m12l28J03L97n42M52M6n82L41j82O5l32%Q39
6306E11r21O49j23K03j38n32N09J36l03l11K02l02K6O58k30K07j9n06K43l68N72
6327A63l90n7K22N42j73n96Q7M64n55O20j8lp02J081n93o29Q24j01M9k5j42L63
6349D31j83m58J00K93l11k1J62l0L6k24M07J48j32r38O50o7m5J86Q14r30J33m20
6371c99O26M8q2K36J74l38j92m32L96j31k16n4Q29k70q4m47R8L4KN0J08P68q92
$$ y = [206, 383, -213, 30, 102, 281, -639, -482, 284, -423, -84, 323, 6, 53, -591, -21, -211, -137, -35, -36, -243, 6, -408, 211, -161, -56, -29, -78, -181, -302, 227, -637, -79, 211, -222, -199, -89, -174, 546, -196, -44, 401, 159, -54, -552, -465, 626, 92, 374, 596, -156, -81, 61, -19, 193, 60, 178, -3, 272, -160, 111, 34, 102, 464, 64, 134, 162, 24, 208, 258, 32, -224, -153, -72, 646, 234, -94, 9, 406, -136, 316, 362, -220, 121, -61, 4, -328, -328, 511, -410, 239, 116, 319, 181, -351, 158, 294, -9, -320, -118, -420, -394, 264, 34, 241, 222, -284, -41, -409, 163, -227, -284, -62, 480, 307, -289, -202, 262, -293, 327, 309, 306, -396, 685, 92, -537, 287, 186, 235, 210, 68, 431, 248, -210, -110, 183, -128, -149, 13, -17, 19, -205, 202, 350, 218, -720, -70, -137, -182, 4, 818, -112, 21, -399, 227, 275, 193, 429, 603, 265, 73, -359, 37, -94, -310, -364, 465, 195, 111, -336, -238, -204, -202, -152, -44, 724, -168]
6394a68K48k7k00O76l45n25J37K70K70j53q8j89K91j78N84o05J30N13p48k3P0
6415f0K01j49j20j89M01N2J0N2K26n45L22k26l40L41J34R1k44k91R1j16M18l88
6437c29O8K6l5L08j0P01r87K68n60N36J01P9l70Q1K46k77M05k75j53L35K32n14
6459a24rq8M13m02J2L37O5m09K84k14o87R30m76j75M37N7l57O40k50J58m88O92
6481C46o3l23j23L84j48m3M18n50L0j08l29R1M63L79l21q3l50M13N36q32l87O10
6503A0J48L74o19J94n13N50Q5n38L91pK93j12km49J30R3l63K13K35l70j27M45
6525F1j61L24k62j31Q4J89o2j22N6K69j61J27j50l40p8M36J34j72J13L01l95l10
6547b50O52n27J4o3P7J69j67qOJ23Ql28M09j35J25n9j23l67P7R24o56M76k72p2
$$ y = [-168, 80, 53, -147, 529, 184, -341, -204, 66, 336, 183, 95, -94, 197, 19, 603, -2, 128, 641, -107, -130, -60, 141, -8, -128, -317, 84, 136, 146, 198, 424, -121, 201, -25, -365, -24, 110, 201, -43, -334, -243, -359, 59, -329, -261, -235, -270, 38, 28, 729, -258, 10, -550, -14, 87, 166, -204, -123, 123, -154, 251, -24, -177, 158, 390, -124, -133, -221, 192, -210, -198, 139, 204, -205, 79, -135, -822, 108, -368, -543, -106, -49, -406, 234, -16, 142, -346, 346, 283, -40, -163, 221, 73, 30, 448, -102, -72, -180, -509, -418, 45, 424, 103, 20, -330, 83, 619, -213, -600, 10, 158, 532, -87, 107, -406, 144, 229, -309, 82, 75, 368, 256, 254, -195, -65, 28, -335, -122, 113, -257, -384, 61, -100, 224, -38, -169, -85, 104, 42, -80, -24, 245, 84, 211, 61, -279, -357, 79, 213, 41, 154, 455, 60, -250, 402, -125, -111, -174, -97, 72, -95, -103, -97, 26, 34, -294, 115, -20, 105, 46, -77, -444, -367, 557, -99, 377, 105, 33]
6571C3n7l41kJ76L82K77n46p6l16P63K38n60M3k05j19L09N77k75n34k56Q13p65
6593d41L63m96N39K06K59k66j31L83l25J27k27M66m83M3M15l37n3J52j42j17k43
6614c08L89k85N4q9L65o91O48l73N73m22L9n05N31L04n02q7L44J49N58o33o8R3
6636H4Q7J87l07K76n68R3n2N01k78k71M09j18l95J91n2L53N99n38j63J74p4L6
6658A74l0pq3n29L93P2nl19O40m25k04ML71M96p98J26L54n2N6o82N85J64q63M17
6682a45O40j67Q4k02N6J13n77n00M53L77m0j18J34n2k08L90j62J94l16K13n96
6703d29L25L44o39L04O39o12k35j45M36k55j68K20l75L31K76L21q45O07m22R0
6723b32N9L70K21k63r4rK53k93M01n61k57L23L05l00L48j17l06K83j58Q1k36Q8
$$ y = [33, -24, -365, -367, -191, 191, 468, -78, -154, -470, 293, 531, -29, 14, -191, -310, -1, 576, 301, -233, -489, 324, -441, -78, -574, -35, 171, 430, 164, 33, 416, 91, 218, -9, 457, -26, 17, 432, 95, 42, 194, 52, -65, -308, 81, -204, -150, -239, 126, -565, 83, -290, 283, -139, -100, -605, -74, 230, -272, -359, -15, 134, 692, 59, -9, 84, 171, 358, 51, 327, -241, -148, -200, 301, 23, -248, 161, 43, -352, -161, -213, 140, 739, 201, 38, 212, 138, 174, 144, 137, 54, -475, -82, -10, -15, -334, 306, -119, -323, -319, 52, 548, -250, -124, 230, 178, 234, -448, 137, 301, -562, -145, 495, 328, 412, 210, 266, 379, -198, -698, -245, 132, 92, -26, 108, 56, -152, 238, 76, 270, -46, 167, -429, -104, 240, -399, -95, 544, -68, -303, -448, -12, -267, -435, -215, -590, -259, 17, 338, -507, 100, -322, -232, -173, 197, 418, 155, 61, 52, 305, 12, 413, -148, -405, -82, 223, -77, 271, 154, -152, 131, -27, 54, -182, -94]
6745i4N36l85k16L77L83p87O20m47l10M7K17J97r5m7j91Q0L95L4m08K10M4K36
6767C96p95J12J98p9O37k8k91L4l33L6J82L14K87n02n78N52q1L04k21q55P52l20
6789b79K06J03K4m87L11j2K93k77J01J6J53k05L66j42k5n4q9K67J8n12l1K33k45
6812b67K09K23n84K84N26k29Rj2o1pp2N43q31M92k62J71j38J51l89RK17l3m7o4
6836a62K55j44J52l92O01k07j72O3M22m04J18J90l28L37l18m0j10N97o56L7N02
6857C41o58O6q7K03L25o09j08K38O06p19L12L14J3J60l87n2Q3j11m8K95k1P5n05
6880b74K63k43K11k16M13L19j41k98P9L2o3k16M12j35q98L37L00o5N82m17L66
6901C48k89J39k39j62j80J90P05n14j23J31Q6J7l31M7M36n50M47q9J19m42M90
$$ y = [-94, 442, 57, -159, 218, 601, -186, 434, -13, -323, -276, -59, 138, 43, -4, -195, -115, 280, 314, -94, 116, 160, 396, -399, -287, -89, -168, 469, 441, 150, 184, -149, -113, 69, 383, 670, 168, -410, 142, 61, 365, 144, -711, 41, -279, -73, 30, 54, -433, -122, -134, 159, -118, -17, -1, 152, -53, 313, 171, 146, 92, 3, 270, 288, -224, -255, -22, -267, -58, 165, -419, -135, 391, 162, 171, 159, 98, 91, 19, 562, -269, 223, -39, 132, -6, 145, -244, -235, -18, -51, -98, -162, 93, -51, 101, -291, 310, 103, -69, -6, 416, 12, 130, 320, -8, 329, 11, -29, -139, 458, -198, -161, 341, -317, -251, -338, -135, 190, -419, -527, -289, 317, -402, -90, 224, 237, 397, 10, -42, 41, -70, -118, 177, 156, 231, -274, -11, -254, -43, -259, 154, 473, 332, 34, 113, 145, 82, -134, 278, 143, -755, -418, -118, -183, 399, -18, 348, 59, 198, -41, -203, -383, -193, 512, -2, -125, 6, 92, 109, -222, -175, 261, -289, 158, 69, 188, -254, 236]
6922B36L08m58j33l74N30R5o9L16n24k0j25N86l80J11k37J59n44P19L06q36M40
6943A06J28o91O47l11L80j10p5m12JR1N35j00o09M24K54L74j046M91J9jm53J42
6965b16L02l3p1K03l63J29K7o38M18q0k03R24o24K72m11L23M2N89m46n24M65r5
6987a0j94m21O40O03j230L61l27N19m4mL61l65L05m22O55l02j17j09L80l68j52
7008b41K58m9j23j20K26k12J76M41k33Q7m66K74K06l19Q2j77O50j20m41N2J3j81
7030b17J83R8O32p70R6J24m88K20RO49r49O30q6l68P04o92N47K5o37R9M24l42
7052a09J29J86j28j73K50m36L76l41L95m04L2k09N3N26j7n05L69J67j48J28k73
7073a32L20l2r7j51M06p29M59M1pk1q2qJ25M57p64K32p03K19Q58j98k23J26k97
$$ y = [236, 544, 86, -47, -421, 109, 204, 135, 451, -73, -93, -218, 368, -12, 99, -138, 21, -523, 196, 502, -334, 106, 234, -457, 190, -121, 259, 149, 74, -338, -337, -246, 289, 189, -420, 4, 258, 632, -414, 77, 96, 95, -358, -216, 86, 53, -18, 185, -178, -49, -22, -660, -242, -322, -525, 399, -225, 47, -364, -41, 1, 590, 144, -380, 85, -10, -204, -625, 15, 618, -612, -251, -578, -59, -103, -107, 254, -111, 194, -228, 427, 125, 8, -101, 279, -89, -241, 17, -32, -155, -275, -49, -261, -85, 356, 123, 210, -256, 18, 224, -95, -13, -190, 460, 340, -101, -49, -36, -217, -34, 64, 696, -74, 22, 146, -342, -122, -113, 536, -413, 217, 131, -237, 467, -225, 322, 347, -290, -191, 233, -109, 20, 206, 78, -95, 155, -281, 95, -246, 149, -255, -223, -432, -379, 147, 130, -375, -6, 161, 13, 141, -132, 188, 156, 59, -92, 314, -415, 44, 85, 78, 57, -25, -33, 92, 549, -215, 17, -686, -467, 391, 193, -30, 96, -201]
7096b01P4L80N1j67m1p1J61j05K84o40K55q9L10l87r3M18O84q68J46n29p4K15
7118b87K91O7k86M98r5n31P36q78M64J45l83M63m51L21n08M22m0p7K28p8j46K94
7140A69pK8p23N74N17l92oj29k50K21k4j04L74l94K68l44L64o3r1o6K32j36Q2
7163A00L30j12K07k04r9o64N2J75K70k24j46N70q0l53K46L73p63O69j71l13j88
7184c25K77J35k01J22j93M53J87k16l44K40P9m87K77q2pMk39K58j07n1j36P42
7206C86j42m58J44n8k99N38m31L12l1m08J38K27o7L71M5n03P53p32K49P5J82j24
7228A67O3l70O5L90l69j72P40m98j2k93K80K62l47p8j11K78J92pk43k41J12J11
7250h1j75L90k97J46j31k16L38K85K46m89J18J92m33N70m07M00o40j10K34L02
$$ y = [-201, -127, 253, 304, 137, 96, 25, 186, 81, 365, -275, -20, -109, 201, -186, -279, 139, 823, -45, 101, -428, -502, -287, 4, 71, -215, 283, 188, -343, 393, -485, -21, 124, -259, 204, -247, 74, -434, -12, -52, -129, 99, 21, -125, 169, 162, 190, -533, 41, 558, 166, 160, 31, -219, 2, -22, -126, 248, -146, 122, -222, 142, 79, -12, -78, 154, 18, 100, 430, 318, 525, 321, 222, -442, -390, -215, 55, -169, -315, 255, 175, -178, 68, 441, -322, 347, 176, -137, -325, -48, 87, -114, 8, -185, 268, 455, 239, -105, 135, 214, -273, 4, -78, -85, -81, -320, -62, -169, -220, -356, 386, 244, -214, -70, -128, -427, 111, -320, -8, -39, -447, -309, -82, -149, 222, 267, -236, 517, -215, 34, 109, 291, 167, 230, -140, -75, 315, -54, -226, 514, 16, 4, -289, -9, 253, -94, -172, -283, -5, 187, 180, -63, -304, -192, -81, -256, 134, -163, -17, -148, -364, -26, 259, 505, 16, 134, 326, -107, 463, 56, 456, -184, -294, -60, 242]
7270B42lj69J38m25L40K33n08m3J06J87j20R9l77J33j46O40J82p97L17L9Q6o7
7292H7L27l82K8j42J30j26k32K89L50o59L67j4J18n01P72p18K09K44jj31Q0j34
7314c9L12m4%R3k78q7n9L8N0j46j57j78R97N5q6p38Q8J31K89n04K76k9j72J57
7338c1K21M99n90J19m33J28K14l26R1j11L98l97L82j75l05M97n2k39K4n8J72k44
7360b16J24p5j28k2L83L4J05J32o5lq85P65m02J51j05J92l85J31M66K38m74R7
7382E8O16o43L14n71K56K14L9r1j30n23N90j96l74R33q62N44n09N74J21l52j96
7403a88O8j87J53L8Nj07N54j20K09l38l40L05rl28J16j11n1J078j216L39p6j20
7425c26L75l34L36M19m86K93K4j28L2R9p6o88N72L42p72L60M1k10J05K1M9l7l24
$$ y = [242, 239, 70, 208, -217, 123, 356, -152, -195, -89, 98, -22, 77, -300, -167, -313, 327, 509, -288, 29, 68, 154, 87, 414, 32, 60, -82, 48, -78, -310, -21, 329, -330, 37, 23, 141, -360, 412, -306, -97, 147, 146, 15, 95, -39, 273, 229, 229, 322, 44, -43, -102, -64, -14, -160, -317, -495, 502, 557, 471, -267, -179, -48, 241, -263, 13, -16, -188, -31, 190, 689, 99, 218, -215, -87, 127, -199, -108, -219, 179, -218, 164, -11, -316, 181, 129, -110, -86, -144, 28, -216, -92, -167, -295, -317, 66, 100, 205, 337, 272, 269, -616, 149, -253, -102, -207, -15, -400, -269, 197, 435, -39, 58, 674, 31, 345, -226, 30, 244, 283, 192, 62, -461, 129, -67, -441, 492, -370, 174, -335, 239, 360, 8, -188, -120, -307, -154, -116, -111, -218, 336, 216, 425, 87, -253, 52, 43, -285, -169, -280, -331, 747, -469, -130, -206, -326, 49, -285, 51, 470, -16, 277, 301, 173, 205, 304, 228, -460, 112, 454, -318, 42, 83, -127, -22, -1, 48, 11, -313]
7448c13k59O53Q36p50J97k26n74K79K27k81P6K83R1j90j06j76L99O8m46r7P40
7469D31j55l24j12m1L60J16k37j14n34M90N62n51K21J24m22K53l9p0P4L15m55
7490a08k4K03j46P9kj79L71Q6l96k26k9L19O1j50J28R5M9J1o14Q18q59L18O26
7513D31o16O90o69M79l03M56q00k42R12q18J94R3J18P16j131L44R2K03o7rJ71
7534B44l31L19k02k21J75L35q78M62k2J53k63M94L7k96O14q72N95k71J35l1n83
7555d07M01M02j33m58K63k01L31m86j41N50m7J30J40k21k45K42l58L4P4N80m37
7576A3m37R42n88K44l27k72J89l1N94m61k7J00K29p28R62k35O4q8r0j00L58k23
7598H8j26l45P57k29k1p8J67J57N0m91o4K78l74L46o60O90j13j89N87l12o17J52
$$ y = [-313, -572, 81, 917, 167, 364, 138, -436, -157, 70, -211, -135, 148, 239, 49, -57, -233, 166, 234, -212, -309, 431, 276, -48, -160, -201, 159, 275, 38, -76, -610, -120, 442, -109, 112, 236, -186, 67, 28, -42, 32, 347, -108, -132, 71, -75, 4, 2, -177, 194, 280, -116, -342, -371, -52, 9, -141, -13, 82, 131, 142, -472, 346, -513, -195, 431, -185, 505, -164, 315, 12, 468, -332, -574, 338, -480, -286, -193, -75, 641, -490, -146, -54, 149, 82, 73, 244, -87, 232, 30, -191, -16, 319, -559, -97, -119, 34, -229, 265, 302, 6, 620, -252, 343, 72, 207, 176, -407, -6, 396, 263, -195, 68, -133, 198, -288, -429, 121, 74, 204, 344, 123, -122, 120, -238, -204, -130, 450, 13, -424, 518, -70, 174, -153, -425, -236, -267, 327, -134, -161, -61, 168, -560, 402, 167, 231, 143, 53, -47, 311, 88, -38, -383, 374, 145, 124, 46, 213, 370, 420, -71, -135, 143, -231, 115, -545, 145, 32, -157, 430, 118, -499, -347]
7620c47L67l46M14L7Q8k07L76l09j14k76K74L50l28k0J31n98J82K83l07M03k27
7641a74J53J09j04K64n03N20j07n90O47m94K89NJ82o03L92m8J65J71m34L12M96
7662F48q57K97l52P8J0K93j03j62L92n28K30j18L64j3P4l87p7J20p9L24Q9j85
7684E8j30J0m33P40k56N5j93K62K9J19l92N57k01m30k6J49K67o86O75P4m95J4
7706b33M50J06m83J67L90k09l74r3N80l32l95J56O78l81j02o9N62j77J15p43N50
7727A63o8l20K86l06N19m41M1P26n26j5K93r0r3k22l55K41J13O74j98J56n51j60
7749a33L64n26M23j36m16M14K6j83O92m25K9J83l20L7l32j74N20k11L2PJ80j07
7771e6k36N49k51l41J4M58n74K02K75k5P4J56n34P04m17l92k5P10m37K57k19j28
$$ y = [-347, 20, -326, 88, 125, 213, 6, 382, 73, -41, -317, -43, 307, -21, -41, 90, -508, -326, -43, -350, 53, -174, -21, 88, -16, 248, -255, 265, 158, -432, 215, -279, 10, 15, 197, -406, -14, -62, 103, 274, -160, 152, 648, -209, 88, -264, -186, -176, 117, 14, -148, 244, -284, -54, -172, 192, 179, 253, -134, -211, -91, -170, 154, 243, 58, -72, -62, -495, 245, -11, 44, -149, 113, 142, 261, -131, 426, 225, -205, -231, -82, 185, -501, 174, 248, -247, -233, 217, 323, -160, 7, 397, 188, -186, -279, 301, -31, -426, -270, 408, 27, -75, -144, 418, 241, 356, -387, 163, 95, -225, 61, -245, 274, -167, -126, 600, 74, 59, 352, 262, 169, -53, -408, -167, -54, 620, 422, 578, 27, -133, 231, -295, 128, -8, -424, -10, 16, -167, 525, 100, 129, 312, -8, 29, -303, -477, 43, -168, -136, -129, 51, -56, -292, 257, 6, -335, -321, 137, -437, -235, 40, 15, 89, 245, -289, 415, -2, -394, -419, 291, -146, 111, -108, -236]
7793b36P36k94m82O65n46L74l47q4R3p9L05j55l08L91R6k74l6K00L9l54M77l8
7815A43l28j09P77k27k99m10N12m56J118j128L9M55m57P43l01Rj18j08k29J51
7835b23M56k24J67L5o99N70l1l27N25k02K06j90M6K59m16j60N9pj94p5L13k60
7857c72N11j48k45L72j04l13O30k22m4j3L05l41j5p82O94j53l33N98l01j33K95
7878a14j01P08j57qo22L02L73j80k65j9k96O01m59K30l05l16P98J38j58n75R81
7899E56p54O43j74k14p6K1j09J9K86k07j16M70n14K09N2p3K17j94j82P0R4k10
7921a86K28K80K7m36p9K57j04K07p2P8j31k14L94l57R0l87M69j95q0n4M99m4J50
7944C40k00q7j76J61m3K91n16R6K01l93O75j56k65m69K42N21k06M90l18n48Q6
$$ y = [-236, 500, 206, -276, 389, -157, 217, -130, -214, -121, -200, 105, -50, -358, 33, 129, -145, -181, 19, 58, -296, 181, 143, -185, -294, 483, 256, -43, -453, 59, -397, 721, -407, -368, 87, -370, 373, 72, 81, -37, -145, -374, -223, 233, 9, 176, 211, -488, 82, 51, -276, 249, 47, 253, 63, 109, 368, -48, -208, -149, -156, -350, -425, -112, -372, 139, -9, -254, 118, 14, -299, 331, 109, 65, 52, 357, 16, 1, -781, -87, -240, -573, 25, -276, -409, -114, -215, 493, 336, 328, -294, 8, 381, 201, -64, -83, -379, 222, -237, -7, -312, -628, 170, 308, 150, -425, 556, -198, 445, 271, 57, -19, 2, -107, -88, 198, -9, -125, 345, -169, 40, 92, 19, 236, 42, -140, -70, 24, -186, 42, 322, 349, -87, -166, 91, -13, 194, 122, 200, 69, -145, 249, -108, -18, -405, 64, -131, -211, -265, 234, 190, 340, 140, 53, -123, 38, -5, 286, -230, -134, 67, -326, 349, 193, -72, -541, -299, 222, 16, 506, 188, -360, -274]
7965b74M68K16n02l27N71k9L52l93m12j2k45P03Rl08J12k24J12J03M35l35j74
7986a54l41J84J66M0L81J38n15j46J16J15K8k05j08M3K38J66o8k64N24rk48o3
8008A8L2j44L36o61M80l02j94K32K24q8J70K26p51O11j37L41k15m97K22l14J92
8029b19J92Q70r09k2j60K76L3k10j0N1P4l17M8M31J96l39m96P33m58p15Q17L37
8051B03l19J41r4%N3k55M37K15l54l36N22K57l12j15j68L82j8l13M29m69J21p59
8073g52R18J4J42l36m1l08O44p19L73J0K2j28K23L58l41L39O4j25m48j41kM17
8095A83q4j98M83n98j25K13Q7j73K24J61J28l8k2m52N5K34j07l4k96O45o44O06
8117B48m96K00o6P4j87J43j41M33m32j94L14oL17k4q4J11m14M39q9o5j77J88j32
$$ y = [-274, 194, 410, -92, -419, 152, 123, 475, 82, -330, -342, -587, 116, 125, -183, -71, -295, -183, -80, 355, 20, -154, -495, -311, -145, -105, 276, 414, -101, -247, -131, -16, 12, -193, -301, -258, -20, 146, 78, -186, 338, 329, 81, 18, 50, -94, 242, -419, 61, -241, -435, -203, 21, -67, 103, 329, -422, 189, 52, 393, 178, -319, -97, -411, -219, -27, 843, -66, -88, -248, 28, 61, -149, -159, -108, -34, -351, -303, 128, 324, -15, -511, 222, -236, -951, -134, 203, -116, 25, -69, -69, -16, -271, 166, 381, 27, -309, 213, 470, 158, 43, -125, 257, 239, -74, 355, -114, 7, -752, 166, 180, 322, -14, -55, -363, 281, -438, -65, -55, -33, -161, 62, 420, 79, 418, 482, 357, -91, -232, -234, 183, 99, -99, 384, -214, -339, -126, -39, -212, 12, 173, 301, 263, 241, -211, -156, 78, -29, -63, -359, 286, -358, 248, -248, -48, -114, -40, -227, -84, -225, 208, -224, -418, -104, -110, 207, 183, 99, 210, -204, 235, 146, 81, -96, 92, -40]
8140d0J45L82q34L89J76M2k66k38M02K64k52kk11j6M90om87j0L33k36P0n18R9
8163c24L37l90N47m12Q04o08P6r7j93L13k49J36r56R43n55O81Nj33l50K90p0K00
8185eP5k7N30q36K74J63
$$ y = [-40, 105, 487, -347, 42, 218, 260, -6, -244, 158, 422, 170, 168, -43, -59, 431, 425, -62, -72, 261, 25, 95, -423, -324, 13, -377, 170, -242, 562, -46, 30, -67, -260, 53, -196, -60, -1016, -73, -628, 53, 58, -75, -425, -135, -205, -5, 70, 43, 573, -263, 11, 174]
8191A74
$$ Imaginary data points
##PAGE= N=2
##DATA TABLE= (X++(I..I)), XYDATA
0@%%%%%%K4m8M8m8O1q5R6j20J44j68K16k64L12l60M22m96N76o68P69q80J004j144
28f09J298j466J653j860K085k333K605k906L237l596L993m428M905n429O009o652
44c494P370q175R079j0107J1282j2642J4240j6151J8478k1388K5158l0253L7560
57B0957m9007O9647j18509M39026M30506p53655l45044J45980L68735R7053J5747
68C21436j31572k32242j86959J58205K59045M9928j98251j46317m3422L2532Q1481
79c6136J19626l459j22995j03024L2230Q7466Q0966L9681k2432j11300q1451P2123
91d8705J68455M3896j24722j22764K0683J00573N9653k7392n6979k9326j463J1648
103f443L0154K3028l3289o5518k080O1699J9028n2385k4372N1362K5961n8218
$$ y = [0, 0, 0, 0, 0, 0, 0, 24, -24, 24, -24, 37, -48, 48, -72, 72, -96, 120, -144, 168, -192, 230, -266, 310, -358, 411, -469, 535, -609, 689, -777, 876, -984, 1101, -1232, 1373, -1533, 1704, -1892, 2101, -2327, 2578, -2851, 3158, -3494, 3876, -4299, 4780, -5327, 5955, -6687, 7553, -8598, 9880, -11508, 13650, -16603, 20957, -28050, 41597, -76912, 362114, 792620, 38965, -306079, -160099, 208636, 305689, 321436, 189864, -42378, -229337, -71132, 187913, 237841, 39590, -106727, -150149, -117617, -36136, 83490, 80031, -42964, -145988, -113758, -26292, 54674, 94355, 71923, -39377, -120828, -48705, 119750, 163646, 38924, -83840, -63157, 37416, 97069, 69677, 12698, -16628, -18091, -6443, 23711, 46739, 13450, -52068, -54148, 7551, 26579, -25806, -50178, 1184, 27145, -31073]
115c1073l4186O1512M7805m6520n1023K2866L9821l228j4630J0611J0711j5650
127b984j4741K2885L1080j0827m3405j8517K4661L1401k939l2667k4627R164K8581
140b935J8642j1336l6673j0747L9600K9419l1060l1746L1193L7423k7315l7108
152c2643L6004O0240k0483o7574L914O9607J3361n5355k4924K6837J5731j0363
164A4352o183r29q423M708J8293q174l1166M121M1256j064n1125j1502M7712J7977
178B9853l5636j0817L0212O777k7416l21L9078J4275m0866l4250K5768M7022K229
191D5908m0429k5970J7709L2792K109k6094j2281O612m2j0069r94P112k992j4591
205b1220q735P353J6517N985n861n291J076M093J0147J0281L433n034r607j169
$$ y = [-31073, -65259, -3747, 44058, -2462, -53485, -30619, 9202, 5974, -8656, 1955, 12666, -2984, -17725, 5160, 36240, 25413, -17992, -36509, -11848, 19553, 16614, -16053, -40680, -31516, -2935, 15707, 4371, -32302, -43049, -3449, 25970, -5090, -36836, -5643, 31780, 4465, -32643, 3361, 63601, 43118, -24456, -20542, 49065, 62426, 7071, -17853, 8984, 24715, 14352, 8169, 7240, -1183, 3525, 21818, 13644, -17522, -13401, 27855, 26791, -24334, -35836, 11876, 29853, -5783, -16600, 13612, 20389, -7027, -7348, 31730, 46005, 5139, -29111, -3343, 43679, 45908, 5479, -20491, -2782, 30010, 32119, 6025, -6256, 356, 314, -9755, -10749, -3637, -6629, -21220, -29955, -22602, -6085, -100, -5961, -11252, -10176, -6083, 4064, 14345, 17778, 12744, 3137, 1968]
219A968J9302K1582m684k4123r060J5662J5185o465j5378n968l761j1309N07K0958
233A4416O775l0244k7465J8999M0428M617l9682k5901K5163L4823j0174l2324
245b0569j778K6811Q635k0329j1039J7709J7216j3128k4066K433K1713N214k0035
258a1213j7897J3008K4087m142k5549J459K8931P037k5832j3653K1143K0165j3972
271C572k6779L755K5474N292k0591j1597J4731J6694q485k1099m60K0951M660
284F118k2910j4223J7181J8228q797j9030K304J9387O524j3993q339P764Q577
297a209j874n587j835M286M339j80n64N355M307o212l405Q176Q746p273j2462
312e392N07J2840J924j1107j656Q486J210o927J662N394j77q577n277L868P948
$$ y = [1968, 21270, 42852, 38168, 14045, 4985, 20647, 35832, 29367, 13989, 8021, 4260, -7049, -6542, 14416, 21191, -9053, -36518, -17519, 22909, 27526, -12156, -38057, -12894, 21929, 11755, -20569, -22347, 4464, 13099, -7230, -18269, -560, 16656, 3528, -20538, -18105, 3608, 8822, -11213, -29110, -16102, 7985, 3843, -21706, -20247, 8684, 15721, -10111, -23764, -2621, 17544, 3572, -23207, -19452, 6022, 11314, -9277, -20874, -6143, 10551, 2066, -19033, -19493, 1458, 6118, -16792, -31015, -13834, 4394, -4403, -23433, -21129, -1742, 4782, -9211, -17550, -9786, -1209, -3083, -8670, -10505, -6219, -1880, -2060, -2624, 2731, 7038, 826, -2579, 5597, 14343, 7070, -5392, -4885, 7955, 9879, -1228, -2884, 5602, 6812, -115, 1547, 6941, 6764, -1813, -7090, -3222, 4726]
327D726j065r551k310J0841O391q285o711J0595J4679p889k1971J676K6676P488
341B5290k0337j8182J1598K0832L663j3750q655P419P010n881o653O556P032j0664
355E278j8549M767K5738O925k7012j9093J7628K3733n992k1653m822J4243O135
368G326j1887p909R956J3697n354j5354k273J8112J2756j2659j8700L159J5810
381F680j628j0131J378Q873l615j3346R14J7612J0220j5792k0631J309J8149J1148
395A1140j0209j7032k721J2285O963k711R50J689o851p290O544J3107J174j4808
409g770r072O662J0621N42l817o67N90k815j285L289P617J381j1227j2539O257
424a2233J5998L408r052n857L719L073n12M932R097l825j7762p579J7229J8098
$$ y = [4726, 3661, -5890, -8200, 2641, 9032, 747, -5964, 4631, 19310, 11421, -10550, -8874, 17802, 25290, 4953, -13229, -1631, 19201, 22864, 9114, 459, 7878, 14888, 9007, 2354, 8910, 15942, 5278, -13271, -8504, 17234, 24159, -2853, -21946, -4318, 19415, 13423, -8230, -13052, 1191, 7326, -4561, -12470, -2514, 11183, 5829, -9525, -11798, 6314, 19070, 6411, -12289, -9130, 6680, 5052, -5079, -3701, 5172, 1557, -11789, -10875, 6737, 16957, 1165, -19466, -18157, -8, 11140, 931, -16101, -18822, -6537, 426, -2285, -1335, 354, -6497, -13787, -7243, 5864, 7038, -7770, -16842, -10180, 441, 983, -2834, -3501, -2911, -5726, -7011, -3722, 3895, 5276, -5951, -18490, -12233, 3765, 7173, -1879, -7736, -4017, -944, -1456, 3476, 12573, 8748, -9014, -16593, 636, 18734]
438A8734m555j9452j0899J1766J8288J375j2699p280M911J928m168J661R795l92
452I013j6207j0514J6110K0937m529j9282n815J2557R500n301q134K243P116n015
466B679j1009M162J8693P554j6107j7867O784K3730M819j5873j1165M451N448
479F299m00K331M801k792j1142o629J0525J6990j256k0251j4602Q946J8184K932
493A3936j3911q331O170O649j738R72O844J54j0157n757O589R530J224r611n909
508c346K044L488K372J348j30l058p188n215P434J1111j63j7197j0865J0340J4795
523E770J381r238o112J730K813J501M981K415p443j1874Q17J2724J0017n287j4143
538i948k546J1515Q710m550o360K031J663n288m748N898R491k728j4372m498J1802
$$ y = [18734, 14179, -5273, -16172, -4406, 13882, 15257, 2558, -4722, 189, 2117, -2051, -390, 9405, 9013, -7194, -17708, -1598, 19339, 14810, -4472, -10287, 2270, 11770, 6469, -1665, 578, 7694, 2679, -8330, -4168, 14525, 22079, 5972, -11895, -5111, 18619, 23438, 7565, -3600, 851, 6299, 5899, 8230, 13031, 10239, -903, -7532, 2993, 19983, 18727, -1524, -16126, -7180, 11004, 13936, 25, -8306, -2136, 4513, 2775, 3747, 10591, 10745, 588, -5169, 1420, 10950, 12174, 2563, -3346, -1302, 2186, 4558, 5906, 5776, 2718, -4470, -9685, -2251, 8860, 8697, -8500, -19365, -9025, 5770, 7151, -2087, -8199, -6469, -3656, -2155, 2826, 5241, -2202, -14076, -13259, -535, 9482, 4195, -9948, -12494, -979, 7731, 3181, -3179, -1148, 515, -4773, -9521, -3623, 5868, 3140, -11232, -15730, -3928]
553c928J0668m611j0783j276O145Q27m538Q93Q509k21j1048n456J1860J6023j158
568A1906j6891r201J0895J4343k324j2046n532L537L107m52J379L842k318r567
582i322k193J1762R408p381j1604j40J0632N447l387m652L968N106j697m386J852
597C413P156J550r295q409N542J0372j103r822j315M138N19o12K926L052l886
612D226q738j001R915N710n082j0081k532P108P848j220p776k476M382K01l393
627b909J812L115m045o288J708Q188K836o693l508M647L185l384l253K052M286
642A749q72p797m791O457J0479j348j1851m022R657R341l227q192J38M504j310
657a085j382N845L519o277o563L641Q558K605o022r992n98Q324L463q377q057
$$ y = [-3928, 6740, 2129, -8654, -9930, -3785, -2958, -7496, -6603, 1906, 1685, -9363, -14819, -2959, 13064, 11906, -4985, -14186, -3291, 11052, 8728, -3318, -8850, -5313, -2206, -2658, -1279, 2563, 245, -9322, -11515, 247, 9655, 2274, -9330, -9470, 1162, 6609, 3222, -1430, 2538, 7644, 5947, 1561, 3413, 10569, 12119, 2824, -5585, -43, 10329, 9226, -596, -1911, 2227, 2746, 2134, 5060, 8112, 4226, -4512, -5513, 4402, 10112, 5030, -5051, -7583, -475, 7373, 6153, -1623, -4099, 283, 484, -2909, -1097, 2018, -2027, -8315, -6607, 1581, 4417, -2276, -5784, -1137, 2048, -1336, -4589, -2537, 1749, 877, -6920, -11711, -5254, 5225, 3877, -7974, -11996, -2339, 7002, 3775, -4417, -4279, 225, -1085, -2467, 3378, 6897, 620, -5943, -2302, 6256, 8861, 2839, -7153, -7751, 573, 4036, -4341, -12398]
672a2398L488P342k125p748K847Q431r09q311k64P995K710m684k480K057L740
687c09J546k938l5L220K687l203m674K438P285j653j0937j979J0150K888r376
702d890m463P137N254n555m614M147L496k293l959M58K776J710M74j697n06M587
718B062L631l378m031M655N144m300n654L055M852l574n645M107M146m832o385
733f147L113N933k270p086l246L181N233J134o313m607O939R321j492q089O87
748c709R820K738o216k886P153J447m506j997L628K59k413l41K550M3l761m680
764b871L42M905K175n597q069J719R850N066r686o196O147P284k393m597J745
779a76K439k892k159K739L699m17l545k496K550M443R81m478n077K231M461k291
$$ y = [-12398, -8910, -1568, -3693, -11441, -8594, -163, -1072, -9383, -9647, -1652, 1058, -3626, -6106, -4049, -309, 1237, -1701, -1736, 1484, 4171, 968, -3706, -1268, 6017, 4364, -6573, -8552, 1598, 4486, -4890, -9353, -2216, 3038, -2517, -7131, -2984, 512, -1781, -5740, -5282, -2506, -796, -322, -2019, -2525, 2062, 5693, 2315, -1716, 2939, 8083, 3783, -1871, 1184, 6036, 2462, -3183, 924, 5070, 238, -6147, -3034, 2899, 629, -6457, -9703, -6522, -1289, -155, -6468, -11075, -4136, 5185, 3693, -4396, -3709, 6111, 8849, 2633, -253, 6900, 8347, 3841, 1844, 5472, 5731, 3318, 2977, 5527, 5570, 1809, -2871, -2529, 2376, 4551, -1046, -9115, -7396, 2454, 7520, -2166, -8362, -2215, 5069, 2676, -1921, -176, 2263, -629, -2788, -49, 3650, 3233, -312, -2808, -258, 4185, 5166, 688, -4389, -2158, 2303, 12]
795A2n090K110M108l083n550L033N414j27n324k514K456K451j077o69J214J16
811b520L1o21J003M409L316l315o497J544Q237J534o602m664K346L622o40k411
827a228J981M92m863j848K873L118j533m219k715L030L625N17l104L95L980J516
843B017l397j245O780L926n242p449K830Q304K289m554m414J55K342L176K93p76
859E035l462l907j003M173M691j788p996m126M780Q914J00p134m056M607L592
874B420j094j787J427J115j896k795K981O009L89m831l122K567L279J011l077
889B596j764R44j032k468J035M909O06o855m095L030P134J374o539m705K397K477
905i56J293P37k92j534k210J59M699M607k560o663k441M808N311j365n684j696
$$ y = [12, -5078, -2968, 1140, -1943, -7493, -4460, 954, 827, -4497, -7011, -4555, -2104, -3181, -3850, -2636, -2520, -2489, -3110, -2107, 2302, 5618, 2303, -4194, -2650, 5587, 7121, 519, -4145, -1799, 1823, 1183, -1228, 753, 1245, -3618, -5466, -2593, 525, -1008, -5227, -7942, -4912, -1287, -770, -3874, -3479, 501, 2017, -1380, -2625, 4155, 8081, 2839, -4610, -1780, 6524, 8813, 4259, -155, 0, 2342, 5518, 5811, 5035, 1573, -2334, -3337, 836, 5527, 3739, -4257, -8383, -3603, 5311, 5411, -1723, -5779, -1172, 2420, 1326, -461, 966, 2081, 185, -2610, 371, 6380, 6769, 1938, -1184, 1383, 4662, 5673, 2596, 832, 1776, 744, -1724, -689, 4220, 4826, -2029, -6124, -3094, 4040, 5414, -1125, -5830, -3433, -956, 337, 1074, 782, -752, -2962, -2803, 1896, 6503, 3943, -2720, -5161, -353, 4958, 3593, -2091, -3787]
921c787K855J915k326k07L389l14m032k936L298M214o40m645k044J249L313J267
937E69P2j70p66k364l86L520M655j498q049l098N602O819J08o890l460L523L304
954A491M04j262l77j690k786N76L515K548j619n542n71M327M047j283l552k32
970b006K169L92k434J227L586Q57n330j894M393M086L04l668k331L41K236N94
986B522m23j027j239k889L80L903L514j896o078k073N013N208k350m767r88K628
1002e62J465J23J63P50j032j946N97K926K444k633l091j348K765K218j429k376
1018i66J502J074j417j162J168M027j478n153k116M128L415n56m417r10P11K005
1034a45J334k42o31r75j757j9L331K603k731m978m60N569L266k766m024J226K479
$$ y = [-3787, -932, 983, -1343, -1550, 1839, 1525, -2507, -5443, -2145, 2069, 1429, -3216, -5260, -4011, -698, 569, 641, 471, -295, -2659, -3045, 475, 5130, 3632, -4417, -7515, -1913, 4906, 5014, -1876, -5336, -1813, 1491, 1895, 633, 256, -1434, -4220, -3644, -129, 2419, 800, -4742, -5313, -986, 3061, 1778, -1774, -2006, 163, 555, -1879, -652, 2934, 3791, -1539, -3433, 960, 5046, 5350, 1682, -649, -308, 1928, 2522, 2099, 1072, -167, -3056, -2676, 1227, 4741, 2845, -3233, -5306, -293, 4915, 2565, -2202, -3190, -562, 903, 1026, 1189, 1939, 907, -1039, -442, 2484, 4928, 2295, -796, -2144, 621, 2839, 1410, -966, 536, 1610, 193, -969, 199, 4226, 2748, -2405, -4521, -393, 3022, 2466, -1951, -2861, -2150, -145, 1189, 947, 316, -659, -2416, -2435, 896, 3499, 768, -4210, -4670, 899, 4165, 1399, -2625, -1399, 1080]
1051A080L82k119K60J434r89k644o13K066K188p64l460p1K665K16j159m99J407
1068f20j02j803j399L099L016j264l893j07L510K808j185l473o24J541P89q04
1084e11o0M13j328j751R23K609K018k747l087J057L762J31k741j196K062J233
1100G87p8j532J087K030j7j887j141J743J069j481j641l94J463J24j342P41J950
1117A481o90k401m09L028J802j744l251j69L439J387j484j933l5K638L23j092
1133H90j051J970n5j771q44K031N16j543j213J324K442j56k936k31K557Q91k370
1150D51j738P42K660l20j571j934J816K272j665r15Q73L57r92r98P61J489j164
1167A24k048m85K612J852j708k417J245K202J6k103j949K249J474p37k793M86
$$ y = [1080, 1462, -657, -397, 1037, 48, -2596, -3209, -1143, 1045, 281, -3179, -3250, -585, -369, -1528, -2027, -620, -722, -2525, -3924, -825, 2191, 927, -2966, -3073, 437, 3245, 2060, -1413, -2037, -496, 293, -511, -571, -158, -1486, -3237, -2314, 295, 2313, -434, -3521, -2464, 1298, 1429, -1312, -2508, -446, 787, 709, -823, 264, 2294, 2277, 390, -751, 992, 2061, 580, -1061, -1455, 8, 132, -1210, -469, 1481, 791, -1610, -2019, 1009, 2811, 1067, -2184, -2353, 1086, 2473, 989, -944, -979, 1659, 1982, 890, -161, 1809, 1754, -17, -861, 1170, 1686, 143, -1070, 254, 2696, 2540, -396, -627, 1930, 2821, 451, -1287, -545, 2115, 1795, 224, -1710, 106, 2378, 713, -202, 671, 1028, 36, -962, -201, 1288, 124, -1924, -2409, 203, 2055, 347, -2070, -825, 1377, 1393, -710, -2659, -410, 1064, 327, -2466, -1980]
1183a980K164K67m47j010J246L23j277k93J082R30k045j996J264K029P45k043
1199a041j571Q77K985n85j529o75L38J578r27j238J587J040j511p89Q17K219l76
1216A199j360o08J73J398j432k190K468J310j226j367M36K313J342k010j786M10
1232i30J910O03j491p8O11k82q39P08J896M43k689k123K019K911q24k839j836
1249b830J789K244K65j987K4J319j60L09l66Q92N13r50j650Q25J462J4j316j79
1267B18J063k91q59k78J839N46k823k466J638L186J166k862k000N93K834J666
1283C170j114j365r8j81O76K08N83k25j984j604J490K807r17k242q36J953M9k64
1301A06l86O03J13m65j349N75J957P46j106j675N44K372M96k376j034Q38k75q69
$$ y = [-1980, 184, 451, 4, -1006, 240, 563, -714, -1007, 75, 1005, -1040, -3036, -1772, 257, 1002, -1041, -2612, -1735, 1250, 665, -864, -1539, -1201, 377, -550, -1788, -201, 839, -672, -1461, -644, 1575, 1199, -161, -769, -596, 802, -630, -2820, -352, 958, -268, -1635, -1199, 1114, 2456, 446, -1340, -930, 980, 1583, 92, 14, 625, 343, -496, 212, 2108, 2551, -138, -2261, -242, 2669, 1845, -994, -2830, -1041, 1203, 1468, -519, -495, 824, 664, 973, 607, 1499, 2012, 1062, -588, 237, 1699, 1713, 397, 218, 1281, 990, 131, -147, 1692, 2238, -585, -3051, -1413, 1773, 2939, 77, -1923, -1330, 1504, 3170, 2056, 691, 593, 412, 1088, 1296, 1879, 1654, -330, -1934, -444, 2363, 1446, -796, -1632, 321, 370, 106, -280, 323, 436, -29, -1378, -803, 1154, 1900, 794, -881, -337, 2035, 2531, 155, -879, -41, -316, -1185]
1319a185O52K139p37k012j910K805J994p09k295j332J013J319J283j344q43m47
1335a609R76k32P07J381k26k714j341K891J878j734j686M00J241m11J75K6J371
1352A093n32r94r02N23J959o3j445k343N43K356R26q69j157J81k45N2J757R83
1370A823j384l063J12K851K371j206j761j115J435J591P32j276j370N37J70k26
1386B21L57P79Q3k060p92J844J870j084p02k07j29L81Q7J38k74j34r88m41O14
1405d37K711N40j936k104Q36J984J03j064j81k11m31k20J653R80q58k594l80K194
1423E85J434m84k424q22M85J125J393j807r41J262K78n28M2J533Kj813p44J354
1441g0M34K43n91M46k86q62L53J301L74l66k579j43O88K147k54k669j405J516
$$ y = [-1185, -533, 1606, 869, -1143, -3053, -248, 1746, 1037, -1258, -2590, -1577, -258, 1025, -319, -1162, -1609, -633, -865, -158, 1223, 997, -1717, -3058, -167, 1711, -23, -1709, -1309, -68, -479, -304, -278, 1093, 561, -433, -1335, -812, 1147, 1084, -361, -2704, -2161, 195, 1121, 252, -905, -724, -969, -917, 840, 1823, 439, -2624, -2512, 339, 2710, 1504, -257, -1372, 63, 1654, 2386, 1110, -260, 277, 447, 221, 578, 1357, 1440, -620, -1412, 432, 2302, 1218, 516, 309, 180, 561, 648, 786, 512, 378, -610, -1051, -437, 2274, 2814, 878, -1226, -390, 1594, 1697, 633, 452, 241, -190, -410, 1243, 2223, 1365, -1229, -1609, 585, 2019, 1535, -889, -1711, -1226, -101, 1292, -515, -1456, -194, 84, -444, -402, 1131, 1133, -680, -1424, -70, 364, 607, 16, 462, 176, -686, -333, 968, 1342, 976, -1603, -1746, -1058, 1089, 835, -1834, -3239, -1723]
1459a723K180J76j208l81J81l00k41J976O3j777j098J139J050L86j14j346m07
1476a444J420L78n50q3J02O30j064j428J187J638L5k117M4J580M98q36p04R96
1494B82q43n64R1R62L26k87o48q33Q18J917L95k175m74R14Q90k10r31L29K28r03
1514g16M92J596L15j135j424M92J279j45o57m04J3K09R93j334K67O93O78n09j187
1533d84N32P57O78j755m87J383o02J36M59L1N2j486J79J734K87j465r95O11J394
1552I59k25k84j986J181P60N79j356J30Q18L15n45o67L05j36R2m66M28K73j93
1571a8O4k4O67J44j043k99K67O63M26r69p88M68J019K94r23j47K33K70n45J51
1591i0l77j96n83J23J119j53l96n68J063K41J30o62n17K28J041r3j117K49O19
$$ y = [-1723, 457, 633, -575, -956, -775, -1075, -1316, 660, 723, -1054, -2152, -1013, 37, 423, 309, -1037, -1444, -24, 354, -196, -279, -177, 453, -611, -2039, -852, 786, 821, -1296, -1252, 328, 826, -10, -714, 282, -561, -1125, -1034, -72, 254, -33, -681, -1514, -696, 1221, 1616, -559, -1033, -119, 771, 561, -370, -41, 187, -716, -224, 1372, 1687, 552, -872, -380, 899, 754, 97, -307, -294, -85, 908, -426, -159, 534, 1212, 703, -484, 48, 805, 1483, -272, -759, 624, 22, 158, 617, 648, 700, -786, -607, 1127, 1414, -51, -1046, -435, 959, 734, 450, -1536, -355, 405, 984, -372, -242, 576, 891, 346, -321, -16, -152, -60, -526, -98, 175, -18, 46, 22, 689, 833, -210, -509, -242, 421, 847, -122, -910, -442, 577, 871, -52, -199, 34, 304, -241, -90, -467, -663, -1246, -1123, -4, -157, -553, -1121, -58, 183, 313, -349, -866, -638, 403, 310, -807, -558, 61]
1610F1M91j0r56k0J102q26l04O46l81l86m88K53J035n14q04q07J589J081p18n71
1630e27j91J31J136j080q72P19J071n4o57K37P82j42m26J75K88k58r12j59J248
1649E09K06o90q85P71M38R40n68j358P6J194M36k69j229Q1L55N56p39J035q1l21
1669D57p68Q45R17q03m84m27L06K72K64n16k08M95M46j054m4Q55P63j266q70O94
1689a26N19N2P6p39L59j07q1L76J50P46j515p44P14J125N1q08j203R26Q81N65
1709A217q04l66k81Q02o80O4M3n3m98l57O79K86M56j183o6K43K13k3M53p75K82
1730c48l01n87N47N71J99p46j06K2J453n57K36q16p9l35J43N42P63m44n94l35
1750g72n0J356K55j129j348K22R27L20m69k46l4J33N07N40Q9r2n25J86J99L36
$$ y = [61, 552, 542, -414, -434, 668, -158, -462, 184, -197, -583, -1071, -818, 217, -297, -1101, -1908, -319, 762, 44, -527, -718, -587, 549, -531, -1403, -684, 387, 333, -324, -87, 695, 553, 127, 302, 590, 332, -580, -739, 509, 715, 25, -860, -89, 349, 1289, 721, -637, -561, 633, 1069, 800, -429, -348, 7, 563, -176, 859, 778, 457, -311, 534, 1451, 648, 164, -263, 43, 315, 579, 63, -145, 350, 796, -258, -302, 553, 1316, 50, -820, -126, 393, 445, 521, -218, 141, 34, -47, 329, 479, 1225, -290, -1034, -320, 805, 856, 48, -1155, -229, 652, 1217, 413, 47, -234, 568, -112, -48, -5, -58, -556, -913, -234, 52, 508, -675, -741, -498, -285, -308, 145, -630, -348, -649, -1236, -689, -118, 81, -665, -771, -749, 704, 147, 383, -433, -512, -847, -704, -162, 601, 157, -437, -772, -822, 534, 789, -340, -1688, -1466, -539, -219, -688, -934, -968, -835, -328, 212, 301, 209, -316, -130, 69, 405]
1770D05L35n91r01N36J95L28k21K95L18j000k97M56O15j27m18q37M79N96L71m8
1790D89o81P8N11k87L77N9k76q74j37L93J355k09r80j76K82J128r2q70m42N57
1810B05o47N51PN46J64q18m08N90K2P62l72m54L3J6J02L7O2l11m16n50J093Q14
1832A028J03j274m91K71P06Q04j051m42k30N19l5K32J07l81m40j68R78L14m8m98
1852Dm98J69KJ19n02O05k9m68j15k58Q63K74j79m02k28P15K06m98m5m68L86K83
1874f4P40k54m99o55p6P30N72j26p88r72R00N24M24r43N2m9K65J57p3K97j015
1895h53L42m28O46Q37k71n51J52L17j90K68l29K06j87k61J96J20M84M2l98l68
1915b26N33K98q1n09J42j52o41L87J12Q12l42n70m59P77N43L4l63n83K97M71k03
$$ y = [405, 740, 149, -752, -216, -21, 307, 86, 381, 699, -301, -598, -142, 473, 346, -72, -909, -430, 166, 537, 489, -192, -114, 397, 110, 487, 546, 270, -604, -741, -348, 1007, 798, -182, -358, -76, 1052, 960, 90, -352, 205, -442, 109, 116, 662, 826, 8, -400, 190, 212, 974, 602, 148, 181, 197, 299, 336, 398, 87, -329, -879, 214, 1028, 1131, -143, -634, -363, 343, 1147, 96, -346, -576, -57, -92, 140, 247, -134, -574, -742, 236, 550, 502, 4, -494, -325, -323, -204, -706, -101, -130, -598, -713, -971, -108, 166, -13, -415, -643, 72, 278, -220, -265, -733, -347, -64, 676, 422, -77, -732, -808, -78, 494, 368, -420, -1392, -492, 32, 456, -487, -435, -484, -219, -62, -135, 162, -853, -511, -939, -293, 544, 273, -278, -126, 191, 1, 269, -60, 146, -41, -302, -106, 14, 498, 540, 142, -226, 307, 605, 524, 15, 157, 5, -636, -249, -137, 675, 333, -237, -696, 81, 624, 658, 295, -288, 9, 480, 277]
1936B77p35N27qK71m68M64J33n7m69J23L36J12K19n81l9J90l16J45o07J200o04
1957A13p6m8j18J095n97n27m48J44K62Q41K23p73k97O30j85k13N06q64jL1N85
1978B83M18m06o12j98K99O25K46r83O10L05q07o7k44Q53j62p21m9N2K91N95m00
1999g2M59m25k90J1O51j85K44q74j32P27M1j23l52K54J82J7o5K56q67r0O94l35
2021b74Q2k40J08K41j04l47Q29m22j247O99R05k80k37k74N41K76K4o29L06M72
2041D29n5k94L0M5K77j21L4k8L8p0m06j52P78l54n76J61n6L53O1p45N68M71j53
2064B35j5l49j02O26N44k34o03j78K81J33P8L2l29O3R5k22l4mp1L08r5L06j89
2087B76j82j89K69K27J10n99K18M91n42J78j94J53m0r5l36K63m7M5k70N01J28
$$ y = [277, -458, 69, 61, 332, -136, 328, 461, 404, -65, 58, 394, 506, 725, 144, 105, 295, -21, 124, -483, 717, 113, 37, -11, -129, 966, 369, -158, -606, -462, -200, 641, 864, 91, -206, 424, 239, 26, 532, -332, -333, -302, 283, 701, 295, -317, -515, -216, 409, 655, -328, 282, 587, -220, -287, -531, 322, 160, -561, -610, -558, -267, 328, -72, 387, -38, -328, -317, 334, 149, 393, -481, -613, 114, 155, 32, -320, -66, 116, 133, 68, 324, -543, -633, 61, -274, -192, -432, -324, -83, -187, -534, 295, -127, -1374, -675, 230, -50, -287, -561, -20, 256, 280, -349, -43, 429, 374, 80, 110, 155, 432, 311, 345, 317, 355, 285, -121, -273, 505, 151, -425, -264, -320, 33, 94, -651, -83, 388, 235, 220, -129, -231, 395, 939, 705, 102, -76, 205, 338, 416, 448, 119, 182, 277, 55, 21, 17, -54, 254, 159, 465, 276, 94, -95, 174, 401, 511, -88, 130, 621, 79, 257, 63, 216, 176, 81, -255, 8, -39, 6, -264, 237, 365]
2108C65k55p4J12L16j041P13j12o9m6P16m29r41N89m2K00L45k17m86N21k91k97
2129d23P79j017J2L02L95L7k29l39p7P48J06j37n76l74O62L13r44P69p2q6j49
2150c00M99p63J03M8N7OR0k46j97R08L12q00j75L87M25k60j82j70o1J55L38n03
2172c29K83L21k89K67l17M79J62j071m3P05L17k89n45j85J28J70K61N08k30j97
2192A06k09j01o0M4K55k42q5J81J5L90k77J85L82m43n63N29M05j68l70j94J6N31
2214C27N60p19J30p6j86J038m20j73j46m60J6M19l61K14K57q02K76P9K46l46K31
2235A04o4L47n68K61m9K79p86L81N31m75O09m12K95n54L68k17J83O77p42k86o7
2256a85JP79n74r1m2k98J048l82l45j99j88M94L2L46k38m82J93q9m6P14r11J86
$$ y = [365, 110, 36, 148, 464, -577, 136, 24, -45, -91, 625, 196, -745, -156, -198, 2, 347, 130, -356, 165, -126, -423, 356, -661, -649, -347, 48, 85, -144, -483, -560, 188, 294, 157, -419, -793, -131, 182, -762, 7, -65, -151, -300, 199, -564, -461, -413, -356, -350, -260, -506, -703, 205, 517, -283, -458, -71, 354, 94, -88, -258, -319, -164, 174, -329, -46, 275, -14, 253, -64, 415, 577, -494, -537, 168, 485, 196, -349, -534, -406, -236, 25, 533, 303, 106, -103, -204, -264, -220, 35, -207, -292, -111, -96, 294, 17, 202, 584, 141, -422, 107, 512, 344, -26, -220, -204, 327, 887, 168, 298, 222, 36, 1074, 654, 481, 335, -125, -109, 310, -51, 163, 420, -382, -106, -27, 219, -127, 104, 40, 387, -181, 80, 31, 310, -476, -95, 436, -39, 570, 158, 453, -101, 267, 50, 233, 910, 168, -118, -185, -184, 595, 21, -70, -112, -410, 638, 256, -89, -288, -476, 18, 50, 396, 158, -324, -131, -220, -266, 448, -463, -277]
2278b77M78m79O63q07n8L66K62l35l02r1R49k16j70l89k49O87J57k81n20P1L32
2299b09L73M0L04k25o66j2K61J87K66j31n80O28K89J53j050K47L17K22N5l74l05
2320b10J41k43j95J19M43m9M77m82j10K67k82J44J62p6j92M3O17o76Q9K32l21
2341a02k34K21K25j1L85n95n37P33k9O38l27q54O72J67j24l87K26L13L3O61m38
2362F36o29j67L5L49n55L66J00r2m0j17l01Q24J77j069P72p88O55m43J44Q6M67
2383D10p00K05j71J172j017K69o99K04L70l8K6m45Q74n72J67j99PJ46J16n67O07
2404A65j34j40K84k54n24R74k74ml82P37k62j25o88J82j46M31r5J99k24L58j17
2425c9J95o20r2L15N54m92n81O89o2N5K57k62M1q51J307n74O11o58K78o25K1L98
$$ y = [-277, 201, -278, 385, -422, -480, -114, 148, -187, -489, -580, 369, 153, -17, -406, -655, 32, 189, -92, -612, -541, -209, 164, 204, 508, 283, -383, -395, -134, 53, 319, 188, -392, 236, 525, 678, -372, -125, 192, 414, 469, 95, -210, -69, -312, -507, -388, 55, 6, 483, 1, -109, 158, -124, 20, 182, 106, -86, -43, 574, -102, -13, 219, -102, -336, -115, 110, 99, 484, -111, -648, 85, 56, 694, 367, -487, 185, 352, 228, -159, 67, 380, 413, 1074, 636, 7, -160, -125, 224, -331, 35, 135, 43, 3, -114, -415, 409, 586, -483, 289, -499, 156, -287, -143, -57, 410, -290, -85, -256, 916, -101, 168, -531, -327, 43, 5, 31, -414, 460, -112, 55, -144, -137, 9, 125, -442, 165, 31, -109, 175, -79, -603, 371, 97, 93, -289, 448, 186, 61, -627, -445, -591, -160, -255, -56, -280, 78, -39, 156, -464, -556, -241, 313, -179, -760, -71, -133, -78, 179, -83, -42, -893, 414, -160, 451, -207, 71, -554, -533, -135]
2447a35m1R6m40R44m93j05k65L99K80J06j61k47k65L11P74j66o90K18J55K21J72
2468F68o21n66K36M30K03l66r9L56m35K11L26J25j94o06M98j10L58j16o22L6P38
2489D50p1l57j62K30q9k8k57L37N49n69K31l84k83J12M90M5l00P9J26NK96m09
2511D1M12o33k38O45k45P50o40Q4k66J63K41o64M24m53L30P7l80N0P2L42j42j3
2533d3J46j83j10M41n25N05P15q28J16k50n6k78M11k4j19O57q3p89m99N66K6O9
2555a35o9l45L10J11P14j40l33P1m65N98m93K1j24N20m59Q19k52l90m08K49K10
2576A0N9o72N17N19l31J41n33L64l17P04k05k50M60j68o56N74o33M90k44J2K37
2597G8j44k7l73K47N79k44R3m9k7j46p7j73K0Q4jn0p8M73l11K19K80l76J78m05
$$ y = [-135, -176, -80, -520, 424, -69, -174, -439, -40, 240, 346, 185, -62, -327, -16, 758, 592, -98, 120, 275, 496, 668, 47, -519, -283, 147, 350, -16, -115, 241, -194, 17, 343, 468, 274, -332, 166, 56, 414, 298, -324, -288, 450, 379, 22, -140, 90, 1, -27, -284, 53, 602, 33, 264, -120, -403, -291, 199, 244, -56, 23, 149, 154, 450, 41, 453, -180, -418, 227, -18, 732, 92, 176, -90, 73, 314, -350, 74, -379, -49, 28, -352, -302, -230, 112, -30, -43, 103, -80, -190, 251, -274, 231, 946, 118, 234, -16, -72, -350, 61, 37, -82, 575, 492, -297, -796, -230, -204, -135, -204, -549, -239, -128, 586, 446, 113, 184, -281, 317, -176, -155, -279, 241, -218, 601, 349, -41, -449, -200, 10, 69, -603, -86, 433, 102, 243, -290, 74, -243, 461, 256, 6, 466, 298, -358, 216, -417, 73, -171, -159, 78, -66, -93, -466, -219, 360, 116, 209, 160, 133, -13, -90, -263, -243, -159, -160, -210, -288, 185, -126, 93, 373, -3, 175, -230]
2621b30J97k07N28j93j04M14j41k76l29l53K36M87M5n30K45K97J80m97P04P7m07
2642A43k36l85P7K72o2M94m98m0L72m63K31J58l22Q5L89n43K54K03K26n19O06
2663D42n56N66l69J54J23r61Q73j77K55N8k90j33k7K61L2J01o72j58K7P61j18
2684A92m04Q1K38j59L50n6n01k53L33K47m27J24O83k99l73k22N16m01L27j6J58
2705A38o36K56J68j72K08r8N3n0L61J06j16J68j81n83L5j83P37m83K48Q5jK09
2727B69p2j00n32P15l90M48k55m94M85Q1j43j40M21J04p82N00o8R0m60L3R3J8
2749a79J98Q0N9L82l10K65q86K26L76j34l9o8O0K48n0L6j20o12M89Q01l65k53
2771B04N0k07M82p11N68n40K8M07l85L98p76M47L00p03N30j59M80o30l01Q30J81
$$ y = [-230, -33, -240, 288, 95, -9, 405, 264, -12, -341, -694, -458, 29, 74, -456, -211, 86, 266, -231, 473, 550, 143, -93, -478, -401, -129, -191, 303, -195, -235, 137, -326, -95, 63, -259, -174, 215, -328, -74, 129, 355, -164, 442, -114, 452, 83, 237, 360, -601, 272, 95, 350, 408, 118, -15, -42, 219, 251, 352, -320, -478, -451, 310, 192, -212, -131, 107, -52, 298, 242, -259, -512, -179, 68, -359, -235, 448, 149, -224, -446, 70, -331, -4, -20, 138, -498, -242, -74, -246, -38, -136, -83, -133, 228, 334, 218, 386, 205, -378, -343, -526, 211, -272, -24, 61, 60, 269, 197, 97, -435, 280, -110, 338, 83, -411, 74, 155, 12, -128, 293, 397, -385, 115, 47, 137, -323, -290, -197, -179, 19, 99, 158, 540, 230, 495, -391, -165, 211, 77, 38, -30, 30, 278, 228, 264, 144, -468, 21, 822, 457, 204, 254, 47, 529, -182, 386, -154, -126, 281, -104, 294, -482, -35, 265, -438, 92, -67, 413, -217, -518, 312, 493]
2792D93j46l48k05K42J22J22L77q30j46L59J06m08j82N44n4nJ1k67J43K57l51
2813a66K95m97Q1l77L84L89L3n36K45L1j94R37n74j90J85J34k76Qo2Nk59K09J70
2836b5p4K10K44n99J46K48l59J39l05M21l01k81P37j94K26L38n58o38P76l80K70
2857D1m11j20L96j79R00j44m10j26k80N06k2p8m23L19o2M06j3l99M76l0l02N49
2879E94k94j79r4K30Q7m02K73p42M09M63j83l25J36L91j95q02N82j54k21O06m08
2900b28j20l70P92M1P04r90j62M39R2k41R9n57K18L98m63M57k87J52N85k49n68
2921b58P18n63M15j76L84m16j14j49J24l28P07k35J34m04r6N04o1k0q3K3q14R96
2943B88m22j10l30K01M36k31N70l07m77l44R51m10M10m02n5N23n8j56l40N16n83
$$ y = [493, 347, -1, -206, 36, 158, 280, 657, -173, -319, 40, 146, -262, -444, 100, 46, 41, 52, -215, -72, 185, -166, 129, -368, -287, -664, -280, 109, 142, -394, -149, -118, -312, 625, 51, -139, 46, 180, -96, -88, -150, -145, -404, -195, -25, -99, 111, 355, -244, -98, 150, -209, -70, -375, 46, -255, -536, 201, 7, 233, 571, 13, -625, 151, -229, 41, -370, -490, -94, -273, 627, 483, 73, -53, -333, 173, 151, 73, -350, -31, -93, 313, 300, -99, 377, 347, 45, 594, 300, 121, 27, 257, 344, -58, 215, -527, -118, 345, 162, -163, -27, 364, 169, -633, -51, -205, -426, 180, -228, -348, -718, 74, 115, 819, -171, -333, 106, 198, -43, 56, -501, -283, 115, -348, 109, -178, -26, 559, 310, -258, 460, -103, 312, 136, 520, 104, -10, -159, -35, -363, 344, 109, 243, -161, -257, 247, 186, 166, 83, 106, -708, 288, -134, -244, -574, -373, 63, -168, 402, 95, -382, -726, 225, -185, 225, -177, -232, 291, 233, 77, -263, 253, -330]
2964c30K79m44O19n61R92o75J61k61K31J65o18m8K23J42K55o58L34K06j36j99
2984c23K79L28k00L11j18k91j26J70q03Q18K38l29L01j00p6J33J70m02j61K78
3004I7m74Q24r4k37l50m09K34K74L11l61J0K41l82J12K49J3j08p67Q01M22m8l36
3026B2k5J5K76k64J87j51o98O60p9J69J60p1Jk62m04L85P26q53L41L21P7p57J06
3049a18K48K53l9l15n12N37q6j51J99j12M61m72O20j246J096p06J011p01k82O88
3069C73r64P20n46L40k16l52Q4P61j3j92L15m36j37L93m16N24l30P00l30j53J20
3090B45n4r3Rk31J84k66Q4J15P9J85n37j5L82l29J05K05m83k06M12j29O11k82
3112iJ58k92r2M62K47n14N5k43J01l53P01j59J33K31o66M07m58N95l29l20N53
$$ y = [-330, -51, -495, 124, -437, 555, -120, 41, -220, 11, 176, -442, -490, -267, -125, 130, -528, -194, 12, -124, -323, -44, 284, 84, 395, 277, -14, -140, 30, -773, 45, 283, -46, 255, 155, 79, 212, 382, -20, -181, 97, -377, 447, 353, 116, -234, -643, -409, -135, 176, -185, -175, 66, -316, -204, 45, 58, -50, -817, -16, 406, 358, 22, -3, 12, 288, 24, 211, 60, -638, 22, -57, 112, 272, 201, 202, -60, -464, -79, 647, -206, 135, 456, 533, -224, -118, 130, 383, 344, 29, -483, 54, -32, -183, 16, -96, 365, -107, 513, -733, 363, -343, 668, -33, -315, 373, -591, 129, -417, -77, -293, -645, -561, 200, 187, -5, 310, -126, -263, 130, -286, 238, -92, 608, 278, 125, 245, 191, 98, 107, -124, 60, -206, -122, -7, 72, 257, -280, -295, 87, -242, -137, 68, -415, -621, -209, -338, 273, -9, 149, -143, -235, 227, 474, -40, 15, -228, -127, -480, 221, 62, 195, 426, -240, 167, -291, 304, -25, -345, 208]
3133B08k19j87N36k69N2q5k05K93K38n44J96J8l70o8P3L88rM83p24M70k69K56
3155B62m49K37K92p67M24l01qj65M12O15m41J53J37o20j80K37O40k57o86nM74
3176Dn5N22n51j32Q27o38k75N86o49K39J17M23o48O00k97l96N3l42J69P88n35
3197a90L05k48k59N97j94K15N3j72k38M16p7r4L8k41m5r0K59l81N64p40J34Q08
3219D20k32k37M39j156P36R3J42j24l72L23j79Lj43N59q7m89N32m32K32k54K48
3240B2R7l68k05Q82m32O5M12p21P48m88J73m80L24o05O47PK0l02J21L19l8j92
3262Fl78L91L30j51j16p9m20L32L51j99o5k26J73K19j27K24n16K95m59mK99L30
3284B10j5M43n75j91M69j62m64N63L11n05l3j17m6J21l55J31J3K71P4k25Q44n92
$$ y = [208, -11, -198, 338, 69, 121, 36, -169, 124, 362, -182, 14, 32, -338, -406, -333, 55, 46, 529, -195, 275, 6, 262, -187, 50, 342, -425, -1, -302, -310, -475, -63, 552, 111, 264, 401, -219, -399, -162, 478, 221, -465, -470, 4, -51, 471, -80, -212, 615, -23, -298, 288, -361, -122, -5, 418, -230, 370, 73, -323, -270, -612, -443, 345, -190, 115, -133, -392, 205, 11, 226, 279, 107, -131, 285, 208, 114, 152, -89, -134, -224, 35, -346, 218, -522, -388, 420, 188, -49, 390, -766, -30, 63, 205, 81, -291, 32, -147, -144, -287, 272, 185, -304, 228, -204, 28, -226, 22, 119, -249, -454, 428, -4, 61, 473, -248, 500, 12, 185, -295, 29, -576, 71, 78, 98, -204, -83, 236, 198, 6, -372, 19, 349, 198, 82, 3, -417, -85, 266, 67, 2, -224, -51, 168, 41, 265, -251, 44, -415, -419, -120, 210, 195, 638, 63, -128, 341, 179, -285, 278, 589, 84, 51, -66, -112, 9, -346, -215, -202, 69, 143, -82, 762, 170]
3306A70n47N97l78P46p49K82m38P15l79J64MJr7m67J94m85L16J38Q09m80J4o53
3328e23M88M63n70k01M6K95K11l54r1L67l15J59O3J06j16O6k84M89m33l42N91
3349A15l12l03M78n41N36j16l5K62J40o73K79l65L01q5M14p02N0R22k95m6m90
3370d66K78J46q7P61k98k29N9l34l30O49m98K46o4j90Q1K07J15l31N10p86L30
3391b31k9K94M1k21m5%J74N4j29L3k22O0J33K2K6j36K41l8j66N43k74j58K60l06
3415g4J64k76j01J66O34q60k4J74K10j78K08K47l3n82K88J83J6P8j39q5j78O57
3437D95p00n3K7M5L94M07m40j93ml7L22N1q20N57J36o73M86P0J09k61k6K28n10
3460c90N80k80J34k54K25l2q2L85n25O75m08p1L02j71K43n26P28p53L39J89l13
$$ y = [170, -377, 220, -158, 588, -161, 121, -317, 398, 19, 183, 187, 188, 91, -376, -182, -667, -351, -213, 596, 116, 130, -523, -35, 428, -142, -343, -297, -2, 209, -145, -236, 131, -184, -25, 38, 144, 28, 94, -190, 299, -134, -476, 115, -197, -500, -22, -563, -27, -143, -178, 84, 224, -449, -170, -535, -234, -319, 95, -607, -557, 365, 70, 24, -466, -188, -42, -129, 632, 334, 105, 164, -170, -500, 149, -349, -103, -167, -357, -276, -69, 46, -285, 225, -561, -231, -260, 34, 75, -146, -191, -191, -17, 37, -92, -59, -281, -221, -88, -66, -40, -176, 65, 27, -139, 404, 130, -28, 232, -74, 90, -186, -287, -121, 513, -347, -371, -197, 13, -165, 43, 290, 257, -325, -37, 146, 162, 240, 101, 16, -162, 495, -205, -258, -231, -186, 208, 615, 175, -18, -22, -59, 263, 314, -506, 51, 187, -486, 0, 70, 179, -82, -108, 120, -390, 190, -90, 44, -210, 15, -17, -99, 286, -239, 436, 28, -43, 259, 88, 331, -195, 533, -220, 119, 308, -5]
3481ej33J65k92M23j85o0j18j01J38L59L4q06J90L82J26K36m9l89Q2J0j35L00
3503A72l88J67J62Q6j49K38n25J31R9m79J128p09J25oo42O75l21P8O45n03j23
3524a39K49n86O54k01J30L00l05j91M3J58L64n68K19o01M84K01j0R8m35j38K11
3545f3m1J56L13r56P34M18o38j42K82K71k45J91J5l28r5K30k04L20m26J5P33k61
3567B79j45l97r2N92K6o03L43M96l53m27K04K29j07o78O81j18K3N09k79n10K23
3588a04j34N8M36n57M62k25J84K65n97M80k43j09k00K48J43k79r2K68k83M39k13
3609e3Q04o62j99P5J04J16l96K65l02K38j39M68m86M57o88O49n54m1L93k26k17
3630c94J97P1L45k62j06k84L68P5j6j02L08J96o47J85l63R9n08J010m32q6J53
$$ y = [-5, -138, 27, -265, 158, -27, -87, -205, -306, -168, 191, 225, -581, -391, -9, 117, 353, 304, -85, -3, 7, -128, 172, -216, -49, 113, 199, 50, 288, -237, -106, -7, -486, 642, -67, 58, 52, -590, 85, -236, -158, 487, -16, -139, 110, -476, 178, -23, 107, 407, 102, -89, -46, 112, 476, -92, 127, -474, 10, 211, 201, 299, -136, -274, -63, -104, 52, 365, -591, 143, 561, -77, -219, 63, 334, 89, 280, 295, -33, -128, 102, -102, 218, -208, -193, 540, 279, 134, -263, -355, 237, 263, -340, 3, 499, 146, -281, -77, 152, 45, -633, 48, -70, -47, 462, 183, -327, -104, -238, -180, 256, -301, 161, -64, 120, 385, -212, 268, 25, -84, -284, -36, 107, -172, -264, 4, -279, 160, -53, 751, 89, -110, -35, 69, 185, -211, 54, -248, -10, -149, 319, -167, 290, -398, 251, -303, -344, 49, -177, -394, -197, -126, 219, -43, -149, -433, -65, 10, -6, -108, 200, 396, -251, -66, -429, -330, -838, 172, -260, -346, -193]
3651a93O11j71o09P5M28p04M87J03k03K88J3k14M10r8j13K50k30j46k70K78j82
3672a90K09P7l26n7k85M28J5O3N77r23M65L62k50m12L8L49K46l06K35o7n98l3
3694c83K79K06Q9j59J41o1j27J38J51m59j53L02J58n65N01k65j70J80N98k31K15
3715C85l45r6P6O4l36M08j91l4N18p33M28N9n19L83m63J59J97k60O53j58K72o69
3737b02p2K49K0M9k90N81k05j04n77N09N27k47l05qk08n01P77q1k8j30O40l6o9
3760B89Pj81ql74J9L33J42J27l76K56n02K34J81k99p1J78J44m58N71m83L96j32
3782gL82n64Qp2L47N85r76J10K63k28J3j38J75J20J7J87l04L39J74n37R9ll28
3805c38N21l9m64O14l16J41l31kN84O1j74l11J16L53l17r0K97p02M18l8L8m71
$$ y = [-193, 418, 247, -362, -287, 141, -563, -76, 27, -176, 112, 125, -89, 321, 223, 110, 360, 130, -16, -286, -8, -190, 19, 96, -230, -287, -572, -144, -129, -66, 511, -412, 53, 415, 165, -247, -209, 140, 386, 80, 315, 248, -350, -383, -104, 102, 191, 32, 173, 112, -15, 123, 274, -185, -338, -36, 122, -443, 58, -207, -377, -197, 401, 170, 385, 40, -56, 20, 84, -252, 156, -35, -69, 449, -284, 144, 203, -316, 67, -396, -237, -40, -300, 353, 195, 467, -202, -274, -25, -5, 44, -246, 335, 130, 26, -551, -42, 485, 238, -67, -75, -283, -784, -7, -88, -116, -246, 394, 358, 289, 296, 115, 107, -267, -248, 85, 227, 354, -22, 234, -268, -34, 147, -152, -223, -45, 99, -359, 212, -271, 125, -7, 375, -189, -181, -253, 94, 679, -297, -187, 76, -152, -139, -277, -102, 18, 35, 222, -82, 257, 431, -106, -7, -10, -338, 183, 144, -320, 294, -22, 119, -212, -214, 370, 431, 257, -54, 62, 415, 98, 8, 305, -397, 21, -17, 21, -450]
3827d50O12r7j2p3j49N4J47kk86L69k43J76j68M52j54l89L09j06J63k00J76l50
3849b21J10m1L84L76n85K00N3k22o7j77kM95l85l10N84J5o50n7N17M73o7r02P15
3872B36n47m06O28j71N18j37L11j153N94N11m62N46m43K99k94k56K09N0K05j44
3892I4M13m49N4k3P9l64P0M56k20n43j4J36J45N1N50o15n0K88ml61K05j79J64
3915a17M41k34kj05J33J91j07j56j68l5J52N54n18m28M89P5l54K19k82j02N06
3936A52m68N03p5K37l34k17j3L02J38l11k89O60L15k05m41r7L41k13L12p9m91
3957b73M26j70K4J69l04M33l84O05o6r08N37j60N5k69J95KL3O03n99N8J21j45
3979a7O94n33j51r2J90R8k24K58p41O96n91J007o14l22K19j54k12K97N56n36L12
$$ y = [-450, 162, 65, 53, -20, -169, -115, 32, 30, -256, 113, -130, 46, -122, 330, 176, -213, 96, -10, 153, -47, 129, -221, -111, -152, 232, 608, 23, 223, 276, 54, -13, -190, -192, 303, -82, -392, 192, 207, -443, -500, 17, 490, 423, -479, 236, -311, -717, -89, -260, 258, 121, 432, -721, -127, 384, -78, 468, 25, 324, 30, -226, -17, 33, 238, 94, 507, 58, 112, 89, 168, -196, -126, 330, 110, -433, -447, -311, -166, -115, 435, -180, -230, 58, 54, -307, -102, -281, -117, 324, 90, 88, -17, 116, 307, 200, 44, -124, -159, -7, 547, 29, -399, 90, 165, -189, 30, -252, -354, 152, -316, 187, 112, 349, 15, -202, -215, 87, 225, -86, -375, 285, 600, 395, -46, -143, 198, -15, 297, 218, -273, 153, -17, 7, 176, -128, 305, -79, 526, 460, -448, 89, -71, -16, -285, -90, -88, -55, 548, -51, 7, 128, -17, 677, 144, -7, -99, 91, 189, -35, 223, -518, 178, -413, 594, -20, -342, -123, -277, -489, -192, 364, -172, 140]
4000A40k16M60m59J09q9L0j34o3K17J09l81J89p2l9K52k5j11j9j66J74Qj72K16
4023d2K33J51k55j87l0K93k41L23k30J71k61M75K23q54N71k69l49J22N39o36M38
4044A85l16R1l53M18m73M92J97l81N20q4m26k8JN52m70k07M11j40n63M25j56J4
4066b91J013j085P14l48j59L79K2l22k88M25M41q09J01O06j94o1j89o4J28Ml6
4087a3l43J55j30K10m0J18j83K92m49L94p12R45k82NM5J86L45n19O0j83K40L9
4109A80q46M80k01L31M21o85M40k33J99r0k9J89K02j83J28k69N52M2j33q64M65
4130I6J33j57k4J54l56J11j9k77L67J57n11O76k95m7j33M41q5J10j61k68N04o09
4152a93P32m04M93o19q2K25p07P03J74r18M83L4J28J14M4k98l11P31n85N16J5
$$ y = [140, -76, 384, -75, 34, -55, -25, -159, -222, -5, 104, -277, -88, -160, -199, 53, 28, -83, -102, -268, -94, -86, -258, -42, 191, 342, 87, -100, -130, 163, -78, 245, 15, 186, -75, 400, 623, -231, 340, 71, -278, -156, 383, -253, 185, -131, -40, -393, 25, -448, 44, 241, -140, 380, 296, -130, -158, -157, 395, -75, -282, 129, -11, -574, -149, -305, -291, 722, -363, 351, 3, -156, 223, 245, -77, -365, 60, 501, -308, -207, 399, 205, 144, -45, -109, 19, 23, -13, -356, -201, -331, -121, -161, -43, -226, 66, -383, 11, -701, 244, -38, -33, 12, 198, 543, 24, 84, -99, 141, 180, -666, -186, -387, -56, 365, -320, 120, -113, 86, -4, -33, 156, 358, 175, 303, 34, 586, 628, 495, -369, 96, 229, 72, 48, 202, -154, -43, -62, -339, 28, 185, -326, 350, 55, 8, -125, 316, 231, 341, 180, -88, 416, -193, 539, 135, 628, 9, -73, 152, -555, 148, 322, -596, -113, -79, 49, 163, 207, -91, -402, 329, -256, 260, 275]
4173B75m75N26o69r1K75O12m42J24l29j83K35o8j36Q7M05l21L83m08P21n88J62
4194I5j27j47Q00m24l80J52k29M70l3j82j73k09K45J18j36r0J00M0j96O51m03
4215e8m3j4l3J61m59N54q3K10J8J67m70m3J39l53K99J67o4j83L99J42n78J93q2
4238a4l86k43Q64L1j09m12k39O79l80L20l2J35l32N7N55k43m38O9j61L66p55L73
4260b95L15L59l50k1K58n76L74n9J34L89n95m67O85k71k61J034q58K43l36N28
4280B30p17O86J86q33O44J86k5l25j0JJ49m03K71J04l20K11j14K23l67j46M31
4301F2k61K36m37O54l64J8j57L71l33KJ58n66R30l00j10n5M34L86o76M69l96n9
4323FO8J27J7J14n24J0o9K71j20L58J04k99n4k24J24P1j89N73n05j59L15j18o57
$$ y = [275, -200, 326, -343, -434, -159, 453, 11, 135, -194, -377, -142, -210, -346, -259, 146, -175, 208, -200, 521, -67, 95, -32, -179, 621, 197, -183, -31, -260, 210, 177, -5, -178, -387, -142, -24, -160, -250, -150, -110, -306, 345, -58, -101, -115, -148, 13, -446, 108, 25, 235, 253, 420, -50, -93, 46, -307, -8, 159, 95, -88, 311, 453, -125, 68, -14, -400, -643, 221, 252, 143, -269, -508, 171, -209, 111, 79, 214, -118, -61, 494, 251, -187, -118, -279, 87, -668, -295, 20, 379, 29, 8, 266, -310, 64, 5, 139, 528, -67, -534, 151, -120, -381, 653, -205, 38, -298, 230, -487, 199, 385, -448, 196, 382, 357, 32, 22, 23, 172, -231, 40, 144, -176, 35, -79, 144, -223, -369, 62, -199, 37, -400, 254, -110, -92, -249, 122, -211, -209, -51, -617, 313, 13, -97, -152, 282, 668, -8, 461, 65, 6, 74, 201, 218, 332, -192, -182, -251, 20, -100, 258, 362, 63, 9, -215, -91, -20, -209, 364, -141, -300, 15, -103, -760]
4346g60N69N55j14j33J48rp2J5q44N23K55k50J77L5k36J97j97j69O59m23m63L74
4368a63L45K18p53N33J47k60k71N16j97N3L72q94M04K17m83J81m27O42n23O5O41
4389C63l94J5JP9O2k55J05j4L03J99o79L97K26m33r0J87k37L43L57n15J84l84
4411a80J99J3j90O5N49M5n05J86n83J58J010j089N67j06j50J49o25Q81n80J06
4431h0k82N63R0j86J0k40M0Oj87M47L48n51l85M71j86j26j37M36l54Q89n27j92
4453a33k37O36j2o30Q0L31l48J0L27Q4n79O65k56m89L21Q8J58k73K18K39q76K72
4475d04P22O1P4m00j74j19K1J03l24M88k59J5K66m82O92k01J64J20l62l7J64k82
4497a54k02K44J83K90n91K44n5L36o85P09j65m96J45j59Q1L56m58L74k11M84l54
$$ y = [-760, -191, 364, 250, 117, 265, 256, 184, 199, -645, -122, 133, -117, 60, 95, -141, 56, -141, -310, 349, -74, -537, -163, 182, 400, -353, 180, 327, 67, -204, 312, 115, 168, 540, -354, 50, 267, -216, -35, -462, 180, -343, -278, 363, -31, -16, -15, 64, 126, -129, -24, -38, 265, 464, -215, 182, 408, -25, -115, 72, -165, 178, 535, 20, 204, -180, 19, 32, -158, -93, 456, 501, -4, 182, -401, -243, 767, -322, 245, 139, -11, 138, -487, 394, -186, -80, -362, 201, 291, 105, 115, -125, -85, -79, -266, 181, 529, -22, -407, 64, -122, -248, -385, 51, -303, 586, 59, -133, -370, 266, 254, -376, -296, 35, -313, -303, 24, 108, -471, 194, -62, -551, -230, -142, 16, -257, -39, 200, -676, -404, 318, 379, 453, 53, -121, -240, -219, -116, -440, 48, -211, -196, 70, -412, 280, 79, 243, 363, 1, -36, 128, -154, -356, -112, 71, 361, -230, 14, -41, 295, -390, 319, 154, -342, -197, -356, -275, 81, -377, -3, -214, 270, -84]
4518h4K82m94K52J50r5n1%K15J04l34o31M69L21L59n29k94O14l45P7r5Q8j00N17
4541C96k83j60ll04L8M59l61Q0l16N36l26q1M32m72K58J42K35n20L27J60m47K36
4563B6L82o29K68J31R3n9jk17K8m76N98j37j31j77N0Q8q8K97r3o6L45N7l46J58
4587A01n36M27q4J42k35O5J97j12K6L23n04J9K35l07J94j24J42J37m04M32k14
4608h0j15O16r43P01j22J02J23l46L41%J98r7l29K6J02k40J23J26Q4Q5l71J03
4630H7n4n52J84J95M47k17l70K51K02K52n66K6k3M32l72j63p4m7L62j96R5J59
4652E8J40n59K6j62L98K40j30l17k2K56L17Q0m1Pn17K33L43J17n93j72M00K45
4674C47j79K8l40L55l89j5j57N12l51Q27j06r40L6L86K21o16K55j8J31l7M26o03
$$ y = [-84, 198, -296, -44, 106, 11, -40, -40, 175, 279, -55, -686, -217, 104, 463, -66, -360, 254, -91, -14, -109, -21, -121, 396, 113, -47, -50, -354, -316, 143, -218, -138, -454, 82, -244, -325, 107, -365, -107, 35, 270, -250, 77, 237, -210, 26, 408, -221, 47, 178, 271, 212, 211, -6, 22, -454, 144, 7, -124, -301, -251, -163, -251, 46, -47, -113, 232, 289, -57, 101, -435, -8, -92, 50, -185, -120, 77, -35, -9, 314, -190, -171, 64, -243, -49, -173, -31, 106, -298, 134, -80, -195, 421, -522, 179, 57, 159, 282, -64, 277, 277, 475, 378, 49, 75, 177, -63, 60, 186, 270, 355, -16, 87, 33, -519, -335, -140, 307, 90, -280, -29, 173, 425, -141, -115, -138, 294, -78, -241, -315, -362, 0, -196, -101, 58, 198, -361, -335, -497, -99, 141, 11, -306, -328, -72, 245, 325, 284, 291, -226, 7, 350, 467, -126, -298, 102, 347, 168, 196, -144, 211, -178, -193, -350, 162, -189, 638, 532, -408, -372, 14, 235, -381, -126, -144, -13, -50, 376, -227]
4696b27K80j08K24k84K62o2M16k30j77j85O4k8j69K08m10J18J75k80N04m18J9
4717c08k42J96O34l59k33M41l46K97j51M76o54K93L13n96J80K20o6l05J64N01
4737D55l48m46L28J85J30l89Lj19R4O2k00n5L83k95KM26l50j70o1L03M33k25k56
4760a10L32j38L9p20N87j11J27k8o0K62k51J27k15N83k90j7q7Q7q1j1j5K6L21
4783C57m63O05q79K00o63Q78J73o09M79nk81J46O71n69N22n02jO1k91M50J89j55
4805C13j49p29K64K63n0j77L29l32K56k42j56Q86n99L26n18N54j6p05K13K39M48
4826D18q22N64j14J50j15k50K91J93j39k76K40l93Q7k21N92p51R07n84N23o99
4846c99L20m96O19L9j58J9O6n96N45J11J57J35n79N15j02m42J84M8L52M8m89M53
$$ y = [-227, 53, -55, 169, -115, 147, 85, 501, 271, 94, -91, -27, -55, -224, -16, -426, -308, -133, -413, 91, -327, -308, -550, -354, 280, -79, -312, 129, -217, 80, -71, 405, -249, 44, 357, -239, -59, 161, 95, -210, -46, 455, 107, -339, -11, 174, 304, -85, -82, -201, -107, -45, -245, -300, 83, -212, -210, 216, -134, -304, -365, -62, 371, 146, -110, 222, 84, 123, -597, -10, -121, 6, -22, -82, 180, -71, 56, -159, 424, 134, 117, 30, 117, 36, 25, 10, 36, 357, -106, 499, -380, -180, -843, 35, 208, -401, 78, 73, -208, -62, 609, 40, 562, 60, 59, 120, -171, 279, 468, 313, 164, -565, -301, -38, -88, -265, 64, -268, -12, -254, -410, 476, -123, 203, -315, 239, 223, -482, -269, -30, 418, -404, 160, 46, 196, 81, -169, 122, 315, 176, -100, 140, -253, -166, -387, 205, -546, 361, -223, 300, -399, -79, -575, 44, 83, -75, -56, 10, -586, -41, 70, 227, 362, -217, 298, 196, -246, -62, -14, 338, 386, -103, 350]
4868C50j50k74J99l90K92j62j81K57J14l1J4O21n58l52j80M09n4K22l0j69l38
4889c91P18J94n03K7Q7J95M9q04M03k67q3K55J24J38L72j17k1o26M20N8m28P39
4911E39o36j83O42k2J07o45L91K02m87m13L10k45J095p69L82q61N07r3J1K72J86
4932B90j57l6L93m85k14O3K97l85M79l82J21N6M16p54k3J73J12K13J36o11M81
4953A83J04p50N88N36p08q5Q8l62L36K42m30J27M78k39K14o51M48l83O34k45M5
4974A70n68J33J43J88K05r4K1q46O44J11n48O48m41N17n79L58K1j27K43o3k23
4995h7k6O8l41M12j68j11K76j90R4K16l67j4J58L04l60M21L1m44l19P67q6p46
5017e12L79O9K36m90Q29n44J07j73J82j14N2n02Q19k64P5l9n07J12J25M21L8o88
$$ y = [350, 200, -74, 125, -265, 27, -135, -316, -59, 55, 24, 38, 659, 101, -251, -431, -22, -76, 146, 116, -53, -391, 327, 521, 18, 45, 132, 327, 376, -428, -25, -292, -375, -120, 4, 142, 514, 397, 376, -250, 170, 228, -200, 539, -97, -280, 362, 340, 447, -198, 193, 395, -92, -505, -195, -440, 655, -114, 268, -593, -86, -179, -168, 104, 290, 133, 97, 490, 5, -209, -146, 151, -234, 245, -137, -16, 40, 456, -298, -321, -148, -36, 177, 313, -298, 183, 287, -463, 125, 661, -47, -132, -44, -406, -70, 172, -258, -131, 347, 108, 322, -329, 119, -264, 370, 125, 170, -398, -265, -122, 66, 271, 177, 198, -648, -4, 107, -441, 207, -234, 283, -296, 62, 83, -44, 199, 136, -87, -113, -45, -386, 26, -142, -253, 23, -167, -73, 143, -224, -238, -80, 224, -136, 285, 316, -128, -447, 320, 234, -512, -133, -64, 172, -318, 511, -33, 74, -99, 83, -31, 21, -481, 338, 74, 149, 110, -397, -285, -160, 261, 299, -389]
5039c89N82l07L36l83k40J62N8M55l50K07J11P3l52Jj54J72k0j36J68J8O2p25
5061f51O12L13l62k5L43p88N57k1Q1k56K09L92j07m01N1q4L41n8k5K24m2l96L88
5084B95m81N00l90j34Q5J30K41o57M77K9j30l78L40n67M20M78J33l97N6K60k14
5105I6o38M59q0L81K53r88j8N83l27M7p1J22R8K48j23j29l42P70n55R3N4J6J80
5128A29K61q46J26L95J54k19K06l88j13Q7n58O64N6L15J2p16K10M54k35k79O25
5149C40m13l9RqR0j8K24l77l96P56o6k8J13j15k79K05K99k87n5L71n44J35k09
5172b92k43K87j16N40k82J00o07Q46k12o4k77L41j29K01j25J31k64j77O87l10
5192C5j43j51K32j40l06M63k61K66j26j74M82%k72k71J70L76j02P7j90j65J04
$$ y = [-389, 193, -114, 222, -161, -401, -239, -181, 274, -76, 131, 242, 315, -37, -36, -190, -18, -38, -174, -6, 12, 74, -651, -39, 274, -88, -113, 230, -558, -1, -22, 59, -197, 12, 404, 297, -104, -53, -137, 204, 146, 121, 345, 303, -93, 295, -186, 314, -76, -210, -125, 5, 246, -411, 66, 95, -35, -413, -73, -640, -220, 258, 391, -6, 50, 310, 96, -542, -83, -163, 218, 471, -517, -535, 48, -279, -232, -303, -181, -83, 165, 42, -87, -429, 341, -214, -121, -67, -51, 129, 390, -456, -330, 65, 219, 0, 206, -182, -295, -208, -766, -102, -46, 269, 281, -435, -225, 229, -6, -285, 340, -73, -112, -103, -111, -21, -39, 185, -192, -588, 168, 102, 74, 187, 72, -207, -2, 297, 10, -45, 326, -218, -83, -292, -535, -248, -364, 176, -106, -6, -613, 233, 21, -43, -320, 21, -108, 93, -32, 99, -165, -342, 345, 35, -108, -259, -27, -167, -473, -10, -271, -5, -131, -305, 177, 177, -95, -366, -196, 180, 78, 155, -35, -200, -96]
5213i6J39j74L91M9m21L99m44J59J3p0O4K49m40M32l42P05n06P5j32k09J38k88
5235c09L47r1L33J00l05k00k37O36l30K47J36n13K65J62p30J77N92k32p6m46J77
5256b97L85N79r80L82l11k71N78l71K08o1K44k13K98q0k40j05J72L4J6K39k05
5277AK33j80j63M14n64L36k4n42N45n30R43l62M47o59M87n67J10J90M2lr5k37
5299a78O65k46m22lm58R60j051M57K54P8m07O74q52N91j1j25M92l04l37O50l02
5320A25P1l39M00J68m59J27l9m11L43J77j15j8K62m88O89l87j63j00m6N63l24
5341C6k97N67j37K70l49j02J08J39K87p59K3l36L83j10J67l26O30pj09M90o30
5362f2J76n17NM99o01P14R1j98n4m08P2K39J32L41k5o85N16j63r0p3M07l13PK1
$$ y = [-96, 43, -131, 260, 309, -112, 287, -157, 2, 15, -55, 9, 258, -182, 250, -92, 613, 107, 182, 50, -159, -21, -309, 38, -53, 280, 380, 75, -125, -362, 274, -56, 191, 327, -186, 79, 241, -489, -312, 280, 48, -28, -474, -297, 88, 667, -313, 69, -242, -513, 65, -306, -98, -159, 85, -128, 170, 90, -150, -255, -83, -49, -33, 206, 1, 234, 54, -109, 305, -259, 77, 53, -489, 56, -474, 469, 107, 554, -105, 382, -185, -75, 115, 157, 154, 59, -178, 487, 241, -181, -184, -642, 318, -733, -276, -22, 56, -351, 323, -529, 62, 51, -74, 418, 114, -223, 427, 125, 196, -143, 257, 425, -34, 93, 54, -357, -14, 163, 48, 30, 292, -196, 493, 106, -57, -157, -203, 360, 36, -261, 306, 169, 439, 90, -12, 96, 235, 522, -237, -214, -550, -167, -277, -110, -436, 194, 187, 78, 568, -62, 114, -403, -398, 101, -500, 214, 305, 107, 53, -355, -283, -44, 88, 429, 404, -281, 235, 72, -18, -91, 316, 3, 10, 31]
5386C1k87Q1K47j00j47M71n46K15J44O4q3Km3Ol69P24j70j51m7Q5J42l88j16O47
5410D12p67M33m4J54l8k47K28j79l41K62J63J6j51L07j10m97P06r2p4L10K13j034
5432c70J81K52l1K34L1l45R3N7k49K33j5n3k11j53Q66m73l00N67l86K80K2k34
5454dk19P78q13P02n83L77j02J86l04K65n62mR0O55m49kQ3n44J015m54P3n27k2
5477c65K44k66K47M78j19l04M2P1j39P19o34j93O55l24Q9O3j84K43j89m13l0J71
5499a38j84M28n98P53k50n6j01N1J5l75N79m8J50n14J78L00p5k76K38m93M87k72
5521b01j0l09O18j50K36l52L68m06N24m54m03N42N77o01k62O13m26L81n73J34
5541a54J18l49J82J26l78N32P3k98o3M38j18j81R4rK50k70k3K47l07J39J72K60
$$ y = [31, -256, -175, 72, -28, -175, 296, -250, -35, 109, 173, 90, 92, 49, 55, -314, 410, 240, 89, 42, 127, 269, -119, -235, 412, -355, 78, 34, 188, 150, -97, 131, -48, -389, -127, 36, 52, -99, 208, 98, -399, 307, 215, 141, 451, 664, -370, -189, 63, 32, 266, 297, -48, 45, 102, -147, 86, 71, 18, -193, -346, 520, 47, -253, 314, -72, 208, 230, -4, -223, 555, -258, 444, -139, 238, 136, 322, 18, 283, -279, -283, -193, 462, 13, 11, 94, -450, 565, 111, 184, -343, -365, -121, -387, -140, 338, 219, -85, -43, 28, -111, 608, -26, -219, 436, 112, 201, 264, 80, 323, 134, -279, -309, -138, -322, 106, -492, 261, 11, -45, -146, -95, -80, -455, 124, 76, 226, -288, -110, 190, 115, -161, 77, -416, 71, -201, -211, -520, 98, -52, 184, -168, 200, -206, 318, -136, -539, 3, 580, -21, -283, 330, -96, 285, -288, -154, -36, -385, -203, -77, -455, 77, 150, -148, -211, 227, 109, -72, 22, 13, 263, -7, -30, 217, -90, 49, 221, 481]
5563D81j22n57j65M84j2J63m45J22k67O88l12K09k83L25m31n2J08j26N07j01k27
$$ y = [481, 359, -198, -363, 121, 109, 272, -173, -51, -318, 370, 58, 267, -16, 309, -122, -174, -66, -192, 315, 214, -13]
$$ [...]
8191A64
##END NTUPLES=NMR FID
##END=
