##TITLE=1H_Pr 4922
 CDCl3+DMSO, 8 sc, 
 27.6.2019
##JCAMPDX= 6.0         $$ Bruker NMR JCAMP-DX V2.0
##DATA TYPE= NMR FID
##DATA CLASS= NTUPLES
##ORIGIN= UXNMR, Bruker Analytische Messtechnik GmbH
##OWNER= root
$$ XWIN-NMR		Version 3.5
$$ Thu Jun 27 16:32:43 2019 Russian Standard Time (UT+4h)  she@DPX200
##.OBSERVE FREQUENCY= 200.13155
##.OBSERVE NUCLEUS= ^1H
##.DELAY= (6, 6)
##.ACQUISITION MODE= SIMULTANEOUS
##.ACQUISITION SCHEME= undefined
##.AVERAGES= 8
##.DIGITISER RES= 18
##SPECTROMETER/DATA SYSTEM= spect
##.PULSE SEQUENCE= zg30
##.SOLVENT NAME= CDCl3
##.SHIFT REFERENCE= (INTERNAL, CDCl3, 0, 15.7039)
##AUDIT TRAIL= $$ (NUMBER, WHEN, WHO, WHERE, WHAT)
$$ ##TITLE= Audit trail, XWIN-NMR		Version 3.5
$$ ##JCAMPDX= 5.01
$$ ##ORIGIN= Bruker BioSpin GmbH
$$ ##OWNER= she
$$ F:/spectra/data/she/nmr/H-F/1/audita.txt
$$ ##AUDIT TRAIL=  $$ (NUMBER, WHEN, WHO, WHERE, WHAT)
(   1,<2019-06-27 16:32:00.31 +0400>,<she>,<DPX200>,
      <created by zg, POWCHK disabled, PULCHK disabled
       configuration hash MD5:
       00 E9 B6 7A A2 85 ED C7 34 08 36 98 17 FE 4E 26
       data hash MD5: 16K
       E9 32 0A 06 E1 D9 09 8C 7C C0 8E 72 49 E7 02 D5>)
$$ ##END=
$$ 
$$ hash MD5
$$ B6 07 B8 6A 99 4A 60 6C 56 87 26 4D 63 CD 3C F9
##$RELAX= 
##$RELAX= 
##$RELAX= 
##$RELAX= 
##$RELAX= 
##$RELAX= 
$$ Bruker specific parameters
$$ --------------------------
##$DU= <F:/spectra>
##$EXPNO= 1
##$NAME= <H-F>
##$PROCNO= 1
##$TYPE= <nmr>
##$USER= <she>
##$AMP= (0..31)
100 100 100 100 100 100 100 100 100 100 100 100 100 100 100 100 100 100 
100 100 100 100 100 100 100 100 100 100 100 100 100 100 
##$AQSEQ= 0
##$AQ_mod= 1
##$AUNM= <au_zg>
##$AUTOPOS= <>
##$BF1= 200.13
##$BF2= 200.13
##$BF3= 200.13
##$BF4= 200.13
##$BF5= 200.13
##$BF6= 200.13
##$BF7= 200.13
##$BF8= 200.13
##$BYTORDA= 1
##$CFDGTYP= 0
##$CFRGTYP= 5
##$CHEMSTR= <none>
##$CNST= (0..31)
1 1 145 1 1 1 1 1 1 1 1 1 1 1 1 1 1 1 1 1 1 1 1 1 1 1 1 1 1 1 1 1 
##$CPDPRG= <>
##$CPDPRG1= <>
##$CPDPRG2= <>
##$CPDPRG3= <>
##$CPDPRG4= <mlev>
##$CPDPRG5= <mlev>
##$CPDPRG6= <mlev>
##$CPDPRG7= <mlev>
##$CPDPRG8= <mlev>
##$CPDPRGB= <>
##$CPDPRGT= <>
##$D= (0..31)
0 1.2 0 0 0 0 0 0 0 0 0 0.03 0 0 0 0 0 0 0 0 0 0 0 0 0 0 0 0 0 0 0 0 
##$DATE= 1561638719
##$DBL= (0..7)
120 120 120 120 120 120 120 120 
##$DBP= (0..7)
150 150 150 150 150 150 150 150 
##$DBP07= 0
##$DBPNAM0= <>
##$DBPNAM1= <>
##$DBPNAM2= <>
##$DBPNAM3= <>
##$DBPNAM4= <>
##$DBPNAM5= <>
##$DBPNAM6= <>
##$DBPNAM7= <>
##$DBPOAL= (0..7)
0.5 0.5 0.5 0.5 0.5 0.5 0.5 0.5 
##$DBPOFFS= (0..7)
0 0 0 0 0 0 0 0 
##$DE= 6
##$DECBNUC= <off>
##$DECIM= 24
##$DECNUC= <off>
##$DECSTAT= 4
##$DIGMOD= 1
##$DIGTYP= 9
##$DL= (0..7)
0 120 120 120 120 120 120 120 
##$DP= (0..7)
150 150 150 150 150 150 150 150 
##$DP07= 0
##$DPNAME0= <>
##$DPNAME1= <>
##$DPNAME2= <>
##$DPNAME3= <>
##$DPNAME4= <>
##$DPNAME5= <>
##$DPNAME6= <>
##$DPNAME7= <>
##$DPOAL= (0..7)
0.5 0.5 0.5 0.5 0.5 0.5 0.5 0.5 
##$DPOFFS= (0..7)
0 0 0 0 0 0 0 0 
##$DQDMODE= 0
##$DR= 18
##$DS= 0
##$DSLIST= <SSSSSSSSSSSSSSS>
##$DSPFIRM= 0
$$ [...]
##$SUBNAM2= <"">
##$SUBNAM3= <"">
##$SUBNAM4= <"">
##$SUBNAM5= <"">
##$SUBNAM6= <"">
##$SUBNAM7= <"">
##$SUBNAM8= <"">
##$SUBNAM9= <"">
##$SW= 24.9336996594482
##$SWIBOX= (0..15)
0 0 2 0 0 0 0 0 0 0 0 0 0 0 0 0 
##$SW_h= 4990.01996007984
##$TD= 16384
##$TD0= 1
##$TE= 0
##$TE2= 300
##$TE3= 300
##$TEG= 300
##$TL= (0..7)
0 120 120 120 120 120 120 120 
##$TP= (0..7)
150 150 150 150 150 150 150 150 
##$TP07= 0
##$TPNAME0= <>
##$TPNAME1= <>
##$TPNAME2= <>
##$TPNAME3= <>
##$TPNAME4= <>
##$TPNAME5= <>
##$TPNAME6= <>
##$TPNAME7= <>
##$TPOAL= (0..7)
0.5 0.5 0.5 0.5 0.5 0.5 0.5 0.5 
##$TPOFFS= (0..7)
0 0 0 0 0 0 0 0 
##$TUNHIN= 0
##$TUNHOUT= 0
##$TUNXOUT= 0
##$USERA1= <user>
##$USERA2= <user>
##$USERA3= <user>
##$USERA4= <user>
##$USERA5= <user>
##$V9= 5
##$VALIST= <valist>
##$VCLIST= <CCCCCCCCCCCCCCC>
##$VD= 0
##$VDLIST= <DDDDDDDDDDDDDDD>
##$VPLIST= <PPPPPPPPPPPPPPP>
##$VTLIST= <TTTTTTTTTTTTTTT>
##$WBST= 1024
##$WBSW= 4
##$XGAIN= (0..3)
0 0 0 0 
##$XL= 0
##$YL= 0
##$YMAX_a= 110186
##$YMIN_a= -166091
##$ZGOPTNS= <>
##$ZL1= 120
##$ZL2= 120
##$ZL3= 120
##$ZL4= 120
##$ABSF1= 10
##$ABSF2= 0
##$ABSG= 5
##$ABSL= 3
##$ALPHA= 0
##$AQORDER= 0
##$ASSFAC= 0
##$ASSFACI= 0
##$ASSFACX= 0
##$ASSWID= 0
##$AUNMP= <proc_1d>
##$AZFE= 0.1
##$AZFW= 0.1
##$BCFW= 1
##$BC_mod= 2
##$BYTORDP= 1
##$COROFFS= 0
##$CY= 11.3945322036743
##$DATMOD= 1
##$DC= 2
##$DFILT= <>
##$DTYPP= 0
##$F1P= 18.9103706918063
##$F2P= -1.10871071338519
##$FCOR= 0.5
##$FTSIZE= 0
##$FT_mod= 4
##$GAMMA= 1
##$GB= 0.15
##$INTBC= 1
##$INTSCL= 1
##$ISEN= 128
##$LB= 0.24
##$LEV0= 0
##$LPBIN= 0
##$MAXI= 10000
##$MC2= 0
##$MEAN= 0
##$ME_mod= 0
##$MI= 1.114404
##$NCOEF= 0
##$NC_proc= 0
##$NLEV= 6
##$NOISF1= 3.799351
##$NOISF2= 2.8
##$NSP= 1
##$NTH_PI= 0
##$NZP= 0
##$OFFSET= 15.70392
##$PC= 1
##$PHC0= -8501.213
##$PHC1= 15.00098
##$PH_mod= 1
##$PKNL= yes
##$PPARMOD= 0
##$PSCAL= 0
##$PSIGN= 0
##$REVERSE= no
##$SF= 200.130013532006
##$SI= 16384
##$SIGF1= 3
##$SIGF2= 2
##$SINO= 400
##$SIOLD= 16384
##$SREGLST= <1H.CDCl3>
##$SSB= 0
##$STSI= 0
##$STSR= 0
##$SW_p= 3612.71676300578
##$SYMM= 0
##$S_DEV= 0
##$TDeff= 0
##$TDoff= 0
##$TI= <>
##$TILT= no
##$TM1= 0
##$TM2= 0
##$TOPLEV= 0
##$USERP1= <user>
##$USERP2= <user>
##$USERP3= <user>
##$USERP4= <user>
##$USERP5= <user>
##$WDW= 1
##$XDIM= 8192
##$YMAX_p= 0
##$YMIN_p= 0
$$ End of Bruker specific parameters
$$ ---------------------------------
##NTUPLES= NMR FID
##VAR_NAME=  TIME,          FID/REAL,        FID/IMAG
##SYMBOL=    X,             R,               I
##VAR_TYPE=  INDEPENDENT,   DEPENDENT,       DEPENDENT
##VAR_FORM=  AFFN,          ASDF,            ASDF
##VAR_DIM=   8192,          8192,            8192
##UNITS=     SECONDS,       ARBITRARY UNITS, ARBITRARY UNITS
##FACTOR=    0.0002004,     1,               1
##FIRST=     0,             0,               0
##LAST=      1.6414764,     0,               0
##MIN=       0,             -166091,         0
##MAX=       1.6414764,     110186,          0
$$ Real data points
##PAGE= N=1
##DATA TABLE= (X++(R..R)), XYDATA
0@%%%%%%%nJ3j6J6j6K4l2L7m5N6o7P6r0J06j24J45j68J95k23K52k90L31l72M21
31B24m76N34n97O69p48Q30r22J025j138J260j394J544j709J893k099K330k590
48a364K887l230L632m110M686n399O311p525R228j1813J6261k6035Q6723m8997
62B1255j09949Q7839J5779M1449o80r2515j5659J04355k1310m1168K8111l2119
74a4612k9852P4217k3890p2411N1941L9805m1333Q814l0326m5618J06791Q1814
86A05340j04859n9500L4417N597M4042K8807r1945j4888R5678k940k8848K7791
98C8692n0381l2738Q6835P069o7062K2978J1142k2168M6093j8953q5100N2562
110a1031P1310n6658j9462K6068k6500K5443K8605q1042q750Q7830j6580l6094
$$ plain form
0 0 0 0 0 0 0 0 0 -5 8 -8 8 -8 16 -16 21 -24 32 -35 41 -49 57 -67 78 -90 105 -118 134 -156 175 -197 224
31 224 -252 282 -315 354 -394 436 -486 539 -599 661 -733 811 -898 995 -1104 1226 -1364
48 -1364 1523 -1707 1925 -2185 2501 -2898 3413 -4112 5116 -6697 9564 -16471 70252 21255
62 21255 -88694 -855 14924 56373 55693 -36822 -52481 51874 30564 -10604 17507 -14612
74 -14612 -44464 29753 5863 -66548 -14607 25198 -16135 -7321 -37647 -83265 23526 105340
86 105340 481 -59019 -24602 -19005 25037 53844 -38101 -52989 42689 39749 10901 38692
98 38692 -11689 -44427 42408 49477 -17585 5393 16535 -5633 40460 21507 -63593 -11031
110 -11031 60279 3621 -15841 10227 -16273 9170 37775 -43267 -52017 35813 19233 -16861
122a6861L1130l7621k7013P8162N068n6053K3469l301k6910O2761K467q6789K2530
135b8961M6735m0596J5509L5133m2205J2361L1667o8394p018P5199k4881l3330
147b8781L5783l2739k2705P1833K67m7350K7858j0575l1033O7714J0533q0903
159d0098J7921M3183l2385J7796K4241m5122K5388M7596o3130k1178N7320j8252
171A3280j1994L8410m3157l2565O3007j04l6452L2317j8066m2109N8773J4993
183C6333p0186J2372K9642l1729K0826J3818n7443K3371O0532m4991k5560L0504
195b511k6957J0006O3041m1354n3760M2155P187r230M6392k7716n5870N9854L3907
208D5144n1391N229R539l0771M0255K1043o9917R293O2356k7083j4481J6392m6251
$$ plain form
122 -16861 14269 -23352 -50365 27797 32865 -23188 281 -3020 -29930 32831 35298 -51491 -28961
135 -28961 17774 -22822 -7313 27820 -14385 -2024 29643 -38751 -45769 29430 4549 -28781
147 -28781 7002 -25737 -48442 23391 23658 -23692 4166 -6409 -37442 30272 40805 -40098
159 -40098 -22177 21006 -11379 6417 30658 -14464 10924 58520 -4610 -25788 31532 13280
171 13280 1286 39696 -3461 -36026 26981 26877 -9575 22742 4676 -37433 21340 36333
183 36333 -33853 -21481 8161 -23568 -2742 11076 -46367 -22996 37536 -7455 -33015 -2511
195 -2511 -29468 -19462 43579 2225 -51535 -9380 -2193 -11423 34969 7253 -48617 11237 45144
208 45144 -6247 -1018 8521 -22250 18005 39048 -30869 -21576 40780 13697 -784 15608 -30643
221c0643Q906P5121l0999n5848K4873n417m084N4077k9118o3993M9697L5924l4015
234e519J1175j0126m5469M8538L9744o3663p598M1370j8202J3176K6090o0705
246c1189j1073O9919r825l2858J9864k2382p351O0399k2111o4184L9019L2043
258B0271k0928K0304j5926n3702M7807M7476n3905j6207K2583j8533K8852L7370
270D5462o0856k3450N4800o896j5251K8036k8872j7012N7562j3080n4310L1122
282b745J7656k1074L0190o776n3752L8090M3951m3348j0876J0041l1708L2135
294A784M8719n3647k8980M2118q851o382L1177l7202k4078N9911j717m6791K1770
307b169K870k1424L9930j912n6311L2126M1878l3085p94N173m1219K7818N1393
$$ plain form
221 -30643 -21737 53384 22385 -33463 -8590 -14007 -18091 35986 6868 -57125 -7428 28496 -5519
234 -5519 5656 -4470 -49939 -1401 38343 -25320 -32918 8452 -9750 3426 29516 -31189
246 -31189 -42262 27657 17832 -15026 4838 -17544 -24895 35504 13393 -50791 -11772 20271
258 20271 -657 19647 3721 -49981 -2174 45302 -8603 -24810 -2227 -20760 8092 45462
270 45462 -15394 -38844 15956 9060 -6191 21845 -7027 -24039 33523 20443 -33867 -2745
282 -2745 14911 -6163 24027 17251 -36501 1589 45540 2192 -8684 1357 -30351 1784
294 1784 50503 -3144 -32124 9994 1143 -5239 25938 -11264 -35342 24569 22852 -23939 -2169
307 -2169 701 -20723 19207 17295 -39016 -6890 34988 1903 1109 6282 -34937 -7119 44274
320D4274m5770k3981L8390j0482k228L1400m0575k7445N7351N067l5189K0174
332A0986r483k5609M5158M355n5926J9383L2007k3113J5963P764n1742J4711M8535
345C2989l4780j8979K8593j6265N925L8620m1303l5676M8060P807k2198K1944
357A4737j8722k9516N0333J2652n4360P561K0546j6942K9121J2799n4878Q175
369a8494M4350k8163j2907K1566k4171Q693M7661l4204l6570L7423J277j5499
381i038K9668j9281l4965M7514J8574m3553O155O072k3666L6820K1768n3321J850
394a5403L9158k1835l432J7658l7557L190N4971k2590l3966K6357o678j0420L6802
407B6255k0299m1719M1421K1855l2367Q920l158l1151L7583K6096m9688j781L3660
$$ plain form
320 44274 -1496 -25477 12913 2431 203 31603 -8972 -36417 20934 26001 -9188 10986
332 10986 1503 -24106 21052 25407 -30519 -11136 20871 -2242 13721 21485 -30257 -15546 32989
345 32989 -1791 -20770 7823 -8442 -2517 36103 -5200 -40876 7184 14991 -7207 14737
357 14737 -3985 -33501 16832 29484 -24876 -17315 3231 -13711 15410 28209 -26669 -18494
369 -18494 25856 -2307 -15214 6352 -17819 -9126 38535 4331 -32239 5184 6461 -9038
381 -9038 20630 1349 -33616 13898 32472 -11081 -4926 1146 -22520 14300 36068 -17253 -15403
394 -15403 23755 1920 -1512 16146 -21411 -18221 36750 14160 -19806 6551 -127 -10547 26255
407 26255 5956 -35763 5658 27513 -4854 4066 908 -30243 7340 33436 -16252 -18033 15627
420A5627j8057N070J8230m2770l712N1581j4052k5146K1702j4994r731M2526j4783
433A1491m2285L1495J6938k2540J8260n608l9006L2679L0486m0670l331K2282
445A0191j9834J4769K4670m5094j1871M4971q608j4925J9767k4886j2568M8356
457B4938q026m1840K2607R924j6757K6813o194m4543K7499L1439l2705N11J4001
470G667k6117J8326L0717m1957j5119L7291r019o006K4381l0618j9075M7355j897
483A5929l4896J8200R22j5476L5109j624m8153J8953K8313k3962Q071R996l4277
496b2895J7909L7145l5963j8236K7726j0937L005L0470l2250k4816M2931L245
508A7334k8008J4361p574j4776M2218L358m8536J1602K2989j8907J3375P731l8333
$$ plain form
420 15627 -2430 2640 20870 -21900 -25612 25969 11917 -13229 8473 -6521 -16252 26274 11491
433 11491 -30794 701 17639 -4901 13359 7751 -31255 1424 31910 -8760 -12091 10191
445 10191 -9643 5126 29796 -15298 -27169 17802 9194 -5731 14036 -10850 -23418 24938
457 24938 16912 -24928 -2321 7603 -9154 17659 11465 -33078 -5579 25860 -6845 -6334 7667
470 7667 -18450 -124 30593 -11364 -26483 10808 1789 -4217 20164 -10454 -29529 17826 15929
483 15929 -18967 -767 155 -15321 19788 18164 -29989 -11036 17277 -6685 1386 11382 -22895
496 -22895 -4986 32159 -3804 -22040 5686 -5251 -2246 28224 -4026 -28842 14089 17334
508 17334 -10674 3687 -3887 -18663 23555 26913 -21623 -10021 12968 -5939 7436 15167 -23166
521b3166J5522L9382k8509j7107J7641j6616O975L5856l0144k8368L7289M598
533A3353k0366J4263j6210j9673M5258J1174m4096O506J5450j7320K0300Q531
545A7170m3490J0248M0942j8835j0628J0500k6802P701M3582k6313l1642L0546
557B979M968j0489J8289k3376k8303M4051J6784l6607N097P887j8116K5318J1303
570A9785m5449M215L5547j3508l95J1753l4480J658M5376j8749k8593K2312j071
583a599m124K7742k1109l4714L4844J6363k7139J0218K300k3577K6394J7099l9635
596a6937p58K4628j5933Q034J8482l5440o401M0035j1553k1292J7193j0395m484
609a4821L4119j4729l4074K7409J1848k2683J5821K660k6428K2980J9082l1664
$$ plain form
521 -23166 -7644 31738 3229 -13878 3763 -12853 -5878 29978 -166 -28534 8755 13353
533 13353 -7013 7250 -8960 -28633 16625 27799 -16297 -9791 5659 -11661 8639 17170
545 17170 -26320 -16072 24870 6035 -4593 5907 -20895 -13194 30388 4075 -27567 2979
557 2979 7947 -2542 15747 -7629 -35932 8119 24903 -11704 -6607 1280 -16836 8482 19785
570 19785 -25664 -21449 14098 590 195 11948 -22532 -20874 24502 5753 -22840 -528 -1599
583 -1599 -5723 22019 910 -33804 1040 17403 -9736 482 2782 -20795 5599 22698 -16937
596 -16937 -17695 6933 -9000 -966 17516 -17924 -24325 15710 4157 -17135 58 -10337 -14821
609 -14821 19298 4569 -29505 -2096 9752 -12931 2890 5550 -20878 2102 21184 -10480
621a0480M546J8562k2534Q699K5340k9580q438L2319j0823j2080J9565j6468j0587
634a1959L5316r958l0513K4216O149k2568J8424L250k8321J8528J5523k8383Q661
647a635J6280k7392O634K6877k6727q867K6956j2407o200K2682k0231j3522L5882
660A8330o389k8162K1601M433j8770K1592K637k8635J7973J4665k6499J0210J5648
673A8634k8069P442K8158k3767j0217K0465j3531j169K4820k3552j8540L4641
685A5315o1k4318J4456k814j6494K7482L386l2189J3398J4144k1188J2644J1294
698A5055l2442O344L2796j7393j0506J1881j7958N531L1937k5592k6515L0906
710D044O403j4498J2998j3578k0274L2929R320l2185P668R986j7348J9487J2346
$$ plain form
621 -10480 -5934 12628 -9906 -1207 24133 -5447 -13885 18434 7611 -4469 15096 -1372 -11959
634 -11959 23357 13399 -17114 7102 13251 -9317 9107 12357 -15964 2564 18087 -10296 -1635
647 -1635 14645 -12747 -6113 20764 -5963 -14830 12126 -281 -6481 16201 -4030 -17552 18330
660 18330 11941 -16221 5380 9813 -8957 12635 15272 -13363 4610 19275 -7224 2986 18634
673 18634 -9435 -1993 26165 2398 -7819 12646 -885 -2054 22766 -786 -19326 15315
685 15315 15254 -9064 5392 2578 -13916 13566 16952 -15237 -1839 12305 -8883 3761 15055
698 15055 -17387 -11043 21753 4360 -6146 5735 -12223 -6692 25245 -347 -26862 4044
710 4044 10447 -4051 8947 -4631 -24905 8024 17344 -14841 -7173 2813 -14535 4952 17298
723A7298l8208M38L1998q911k959P194k7162N707M0738j9100k9968K0375N143
736B583l831K1061j7849k8253L1483J5525k5891O111K005j9538K4865J8112l6974
749a0591o469K2635o883O829R919l4935k266M1868j0072k6083J1172m605j325
762a0806K8220j5000l1242K4638J4547j9031J0008q26k3695K3051K1555k9391
774g972m453J6102j1569J1750J7475l2368p807L6013n129j6508J1545j1121m997
787i039L0222r759k9627K1216R872j7605J3960k31k6461J8281J8948k6008j00
800f331J3664j8080R891J9922k8826r211L0233p095j2050J4399j3845o980L0839
813A6530r353k8328K0263P981j6332J6324O67k6089J7914J6999k4470K774J3268
$$ plain form
723 17298 -20910 -20472 11526 2615 -344 6850 -20312 -14605 26133 7033 -22935 -2560 2583
736 2583 -1248 19813 1964 -26289 5194 20719 -5172 939 2944 -16594 8271 26383 -10591
749 -10591 -17060 5575 -1308 5521 15440 -19495 -21761 20107 10035 -16048 -4876 -9481 -10806
762 -10806 17414 2414 -28828 -4190 10357 -8674 1334 508 -23187 -136 21419 -7972
774 -7972 -12425 3677 -7892 3858 21333 -11035 -18842 17171 12042 -4466 7079 -4042 -9039
787 -9039 21183 11424 -18203 3013 12885 -4720 9240 9009 -17452 829 19777 -6231 -6331
800 -6331 7333 -10747 -856 19066 -9760 -18971 11262 4167 -7883 6516 -7329 -14309 16530
813 16530 7177 -21151 -888 7093 -9239 7085 7752 -18337 -423 16576 -7894 -5120 8148
826H148j9463Q939K1166k6215q101K6685q445r014J5881j5947q615L1956o714
839A0261k7495J6124N203j3500J8996j0k7625J5869J7542k0980M166R479k2084
852a4054R557K4198k2949q938K0776r362l640J8188j9083j3067L0539j003k2395
865a1233J2747j572j3085K3158J426k9492J1917J5589j6344Q786P597k7089P473
878a0122K6960j7710q464J4600j3516Q10K4660j8575j8514K6057J151j3079J5564
891I822p602j8426K4981O507k6889Q928R938j5507J5134J0537k9047L190K4766
904A6332j3615m114J0903k0644J009K9977j5233j9973J9249j153p978K0485j0231
917E014k4172K1774R033k0838R099M603j9182J7563J4883k6900J16J9464j2948
$$ plain form
826 8148 -11315 -2376 18790 -7425 -15526 11159 2714 -6300 9581 -6366 -14981 16975 10261
839 10261 -17234 -1110 4093 -9407 9589 9579 -18046 -2177 15365 -5615 -1449 8030 -14054
852 -14054 -4497 19701 -3248 -12186 8590 -772 -4412 13776 -5307 -18374 12165 11162 -11233
865 -11233 1514 -58 -13143 10015 11441 -18051 -6134 9455 -6889 1897 9494 -17595 -10122
878 -10122 16838 -872 -9336 5264 -8252 -7442 17218 -1357 -19871 6186 7337 -5742 9822
891 9822 2220 -16206 8775 15282 -11607 -2679 7259 -8248 6886 17423 -11624 -8434 16332
904 16332 2717 -1397 9506 -11138 -10129 19848 4615 -15358 3891 2738 -5240 15245 5014
917 5014 -19158 2616 11649 -9189 -90 4513 -14669 2894 17777 -9123 -9007 10457 -2491
930b491J011J2463k3288k142L0523j0649j6713J5694n278p008K3909r289k5425
943a8683J8613Q753j5795J1519J798k1810J6928J6880k4373p08J4825j4604N489
956a168J6262k3929n416K7878q376j2974J4851r473q059K5184p121k4593J7218
969B84O858j4316J4880O36k4391J6012J7224k3012l30J1464j5730Q121J9830k3600
983f070p369K4587p933r648J5221j3620j0224K6806m065k2295J5650M215j4070
996h815J7382J136k5985J4059J7110j9796J385Q580j7645R930K2034k1658r043
1009a1326K1121p875n568J6104j6273j2548K6937q14j8500J3691m19j4204J9648
1022I974L085k6704J0350J5231j5854N241P444k1468Q356K3114j9611q832J7729
$$ plain form
930 -2491 -1480 10983 -12305 -14447 16076 5427 -11286 4408 -870 -7878 16031 6742 -18683
943 -18683 -70 8683 -7112 4407 6205 -15605 1323 18203 -6170 -6878 7947 -6657 -1168
956 -1168 15094 -8835 -14251 13627 5251 -7723 7128 -2345 -10404 14780 7659 -16934 284
969 284 7142 -7174 7706 8342 -16049 -37 17187 -5825 -6155 5309 -10421 -2300 17530 -6070
983 -6070 -13439 11148 3215 -6433 8788 -4832 -15056 11750 7685 -14610 1040 5255 -8815
996 -8815 8567 9703 -16282 -2223 14887 -4909 -3524 5056 -12589 -2659 19375 -2283 -11326
1009 -11326 9795 1920 -3648 12456 -3817 -16365 10572 9758 -8742 4949 4530 -9674 9974
1022 9974 13059 -13645 -3295 11936 -3918 1323 8767 -12701 -4345 18769 -842 -9674 8055
1035H055r645k497J8437j6872j5207K4244J185j5327J3078m214j5724K1913N157
1048A2583k5724Q093J1876j4170J0039Q362k4854N440K2697j6584o005J5051j2403
1061e599r72K2335j5201j6242K1598q25j1862J5297o970j7537K2732P271k3460
1074i435O914Q621j4483J3364R632k5992K432K1311j4430l295J3916j5913j490
1087h848K4058j2905j5670J8048l425j0257J7701o808j9699K0927Q237k0059O942
1100a758N147j5769J4427J1916k5278J340J8932j2478p5J3787j8356k887K4487
1113A3435j0236j3592J5581n943q606K0875n742k0512J7543P534j6503R119K579
1126E532j8518J4933J3820k2793R35J5463j3376K924J4569k0045n260K3344q328
$$ plain form
1035 8055 -1590 -4087 14350 -2522 -17729 6515 7700 -7627 5451 1237 -14487 7426 12583
1048 12583 -13141 -5048 6828 -7342 2697 11059 -13795 -8355 14342 -2242 -8247 6804 -5599
1061 -5599 -6571 15764 563 -15679 5919 5094 -6768 8529 1559 -15978 6754 14025 -9435
1074 -9435 -2521 6100 -8383 4981 14613 -11379 -8947 12364 -2066 -5361 8555 -7358 -8848
1087 -8848 15210 2305 -13365 4683 1258 -8999 8702 1894 -17805 3122 11359 -8700 -1758
1100 -1758 3389 -12380 2047 13963 -11315 -9975 8957 -3521 -3596 10191 -8165 -11052 13435
1113 13435 3199 -10393 5188 -755 -9361 11514 5772 -14740 2803 10337 -6166 2953 5532
1126 5532 -12986 1947 15767 -7026 -6091 9372 -4004 -1080 13489 -6556 -11816 11528 3200
1139C200j0626J4691r243r203K3275m048k1184J4494M921j4166J2654J562k1728
1152a5401J4037J4897j9681J958J2453j5946M626J7114j9730p123K0867p623o702
1165f254J5808j2308j0807K3854j770j9630J2611J721j3077J6680J902k3514J1439
1178c345J4733j6170L840R193j7949N278J8973j7749p835J7452q397l117J7089
1191A1996j3968j2893K2898R0j6933J1384j726j2669J9246L539k4282Q627J3101
1204H410j3826O266P475k0761N807K1054j6240p367J3965r662j151J9608j4706
1217a128j5047K1567P62j3490J1768m797j3867K1497N429k3800O868J0324j2592
1230f506J0059P164k3472N071K1845j3246n831J1876j2808Q9K2072j4220j5789
$$ plain form
1139 3200 -7426 7265 -1978 -11181 12094 8046 -13138 1356 6277 -7889 4765 6327 -15401
1152 -15401 -1364 13533 -6148 -4190 8263 -7683 -3057 14057 -5673 -12796 8071 448 -6254
1165 -6254 9554 -2754 -13561 10293 8523 -11107 1504 3225 -9852 6828 8730 -14784 -3345
1178 -3345 11388 -4782 -942 8251 -9698 -4420 14553 -3196 -11031 6421 -1976 -5093 11996
1191 11996 -1972 -14865 8033 8123 -8810 2574 848 -11821 7425 10964 -13318 -4691 8410
1204 8410 -5416 850 8325 -12436 -6629 14425 -1815 -9182 4783 -4879 -6030 13578 -1128
1217 -1128 -16175 5392 6154 -7336 4432 -365 -14232 7265 12694 -11106 -4238 6086 -6506
1230 -6506 3553 10717 -12755 -7684 14161 915 -4916 6960 -5848 -5759 16313 2093 -13696
1243a3696J8701M6r584J4051p673j6687K1378P615k1498N986O437j3145J3191
1256E122Q631k4861K721K0661j1406l088J0490j5402l53K3179j2520j5007J6455
1269D622k230q225J6824p339j8284J9017P602j8080P347L696j4715J3565J0637
1282A4437k3283J229J7803j1127n06J1131j6572j268K2224j1230j3010J5543m679
1295F92q611J8251n669j8357J6737N789j5480R363K634j6495J3710J1194k1813
1308h055J786J5742j2643J376J2317j7061j393K1166j1474j1180J6126o609q815
1321h717J8268n572j6874J5786L328j5045J2145J925j8699J3440J1725k0234K195
1334f329J3253j3449K971J3088j7509j839K0074j0850r362J6336p769r232J8860
$$ plain form
1243 -13696 5005 5051 -4533 9518 1845 -14842 6536 14151 -7347 -1361 5076 -8069 5122
1256 5122 13753 -11108 -8387 12274 868 -2220 8270 -7132 -7485 15694 3174 -11833 4622
1269 4622 2392 -5833 10991 3652 -14632 4385 11987 -6093 1254 4950 -9765 3800 14437
1282 14437 -8846 -7617 10186 -941 -1447 9684 -6888 -8156 14068 2838 -10172 5371 692
1295 692 -7919 10332 4663 -13694 3043 8832 -6648 2715 5349 -11146 2564 13758 -8055
1308 -8055 -6269 9473 -3170 -1794 10523 -6538 -7931 13235 1761 -9419 6707 98 -8717
1321 -8717 9551 3979 -12895 2891 6219 -8826 3319 5244 -13455 -15 11710 -8524 -6329
1334 -6329 6924 -6525 -3554 9534 -7975 -9814 10260 -590 -9952 6384 -1385 -10617 8243
1347H243m335j5951J4820J865j3497J4203J841k0025J1914J2882j7358K513R908
1360G023j4108N289J4598j7864l553J8350j0163o567J6315r551j1000J8903k696
1373D976j4095J2978j412j3638J6984L680k1710Q961J1859j3855N107P350j7522
1386a0337N832J7180j6053m897J5678j1125l378J8871j0792j3205J6964q07j0496
1399f565J4020n566j5966J9483O819k1000O348Q273j2291R720P695k1068M329
1412e769J8054j3713l044J3187j3726k581K0488r680j3161J4429l037p330J6512
1425A0629o776j8558J7682Q563j7157N508M185j3752J2415J0102k1766J575J6491
1438I141j2111n11J2630j5227m182K0588p820j1473J2798n569p094J8648n243
$$ plain form
1347 8243 3908 -12043 2777 4642 -8855 5348 7189 -12836 -922 11960 -5398 -2885 7023
1360 7023 -7085 -1796 12802 -5062 -8615 9735 -428 -6995 9320 -231 -11231 7672 4976
1373 4976 -9119 3859 2447 -11191 5793 9473 -12237 -3276 8583 -5272 -165 7185 -10337
1386 -10337 -4505 12675 -3378 -8275 7403 -3722 -7100 11771 979 -12226 4738 3931 -6565
1399 -6565 7455 1889 -14077 5406 12225 -8775 -2427 5846 -6445 3275 10970 -10098 -5769
1412 -5769 12285 -1428 -4472 8715 -5011 -7592 12896 3216 -9945 4484 1447 -5883 10629
1425 10629 3853 -14705 2977 11540 -5617 -109 4076 -9676 2739 12841 -8925 -7350 9141
1438 9141 -2970 -3481 9149 -6078 -10260 10328 2508 -8965 3833 -1736 -8830 9818 4575
1451D575j9544J5379Q156j4309O892K365j5092J3069J0944k0251J944J4222j1998
1464c648J237J3285j5770m012J9466q349r027J3719p415q328J9576m524j8309
1477a2099J4182N780j3765R233J540j6173J2913J0640j9552J956J3296j2828J883
1490b994J3422j6063l964J8619q573q136J4074q125q509J9593m140j8101J3872
1503I75M575j2036J0116Q07j6736J2992J1593j8660J778J1719j2439L567J3100
1516A1351j6254m303J8392p832o890J3532r431q372J9751l243j6577J1727K806
1529D657j0901J2337R86j8698J1316J1973j6245K115R423j4451M936J4991j5995
1542c556n215J5946p476m684J4553j1478j0044J9412j475j4810J0944l00j0948
$$ plain form
1451 4575 -14969 410 8566 -5743 1149 3514 -11578 1491 12435 -7816 -5872 8350 -3648
1464 -3648 -2411 10874 -4896 -8908 10558 2209 -6818 6901 -514 -8842 10734 6210 -12099
1477 -12099 2083 7863 -5902 3331 4871 -11302 1611 12251 -7301 -5345 7951 -4877 -2994
1490 -2994 10428 -5635 -9599 9020 447 -7689 6385 -1740 -10249 9344 5204 -12897 975
1503 975 5550 -6486 3630 4437 -12299 693 12286 -6374 -4596 7123 -5316 -1749 11351
1516 11351 -4903 -9206 9186 1354 -5536 7996 -1435 -9807 9944 6701 -9876 1851 4657
1529 4657 -6244 6093 7079 -11619 -303 11670 -4575 -2460 6963 -7488 -2552 12439 -3556
1542 -3556 -8771 7175 -301 -4985 9568 -1910 -11954 7458 5983 -8827 2117 1817 -9131
1555i131J5056J915j9229Q722J0690j3508M899P869j6827M773J6574j4120m583
1568f900J3591r615k555J6728j1473j1788J7998j005j1625J1774l021j2647J6226
1581E688L911j8273P722P587j3187Q191Q395j8582K973J6308j2222k789J2047
1594G769j2172k122J7963j0163j1765J5016j711r500J3608l966j4488J5042N080
1607H591j6304P380N796j4063R275R717j8083J517J4527j1222p12J1569j3446
1620e458k537J8325q955j0776J4042l710q069J4917m112j4742J4182M734j4741
1633f900Q634L940j4778J0089J0405j7414J407J2584j1041J239J1695j4528l024
1646g692J8228q324r308J3259n422q519J6393m293j5260J3742L565j3447R770
$$ plain form
1555 -9131 5925 7840 -11389 -2667 8023 -5485 -586 7283 -9544 -4771 11803 -2317 -6900
1568 -6900 6691 -2924 -5479 11249 -224 -12012 5986 4981 -6644 5130 2109 -10538 5688
1581 5688 9599 -8674 -952 6635 -6552 1639 10034 -8548 -5575 10733 -1489 -4278 7769
1594 7769 -4403 -6525 11438 1275 -10490 4526 2815 -6685 6923 2957 -11531 3511 8591
1607 8591 -7713 -333 5463 -8600 675 10392 -7691 -6174 8353 -2869 -3581 7988 -5458
1620 -5458 -7995 10330 1375 -9401 4641 931 -7138 7779 3667 -11075 3107 7841 -6900
1633 -6900 1734 5674 -9104 985 11390 -6024 -4617 7967 -3074 -1835 9860 -4668 -7692
1646 -7692 10536 2212 -7096 6163 741 -7778 8615 4322 -10938 2804 6369 -7078 2692
1659B692K825j5868J0233J0197j6164J675J0629j1758L016J2476j5528l630J7755
1672H550p927p958J2784o570p958J6940l639j4402J2432K488j2122J1070K502
1685F190j6723R740J0602j4602K216R176j2678L789J3856j5128m647J6307p698
1698D00n543J2475q288p905J6588k391j3468J1150Q24j1567J2381K545j7225Q434
1712a590J0197j3523L831P600j3870M090J4161j4095m661J4171q262l605J3548
1725G992r591q906J6797k241j1839J1059j326j1302J3765K947j7017P978Q379
1738F695j2255O037P067j5602M455J4315j3200l285J2706r218k528J4772j0142
1751a83r181J5624k295j0046J1442k922j1571J4138L820j6323O812O776j1718
$$ plain form
1659 2692 5517 -10351 -118 10079 -6085 -4410 6219 -5539 -2523 9953 -5575 -9205 8550
1672 8550 623 -7335 5449 -1121 -9079 7861 4222 -10180 2252 4740 -7382 3688 6190
1685 6190 -10533 -793 9809 -4793 -2577 6599 -6079 -2290 11566 -3562 -8209 8098 400
1698 400 -5143 7332 -956 -8861 7727 5336 -8132 3018 3842 -7725 4656 7201 -10024 -1590
1712 -1590 8607 -4916 -1085 6515 -7355 -3265 10896 -3199 -7860 6311 -1951 -5556 7992
1725 7992 -1599 -10505 6292 4051 -7788 3271 1945 -9357 4408 7355 -9662 -1684 6695
1738 6695 -5560 477 7544 -8058 -3603 10712 -2488 -5773 6933 -2285 -4813 9959 -183
1751 -183 -9364 6260 3965 -6081 5361 2439 -9132 5006 8826 -7497 -685 6091 -5627
1764e627P430O730j6506L910J3924j2253k320J1140j0236j737J4841r353r553
1777i610J4153k673q478J1903l434j2577J3927M106j4927O889M869j1600Q585
1790A133P360j6437K989J3521j1189j029J0709j1106k175J5531q566q539J2910
1803E112l861p385J3567m036j2996J3014L733j3137P436L428j2378Q958Q058j5779
1817f266K940J1233j1089N16J0743j2650k200J5418p942p543J2117n443p188J4257
1831F903l623j3253J1927K820j1373Q476K563j3393R086Q389j4592K884R451j1459
1845e194K215J1365j2590k841J4310o976n821J2135p008p371J4699k631j2641
1858h349J0964J648j0542J0123K576j4264Q188Q058j2873L287Q072j2540K818
$$ plain form
1764 -5627 1803 8533 -7973 -4063 9861 -2392 -4712 6428 -3808 -5545 9296 -57 -9610
1777 -9610 4543 1870 -6608 5295 1861 -10716 3211 7317 -7610 -721 4148 -7452 1133
1790 1133 8493 -7944 -4955 8566 -2623 -3652 7057 -4049 -6224 9307 741 -7798 5112
1803 5112 1251 -6134 7433 3397 -9599 3415 7148 -5989 1447 4875 -7503 1455 9513 -6266
1817 -6266 -3326 7907 -3182 -2666 8077 -4573 -6773 8645 703 -6840 5277 -166 -7354 6903
1831 6903 3280 -9973 1954 4774 -6599 1877 4440 -8953 133 8522 -6070 -3186 6265 -5194
1845 -5194 -2979 8386 -4204 -7045 7265 289 -5532 6603 -405 -7776 6923 4292 -8349
1858 -8349 2615 4263 -6279 3844 6420 -7844 344 8402 -4471 -1184 6888 -5652 -2834
1871b834J2317j1919l525J2865p267m210J2239q012q360J4629j947j1353R950
1884B573K24j0154J1464K183j4666P289P287j1429M320P054j3506L207J3073j0967
1898b048l760J1121p738k006J2572r021q441J4443j785r343R755j653r986J2470
1912D580K317j4308O499O454j0685O287O276j4351L336J2945j0258k823R316r097
1926c512q18J3951r305q912J3352j628q029R923l496j0528J2654L099j3514O105
1940f58M982j0261P163O555j4853K352J2243r324j705Q530r629r02J4600q537
1954E56r008J2177k033o928J0044l308j0704J2204L446j2507O603L680j0617P848
1968A453O840j4328J828J1065q709j10Q514j0558j102J4434p943q477J1551l165
$$ plain form
1871 -2834 9483 -2436 -5961 6904 -363 -4573 7666 -346 -8706 5923 3976 -7377 2573
1884 2573 2797 -7357 4107 6290 -8376 -1087 6200 -5229 -909 6145 -7361 -4154 8919 -2048
1898 -2048 -5808 5313 -2425 -4431 8141 -880 -9321 5122 3337 -6006 3749 2096 -7890 4580
1912 4580 6897 -7411 -912 5542 -5143 1144 7420 -6931 -3595 9350 -908 -3731 5585 -3512
1926 -3512 -4330 9621 316 -8596 4756 3128 -4901 5022 1526 -9002 3652 6751 -6763 -658
1940 -658 4324 -5937 1226 7781 -7072 -4720 7523 -1801 -3506 5024 -4605 -5507 9093 556
1954 556 -8452 3725 1692 -5236 4808 1500 -9204 3000 6446 -6061 542 4222 -6395 1453
1968 1453 8293 -6035 -4207 6858 -1851 -1961 6553 -4005 -5107 9327 1384 -7093 4458 1293
1982A293n935J0841l837j1074J2394K840j2018O976K876j1143P947O819j4081
1995f102J850J0209q616R13Q473j1450j229J4237p996p688J0798l620n498J1513
2009E794m186j0434J1700K187j1074P461K358j1541Q110O926j2469K176Q831q967
2023c128J903R253j1891j965J3332o932o148J0099m827n162J2174l497j0561J0677
2037C327J311j0249Q394J676j1906P498P129j1407K860O886r911K899R446j1572
2051c619k969J2467o332m471J0102o244n688J2783l219r594R364M6r646R584K135
2066D699j2521P145O495j0329M337N859j1437L238J0318j0859k383J0731o765
2079a472k431J1027p246o513J1904k619q423R908j647r951J0878K613j1833N907
$$ plain form
1982 1293 -4642 6199 2362 -8712 3682 6522 -5496 1480 4356 -6787 1160 7979 -6102
1995 -6102 -4252 5957 -2659 -1746 6727 -4723 -5952 8285 289 -7399 3399 -221 -5719 5794
2009 5794 1608 -8826 2874 5061 -6013 1448 3806 -7735 375 7301 -5168 -2992 5839 -3128
2023 -3128 -1225 8028 -3863 -5828 7504 572 -5576 4523 -304 -5466 6708 3211 -7350 3327
2037 3327 4638 -5611 2783 4459 -7447 51 7180 -4227 -1367 5519 -4392 -1493 7953 -3619
2051 -3619 -6588 5879 -453 -4924 5178 -1066 -6754 6029 2810 -6784 2580 2626 -7020 2564 4699
2066 4699 -7822 -677 5818 -4511 -174 5685 -5752 -2514 7804 -3055 -5438 5293 -1472
2079 -1472 -3903 7124 -122 -6635 5269 2650 -5773 4135 2488 -7463 3415 6028 -5805 102
2093A02N062r776N895N675j2638K444J0723r571j444R112q072j655J1783p158
2107D82p082J0836k904o964R979k273j0294J0700K966j0979N763L892j0163N961
2121h0O442j2487K072R934q454m27Q802q951j919J1633o120o468J0284l443o335
2136e517J0276k119j0124R919L090j0264O300K736j0029O736O009j1941K024R142
2150F238q472L54Q814j0018j825J2023o855o073J0052l779n537J0718l202j0009
2164g571R732K300r510O252K568j0289P068O058j2047K210Q333q135P97Q482j0038
2179c790j399J1330n886n863R704m719n008J1374l059r941R271K194r186P087
2193B109J762j0481P341O349j1050J934O997q180J823Q599r939k503J1410n281
$$ plain form
2093 102 5164 -4612 1283 6958 -5680 -3236 7487 -2084 -3528 5584 -2488 -4143 7640 482
2107 482 -6600 4236 1332 -5632 4347 2074 -8220 2480 5446 -5533 230 4122 -6041 -80
2121 -80 6362 -6125 -4053 5881 -2573 -3000 5802 -3149 -5068 6565 445 -6023 4261 818 -5517
2136 -5517 4759 2640 -7484 2435 5525 -4739 1561 4297 -5732 1004 7013 -4928 -2904 6238
2150 6238 -2234 -1880 6934 -3084 -4909 7114 259 -5814 4238 459 -5078 5640 2438 -7571
2164 -7571 2161 4461 -5049 1203 3771 -6518 550 6608 -5439 -3229 5104 -3031 -2234 6248 -3790
2179 -3790 -5189 6141 255 -5608 4096 -623 -5631 5743 2684 -7257 2014 4208 -4978 2109
2193 2109 3871 -6610 731 7080 -3970 -2036 4961 -3219 -1396 7203 -2736 -5239 6171 890
2207H90n038Q733n455m777J1380k467r633Q248J507q187P169J536j0964O786O140
2222E868j0112K589O225r430K803R106j0145k470J0220n512l301R260o306n787
2236f992J1355j702q773Q031R2p644Q455J519j1094O012N984r433L500N424r933
2251e199K882R404q815k489Q945o102j965R715o820n918J1164j686p822P979r33
2266B340q193R299J725j0635N575M953r188M496N532j0724K006R465q293j671
2280c313Q052p058j663R927o291o316J0374j948o620Q396j871q722R319J902r802
2295e634N574L566q567N205N926j1280K099Q978p714n54P676p505j249J0456o366
2310F11o117R854k538n985R029k065q566Q843K038r470N379L269r138N884N588
$$ plain form
2207 890 -4148 4585 -870 -5647 5733 3266 -6367 1881 3388 -4799 2370 3906 -7058 -272 5868
2222 5868 -4244 -1655 4570 -4860 -2057 7049 -3096 -5566 4654 -858 -4159 5101 -1205 -6992
2236 -6992 4363 2661 -6112 1919 2011 -5633 2822 4341 -6753 -741 5243 -4190 -690 4734 -5199
2251 -5199 -2317 7087 -1728 -4217 4728 -1374 -3339 6376 -444 -6362 4802 3116 -4706 3273 2340
2266 2340 -5853 3446 5171 -5464 111 5064 -4124 372 5904 -4820 -2814 6651 -1642 -3313
2280 -3313 4739 -2319 -3982 5945 -346 -6662 3712 1764 -4856 3540 1669 -7053 2266 4168 -5634
2295 -5634 -60 3506 -5061 144 6070 -5210 -3111 5867 -1847 -2401 5275 -2230 -3479 6977 611
2310 611 -5506 4348 1810 -4175 4854 2789 -5777 3066 5104 -4366 1013 4282 -4856 1028 6616
2325F616j0845J683P944p889J98P592q275j480J0506n791n871R149l485n309R554
2340D297k250q861Q653J837q686O247J961r715O571N886j0201J742P294p554O72
2355b107P742q882j480J0594n382m898Q625m163n288R767k271q628Q530J415q020
2370d446O534K008r938N537O228r568K070O554q057J449Q069r001k350R778n102
2385b35l638Q469m555n624R637j588q115P458L29p361P902J354j0468N788N529
2400D882q685K312N466q409K336Q530r206k109R411n590k863Q730n125n316J0251
2415D615j883p788P204n5p445Q171J982j0281N899N198q786K971M942r108K637
2430a727Q586q097j627Q069o141k298Q858n881n686J0035j578o823P284j524p521
$$ plain form
2325 6616 -4229 -2546 5398 -2491 -2293 5299 -2976 -4456 6050 259 -5612 3537 52 -5257 4297
2340 4297 2047 -6814 1839 3676 -5010 1237 3198 -6517 54 5940 -4261 -2519 4775 -2779 -2107
2355 -2107 5635 -3247 -4727 5867 485 -4413 4212 49 -5239 4528 2257 -6371 2159 3574 -4446
2370 -4446 2088 4096 -5842 -305 5923 -3645 -1575 4979 -3078 -1629 6440 -2561 -4911 4867 -235
2385 -235 -3873 4596 41 -5583 4054 2466 -5649 1809 2138 -5223 2679 4033 -6435 -647 4882
2400 4882 -3803 -1491 3975 -4434 -2098 6432 -2774 -4883 4528 -1062 -3925 4805 -320 -5636 4615
2415 4615 2732 -5056 2148 2093 -5352 2819 4801 -5480 419 5617 -3169 -198 4744 -4364 -1727
2430 -1727 6859 -1238 -2865 5204 -937 -3235 5623 -258 -5944 4091 2513 -4310 2974 1450 -6071
2445f071Q640J626j0016N257M813q042L842M313r745K488Q651q169j118Q124o232
2460a639j687R008o447n236R352j668n764P645j837p677Q717J286r351N328L877
2475C907q101M775M775r874J849P943p717l93P660p100j357R483n730n672Q573
2490C021k478m819Q217k146q045Q768J645r129N142K749p481N285M632r929K310
2505b258P418p914K26P370p815j122R610n540m955Q268l297m922Q988k526p886
2520f355Q395J562q554N918K245q529N383N197r104K222O502p837O48P493p511
2535b325j673R401n213l556P716m244m777R339k055p864P865J003p619N891K212
2550D101q976N339M750q556K378O056q295J349P611p622j837Q665n053l359P649
$$ plain form
2445 -6071 2569 4195 -5821 -564 4249 -3793 49 4362 -5383 -2895 5756 -2413 -3531 4593 -1639
2460 -1639 -3326 5682 -765 -6001 3351 1683 -4081 3564 1727 -5950 2767 4053 -5298 30 3907
2475 3907 -4194 581 5356 -4518 -2669 5274 -2443 -2836 4824 -2276 -3633 5850 120 -5552 3021
2490 3021 543 -4276 3941 1795 -6250 2518 4163 -4966 176 2925 -4556 729 5361 -4568 -2258
2505 -2258 5160 -2754 -2528 4842 -2973 -4095 5515 -25 -4980 3288 -9 -4931 4057 1531 -6355
2520 -6355 2040 3602 -4952 966 3211 -5318 65 5262 -3842 -1620 4882 -2955 -2307 5186 -2325
2535 -2325 -3998 5403 190 -3366 4350 106 -4671 4668 2613 -5251 2614 3617 -4002 1889 4101
2550 4101 -4875 464 5214 -3342 -964 5092 -3203 -1854 5757 -1865 -3702 4963 -90 -3449 4200
2565D200m804m824R595k184o981P647R1p589O470K038r024N291M455q316L647
2580b88N407r106J530P909p133j825P876n198k284Q482n520n465R540j809o738
2595d622P556l3p347P089J529r558N179M353p644M094M956q925J378P511p514
2610a998j498P551n428j439Q308n860n029Q845k103o489P865p04p201P589J204
2625C613q958M679L673p783M854N107r227J586P585p277j321O948o460j158R996
2640E857n285n553Q468k456n593P351j548p297Q463K212q510M093L340p977M803
2655C68M824r156K084P797p280p67O354o779j059R344n132n019Q526k823n462
2670d180P603k215p415Q292J943q005N386K439q704M819M884r534J970P302o477
$$ plain form
2565 4200 -604 -5428 4167 1983 -4998 2649 2740 -4849 1621 3659 -5365 -74 4381 -3935 -288
2580 -288 5119 -3987 -2457 5452 -1681 -3506 4370 -828 -3112 5370 -150 -5615 3925 2116 -4622
2595 -4622 2934 2901 -4446 2643 4172 -5386 -207 4146 -3498 596 5552 -3373 -1995 5516 -1998
2610 -1998 -3496 4055 -1373 -2812 5496 -364 -5393 3452 1349 -5140 2725 2021 -5180 2409 3613
2625 3613 -5345 -666 3007 -4776 78 5185 -4042 -2456 5129 -2148 -3469 3479 -2981 -4139 5857
2640 5857 572 -4981 3487 1031 -4562 2789 1241 -6056 2407 4619 -3891 202 3542 -4435 368
2655 368 5192 -3964 -1880 5917 -1363 -2130 4224 -2555 -3614 5730 598 -4421 4105 1282 -4180
2670 -4180 3423 1208 -6207 2085 4028 -3977 1409 3848 -4856 -37 4847 -4687 -2717 4585 -1892
2685a892L7O691p681j654R476n041m727Q132k814m680Q003k509p757P970J909
2700C463p638N573J978q031N581M311r608K077O610o495R63O758p612j270Q813
2715E473n313m342P763k912m504Q521k183p573P100P33p381O346J444q105N074
2730A41N070q807J744N534p165J517P471p789j454Q294n064l490P711m499m476
2745e262R165j812o979O849J33o880O561J255q553N424M921q106K379N299p862
2760c468J551P085p337j170Q323n425k789Q177m783n030Q400j604o169P184m50
2775B495p015O707J822q938N124M056p727K875N718q372R25P297p196p92P372
2790D351n805k200Q613m958n075P969j504n895O875p09p017P261J973q926M637
$$ plain form
2685 -1892 -1855 4836 -2845 -4499 4977 -64 -4791 3341 527 -4153 3850 1341 -6416 1554 3463
2700 3463 -4175 1398 3376 -4655 926 5237 -4371 -2294 4316 -2179 -1216 5542 -2070 -3340 5473
2715 5473 160 -4182 3581 669 -3835 4686 2503 -5070 2030 2763 -4618 1728 3172 -4933 141
2730 141 5211 -3596 -1852 3682 -3483 -1966 5505 -2284 -3738 4556 -508 -3998 3713 -786 -5262
2745 -5262 3903 2091 -4888 1961 2094 -4786 1775 3030 -5523 -99 4822 -3284 -905 4394 -3468
2760 -3468 -1917 5168 -2169 -3339 4984 -441 -3230 4947 164 -4866 3534 1930 -4239 2945 2495
2775 2495 -4520 2187 4009 -4929 195 4251 -3476 -601 5117 -3255 -2330 4967 -2229 -3021 4351
2790 4351 -1454 -3654 4959 1 -5074 2895 1391 -4504 2371 1662 -5355 1906 3879 -5047 -410
2805d10L787p371L536M958p992J606O771p190n50P224n850k238Q804m723n020
2820d658P908k238n217P444j140p079P023J751q321M906L381p885M212M818q543
2835c638J849O534o936m78P325o573j777R056m935m968P579k239m948P414j616
2850A649p156P618J493q176M900K548p366M494M493q445J737O535p276J57O952
2865D157o811j579Q896m375m473P151l128m676Q137j202p313P674J306p450N045
2880A359K172p969M377N059p578J771N866o974O05O848p314j764Q352l800l819
2895b809O743l812m797Q109j532p212P168J403o827N228J305q105M238M777p769
2910c892K650N646o850Q36O580p538j770Q111m655k472P671l972m505P772k150
$$ plain form
2805 -410 3377 -3994 -458 4500 -3492 -1886 4885 -2305 -2855 4369 -1481 -3719 5085 362 -4658
2820 -4658 3250 1012 -4205 3239 2099 -4980 2043 3794 -4527 379 3760 -4125 87 4905 -3638
2835 -3638 -1789 4745 -2191 -2669 4656 -1917 -3694 5362 427 -4541 3038 799 -4149 3265 1649
2850 1649 -5507 2111 3604 -4572 328 2876 -4490 4 4497 -3948 -2211 4324 -2952 -2795 4157
2865 4157 -2654 -4233 4663 288 -4185 2966 -162 -4838 3299 2097 -5216 2458 3764 -3686 1359
2880 1359 3531 -4438 -61 4998 -2580 -809 5057 -1917 -1312 5536 -1778 -3542 4810 1010 -2809
2895 -2809 3934 122 -4675 3434 1902 -5310 1858 3261 -3566 1662 2967 -5138 -900 3877 -3892
2910 -3892 -1242 4404 -2446 -1610 4970 -2568 -4338 3773 -882 -3354 4317 345 -4160 3612 1462
2925A462o316O750P35o483O237K005q603L986L902p403K937N490p213J542P287
2940F315p214k730O971m710j853P697l765m578Q273k063p066O331j41o434O927
2955A960J927p724M067L747p978K772N304p764J711P370o733j708O584n634k171
2970d270P953m162l973Q271k137o245O440j105o847O973K133p177M653L416p681
2985c758L121M572q228J591P253n727q75O413n556k073P823m533m142Q178j727
3000B332n586O657j343p182O653K112p440M811L066p517L601M136q142J168O778
3015D104o435k09O781n960j986P606m923l943P698k389m776P229j128p020O693
3030A342J251p097N334K652p513M210M865q252J312O213o120L69O699o145j820
$$ plain form
2925 1462 -4854 1896 2631 -3852 2385 4390 -4213 -227 3675 -3728 -791 4699 -2514 -972 6315
2940 6315 -899 -3629 3342 -1368 -3221 4476 711 -3867 4406 2343 -4723 1608 1467 -4967 1960
2955 1960 3887 -3837 230 3977 -4001 -1229 4075 -3689 -1978 5392 -1341 -3049 3535 -2099 -4270
2970 -4270 3683 -479 -4452 3819 1682 -4563 1877 772 -6075 898 3031 -4146 507 3923 -3758
2985 -3758 -637 3935 -4293 -2702 4551 -1176 -2051 4362 -1194 -3267 4556 23 -4119 4059 2332
3000 2332 -3254 3403 2060 -5122 1531 3643 -3797 1014 4080 -3437 164 4300 -3842 -2674 4104
3015 4104 -2331 -2540 4241 -1719 -3705 3901 -1022 -4965 2733 344 -4432 2797 1669 -5351 1342
3030 1342 2593 -4504 830 3482 -4031 179 5044 -3208 -1896 4317 -1803 -1434 5265 -880 -2700
3045b700P560m405m049P514k871m619P469j164o934O349R35p065N257K223p623
3060d123M054M816p817J267N473o057L00O641o090j667P511m785l721P677l268
3075B11m503P391j134o537O089M62o454N642K227p888M363M420p570J930M698
3090C347o533J230O752o717j540P525m762l202P440l690m326P805j362n970O063
3105B060j49o289N858J975p669M711M158p197J784M565p072J626O497o685q66
3120b693P001m838k708P224m260m537P666j528n105O109p46o443O053J453p530
3135d882M606L866o901K733M164p316J430O403o213p82O943m955j742P066m327
3150I3m573P637j760m737O417q57o052O493R90p609M181L173o245L159M335p451
$$ plain form
3045 -2700 4860 455 -3594 3920 1049 -3570 3899 2735 -4199 2150 3085 -3980 1277 3500 -4123
3060 -4123 -69 4747 -3070 -1803 3670 -2387 -2087 4554 -1536 -3203 4308 -477 -4198 3479 211
3075 211 -4292 3099 1965 -4572 1517 1979 -4475 1167 3394 -4494 -131 4289 -3281 -1351 3347
3090 3347 -3186 -1956 4796 -1921 -3461 4064 -698 -3900 3540 -150 -4476 3329 1967 -4003 2060
3105 2060 1911 -4378 1480 3455 -4214 497 4655 -2542 -758 3807 -3265 -1639 4858 -1827 -2693
3120 -2693 4308 -530 -3238 3986 -274 -4811 2855 1327 -3778 2331 1585 -4858 1195 2648 -4882
3135 -4882 -276 3590 -3311 -578 3586 -3730 -2300 4103 -2110 -2892 4051 -904 -2646 4420 93
3150 93 -4480 3157 1397 -3340 3077 2220 -3832 2661 3651 -3958 223 3396 -2849 310 4645 -2806
3166b806J464N865o254q34O599n271j742P713m467m439P049k260m646O754j453
3181A272n967O819J162p211L938K856o569L757M342p570J805N785o105n58O086
3196C842n734j256P370l859l907O728k319m442O411j586n874O448J510o866M275
3211G41K416o872L420M180p264K041N671o235m8O154n613j684O931m003l534P060
3227C361k580m223O530j359o475O012J349o066M481K414o910L321L778o948J657
3242a658N179n794K09O437o117j574O829m488l237P270l056l703O543j472n757
3257d389N831L10n993N095K384p165M165L379o738K077M405n982Q51O356n920
3272a334j112O532m498k979O400k902l806O908j061n885N915j45o013N290J683
$$ plain form
3166 -2806 -1342 4523 -1731 -2565 4034 -1237 -2979 4734 267 -4172 2877 617 -4029 2725 1272
3181 1272 -4695 2124 3286 -3925 13 2869 -3700 57 4399 -3171 -1366 4419 -1686 -2244 3842
3196 3842 -1892 -3148 4222 363 -3544 3184 865 -3577 2834 1248 -4626 1822 3332 -3534 741
3211 741 3157 -3715 -295 3885 -3379 -1338 4333 -1902 -1950 4204 -1409 -3093 3838 -165 -3699 3361
3227 3361 781 -3442 3088 1729 -4746 1266 2615 -3451 1030 3444 -3466 -145 3633 -3315 -1658
3242 -1658 3521 -2273 -2064 4373 -1744 -3318 3511 -977 -4214 3056 0 -3703 2840 1368 -4389
3257 -4389 1442 1752 -4241 854 3238 -3927 238 3617 -3121 -1044 3361 -2621 -1770 4586 -1334
3272 -1334 -2446 4086 -412 -3391 3009 107 -3699 3209 2148 -3737 2178 2033 -3980 1310 2993
3287B993o480L929L623o846K326M031o437R03O157n790o74O143m513k237O286
3302C414m027l503O607j099n161N844k69o007N428J491o510L873K953n903K638
3317b31M015o867R64N915n517m74N784m399j851O393l648l751O384j256m686N989
3333B764p86n788N296J729o656L744K922o173L292L760p008J122N953n602o71
3348b102N814m847j548O406l758l935O408j558m291N867j032n850N654J393o257
3363c636L798K476n862L131L829p090J513N320n183j17N359m863j539O577l866
3378a53l597O387k212l689O181j082n748N309J175n858L893K042n743L807L583
3393D295o940J342M824n378K04N355m894r38N949l752l379N660j937l816O189
$$ plain form
3287 2993 -3487 442 4065 -2781 -455 3576 -2861 -1958 4199 -1591 -2265 3878 -635 -2872 3414
3302 3414 -613 -4116 2491 1392 -3769 2075 1806 -4201 1227 2718 -3792 81 3034 -2869 -231
3317 -231 3784 -3083 -2119 3796 -1721 -2195 3589 -810 -2661 3732 84 -3667 2717 1461 -3225 2764
3333 2764 1978 -3810 1486 3215 -3441 303 3225 -2948 344 4104 -2904 -1782 4171 -1431 -2102
3348 -2102 3712 -1135 -2683 3723 -35 -3970 2438 880 -3411 2456 1424 -4426 1228 2621 -3636
3363 -3636 162 2638 -3224 -93 3736 -3354 -1841 3479 -1704 -1821 3538 -1325 -2864 3713 -153
3378 -153 -3750 2637 425 -3264 2917 1835 -3913 1396 2571 -3287 606 2648 -3095 712 4295
3393 4295 -2645 -1303 3521 -1857 -1653 3702 -1192 -2130 3819 67 -3312 2348 411 -3405 2784
3408B784r71n387N107M55n703M439J456n740L809L566o358J465M279n759N53N586
3424C581n014j153O493l950k946N660k862m044O783q98n278N545K40n503M384
3439A038J183o177M032L510n962J733M247n757Q12M737n134n31O193l903k326
3454b305N867l501l877O367j447m433N442J37n434M881R04o688L838L382n828
3469b695K344L755o021J310M614n282r21N954m274j520N978l420l526N761j179
3484H78m466N571p06m803N295P16o212L405L073n591K543L514n231J132M721n428
3500a589l61N268m341j460O101l623k948N945j860l939N264j136m687N269Q05
3515B708o090L827K254n487K851L407n805J245M980n449n44N152m306j078N779
$$ plain form
3408 2784 1813 -3574 1533 1988 -3715 724 2180 -3560 249 3815 -2543 -1078 3201 -2558 -2005 3581
3424 3581 -1433 -2586 3907 -43 -2989 2671 -191 -4235 2548 1650 -3628 1917 2157 -3346 1038
3439 1038 2221 -3956 76 3586 -2376 -643 3604 -2153 -1341 3396 -1738 -2269 3924 21 -2305
3454 -2305 3562 61 -3816 2551 1104 -3329 2113 2250 -3184 1697 2601 -4087 -249 3133 -2695
3469 -2695 -351 3404 -2617 -1307 3307 -1975 -2896 3058 -1216 -2736 3242 -178 -3704 2057 878
3484 878 -3588 1983 1277 -3526 1769 2485 -3727 -322 2751 -2840 -297 3217 -2014 -882 3839 -1589
3500 -1589 -1950 3318 -1023 -2483 3618 -5 -2953 2992 1132 -2807 2457 1321 -3366 1903 2708
3515 2708 -3382 445 2699 -2788 63 3470 -2335 -1090 3890 -1559 -2103 3049 -1257 -2335 3444
3530C444l591k653N381j873l886N477j212n000N484O32n598L785K055n601L123
3545c3L394o187J675M456n319K6M826m505p05N742l466k651N142k227l354N540
3561B354j199m811N483Q40n655L630J882n376L476K978n751J667L749n252P26
3576a259M693m804r64O117l629k584N234k966l356N577j380m610N366K66m827
3591c126L942Q75n652L402K848n301K002L516m619M65M618n016m69N457l389j857
3607b304N363l287k899N633j553m135N115K03m571M178O88n500L489K472n252
3622b360K177L644n398J044M664n088q10N046l567j607N220k826k998N301j466
3637I76m492N151q6m851M549J075n355K948K449n088K147L472n486J495M605m876
$$ plain form
3530 3444 -147 -2800 2581 708 -3178 2299 1087 -3913 1571 2203 -3395 390 2445 -3156 -33
3545 -33 3361 -2826 -1151 3305 -2014 -1988 2838 -1667 -2372 3370 -96 -2747 2395 168 -3186 2354
3561 2354 1155 -3656 1827 2667 -2988 642 2524 -2852 624 3602 -2149 -482 3267 -1985 -1259
3576 -1259 3434 -1370 -2334 3783 154 -2430 2804 -162 -3518 2059 679 -3931 1435 1701 -3126
3591 -3126 816 1691 -3961 -559 2289 -3012 -1010 2506 -2113 -1648 2970 -2046 -2515 2942 -447 -2304
3607 -2304 3059 -228 -3127 2506 953 -3182 1933 2136 -2435 1743 2431 -3069 420 2892 -2360
3622 -2360 -183 3461 -1937 -893 3771 -1317 -2127 2919 -648 -2255 2965 139 -2859 2442 976
3637 976 -3516 1635 1549 -3302 1247 2322 -3033 -85 2364 -2724 -577 2895 -2591 -1096 3509 -1367
3653a367p92M709l593j298M924k916k554N474j661l988N204j003m437M626J237
3668B565n201L488J746n076K537K973n094J346M275m448n24M476l926j135N265
3683C267l481k144N034j812l414M809q89m077M156Q51n493L633J849n026K661
3698g6K682n415J694M024m592k95M235l760j161N286l257k495N044k015l156N297
3714B040j039m454M630O76m705L370J805m912K939K641n336J619L818m728P90
3729h46M027m270p16M912l149k164M957k482k786N141j643l814M369L19m701L436
3745E90J394n007L158K279n130J637L637m427M05M051m335m62M878l218k145N311
3761B616k829k668N107j638l954M799J83m283M173Q27n268L346K235m942K098
$$ plain form
3653 -1367 -2159 2550 -1043 -2341 2583 -333 -2887 2587 926 -3062 2142 1139 -3298 1328 2565
3668 2565 -2636 852 2598 -2478 59 3032 -2062 -716 3559 -889 -1413 3063 -863 -1998 3267
3683 3267 -214 -2358 2676 864 -2550 2259 1370 -2707 1449 2300 -3193 440 2289 -2737 -76
3698 -76 2606 -2809 -1115 2909 -1683 -1978 2257 -1503 -2664 2622 -635 -3130 1914 -101 -3257 2040
3714 2040 1001 -3453 1177 1853 -2852 518 2323 -2589 350 2991 -2345 -726 3092 -1636 -846
3729 -846 3181 -1089 -1805 3107 -42 -2206 2751 269 -2517 2624 981 -2833 1536 1855 -2846 590
3745 590 1984 -3023 135 2414 -2716 -1079 2558 -1869 -1464 2587 -1748 -2210 2668 -550 -2695 2616
3761 2616 -213 -2881 2226 588 -3366 1433 1616 -2667 1506 2333 -2935 411 2646 -2296 -198
3776a98L047m672J153L858m388n68M700l147j645M623k808k437N104j212l901
3791b491M270k68l860L864N34m725L225K068m800J708L146m656J120L968m459
3806a356l20M354l501j258M741k838k672N092j418l621M239m94l933M171J96m462
3822c080L049K306m657K080K915m678R40L998m382K3L911l247j270M686k753k483
3838b642M996j366l189M233o82l692L911M21m747L210J854m586K436K678n094
3853b259J305L866m430J7M220l887o63M788l390k034M265j391l126M331r32l740
3869c060M324M46m671L543J133m353K669K354m798J503L695m258M5L924l951o64
3885b119N215l244k134M443j824k876M319j074l689M416P62m626L367J331m737
$$ plain form
3776 -198 2849 -1823 -670 3188 -1200 -1768 2932 -215 -1860 2763 -45 -2482 2622 1410 -2491
3791 -2491 1779 1511 -2349 1515 2049 -2676 549 2617 -2183 -475 2671 -1985 -865 3103 -1356
3806 -1356 -1676 2678 -823 -2081 2660 -178 -2850 2242 824 -2797 1442 948 -2985 1186 1382 -3080
3822 -3080 -31 2275 -2382 -302 2613 -2065 -1125 2873 -1509 -1486 2425 -822 -2092 2594 -159 -2642
3838 -2642 2354 988 -2201 2032 1350 -2342 1569 1990 -2757 453 2307 -2279 157 2835 -2259
3853 -2259 -954 2912 -1518 -1501 2719 -1168 -1831 2957 -433 -2467 1798 407 -2719 1612 680 -3060
3869 -3060 1264 1710 -2961 582 1715 -2638 31 2385 -2413 -910 2785 -1473 -1428 2496 -1455 -2119
3885 -2119 3096 -148 -2282 2161 337 -2539 1780 706 -2983 1433 2195 -2431 936 2267 -2470
3900b470K533K248m281J574L359m201L79L509m076m83M711l238j666M692k176
3915D14k753M675j902l490M572o1m100L504R94m501K636K308m718J670L119l926
3931a559P61L575m212o58M629l345j477M665k315k507M581j263m005M661q8l989
3947b546L698J038m529K695J915m751K100K981m175J015L652m283o87M529l070
3962d18j739M613k415k219M704j681l469L983k45l791L633J024m632L124J871
3977B343m537J740K756m161Q13L979m235n84M479l221j493M521k686j909M322
3992B127j673l161L990k60l733L709O04l924K765J819m393J837K737m663J458
4007g61L680l901j98L852l298q80M125k680k077M397j273l183M067p14l696L924
$$ plain form
3900 -2470 63 2311 -1970 -396 2963 -1238 -859 2650 -1426 -1909 2802 -436 -2102 2590 414
3915 414 -2339 2336 434 -3056 1516 1455 -2645 859 1853 -2648 -12 2296 -2422 -752 2367 -1559
3931 -1559 -798 2777 -1435 -2093 2536 -809 -2286 2379 64 -2443 2138 875 -3130 1531 1443 -2546
3947 -2546 1152 2190 -2339 356 2271 -2480 -380 2601 -1574 -559 3093 -1190 -1877 2652 -418
3962 -418 -2157 2456 41 -2178 2526 845 -2624 1359 1114 -2677 956 1980 -2652 472 2343
3977 2343 -2194 -454 2302 -1859 -1046 2933 -1302 -1886 2593 -628 -2121 2400 -286 -2195 2127
3992 2127 454 -2707 1283 1023 -2710 999 1603 -2321 444 2263 -2130 -293 2444 -2219 -761
4007 -761 2919 -982 -1180 2672 -626 -1506 2619 -61 -2138 2259 986 -2197 1870 1156 -2540 1384
4023A384O97m581L159J451m008J855K354m525J034L846m025j29M123l774p48M070
4039B183k738k210M767j630k821M274j069l485L665P03m156L021J426m387K451
4054fK265m565J385L568m050L17L769l768n54L990k372k185M421j697k649M320
4070B189j053l693L817M63l900K771J446m236K829J983m820J500L166m142P48
4085i32L676l765o42M260k963j960M242j890k611M627j170l704M057l21l489L127
4101E42R61m023K797K241m904J597L182m199O70L962l966m43L972k665j603L937
4117B058k076k507M537p40l654L590J11l694L597P36m390K724K179m299J465K892
4133B529m045O86L587m001l69M329l119j518M315k452k550M442r56l402L802q8
$$ plain form
4023 1384 2081 -2500 659 2110 -1898 -43 2311 -2214 -1180 2666 -1359 -1488 2635 -1139 -1887 2183
4039 2183 -555 -2765 2002 372 -2449 1825 756 -2729 936 1639 -2517 504 1930 -2457 -6
4054 -6 2259 -2306 -921 2647 -1403 -1086 2683 -1085 -1639 2351 -21 -2206 2215 518 -2131 2189
4070 2189 1136 -2557 1260 1723 -2177 594 2040 -2196 633 2616 -2204 -704 2462 -1680 -932
4085 -932 2744 -1021 -1663 2597 -366 -2326 1916 26 -2585 2042 872 -2832 1225 904 -2585 542
4101 542 1503 -2520 277 2518 -2386 -789 2393 -1806 -1136 2826 -1140 -1583 2389 -276 -1879 2058
4117 2058 -18 -2525 2012 1272 -2382 1208 1319 -2375 1222 1958 -2432 292 2471 -1828 -363 2529
4133 2529 -1516 -830 2757 -1244 -1613 2716 -403 -1921 2394 -58 -2608 1834 878 -2524 1278 1190
4149A190l617L342O78m148K837J989m458K015K570m240R91L033l519l77L817l023
4165i20j032M277k512k409M561j564l002M136m44l607L745M59m454L154J655l894
4181a851J691K608m163Q26L647m040j67L944k899j336M158k597j929M207j559
4196E40k961L821o70l166L908j16m317L329J755m312K060K264m335J286L301l944
4212a557J90L494l304p10M269k778j961M405j635k492L416q23l085L698K08l822
4228b487L189J275m153K115K227l781R93L017l755L60L488l666n90M226k620j818
4244a980M297k087k248L871j152l472M243K85m247L148J249m085K273K055m227
4259b077J689K802l980O24L621l962m49M045k790j734M491k345k201M069j038
$$ plain form
4149 1190 -2427 915 1593 -2555 282 2271 -2187 -172 2398 -1842 -851 2182 -1337 -1714 2103 -920
4165 -920 -1952 2325 -187 -2596 1965 401 -2601 1535 1091 -2516 1229 1688 -2766 388 2043 -1851
4181 -1851 -160 2448 -1715 -889 2758 -1282 -1449 2495 -404 -1740 2418 -179 -2108 2099 540
4196 540 -2421 1400 730 -2436 1472 1356 -2961 368 2123 -2189 -129 2135 -2200 -914 2387 -1557
4212 -1557 -1367 2127 -1177 -1887 2382 -396 -2357 2048 413 -2079 1337 514 -2571 1127 1335 -2487
4228 -2487 702 1977 -2176 -61 2166 -1615 -622 2395 -1360 -1000 2488 -1178 -1768 2458 -162 -1980
4244 -1980 2317 230 -2018 1853 701 -2771 1472 1757 -2490 658 1907 -2178 95 2150 -2077
4259 -2077 -388 2414 -1566 -942 2679 -1283 -1732 2313 -477 -2211 2280 -65 -2266 1803 765
4274G65l348L853K7l735L278P33l944K557K084m304J465K582l563O41L621l715
4290a003o03M103k779j787M421k002k319M172j310k995L602m10l256L199O12l724
4306b079K481J927m253J900K276m086J072L391l949k39L984k909j467L977k361
4321c35j913M089j243l138L722j59l713L350Q57m032K727J622l916J839J994l670
4337a919J032L239l713k86M027k889r69L748k457j805M137j688k674L918o99l341
4353b339L608L28l625K582J542m038J920K427m351J337L437m216J04L699k859
4368d44j113L638k438j970M008j454k715M278p74l334L272K78l627K681J381l884
4384b217K178K116l932J090K779l502L49L521l249q13L683k292j633L775j423
$$ plain form
4274 765 -2583 1270 1297 -2438 840 1573 -2371 186 2270 -2034 -569 2013 -1550 -909 2712 -1003
4290 -1003 -1606 2497 -282 -2069 2352 350 -1969 2203 893 -2102 1500 1090 -2166 1033 1645 -2079
4306 -2079 402 2329 -1924 -24 2252 -1834 -762 2629 -1320 -1559 2425 -484 -1951 2026 -335
4321 -335 -2248 1841 598 -2540 1182 1023 -2690 660 1517 -2515 212 1834 -2082 -243 1751 -1919
4337 -1919 -887 2352 -1361 -1647 2380 -509 -1478 2270 -187 -1992 2145 457 -2217 1701 1002 -2339
4353 -2339 1269 1597 -2028 554 2096 -1942 -22 2405 -1946 -609 2828 -1388 -1284 2415 -444
4368 -444 -1557 2081 -357 -2327 1681 227 -2488 1790 1016 -2318 954 1232 -2395 286 1667 -2217
4384 -2217 -39 2077 -1855 -765 2014 -1488 -1139 2382 -867 -1680 2003 -289 -1922 1853 430
4399D30k604M077j338k896L573K59l690K825J016l742K498J787l929J472L005
4414B743l954L26L285l216l73L712k686j874L977j580k589M027j091l045L606
4429A268M0l735K858J122l916K647J582l999J512K977l973N37L314l367k71L630
4445B226k604j461L864k053k311L817q95l018L836j06l451L106O49l728K575J788
4461B234m134J427L067l944N60L212l342q6L397k891j053L892k380j992L879j470
4477C76k604L658j69l254L015M58l882K660J688l947J515K437l525O34L377l763
4493a326K15L367k779j349M143k299k276L973j399k741M098o70l352L403L11l887
4509b568K859J561l541J460K226l508R17L017l772L97L176k976q95M039k774j492
$$ plain form
4399 430 -2174 1903 565 -2331 1242 1501 -2189 636 1652 -2090 408 2195 -1734 -262 2743
4414 2743 -1211 -885 2400 -816 -1189 2523 -163 -2037 1940 360 -2229 1798 707 -2338 1268
4429 1268 1308 -2427 431 1553 -2363 284 1866 -2133 -621 2356 -1617 -1080 2234 -1133 -1404 2226
4445 2226 -378 -1839 2025 -28 -2339 1478 583 -2435 1401 1295 -2156 950 1599 -2129 446 2234
4461 2234 -1900 -473 2594 -1350 -790 2422 -920 -1006 2391 -500 -1553 2339 -41 -2033 1846 376
4477 376 -2228 1430 1261 -1993 1022 1480 -2402 258 1946 -2001 -486 1951 -1574 -940 2437 -1326
4493 -1326 -1111 2256 -523 -1872 2271 -28 -2304 1669 270 -2471 1627 957 -2395 1008 1319 -2568
4509 -2568 291 1852 -1689 -229 1997 -1511 -594 2423 -1349 -952 2224 -752 -1647 2392 -382 -1874
4525a874M048j781k604L643m27l347L730K12l719K673J188m000K512J787l881
4540a840J189K915l566K20L117k992n21L661k747j481L764j820k016L181n13k930
4556b379L529l0l372K727J231l880J994K133l825J210K857l517L64L145l039n50
4572a402L683k785j395L882j821k075L586r42k905L394l9l312K882J089l889K205
4588A56J804l634J443K312l265N11K973l228n49L698k588j501L572j568k153L510
4604A493j215k738L679q6l269K653R86l762K356J740l818J465K211l217M51L207
4620B136l427j6L405k622j091L341j462k068L619j346k640L480k24l271L011Q24
4636A649l798K596J477l747J580K540l848R05K989l428K7L369k734j149L656k370
$$ plain form
4525 -1874 2174 393 -2211 1432 1005 -2342 1388 1600 -2119 554 1742 -2258 254 2041 -1840
4540 -1840 -651 2264 -1302 -1082 2035 -957 -1478 2183 -564 -2045 1719 -101 -2117 1064 551 -2379
4556 -2379 1150 1120 -2252 475 1706 -2174 -180 1953 -1872 -662 2195 -1322 -958 2187 -852 -1402
4572 -1402 2281 -504 -1899 1983 162 -1913 1673 731 -2174 1220 1181 -2131 751 1840 -2049 156
4588 156 1960 -1674 -231 2081 -1184 -673 2300 -928 -1477 2221 -367 -1868 1704 136 -2017 1493
4604 1493 278 -2460 1219 1133 -2136 517 1503 -2259 97 1837 -1981 -516 1695 -1522 -1071 2136
4620 2136 -1291 -1307 2098 -524 -1615 1726 264 -1804 1815 469 -2171 1309 1085 -2186 825 1649
4636 1649 -2149 447 1924 -1823 -243 2297 -1551 -646 2343 -1085 -1058 2311 -423 -1572 2084 -286
4652b86j468L468j345k500L385m82l081L094N92l505K471J502l690J515K118l344
4668a556Q57K840l599K17L193k755o43L378k425j402L732j417k483L531o95k935
4684b162L448J57l290K246J189l081J475K082l515R95K858l538J79L176k721q82
4700a384L607k574j334L688j940j846L250p72k808L029J83l311K723J239l340
4715a590J647J597l393J143K582l199Q9L097k745o86L523k494j544L667j485k222
4731b013L142n98k584L071J54l364K650J341l604J872J824l577J336K577l382
4746a155K94L081l079m04L540k364j371L543j918k040L367j020k716L508l27k894
4762a955K633Q34l215J871J819l610J147K347l213M46K961l242k98L428k401j176
$$ plain form
4652 -286 -1754 1714 369 -2131 1254 772 -2309 785 1377 -2128 343 1845 -1845 -330 1788 -1556
4668 -1556 -699 2141 -1458 -1241 1952 -803 -1446 1932 -493 -1895 1837 420 -2063 1468 773 -2162
4684 -2162 1286 1443 -1847 399 1588 -1493 -18 2064 -1451 -456 2402 -1136 -957 2219 -502 -1384
4700 -1384 2223 -351 -1685 2003 63 -1783 1467 695 -2113 916 1099 -2212 511 1750 -1590
4715 -1590 57 1654 -1739 -596 1986 -1213 -1124 1973 -772 -1458 2065 -429 -1973 1694 209 -2013
4731 -2013 1129 531 -2053 1018 1172 -2192 458 1799 -1805 67 1891 -1686 -350 2227 -1155
4746 -1155 -861 2220 -859 -1263 2277 -87 -1458 2085 167 -1873 1494 474 -2242 1266 939 -1955
4762 -1955 678 1512 -1703 168 1987 -1623 -476 1871 -1342 -896 2065 -1177 -1475 1953 -448 -1624
4778a624L414k243j561L460j158k482L347m13k537K471N87l305K271J479l459
4793a753J489K194l411P62K767k999k46L231k486q29L199k083j649L529j518k236
4809b039L398n27k712K698K85l078K407J407l639J769J813k881L67K554k856l24
4825a358L081k349r70L262k200j332L341j342k095L207n15k680K729J85l014K249
4841A99J423l177J534J553k990Q20K493l058J35L158k792o67K955j791j427L233
4857A601j200k104L104m32k882K776M02l066K358R78l173J605J871l413J201K404
4873B030l235L67K476k070o77K807k258r61K922j245k024K885l94k782L107q6
4889H62k956K487P84k879J691J292k837J176K210k928L08K455k595j50K991k397
$$ plain form
4778 -1624 1790 -453 -2014 1446 288 -2194 1153 740 -1797 674 1261 -2044 227 1706 -1753
4793 -1753 -264 1930 -1481 -719 2048 -951 -1197 2034 -452 -1281 1918 -165 -1814 1715 197 -2039
4809 -2039 1359 832 -1880 818 1103 -1975 432 1839 -1800 -31 1782 -1099 -732 1822 -1034 -1358
4825 -1358 1723 -626 -1596 1666 -534 -1866 1475 133 -1962 1245 730 -1950 779 964 -2050 199
4841 199 1622 -1555 -21 1532 -1458 -638 1855 -1203 -1068 2090 -702 -1369 1586 -205 -1632 1601
4857 1601 401 -1703 1401 969 -1913 863 1265 -1801 557 1535 -1638 -33 1838 -1575 -374 2030
4873 2030 -1205 -838 1638 -432 -1109 1698 -560 -1521 1401 156 -1868 1017 623 -2159 948 862
4889 862 -2094 393 1177 -1702 -11 1281 -1556 -380 1830 -1098 -790 1665 -930 -1080 1911 -486
4905d86j098L051j324j719L036j026k331L144j25l028K499Q42l048J965J184l295
4921a759J428K225k870M69K526k804j51K789k291j128L219j488j963L146q42k159
4937a653K769L0l078K436O19k740J661J242k716J122J670k362J74K336k686R9
4953a077K863k568p05L027j409j787K874r36j934K653k00k609K319O18k804K033
4969C58J105k992J552J938l045L89K543k561k30K765k122p98K734j711j540L139
4985A524j036j926K613n02k413K352L66k745K179J080k813J130J577k645Q04J990
5001A535k505J26K466k216n48K753j939j225K799r22j949K707k00k866K851N6
5017I23k661J898J102k881J560J678k965R87J950k564n7K861k425k84K414j590
$$ plain form
4905 -486 -1584 1467 143 -1576 1460 434 -1897 1247 1122 -1906 593 1435 -1613 352 1536 -1759
4921 -1759 -331 1894 -976 -507 2019 -785 -936 1853 -438 -1566 1653 165 -1798 1348 506 -1653
4937 -1653 1116 1146 -1932 504 1123 -1617 44 1286 -1430 -308 1362 -1000 -826 1510 -1176 -1077
4953 -1077 1786 -782 -1487 1540 131 -1656 1218 282 -1652 1001 801 -1808 511 1129 -1675 358
4969 358 1463 -1529 23 1961 -1084 -695 1848 -713 -943 1822 -300 -1098 1636 -75 -1615 1524
4985 1524 488 -1438 1175 673 -1740 612 978 -1767 412 1492 -1321 -191 1386 -1259 -455 1535
5001 1535 -970 -844 1622 -594 -1142 1611 -328 -1553 1246 324 -1625 1082 882 -1984 867 923
5017 923 -1738 160 1262 -1619 -59 1619 -1346 -359 1591 -973 -1030 1831 -594 -878 1536 -54
5033e4j333K925j192j857K807q79k156K696J6k674J998R24k546J457J126k197
5049i39P16J901k988M17K550k299m13K440j873p90K804j276j877K903p89k276
5065a789K823j40k562K240P21k763J636J399l004R22K009k445N06K132k618n0
5081i83K905k023j263L018j550j264K568r00j758K195K75k830K185M31k419J694
5097B81J078k914J501J796k726K77K186k359J6K373j872r08K625j431j461K900
5113A362j010k015K647m36k114K148L71k569J787J160k724J308J498k441N12J858
5129A342k390K6K385j753q29K657j532j090K557q57k018K484k45k151J923M94
5145A003k434J822J142k923J501J442k430O24K047k724q3K435j916n62K590j521
$$ plain form
5033 -54 -1387 1538 346 -1511 1296 417 -1739 957 973 -1701 297 1221 -1325 132 1258 -939
5049 -939 -223 1678 -1310 -893 1657 -642 -1055 1385 -488 -1278 1526 250 -1627 1276 487 -1789
5065 -1789 1034 894 -1668 572 1293 -1470 166 1565 -1439 -517 1492 -953 -447 1685 -933 -983
5081 -983 1922 -101 -1364 1654 104 -1160 1408 508 -1250 945 1220 -1610 575 1006 -1413 281
5097 281 1359 -1555 -54 1742 -984 -707 1479 -880 -864 1509 -363 -1271 1354 -77 -1538 1362
5113 1362 352 -1663 984 548 -1566 582 953 -1616 171 1331 -1393 -85 1413 -1028 -516 1342
5129 1342 -1048 -1022 1363 -390 -1219 1438 -94 -1184 1373 516 -1502 982 737 -1414 509 1003
5145 1003 -1431 391 1533 -1390 111 1553 -877 -253 1794 -930 -1013 1422 -494 -1056 1534 13
5161A3j464K837j181j637K354l53k021J850K44k240J965O82k476J467J368k712
5177a304P00J921k252n9K531k062m94K689j994j155K785j035j895K655n18j864
5193a351K079J68k465K025P52k616J421J403k350P86J765k529K38K240k055m09
5209h98K259j646r84K661j161j458K084l27j962K159P3k284J940N29k608J651
5225B8J100k373P99J880k161Q2J839j892j2K134j813p95K493j078j577K155m86
5242C23j916K240N7k072J830N76k501J577J240k498R28J693k437L87K033k003
5258e43n41K393j364j093K615j240j482K431o97j733K128J6k363J924M94k331
5274a386J412J313k491R54J368k332M66J743j797RK120j711r13K337j066j389
$$ plain form
5161 13 -1451 1386 205 -1432 922 569 -1452 398 642 -1598 367 1049 -1427 40 1408 -1304
5177 -1304 -604 1317 -935 -994 1537 -525 -1019 1670 -324 -1479 1306 271 -1624 1031 513 -1351
5193 -1351 728 896 -1569 456 1208 -1408 13 1416 -934 -148 1617 -912 -674 1566 -489 -898
5209 -898 1361 -285 -1269 1392 231 -1227 857 530 -1432 727 800 -1484 456 985 -1623 28
5225 28 1128 -1245 -446 1434 -727 -645 1194 -698 -710 1424 -389 -1184 1309 231 -1346 809 323
5242 323 -1593 647 704 -1368 462 1038 -1463 114 1354 -1144 -216 1477 -960 -573 1460 -543
5258 -543 -1084 1309 -55 -1148 1467 227 -1255 1176 479 -1254 874 890 -1473 451 945 -1386
5274 -1386 26 1339 -1152 -198 1170 -1162 -696 1047 -750 -741 1379 -332 -1245 1092 26 -1363
5290a363K500r02j639K110L0k230J937N39k414J590J130k578J118J338k157N46
5306d45J910k192j28K376j959m26K342j494q13K078p36j669K024m39j656K035
5322H08J80k510J824R33k498J147J417k310O62J667j946l2J784j573o82K448j475
5339a56j331K463q91j664K374n26j611K104p7k142J506Q80k009R09J290k098O57
5356c22J517j936J20J964j796m49K227j314r93K130j042j418K383n15j820K287
5372A023j78k214J689Q18k267J336Q92k152P24J758k139L45J671j459j097K427
5388A177j315j082K135p81j366J914l22j739K087R2k432J829Q29k332J372J059
5404A125k207N35J791k212L10K170k010l18K056j431q79K216j085j226K045m50
$$ plain form
5290 -1363 1137 235 -1404 706 736 -1494 443 982 -1432 158 1288 -1290 -172 1166 -991 -445
5306 -445 1465 -727 -855 1521 -438 -864 1478 -16 -829 1249 513 -1156 868 429 -1227 808
5322 808 988 -1522 302 1235 -1263 -116 1301 -1009 -347 1320 -626 -658 1126 -447 -1129 1319 -156
5339 -156 -1487 976 85 -1579 795 269 -1342 762 685 -1457 49 929 -1080 -171 1119 -979 -322
5356 -322 1195 -741 -621 1343 -453 -902 1325 11 -982 1148 106 -1312 1071 556 -1264 1023
5372 1023 845 -1369 320 1138 -1129 207 1099 -1053 -329 1429 -710 -365 1306 -153 -1250 1177
5388 1177 -138 -1220 915 134 -1232 682 360 -1379 708 800 -1632 197 1026 -1306 66 1125
5404 1125 -1082 -547 1244 -968 -658 1512 -498 -816 1240 -191 -1070 1146 61 -1165 880 430
5420D30j811K110J26j943J448P62k405J537R51k171R26J308k023K17J936j959
5436e61l40K177j443q38K207j163j166J968m95j852K354j93k027J704N74j926
5452a020J214P88k103J030J318k155N30J804j907k79J697j415o44K182j337q28
5468a125J990o38j351J942o7k034J870M54j861J094P45k050P64J531j975M08J589
5485A286j756n0J614j429n38J907q53j134K171q17j691J894j11j639J418M25j875
5502a178J416O07k030P71J360j705M10J565j934j24J886j087r89K155j226j261
5518a364K397p41j618J990k44j521J416M57j912J291R38k315J226J188k110M11
5534e11J709k057K32J658j338p97K193j255q31K176r38j473J939k41j615J642
$$ plain form
5420 430 -1381 729 855 -1088 360 1122 -1283 254 1205 -966 -40 1268 -755 -538 1398 -561
5436 -561 -901 1276 -167 -1005 1202 39 -1127 841 346 -1506 848 655 -1372 332 906 -1020
5452 -1020 194 982 -1121 -91 1227 -928 -398 1406 -501 -780 917 -498 -1142 1040 -297 -1125
5468 -1125 865 227 -1124 818 751 -1283 587 1041 -820 274 1019 -1031 -267 1264 -711 -303 1286
5485 1286 -470 -520 1094 -335 -873 1034 181 -953 1218 401 -1290 604 493 -1146 272 697 -1178
5502 -1178 238 845 -1185 -414 946 -759 -349 1216 -718 -842 1044 -43 -1032 1123 -103 -1364
5518 -1364 1033 292 -1326 664 420 -1101 315 772 -1140 151 1089 -1226 0 1188 -922 -511
5534 -511 1198 -859 -627 1031 -307 -1104 1089 -166 -997 1179 241 -1232 707 466 -1149 493
5550D93J40j737J539O86k107J010P90j784O73J549k059J37J881j663n78K142j384
5567b72o26J992r39j493K039k19j621J791k84j794J577Q74k055R32J166j934N17
5584c49J716k038J19J598j612N4K035j822n90K039r62j307K261o75j614J663L48
5601H64j913J358O68k120J123J272k273P86J524j991J61J503j450p8J611j287
5617b42q46K007o20j596J855m45j317J637J17j712J757L3j681J120J215k330P31
5634c17J406j678LJ471j423j16J993j680p39K301q68j392K098p66j497K052q5
5651G63j920J724L22j939J386N89j869P64J391j832J91J681j772m24K065j409
5667b89o72K142j113j170K138q91j419J761P2j744J364O75k250J488R90k132Q74
$$ plain form
5550 493 633 -1104 435 1121 -986 24 814 -970 -297 1252 -807 -670 1211 -452 -1030 1112 -272
5567 -272 -898 1094 155 -1338 701 482 -1139 652 368 -1426 151 1025 -1030 -98 1068 -866 -349
5584 -349 1367 -671 -552 1046 -566 -512 1523 -299 -889 1150 188 -1119 1142 467 -1147 516 864
5601 864 -1049 309 977 -1143 -20 1252 -1021 -235 1289 -702 -541 962 -488 -566 1045 -242
5617 -242 -1088 919 299 -1297 558 113 -1204 433 550 -1162 595 628 -1053 67 1282 -1048 -317
5634 -317 1089 -589 -586 885 -538 -654 1339 -341 -1080 1221 353 -1039 1059 293 -1204 848 763
5651 763 -1157 567 889 -1050 336 925 -944 -180 1211 -621 -430 1251 -521 -945 1120 -289
5667 -289 -961 1181 68 -1102 1036 145 -1274 487 559 -1185 179 854 -1396 92 1082 -1050 -176
5684a76J031j717M47J437j488O7J640j598n85K126j429q62J991q05j213J890k05
5701E51j756J476O34k042J519N58k044J210J183j970M46J330j883K69J633j327
5717b13m50J743j081j029J865o23j178J877n11j575J902l6j951J679M99j787N20
5734c49J304j882P51J195j868L36J422j380m57K171j557p99K077q93j206J969
5750H34o19j164J663P5j956J356R08k089J135O30j402M19J381k051M05J711j791
5767e55J28J447j198o33K118j017j627K198n23j410J719j46j540J637L35j878
5783i45J073P81j797O76J445k045L74J585j705j39J771j315q73J910o57j292J931
5800G78m13j554J644J54j999J665M13j518J158N16j727O99J180j837N00J503j657
$$ plain form
5684 -176 855 -862 -415 1022 -466 -399 1241 -357 -942 1184 -245 -1107 884 79 -1134 756 551
5701 551 -1205 271 905 -1137 382 940 -1104 106 1289 -681 -235 1095 -788 -519 1114 -213
5717 -213 -663 1080 -1 -1030 835 212 -966 911 400 -1175 727 691 -1260 419 918 -869 -349
5734 -349 955 -927 -176 1019 -849 -513 909 -471 -928 1243 -314 -1113 964 71 -1135 834
5750 834 215 -949 714 789 -1167 189 1097 -992 143 773 -629 -210 1171 -880 -475 1236 -555
5767 -555 -427 1020 -178 -811 1307 290 -1337 861 338 -1072 647 501 -1039 598 933 -945
5783 -945 128 909 -888 -212 1233 -812 -438 1147 -558 -697 1074 -241 -1114 796 139 -1153 778
5800 778 365 -1189 455 609 -1390 275 688 -830 328 844 -883 -184 996 -841 -341 1162 -495
5817d95j2J649j294p72J787p88j158K130m79j467J660r5j809J468M29j936J468
5834B86P78k079J166J092j993J22J630j461j41J856j642l93J678j264q59K172
5850I48n51j562J863l47j444J405N0j566J381O57j989R24J093j549L79J393j716
5867f31K12J394j328j16J452j247n90J700m95j134J536j80j639J318M87j900J392
5884B31L94j571J020R70j878O64J269j844K37J737j663j82J605j126o95J889r85
5901G2j128J787k44j358J644j98j707J186O58j738J148P39j632O89J036j684J60
5918e70J522j495L1J772j699l55J737o31j414J726j9j750J326J61j150J407K76
5935H75j822Q56J154j875Q48Q52j558K38J358r79m43J694j466l56J547r71q85
$$ plain form
5817 -495 -507 1142 -152 -924 863 75 -1083 1047 568 -899 761 666 -1143 325 754 -1182 286
5834 286 1064 -1015 151 1243 -750 -628 1002 -459 -600 1256 -386 -779 899 -365 -1224 948
5850 948 397 -1165 698 351 -1093 312 362 -1204 177 834 -1155 -231 862 -687 -308 1085 -631
5867 -631 -419 975 -353 -469 983 -264 -854 846 351 -783 753 573 -1066 252 739 -1161 231
5884 231 625 -946 74 1044 -834 -170 1099 -745 -508 1229 -434 -616 989 -137 -832 1057 72
5901 72 -1056 731 487 -871 773 575 -1132 54 712 -1026 122 861 -771 -82 954 -730 -570
5918 -570 952 -543 -512 1260 -439 -794 943 312 -1102 624 605 -1145 181 342 -808 599 875
5935 875 -947 -91 1063 -812 36 888 -670 -432 926 -53 -496 1198 -268 -624 923 -48 -933
5952i33J731n86j563J793K39j879J318L65j552J034R69j664N01J065j539K68J518
5969A085j660M5J438j114o75J812j075r79J926p17r34J499k54j426J280L24j683
5986a108J146P54j584P23J074j566K68J482j441k46J500j277n44J700q66j070
6002a055J829p13j049J569j34j495J507J65j528J003O99j712Q85R32j742N81J159
6019I01j621O6J692j285l41J567j042q74J816o25j407J835j75j370J336n0j333
6036i10J013N96j656N99J312j289J11J415j745j21J536j052k14J343j086p45J724
6053H31o17r63J388k07j330J423P0j501J055O18j612P06Q72j388M26J198j621
6070f52K44J240j184m00J777j314p47J859o25j200J752n32j268J550j68j527J232
$$ plain form
5952 -933 798 212 -1351 442 681 -1198 120 485 -1067 -33 936 -728 -227 838 -701 -433 1085
5969 1085 -575 -530 908 -206 -881 931 -144 -1123 803 86 -848 651 397 -1029 251 575 -1108
5986 -1108 38 792 -792 -69 1005 -561 -293 1189 -252 -498 1002 -275 -819 881 15 -1055
6002 -1055 774 61 -988 581 447 -1048 459 624 -904 99 798 -914 -29 903 -839 -258 901
6019 901 -720 -654 1038 -247 -588 979 -63 -937 879 254 -1153 682 507 -863 473 423 -910
6036 -910 103 699 -957 -358 954 -335 -224 1191 -554 -675 861 -191 -405 938 -148 -893 831
6053 831 214 -749 639 432 -898 525 595 -906 149 767 -845 -139 733 -655 -229 969 -652
6070 -652 -408 832 -352 -752 1025 -289 -1036 823 198 -1002 750 218 -1050 500 332 -1195 37
6087C7Q05j745R54Q76j658L94J344j811L97J513j507l25J744j101o77J578o17
6104B01j040J634k21j461J499K36j663J126M20j569Q23R85j911O65J296j801J10
6121f71J479j229k45J688j066p09J371m05j031J459k56j243J088J97j375J201
6137B53M17j639J065O43j535Q27R14j672K07J482j387q0J436j039m54J493p32
6154A99j168J672o32j211K182l00j822J482J09j147P53N38j170N45Q08j233P5
6171c20J255j392j34J292r14n06J304n87q59J509p75p31J095N6j096J118M09j733
6189a009J069M90j374O94R75j495L33J126j268l04J553j097m67J656q98q11J778
6206I51p03j146J656l69j276J292M28j589R03N22j451Q97O30j221J90J268j571
$$ plain form
6087 37 842 -903 51 927 -731 -337 1007 -804 -407 1106 -401 -726 1018 -83 -760 818 201
6104 201 -839 795 574 -887 612 848 -815 311 731 -838 -15 970 -941 -276 1020 -781 -671
6121 -671 808 -421 -666 1022 -44 -753 618 213 -818 641 385 -858 230 427 -948 253
6137 253 670 -969 96 739 -796 31 945 -727 -520 962 -425 -505 931 -108 -562 931 199
6154 199 -969 703 71 -1140 1042 742 -1080 402 511 -636 117 655 -515 30 838 -395 -320
6171 -320 935 -457 -591 701 -213 -719 585 -2 -861 648 -127 -858 237 293 -803 315 724 -1009
6189 -1009 60 550 -824 -130 845 -650 -317 809 -459 -763 790 -307 -774 882 -16 -827 951
6206 951 248 -898 758 389 -887 405 833 -756 147 669 -782 115 745 -476 -286 982 -589
6223e89L59J156j511OJ363r99m88J563p90r29J240J11j150J236j30j153R05L95
6241E95j532Q08Q84j441O38O94j367K51J407j142l64J316j024l76J325n99p33
6258f60J191j51j061J203J23j552J022O21j705J057O34j464N88R44j474J11J209
6275F36j077q8J611j216o21J456p05o58J205m56r27J398l4j221Q78L60j311Q13
6293D3O69j686O41J306j552K42R39j000k08J443j314k80J472p80p69J418m30j249
6311a095J464kj273J173K62j106M59Q49j577N07J262j185L44Q53j368k37J624
6328I54j345j04J346r15n99J205k42j277J461R0j361J271J82j336Q63N11j425
6345g21M75J084j479M08J345j617o3J512j256l60J316o06q22J306l15j180J389
$$ plain form
6223 -589 -230 926 -585 -579 784 -215 -703 860 70 -859 381 492 -658 578 448 -705 200 595
6241 595 -937 -129 755 -686 -48 646 -721 -470 937 -205 -569 747 -277 -653 672 73 -660
6258 -660 531 380 -681 522 645 -907 115 736 -969 88 722 -742 -154 790 -684 -573 636
6275 636 -441 -529 1082 -134 -755 701 -4 -662 543 87 -840 558 524 -697 181 541 -770 43
6293 43 712 -974 -333 973 -579 -337 602 -398 -606 837 -477 -757 715 -65 -834 584 154 -1095
6311 -1095 369 367 -906 267 529 -577 -118 731 -846 -339 923 -262 82 935 -433 -670 954
6328 954 -391 -495 851 -64 -663 542 300 -977 484 574 -787 484 666 -670 193 704 -721
6345 -721 -246 838 -641 -233 1112 -505 -568 944 -312 -672 644 38 -784 522 207 -973 416
6362D16k09j149J203K70j331J055M77j539P98O95j279M20J196j333M6J088r17
6379i3n13J337n46q70J174m77q55J388j03j298J126K16j264R30M35j300O70O27
6397E84j256L63J192j417L80J097j347k37J530j213m35J773r70o61J231l18j128
6414h32R61M66j461J128L46j199M43Q31j584N00J294j280n6J215j278K5J424j067
6432a24o13J203m05r02J439n06o53J006m7j213J237L43j417M77J090j533O50R30
6450I62j319L2J032j065j37J190p24l88J257n11r99J325m70r99J134O5q68O22
6468A39L80j109N47O62j339L11J322j370J34J114q96j81Q11p11l05J116o19o27
6486f21J064j98r55J055L7j179J071M19j476R64K85j416P29Q38j270O07R03j254
$$ plain form
6362 416 207 -942 261 531 -800 255 732 -807 -9 686 -593 -173 1023 -310 -264 824 -93
6379 -93 -606 731 185 -685 489 12 -843 545 442 -856 270 486 -778 152 587 -713 -43 584
6397 584 -672 -309 883 -534 -154 943 -404 -641 889 -324 -759 1014 44 -617 614 296 -832
6414 -832 129 595 -866 262 608 -591 -148 683 -901 -401 893 -387 -443 772 -506 -481 943 -124
6432 -124 -737 466 61 -841 598 92 -561 445 398 -815 422 765 -652 -175 915 -618 32 962
6450 962 -357 -325 707 -358 -495 695 -29 -417 840 329 -670 655 185 -814 320 385 -483 139
6468 139 519 -590 -43 619 -720 -409 913 -457 -323 791 -105 -286 525 -186 -491 625 6 -621
6486 -621 443 245 -710 345 382 -797 274 693 -783 181 466 -950 -221 617 -653 -46 857 -397
6504c97J02J311j168l79J233n67p31J089m73n34R55q7j197J163K64j191R18K76
6522E87j108M94O39j263N79Q25j065j32J125r39n04J136n49o15J509n96q17R43
6540B49N2j284J133K83j091P09L39j037O63P62j565L52J218j118LJ059q38k06
6558c17J053o83o90J234m08p37J006l2j241J044J79j055Q36L40j249P34P41j495
6576g40L97J122j151q1J103j007j82J345j063q9P83l16r21J186l06j053J409j98
6594B38r98R06M63j321R08L13j035K28P23r26J37J035q92NR31q75n20J471q88
6613i7n53J561p08j043J390l16p13P85L83j138O75N71j356L42P56q46L2J034q87
6632a28j62Q96o24n77J007l12o35J089l52j145J085K72j369J321Q5j080Q63K92
$$ plain form
6504 -397 -295 1016 -152 -531 702 135 -596 493 20 -514 441 354 -843 320 584 -607 311 587
6522 587 -521 -27 612 -651 -72 753 -312 -444 681 -258 -762 374 -175 -790 719 123 -694 249
6540 249 301 -983 150 433 -658 51 390 -647 16 778 -787 -435 783 -335 -332 727 -111 -317
6558 -317 736 53 -637 597 189 -548 458 426 -815 229 408 -647 189 529 -720 14 755 -740
6576 -740 -343 779 -372 -453 650 -357 -539 806 -257 -346 437 121 -800 386 80 -973 436 238
6594 238 -760 146 609 -712 196 509 -526 -298 425 -501 -364 671 -221 -216 715 -160 -680 791 -97
6613 -97 -650 911 203 -840 550 234 -479 306 689 -449 226 797 -559 -217 539 -307 -275 759 -128
6632 -128 -290 606 -18 -595 412 100 -535 554 202 -943 142 414 -955 366 451 -629 234 526
6650E26j150L67R67j196J96J162j367O0J059r31k27J038n16p84J494m87r20J292
6668E83l4j296J070J97j237Q19M96j280M84J050j028k4P99r17j78J123p33k41
6686c47R52o52o22J203n68p78J181l96n84R60kq21P08L23j117P57L09j218N74
6705a38Q33j020O3Q51r67l13J259o21o47J179m07q59J243l36o87R28O7j074R66
6724C20J30j028N78Q24j325L73P17q96kJ245j294j42J105o88l55R03k02q53J079
6743D89j72j006Q90L4p40O11K50p54M91L00r85M11O65q60K71R31j090k43J010
6762E03r86j15J300m78n69P10m46l81Q35k19o43Q81l2j312J079J87q67J75Q64
6781D86j124N32Q48r03J1O18p17l26J273o42n63J049k95r39J181l14p43P48N36
$$ plain form
6650 526 -624 -257 710 -486 -290 872 -495 -435 624 -307 -534 504 -12 -796 698 211 -709 583
6668 583 549 -747 323 520 -717 102 598 -682 -198 852 -176 -200 599 -318 -496 627 -106 -347
6686 -347 605 -47 -669 534 -34 -812 369 -27 -611 349 347 -474 234 557 -560 197 506 -712 -138
6705 -138 695 -325 -262 589 -378 -691 568 -53 -700 479 72 -787 456 120 -567 361 428 -646 320
6724 320 450 -578 0 824 -501 -128 589 -307 -309 936 -358 -500 605 -83 -438 465 263 -590 489
6743 489 317 -689 201 235 -505 106 356 -398 93 393 -592 -181 484 -376 -105 826 -264 -507 503
6762 503 -483 -598 702 224 -345 365 -81 -462 373 154 -489 392 360 -952 127 314 -553 -378 486
6781 486 -638 -106 742 -161 -150 468 -249 -575 698 56 -507 542 247 -692 489 175 -568 180 716
6800G16j203M03O22q99L22O71j186J57J105r32r0R62p69o41J266l69n33R21n22
6819An49R28k11r05Q32K56q94P25K26r44O46N83j112J94P83o58m4O57o32n27J171
6840E26m20n99J174m11r80J170k46n81O19L25j107P67L10j144N41O20j028J99
6858b65O72m76k26R48q57k99J011m51o01J151p88n43J154k59q35P41L53j120O76
6877a4M28r60M52Q06j269M13P39j047M2J008p14l59P08k58n33R77l66m59Q25j74
6897B45p47O55K52q91O54J19o70M16L29q01J56R49j067J96R31j011J18O87o31
6916a11o93J389m21p23Q02j40q32R09K63q17M97K71r15L01Q51j075M84L63q16
6935d13K62P00q99jO75l99n07J210n30o06O58J32n30N60J2q48Q48Q0q98M21M58
$$ plain form
6800 716 -487 -84 538 -361 -39 632 -554 -397 708 -224 -314 648 -121 -762 504 135 -398 523 1
6819 1 -548 380 169 -736 96 352 -542 183 409 -535 111 694 -418 -224 559 -99 -143 514 -118 -645 526
6840 526 106 -493 681 270 -710 460 214 -367 252 577 -530 237 547 -597 -56 564 -464 -265
6858 -265 407 -69 -295 653 -204 -503 508 57 -544 607 -181 -724 430 171 -664 77 430 -690 -14
6877 -14 414 -546 -94 712 -557 -144 595 -452 -410 598 -116 -475 233 -25 -558 419 53 -406 419 245
6897 245 -502 153 405 -486 168 287 -383 33 362 -439 -283 666 -401 -205 726 -285 -167 520 -111
6916 -111 -804 585 164 -559 243 103 -729 180 443 -374 123 394 -521 -220 631 -444 40 403 -413
6935 -413 -151 549 -350 -351 324 -75 -582 628 98 -508 150 282 -248 312 324 -524 324 404 -494 -73 385
6956C85q47O64K99p70J44O94p44j53J053q77p9P27m69n81R73j11q59J060k36r09
6976f36P38J17q45Q13L93r69L84N50r16q3Q90p09j11Q50n58n28J228n46m28P86
6996D20k32p11P88J86p38N60r8n05M99J20r09N75O52j147L69P58p77j72P74o10
7016a98j39Q99o44m23J043n35o27R65l09l78P40k45o54M55M61r45M75M85p35L2
7036b77Q29q46L7O76o84r0Q97n69p71J194n75l85J015l92o32P29L27o44L13L58
7056E10q96M60O37q15o4Q65r15l8P32p81n9R13o53m20J131m54o59R53k90q42Q52
7077A67L61j104O19O11j347O45M28p81L40K95l45rN97p26k17R25p64j96Q34k76
7097E7o50J120k57o58O75m9p64Q04J44r19N28M19r61N46N56r55J05P58p38j03
$$ plain form
6956 385 -462 202 501 -269 -125 569 -175 -328 725 -152 -231 496 27 -554 419 308 -551 509 273 -636
6976 -636 102 219 -626 187 580 -389 -5 545 -371 -454 436 -273 -384 466 -92 -620 608 62 -366 420
6996 420 188 -523 265 451 -287 273 175 -330 169 289 -620 -45 607 -540 -171 587 -190 -362 412 -198
7016 -198 -337 562 -82 -505 538 3 -624 341 32 -346 394 149 -505 -50 411 -534 -59 426 -309 -277
7036 -277 552 -294 -257 419 -265 -355 542 -27 -798 396 -179 -564 451 59 -573 156 483 -161 152 510
7056 510 -386 74 711 -104 -168 697 -218 -256 476 -305 -364 549 -104 -524 607 153 -506 447 157 -685 167
7077 167 528 -576 43 654 -693 -48 380 -401 -61 234 -111 -120 477 -249 -466 459 -305 -501 333 57
7097 57 -593 527 270 -388 287 238 -526 278 422 -497 31 450 -511 35 591 -364 -259 499 -239 -342
7117c42O75m61m70J110n31l41P11k44n54N83N56j202P01K88q75N67M86j103M38
7136hK38p44O11L09o58k04R61o75l80J077n18n04O55j39m80N35J72q43Q15J19
7156C39p77M42L29p80L65M47r28M97O77r09k12J094o29m58R11l32o32R92k08n20
7176b92Q17k31r45J017l8p23Q49p2q18K24P78j174N60O20p72j48R38q26l20R75
7196D19m95l22P71l52n53Q64q4q02P87J07q46M95L38r05L73O20r28M61O84q77
7216b45J00N94o66k07P92m07l49J047n88m23P50j66o23Q80p9j011Q75L0n97L38
7236D5M46o91O2M75m76k77P89m18o5O83o31m06Q31k75m57Q54n40m99Q28M8p54
7257d28N17j14n24M96M19o94K59N36q45mQ58p82k20J064o54m39J141m14p67J072
$$ plain form
7117 -342 333 -128 -598 512 -19 -360 351 107 -447 136 692 -510 191 479 -396 171 657 -446 -8
7136 -8 230 -514 97 406 -252 -456 505 -170 -550 527 9 -495 160 21 -459 76 248 -595 220 339
7156 339 -438 4 333 -447 -82 365 -563 -66 611 -298 -510 584 -45 -503 408 76 -556 436 228 -292
7176 -292 525 294 -651 366 328 -395 454 382 -436 -212 566 -608 -48 572 -200 -348 590 -236 -556 419
7196 419 -76 -398 373 21 -532 332 248 -554 233 340 -506 -11 327 -578 -205 415 -513 -52 632 -245
7216 -245 -145 449 -217 -424 368 -39 -388 659 71 -352 398 232 -391 489 410 -601 274 304 -293 45
7236 45 491 -200 -138 337 -139 -416 373 -45 -110 573 -58 -464 367 92 -365 489 -51 -550 278 326 -428
7257 -428 89 -25 -549 -53 366 -328 -69 467 -378 -382 476 -306 -526 538 -116 -555 586 172 -595 477
7277D77k67o17O33O6o31M92K55p70L85M70r10N40M92q63L6L21l45J4Q41o69q4
7298a34N67n64l44R67m95n64J044k53n86N20L85j065N38M23r24N05L69p90L36
7317f5L80p50j5P50n52m5P39l49m46P24j62p81Q87j97q08R54pp27M57M22r54O07
7339F2L33p44j32Q10n58j89R58q58n0R54n60l06O50j92q20J021l3o88O43L4o50
7360c15N07J63q19K99N50p42K07M78n56L5P84p77j22O45k98m86R42l18o43P88
7380C22j54o94O71J04q28P14J99o39J21P40r09K2P66p86J17P87o62rM86m43l08
7401c83P86j81q75R93k66p97J006K7o63O86m7q61O47K54q08K78O53n20l03P14
7421C40o41o3N50l12k01O73k57m57O28j27p20Q87j03n22K41K61o79M82L00n60
$$ plain form
7277 477 210 -407 226 292 -339 153 408 -362 23 493 -417 123 615 -248 -212 109 -236 -222 619 -50 -134
7298 -134 433 -131 -475 492 -3 -567 477 224 -362 158 543 -522 16 439 -485 20 389 -401 -65
7317 -65 315 -435 -450 300 -252 -297 442 93 -353 371 209 -572 315 118 -690 264 257 -470 -13 409 -545 62
7339 62 395 -349 -481 329 -229 -418 540 -318 -368 586 26 -280 370 178 -642 379 346 -342 301 335 -315
7360 -315 192 355 -464 -165 385 -357 -150 328 -228 -193 591 -186 -308 337 39 -447 495 177 -466 322
7380 322 168 -526 145 249 -579 135 334 -305 -184 556 -353 -331 435 -351 -234 553 -109 -118 368 -75 -383
7401 -383 403 222 -653 340 74 -723 283 310 -353 333 286 -575 72 326 -482 -204 449 -71 -374 340
7421 340 -301 -364 186 -126 -327 346 89 -368 260 133 -587 300 197 -325 -84 177 -502 -20 280 -280
7441b80J73O47r51j6P89p12K15M77m65n10J187l66o04N79r4l39O66j54o77N10
7461G5L19q27N98K55p04L30L83q19L36L63n56mQ74o21o02J046k91m39N87l23m65
7482d85O29j04m47M32J65p18Q04O8p65L92N53o78K68K85o79n0O09l18k52P52l77
7503H4k55O31k73m90N51k6q84O65K62n83M22K92o14K84L80q05K86N47o21P5M78
7524D06l50n07Q63n54k99Q24m44m58R45l82n42N46J36o02N39J60o58M59K01m06
7544a23n9N26n69k15O87l66k9O05l42m95P15j33m49L51M4q10Q98j35l66M40L17
7565D92r93M73L45p10L76L76p29K39N43n01j70O60n33j25N56l41k65O60l15m11
7585c73M64L44r55N92K7n81O43K08r08M81N23r67J20P38n28o5N54n15k54P93l47
$$ plain form
7441 -280 -107 540 -411 -427 362 -350 -135 342 -123 -633 554 188 -416 163 69 -270 396 242 -435 75
7461 75 394 -433 165 420 -284 46 429 -390 -54 309 -247 -251 623 2 -600 446 155 -284 303 -20 -485
7482 -485 144 40 -407 25 190 -528 276 344 -421 -29 524 -154 114 399 -280 -330 279 -39 -291 461 84
7503 84 -171 460 187 -303 248 222 -662 3 265 -318 104 396 -218 66 446 -359 -73 474 -147 -72 406
7524 406 56 -451 412 -142 -441 383 -61 -519 426 44 -498 48 184 -418 121 281 -377 82 283 -123
7544 -123 -182 344 -225 -440 247 -119 -148 457 115 -380 335 202 -247 104 148 -662 236 101 -265 175 492
7565 492 -501 -28 317 -393 -17 359 -370 -131 412 -89 -259 401 -132 -257 299 -42 -307 353 38 -373
7585 -373 91 435 -520 72 99 -482 161 369 -539 -58 465 -502 -382 356 -172 -237 317 -198 -452 341 -6
7606fn30J018k95n53M89p8l80O09N9o10M02J47m84J26M71p82l3Q28o82L3P80q95
7628c66K30N20k67m66Q33m48l87M39J95o68P21j60o30M26M08n21J94K97n42kO15
7649D21n38N4N40p05m28R96m11n19R23l44l41P15j44p01N07J11o37L50N59n56
7669a48M7M12o81L41L58m32k38O37j93l14O77l42n36P67k17m07N60j09m57L37
7689F2pj73K99J23o07L16N55q21L05L42n95N1N20m99kO39o63j20N13m04JM60j00
7712A95n13O28O8q87M19M38o91N28K23o08j12N47l68J29K38n41J20O80m28l88
7732c23O79j25n42Q31l45o67P32j73o89O63K30n77M54K88q22J15N32n95p2O77
7752B71k26l33Q05n61l49N81k47j13N45m00l77N72K40o55L71K7l88L39J54p41
$$ plain form
7606 -6 -536 482 187 -366 123 45 -335 274 333 -277 125 272 -212 -86 385 -397 -430 398 -284 -251 529 -366
7628 -366 -136 384 117 -349 484 36 -351 88 283 -385 336 176 -454 -28 380 -141 53 350 -192 -194 421
7649 421 -117 -63 477 -228 -656 340 -71 -590 333 -11 -352 363 219 -482 25 136 -501 -151 408 -148
7669 -148 -101 311 -370 -29 329 -103 -341 296 103 -211 466 124 -412 355 138 -269 291 182 -275 62
7689 62 55 -118 181 304 -303 13 568 -253 52 394 -201 -150 370 -129 -131 508 -155 -275 238 -166 -165 295 195
7712 195 -318 310 378 -509 -90 348 -343 185 408 -200 -312 235 -133 -4 234 -307 -187 493 65 -323
7732 -323 356 231 -311 520 175 -492 240 67 -622 41 271 -306 148 436 -386 -271 261 -334 -406 271
7752 271 45 -288 517 -44 -393 188 -59 -172 373 -27 -404 168 408 -247 124 151 -237 102 256 -485
7772d85L42L29p14M23M42l68j36N52l32l73O06j58n66P60j05k41P6N2m25L04J84
7793A67m27K49O26r77K96O59o42j22M75l38k34O34n29j38P66m29o12Q20On61O63
7814C52k90l93K87K47n66L89N23q53J94K02l65K51Q1j51K5O38q49n4N76o48O0
7835c44N94j63m58N37O8p18N01J36n67L57J79l91K85K40o00L14J05l5m7L39m99
7856a67PO21l70m17P10l08l77N52q9n10L86K09l66L65j18m66K51L68o30N2O44
7877C47n26J01L83l16k17O11k19n20M29l3l18O93k71n48M14J23p22N91K18n39
7897c19J33N18n65K96L81n31J57P1m07O2N65o73n5M26Q4l08M81l44j90L18J83
7918B83p39N44J97n25J48K54k54j27M66m71R7N99o82l9N54m42k17P03l10o07N96
$$ plain form
7772 -485 -143 186 -528 -105 337 -31 -167 385 53 -320 286 128 -438 322 217 -24 52 104 -321 -17 167
7793 167 -260 -11 615 -362 -66 593 -49 -171 304 -34 -268 366 -163 -301 465 36 -576 244 250 -311 352
7814 352 62 -331 -44 203 -363 26 549 -304 -110 92 -273 -22 59 -92 -67 571 -278 -332 244 -404 -344
7835 -344 250 87 -371 166 234 -484 17 153 -414 -57 122 -269 16 256 -344 -30 75 40 -7 332 -167
7856 -167 -160 461 91 -326 384 76 -301 251 162 -348 38 247 -119 246 128 -338 -87 281 -349 -297 347
7877 347 -179 -78 305 -11 -228 383 164 -356 73 40 -278 415 144 -404 10 133 -589 2 220 -319
7897 -319 -186 332 -233 63 444 -87 70 141 -266 -204 361 -312 -367 59 143 -165 316 -28 -218 100 283
7918 283 -456 88 285 -240 -92 162 -92 -219 247 -224 -127 472 -210 -249 305 -137 -354 349 39 -568 28
7939B8O6m45O25j97n44P39J24o88N15j75m60M71K72m62r5N67m20LN52n07k04M51
7961B16k02k11M35k21l59N88j92l95N67q6l13J02K44n67M87M70r39K51M93o18
7981b50P8O56q11J1O37m83k03M87k51k31O62j79m59L32J27m93K33J18k26L45J97
8002B97l94M9N02o81J3N90n66M1L92m72M7M54k25j27M24l63m12O37J52p86O51
8023B23P9n71J51K98l63O4P15q02j27M26k52l4P54o47j54L54j88k32N10P0p73
8044d99P06Jl50J18K44l87L42L1n51L15L82o99L25N00m50k40O42o51L32L44l84
8065G1l19M05J15n67N85j52q13P01M4l35L94J32l61RK44l84K37J96k69j94N50
8086B89l10l71O53l02k39M11p5o00M91M18p78M90K85n65P3L66l81K81J21k16k35
$$ plain form
7939 28 94 -351 274 77 -467 272 396 -292 223 48 -412 59 331 -131 -226 341 -79 -76 476 -31 -235 216
7961 216 14 -197 238 17 -342 246 54 -341 226 140 -173 -71 173 -394 93 563 -376 -125 368 -250
7981 -250 -172 484 -327 -316 321 -162 -365 122 -129 -360 302 123 -336 -4 123 -370 -137 -19 -245 100 297
8002 297 -97 -48 454 -227 -214 376 -190 -149 243 -229 -182 272 47 -80 344 -19 -431 206 358 -428 223
8023 223 302 -269 -118 180 -183 -119 596 -206 -333 93 -159 -193 561 -86 -240 114 -74 -306 204 274 -499
8044 -499 207 208 -142 -24 220 -167 175 206 -345 -30 352 -347 -22 478 28 -212 430 -221 111 455 71
8065 71 -248 157 272 -295 290 138 -675 26 70 -265 129 261 -100 -91 153 -231 6 202 -67 -261 289
8086 289 -21 -392 261 -41 -280 131 56 -544 -53 365 -413 77 362 -203 -130 236 -145 136 257 41 -194
8107a94O56n62j29O52l73m24M62L9l21L93p5l48K91J42m35K29J98l45K54J46n05
8128b49M47j6j58j0L09m82L04J74m11o2N52l21o31Q34j68m75N97j78l38O75j31
8149B62q86P94Q2o37M22J99m60J95M02m92j8M55m53J83L80o62J99J33j41l33O24
8170B48k02n65P78j4n07J41M66p61M05K30k40j58J60l42M38J82k92j69N04m88
8190a86k29
$$ plain form
8107 -194 462 -100 -229 423 50 -374 88 127 -194 199 124 -224 67 209 -226 3 201 -144 110 256 -249
8128 -249 198 182 24 14 323 -159 145 319 -92 -154 398 77 -554 280 112 -363 234 56 -282 393 262
8149 262 -624 170 252 -385 37 236 -224 -29 373 -119 -137 318 -135 48 428 -234 -35 98 -43 -376 248
8170 248 46 -519 259 245 -262 -121 345 -416 -11 219 -21 -179 -19 -361 77 259 -33 -202 302 -186
8190 -186 -415
8191d15
$$ Imaginary data points
##PAGE= N=2
##DATA TABLE= (X++(I..I)), XYDATA
0@%%%%%%%%%Qj6J6j6J6j9K7l2L6m4N2o1P3q3R3j08J24j42J63j85K07k33K64k96
33a56L31l69M09m55N06n61O23o89P62q44R35j036J149j277J422j590J785k014
51a069K288k627L056l615M378n492P269j0554J8576p2097j06204J38436N0789
64B3134j0392j0200o8643j5922J10356m866p5851K4857N531l4643O1567N740p4660
77f3992M3361O2779n2196j2071J2713k4693P4963O9322j17724p6608P4694L4046
89B4594P667J8490p2265k4395J01481N843o9709J4935j4604l5075P4714K2148
101E3824q3814R160M0323k9116J7960M057p0936L8759Q5373n9077m7646M5029
113C896q102k105L2728n5377j9737R3221l605o7675K6564j006l1100O5620J8391
$$ plain form
0 0 0 0 0 0 0 0 0 0 0 8 -8 8 -8 8 -11 16 -16 20 -24 28 -33 40 -43 50 -58 66 -76 87 -98 109 -124 140 -156
33 -156 175 -194 215 -240 266 -295 328 -361 401 -443 492 -544 605 -672 750 -840 945 -1069
51 -1069 1219 -1408 1648 -1967 2411 -3081 4188 -6366 12210 -59887 -166091 -27655 23134
64 23134 12742 2542 -66101 -82023 28333 23467 -52384 -27527 -21996 -56639 4928 10668 -63992
77 -63992 -20631 42148 -10048 -22119 -9406 -34099 40864 110186 -7538 -84146 -9452 24594
89 24594 32261 50751 -21514 -45909 55572 61415 -8294 6641 -7963 -43038 31676 53824
101 53824 -29990 -20830 19493 -9623 8337 12394 -58542 -19783 65590 6513 -41133 3896
113 3896 -4206 -6311 26417 -28960 -48697 44524 40919 -26756 -192 -1198 -32298 33322 51713
126E1713p4251J0976K7992l0012L5407J6184q1633J1313P3548l2523j3736M2923
138C7901l4878j5940L9751m3322k0670P9684r160n8514L4612J183l0101N9643
150D0189J3379o5868J5226K0287l3114M2336K2897q1098M191O7922k7607j0971
162G769L2644l6921k832M8351n0779l8634O4616j21l9416L0110j8234m0002N8368
175A4919J7424n6058J6525R551m2835M0759L0582p0445n91N5107k4599k624K8152
188A5867m1469N221O4660l7187m6147M3127l65j1030N0146k7838o4002M7219L4207
201C2409k7592K2722r582n6905M6204M7448o2029j5526L2367k2528J5777K9486
213C2251n9780o672P0784k2234m2896K3910j7870n411O6205k3021p2421L0912
$$ plain form
126 51713 -22538 -11562 16430 -13582 21825 38009 -43624 -32311 41237 8714 -5022 37901
138 37901 3023 -12917 26834 -16488 -37158 42526 33366 -25148 9464 10647 -19454 40189
150 40189 53568 -12300 2926 23213 -9901 32435 55332 -25766 -21575 46347 18740 7769
162 7769 40413 3492 660 49011 -1768 -40402 24214 24093 -15323 14787 -3447 -43449 14919
175 14919 32343 -23715 -7190 2361 -40474 285 30867 -39578 -40169 14938 -9661 -12285 15867
188 15867 -25602 -20381 44279 7092 -39055 4072 3707 -7323 42823 14985 -49017 -1798 32409
201 32409 4817 27539 17957 -38948 7256 54704 -7325 -22851 9516 -13012 2765 32251
213 32251 -27529 -34201 36583 14349 -28547 -4637 -22507 -27918 38287 15266 -57155 -26243
225b6243K7429j6108L4746j2527o3518M3248N4051m6289j3127J3807l2092L1846
237d777M8054n9254k4227N7635o617j5820K5179m0344k0117P1477J4n6336J7480
250g653N146j6870M5593o736o6665L4062N2430l3341o520L232m1221L3554N5643
263E0654n5099l3847M3153j597L604L1589m9222l3804O3261Q595l7755K0862p845
276B549k7055M6379K128o0725K5418L9353k9795P313Q555m6866K3316N2314m5972
289c088l0066L0029j1342J2463M4852m6696m3078N1845R847k6300K3705j5904
301c733l1158N2594J2504n8282J4003K7263k4330K1186J2411n1448J8904N2971
313D2885l7166k3859K1988k2476J1976N1835l9574m0782M5878N757k3013K3446
$$ plain form
225 -26243 1186 -14922 19824 7297 -56221 -12973 41078 -5211 -18338 -4531 -36623 -4777
237 -4777 43277 -15977 -40204 17431 10814 -5006 20173 -20171 -40288 31189 31203 -25133 -7653
250 -7653 -2507 -19377 26216 19480 -47185 -13123 39307 5966 -554 2678 -38543 -4989 50654
263 50654 -4445 -38292 4861 3264 6868 38457 -10765 -44569 18692 27287 -10468 10394 2549
276 2549 -24506 21873 24001 -36724 -11306 28047 -1748 5565 14120 -32746 -9430 42884 -3088
289 -3088 -33154 -3125 -14467 -2004 42848 -3848 -46926 4919 14766 -11534 12171 -3733
301 -3733 -34891 17703 30207 -28075 -14072 13191 -11139 10047 22458 -28990 -10086 42885
313 42885 5719 -18140 3848 -18628 -6652 45183 5609 -35173 10705 16462 -6551 16895
325A6895k0917l2703N3838J7313n0917Q526J3415k6479K9294J7667n4857R419
337a9506M7924k4167r402J6905l7970K623N5280k6726l5324L5516J070j3561L0030
350B2692k5617m0672M9393K3571l8227Q701K471k9762L7323K2809n7046j069M1866
363A6433j3855M937J7161m6641m110N3599j9945l0250K9432o198p415L9424k3792
376H780m6392L9158K0346k9080J6299j008l5831L6017K8485n0631o255K7713j6427
389h826J6656K5795m9240j1766M9414j4596k3333K2995j8358q041N0408j4365
401A6743m8785K7062J3824k1217K4577m252m2818L3789L3899m0895o804J6199
413A322k2098K1998L2310m7180j4725M5325r955j6064K0965k6324j2036N2384
$$ plain form
325 16895 -4022 -36725 17113 34426 -16491 -7965 5450 -21029 8265 25932 -28925 -19506
337 -19506 28418 4251 -5151 11754 -26216 -23593 31687 4961 -30363 5153 6223 -7338 22692
350 22692 -2925 -43597 5796 29367 -8860 -159 2312 -27450 9873 32682 -24364 -25433 16433
363 16433 2578 7515 24676 -21965 -26075 27524 7579 -22671 6761 563 -6852 32572 8780
376 8780 -37612 1546 21892 -7188 9111 8103 -27728 8289 36774 -13857 -20112 7601 -8826
389 -8826 7830 33625 -15615 -27381 22033 7437 -15896 7099 -11259 -19300 31108 16743
401 16743 -32042 -4980 8844 -12373 12204 7952 -34866 -1077 32822 -8073 -14877 1322
413 1322 -20776 1222 33532 -13648 -28373 16952 6997 -9067 11898 -14426 -26462 25922
425B5922n687m1778K0324N016j8419L2122k112m6182K5712L1865l0316P62R826
438G055l1695K0366L8322l9724j7700L4623r921m937K4568l2169k0400M9574J403
451A9365l2494J6485n919j8636M0163K913m8855J7778K7747k2522R423O591l9504
464b7465J8033M2039l2507j6290K6063j4966J569L1337l2677k5267M4436K944
476A7249k3986J8938j2958k4757M2537R494m4207J1941J9750j9516J9043P803
488B1331m5766J1165M1757k3320j0356J9517k3198L219L8929k9422k9846L5298
500I308L830j3820K2830j9115l0848M1119J4362l8543P037J1776j6618K6580R974
513B7872n0218M164L8347j7064m780J5687k8238L001M2284k4531l1780K5936L99
$$ plain form
425 25922 20235 -21543 -1219 3797 -14622 17500 15388 -30794 -5082 26783 -3533 -2771 7055
438 7055 -24640 -4274 34048 -5676 -23376 11247 1326 -3611 20957 -11212 -31612 17962 19365
451 19365 -13129 3356 -2563 -21199 18964 21877 -26978 -9200 18547 -3975 5448 12039 -27465
464 -27465 -9432 32607 100 -16190 9873 -5093 -3524 27813 -4864 -30131 14305 17249
476 17249 -6737 12201 -757 -25514 17023 26517 -17690 -5749 14001 -5515 13528 21331
488 21331 -24435 -13270 28487 5167 -5189 14328 -8870 -5651 33278 3856 -25990 9308
500 9308 13138 -682 22148 3033 -27815 13304 27666 -10877 -3840 7936 -8682 17898 27872
513 27872 -22346 -18182 20165 3101 -1679 14008 -14230 -11229 31055 6524 -25256 680 1079
526A079o311K9061j9853l5193L6583J7184l2654O440L194j9081L3763J7131m8963
539a7620k678L1971j4051K852J5219l4702J285M5965j6778k8719J6325r152k311
552a2394L8662j8018m0310L1089J8450k3940P892o163k5911L6703K4984m3843
564a2799n824K4023j4575R508J7093l8417l529M4660j0005j9677J4370j9066o446
577b0684M3880j0923l9339K2728J4558j5512J6022r291l4544L0586K7615l3506
589h410k758J6181j9248J2351K2424l6249r473L5391q542q766J9152k3587j4285
602b5819M1371k683l2587J6687N975j2002K4796m778l7332K3277K5117k7090L184
615a884J4576k3537J1381K5091l0028q318K7530j4471n775K6397k1273j8684L3923
$$ plain form
526 1079 -5232 23829 3976 -31217 5366 22550 -10104 -3664 -470 -19551 14212 31343 -17620
539 -17620 -20298 11673 -2378 474 15693 -19009 -17724 28241 11463 -17256 -931 -10083 -12394
552 -12394 26268 8250 -32060 -971 17479 -6461 1431 -4732 -30643 6060 31044 -12799
564 -12799 -18623 5400 -9175 333 17426 -20991 -24520 20140 10135 -9542 4828 -14238 -20684
577 -20684 23196 12273 -27066 -4338 10220 -5292 10730 1439 -33105 -2519 25096 -8410
589 -8410 -11168 5013 -14235 -1884 20540 -15709 -25182 10209 1667 -7099 12053 -11534 -25819
602 -25819 15552 12869 -19718 -3031 2944 -9058 15738 10960 -26372 -3095 22022 -5068 -1884
615 -1884 12692 -10845 536 25627 -4401 -12719 14811 340 -5435 20962 -311 -18995 14928
628A4928k242k4844J6849k648j7314K7633M60l6462J8551J9425k5990P483J4193
641A0022k6619Q594K4444k5685m030K5029j9731n278L0159j7942j8853L0015k044
654H081j8625K0377p063k0248L0612M072l4777J5740J7856k2408R958J1518k8266
667a3173Q419K3679k5088k367K3102k0990m917L0503j7580k1311K4722k618j2511
680a0130K1802j2151k3932L1661R668l2630Q901J1814j7394J6794J1097l2567
692a7067N243K5411j9216o48J8368k4605k595L5939j3377k3792J6347m252m488
705h732K7809j6177l1403L0537J7450k4724L969Q70j8896K5523J6743l5427l65
718a2823K3317j3761N353J6379l0785n988L8548n203j9126R973j3290j518L7190
$$ plain form
628 14928 12686 -12158 4691 2043 -15271 12362 12822 -23640 -5089 14336 -11654 -4171 10022
641 10022 -16597 -8003 16441 -9244 -13274 11755 -7976 -13254 16905 -1037 -19890 10125 8081
654 8081 -10544 9833 2770 -17478 13134 17206 -17571 -1831 16025 -6383 3575 15093 -13173
667 -13173 -4754 18925 -6163 -8530 14572 -6418 -11335 19168 1588 -19723 4999 2381 -10130
680 -10130 11672 -479 -24411 7250 16918 -15712 -6811 5003 -12391 4403 15500 -17067
692 -17067 -11824 13587 -5629 -6277 12091 -12514 -15109 20830 7453 -16339 8 -4244 -8732
705 -8732 19077 2900 -28503 2034 19484 -5240 -1271 -401 -19297 6226 22969 -12458 -12823
718 -12823 10494 -3267 2086 18465 -12320 -18308 20240 15037 -4089 5884 -7406 -8924 28266
731B8266j3096l8020K1850J8432j3588R118p720k7477K6281K3761l1772m798J5292
744F529j4949J1947K0276l4139j3359L3227j576r058J0251k2678p092M1303m151
757A6531l6671J2361J1811p479J8746o431l2267K1762K5073k3700j768J0398j8592
770a0226J3220K5115k8711j3698K5215m503l032J6309k3534j4522L6951J026k9407
783i797R640K455j0444K2623k310l3039J6423K1118k1865K370R009k2719J0259
796f277K4526k4564j0099K2004j0106k726K0931k0511j5636L2544K81k2579J2427
809B15j213j2257K4696r29l1906J6291J9763k0142N183R563k3854R202K3616k3490
823e262p626K0820j2411k255K2477j9325j5753K8815q19j9739J4320m083j3634
$$ plain form
731 28266 15170 -22850 -1000 17432 3844 12962 5242 -22235 4046 27807 -3965 -8763 6529
744 6529 -8420 3527 23803 -10336 -23695 9532 7956 -1102 9149 -13529 -20621 20682 16531
757 16531 -20140 -7779 4032 -3447 15299 8868 -23399 -1637 23436 -264 -2032 8366 -10226
770 -10226 2994 28109 -602 -14300 10915 6412 3380 19689 -3845 -18367 18584 19610 -9797
783 -9797 -157 2298 -8146 14477 12167 -20872 -4449 16669 -5196 -2826 6183 -16536 -6277
796 -6277 18249 -6315 -16414 5590 -4516 -7242 13689 -6822 -22458 10086 10367 -12212 215
809 215 -998 -13255 11441 10512 -21394 -5103 14660 -5482 -299 9264 -14590 -5388 18228 -5262
823 -5262 -12888 7932 -4479 -6734 15743 -3582 -19335 9480 8661 -11078 3242 -841 -14475
836a4475K5963Q61l2187J2681J7805j6232Q070P492k5637Q758K4470k0669o977
849a0077J6460j4557J90K5710j7754j8185K3870l28j3990J5147q282j7207K7373
862H370O280k8924P798J1332j4689J3847Q367k8699N713K4721j5468l270J3524
875H902j9561QL0053j3831j9398J8071k893p728K1092j0578k2753K4693J0601
888A6678k1529P533L346j9205J7549J3710k8685J908K0238j3538K364J4750k4373
901i254m751K9572r962j6181J4026q954o191K7662q645k7027J9182R923j5154
914e754J2203j303k5195J7514J8346k3508M50J4945j5468P182J8688k4426q175
$$ plain form
836 -14475 11488 12349 -19838 -7157 10648 -5584 2486 9978 -15659 -6901 17569 -3100 -10077
849 -10077 6383 -8174 -7984 17726 -28 -18213 5657 5329 -8661 6486 -1796 -19003 8370
862 8370 14650 -14274 -6476 4856 -9833 4014 12381 -16318 -10605 14116 -1352 -4622 8902
875 8902 -10659 -10651 19402 5571 -13827 4244 1351 -6377 14715 4137 -18616 6077 16678
888 16678 -4851 2682 6028 -13177 4372 18082 -10603 -8695 11543 -1995 369 15119 -9254
901 -9254 -14005 15567 5605 -10576 3450 -5504 -11695 15967 7322 -19705 -523 9400 -5754
914 -5754 6449 5146 -20049 -2535 15811 -7697 -7247 7698 -7770 -588 18100 -6326 -14501
$$ [...]
8191B36
##END NTUPLES=NMR FID
##END=
