##TITLE=1H_Pr 4922-J
 CDCl3+DMSO, 8 sc, 
 28.6.2019
##JCAMPDX= 6.0         $$ Bruker NMR JCAMP-DX V2.0
##DATA TYPE= NMR FID
##DATA CLASS= NTUPLES
##ORIGIN= UXNMR, Bruker Analytische Messtechnik GmbH
##OWNER= root
$$ XWIN-NMR		Version 3.5
$$ Fri Jun 28 14:54:27 2019 Russian Standard Time (UT+4h)  she@DPX200
##.OBSERVE FREQUENCY= 200.13155
##.OBSERVE NUCLEUS= ^1H
##.DELAY= (6, 6)
##.ACQUISITION MODE= SIMULTANEOUS
##.ACQUISITION SCHEME= undefined
##.AVERAGES= 8
##.DIGITISER RES= 18
##SPECTROMETER/DATA SYSTEM= spect
##.PULSE SEQUENCE= zg30
##.SOLVENT NAME= DMSO
##.SHIFT REFERENCE= (INTERNAL, DMSO, 0, 15.7039)
##AUDIT TRAIL= $$ (NUMBER, WHEN, WHO, WHERE, WHAT)
$$ ##TITLE= Audit trail, XWIN-NMR		Version 3.5
$$ ##JCAMPDX= 5.01
$$ ##ORIGIN= Bruker BioSpin GmbH
$$ ##OWNER= she
$$ F:/spectra/data/she/nmr/H-F/1/audita.txt
$$ ##AUDIT TRAIL=  $$ (NUMBER, WHEN, WHO, WHERE, WHAT)
(   1,<2019-06-28 14:53:29.21 +0400>,<she>,<DPX200>,
      <created by zg, POWCHK disabled, PULCHK disabled
       configuration hash MD5:
       00 E9 B6 7A A2 85 ED C7 34 08 36 98 17 FE 4E 26
       data hash MD5: 16K
       C4 17 02 D3 93 A4 B8 05 E7 B8 E8 DA 28 1D 95 A6>)
$$ ##END=
$$ 
$$ hash MD5
$$ C9 40 3D 3A C8 93 3F BF FF 1B D9 85 6D 24 D5 33
##$RELAX= 
##$RELAX= 
##$RELAX= 
##$RELAX= 
##$RELAX= 
##$RELAX= 
$$ Bruker specific parameters
$$ --------------------------
##$DU= <F:/spectra>
##$EXPNO= 1
##$NAME= <H-F>
##$PROCNO= 1
##$TYPE= <nmr>
##$USER= <she>
##$AMP= (0..31)
100 100 100 100 100 100 100 100 100 100 100 100 100 100 100 100 100 100 
100 100 100 100 100 100 100 100 100 100 100 100 100 100 
##$AQSEQ= 0
##$AQ_mod= 1
##$AUNM= <au_zg>
##$AUTOPOS= <>
##$BF1= 200.13
##$BF2= 200.13
##$BF3= 200.13
##$BF4= 200.13
##$BF5= 200.13
##$BF6= 200.13
##$BF7= 200.13
##$BF8= 200.13
##$BYTORDA= 1
##$CFDGTYP= 0
##$CFRGTYP= 5
##$CHEMSTR= <none>
##$CNST= (0..31)
1 1 145 1 1 1 1 1 1 1 1 1 1 1 1 1 1 1 1 1 1 1 1 1 1 1 1 1 1 1 1 1 
##$CPDPRG= <>
##$CPDPRG1= <>
##$CPDPRG2= <>
##$CPDPRG3= <>
##$CPDPRG4= <mlev>
##$CPDPRG5= <mlev>
##$CPDPRG6= <mlev>
##$CPDPRG7= <mlev>
##$CPDPRG8= <mlev>
##$CPDPRGB= <>
##$CPDPRGT= <>
##$D= (0..31)
0 1.2 0 0 0 0 0 0 0 0 0 0.03 0 0 0 0 0 0 0 0 0 0 0 0 0 0 0 0 0 0 0 0 
##$DATE= 1561719208
##$DBL= (0..7)
120 120 120 120 120 120 120 120 
##$DBP= (0..7)
150 150 150 150 150 150 150 150 
##$DBP07= 0
##$DBPNAM0= <>
##$DBPNAM1= <>
##$DBPNAM2= <>
##$DBPNAM3= <>
##$DBPNAM4= <>
##$DBPNAM5= <>
##$DBPNAM6= <>
##$DBPNAM7= <>
##$DBPOAL= (0..7)
0.5 0.5 0.5 0.5 0.5 0.5 0.5 0.5 
##$DBPOFFS= (0..7)
0 0 0 0 0 0 0 0 
##$DE= 6
##$DECBNUC= <off>
##$DECIM= 24
##$DECNUC= <off>
##$DECSTAT= 4
##$DIGMOD= 1
##$DIGTYP= 9
##$DL= (0..7)
0 120 120 120 120 120 120 120 
##$DP= (0..7)
150 150 150 150 150 150 150 150 
##$DP07= 0
##$DPNAME0= <>
##$DPNAME1= <>
##$DPNAME2= <>
##$DPNAME3= <>
##$DPNAME4= <>
##$DPNAME5= <>
##$DPNAME6= <>
##$DPNAME7= <>
##$DPOAL= (0..7)
0.5 0.5 0.5 0.5 0.5 0.5 0.5 0.5 
##$DPOFFS= (0..7)
0 0 0 0 0 0 0 0 
##$DQDMODE= 0
##$DR= 18
##$DS= 0
##$DSLIST= <SSSSSSSSSSSSSSS>
##$DSPFIRM= 0
$$ [...]
##$SUBNAM2= <"">
##$SUBNAM3= <"">
##$SUBNAM4= <"">
##$SUBNAM5= <"">
##$SUBNAM6= <"">
##$SUBNAM7= <"">
##$SUBNAM8= <"">
##$SUBNAM9= <"">
##$SW= 24.9336996594482
##$SWIBOX= (0..15)
0 0 2 0 0 0 0 0 0 0 0 0 0 0 0 0 
##$SW_h= 4990.01996007984
##$TD= 16384
##$TD0= 1
##$TE= 0
##$TE2= 300
##$TE3= 300
##$TEG= 300
##$TL= (0..7)
0 120 120 120 120 120 120 120 
##$TP= (0..7)
150 150 150 150 150 150 150 150 
##$TP07= 0
##$TPNAME0= <>
##$TPNAME1= <>
##$TPNAME2= <>
##$TPNAME3= <>
##$TPNAME4= <>
##$TPNAME5= <>
##$TPNAME6= <>
##$TPNAME7= <>
##$TPOAL= (0..7)
0.5 0.5 0.5 0.5 0.5 0.5 0.5 0.5 
##$TPOFFS= (0..7)
0 0 0 0 0 0 0 0 
##$TUNHIN= 0
##$TUNHOUT= 0
##$TUNXOUT= 0
##$USERA1= <user>
##$USERA2= <user>
##$USERA3= <user>
##$USERA4= <user>
##$USERA5= <user>
##$V9= 5
##$VALIST= <valist>
##$VCLIST= <CCCCCCCCCCCCCCC>
##$VD= 0
##$VDLIST= <DDDDDDDDDDDDDDD>
##$VPLIST= <PPPPPPPPPPPPPPP>
##$VTLIST= <TTTTTTTTTTTTTTT>
##$WBST= 1024
##$WBSW= 4
##$XGAIN= (0..3)
0 0 0 0 
##$XL= 0
##$YL= 0
##$YMAX_a= 26127
##$YMIN_a= -23793
##$ZGOPTNS= <>
##$ZL1= 120
##$ZL2= 120
##$ZL3= 120
##$ZL4= 120
##$ABSF1= 10
##$ABSF2= 0
##$ABSG= 5
##$ABSL= 3
##$ALPHA= 0
##$AQORDER= 0
##$ASSFAC= 0
##$ASSFACI= 0
##$ASSFACX= 0
##$ASSWID= 0
##$AUNMP= <proc_1d>
##$AZFE= 0.1
##$AZFW= 0.1
##$BCFW= 1
##$BC_mod= 2
##$BYTORDP= 1
##$COROFFS= 0
##$CY= 11.3945322036743
##$DATMOD= 1
##$DC= 2
##$DFILT= <>
##$DTYPP= 0
##$F1P= 18.9103706918063
##$F2P= -1.10871071338519
##$FCOR= 0.5
##$FTSIZE= 0
##$FT_mod= 4
##$GAMMA= 1
##$GB= 0.15
##$INTBC= 1
##$INTSCL= 1
##$ISEN= 128
##$LB= 0.24
##$LEV0= 0
##$LPBIN= 0
##$MAXI= 10000
##$MC2= 0
##$MEAN= 0
##$ME_mod= 0
##$MI= 1.114404
##$NCOEF= 0
##$NC_proc= 0
##$NLEV= 6
##$NOISF1= 3.799351
##$NOISF2= 2.8
##$NSP= 1
##$NTH_PI= 0
##$NZP= 0
##$OFFSET= 15.70392
##$PC= 1
##$PHC0= -8678.995
##$PHC1= 43.60098
##$PH_mod= 1
##$PKNL= yes
##$PPARMOD= 0
##$PSCAL= 0
##$PSIGN= 0
##$REVERSE= no
##$SF= 200.130013532006
##$SI= 16384
##$SIGF1= 3
##$SIGF2= 2
##$SINO= 400
##$SIOLD= 16384
##$SREGLST= <1H.CDCl3>
##$SSB= 0
##$STSI= 0
##$STSR= 0
##$SW_p= 3612.71676300578
##$SYMM= 0
##$S_DEV= 0
##$TDeff= 0
##$TDoff= 0
##$TI= <>
##$TILT= no
##$TM1= 0
##$TM2= 0
##$TOPLEV= 0
##$USERP1= <user>
##$USERP2= <user>
##$USERP3= <user>
##$USERP4= <user>
##$USERP5= <user>
##$WDW= 1
##$XDIM= 8192
##$YMAX_p= 0
##$YMIN_p= 0
$$ End of Bruker specific parameters
$$ ---------------------------------
##NTUPLES= NMR FID
##VAR_NAME=  TIME,          FID/REAL,        FID/IMAG
##SYMBOL=    X,             R,               I
##VAR_TYPE=  INDEPENDENT,   DEPENDENT,       DEPENDENT
##VAR_FORM=  AFFN,          ASDF,            ASDF
##VAR_DIM=   8192,          8192,            8192
##UNITS=     SECONDS,       ARBITRARY UNITS, ARBITRARY UNITS
##FACTOR=    0.0002004,     1,               1
##FIRST=     0,             0,               0
##LAST=      1.6414764,     0,               0
##MIN=       0,             -23793,          0
##MAX=       1.6414764,     26127,           0
$$ Real data points
##PAGE= N=1
##DATA TABLE= (X++(R..R)), XYDATA
$$ [...]
1296a10m03J4L64L28L8n34l08K14L45K16m3m43m09L34M98m8k56l22p0M09M91l36
1318c1l87k5K5M53J83k54o00L7M41K25J19m04m55J91O47J10l16k88l67N30M27
1339B61J09n44k72P5O00J39j90n15j73L69M23J60l15m55j30N31M14k61l25j85
1359b84k7O03K58l23l66j16K94L61J84m12m79J73L90L03k3n04l71M86M80o2l38
1380B27k24k03N20M02l42l84j27N3L61M03l28n59M2M11J34Q2k10m53j4N70J46
1401E07k16k18l10J22O04M5n03m46K56K53M63k45m83j80L40L12J12k06n00k0J83
1422a30M45p7k33l82j01M85L09k53l57j44K55K07L62n37n47K60L51L08j46l63
1442b88l83K62N68j29k44k22k27L53N01m3l77k72O1J98M11k13l05j74K19M07R1
$$ y = [-110, -513, -499, -135, 193, 231, -303, -611, -397, -52, 164, 121, -322, -731, -397, 101, 53, -203, -525, -595, -186, 305, -31, -418, -443, -418, 35, 218, -36, -636, -599, -158, 67, 186, -218, -673, -482, 165, 275, -41, -329, -696, -166, 261, 370, -174, -446, -371, 229, 368, 178, -337, -510, -141, 282, 442, 127, -328, -458, 73, 487, 226, -99, -284, -311, 292, 550, 227, -139, -255, 39, 400, 584, 172, -307, -134, 256, 559, 536, 32, -339, 147, 627, 565, 227, 3, -200, 320, 722, 380, -4, -131, -78, 283, 686, 358, -201, -159, 252, 386, 468, 258, -195, -209, 361, 507, 291, 73, -237, -115, 489, 534, 31, -415, -159, 94, 557, 312, -171, -351, -11, 301, 413, 207, -293, -313, -130, 315, 238, 5, -377, -478, 7, 316, 63, -294, -438, -183, 24, 386, -151, -698, -438, -87, 221, 75, -288, -671, -409, 159, 30, -214, -436, -663, -310, 191, 148, -229, -501, -440, -242, 169, -44, -349, -523, -304, 103, 194]
1463A94k09o28K5N45K96k92j02m05J52L96L28m28k84j64L03M25O2l99l51K86K71
1484B1J21J41n03j07K41M18j13q5l84j89M72L93j7m27j45q8M19L47j71n49q5M29
1506A39K52K4k07n44J71O21rk70k06k06J96N67j9l89k43k3L20M29o0n33j87J86
1528IK04L63j48o14q0M57L09k7l42l06k5O15K61m15m02PJ60K93J65n45k23J78
1550a06K48K34m3l41k76J95M09j18p0l49k74L13M76p3m37k36J51K92L90k44n56
1571d15m2L29J96K13j79l84k20M81M54m06k99k83K69M67p1l26l56O8L77K14p4
1592A3l61k57K88R6M38k18l60k92M08L04J05l00m63K0M24L42k94k79m7O8L53K30
1614B18m03k11j72L81K50J99m99l06K62L36J45j10l31k41L97M20j40l91n8K6L86
$$ y = [194, -15, -643, -618, -73, 223, -69, -171, -576, -424, -28, 300, -128, -412, -576, -273, 152, 214, -185, -536, -250, 21, 142, 283, -220, -327, -86, 332, 219, 134, -250, -439, 33, 426, 409, -18, -163, -251, 168, 515, 344, -205, -290, 139, 391, 415, 208, -336, -165, 456, 447, 177, -29, -235, -39, 528, 509, 120, -123, -146, 174, 603, 543, 10, -177, 9, 213, 576, 428, -186, -266, 191, 500, 473, 131, -175, -200, 415, 676, 261, -141, -134, 26, 319, 484, -61, -284, -106, 142, 376, 333, -8, -284, -89, 320, 202, 132, -217, -491, -178, 298, 225, -212, -448, -297, -5, 385, 141, -415, -457, -128, 68, 281, 102, -282, -502, -21, 433, 27, -272, -555, -286, 181, 110, -216, -572, -504, -127, 87, 13, -348, -605, -317, -221, 217, -1, -361, -653, -245, 59, 164, -136, -599, -579, -155, 187, -107, -386, -433, -365, -12, 218, -185, -396, -568, -187, 63, 262, -237, -543, -281, 55, 200, 90, -241, -482, -85, 335, 195, -196, -254, -228, 158]
1635A58L07k40l35j88L43J53J81l01l05j4N16J28j3k99l33Q0N18J42l76j25l20
1656c23K97K51K10l77k52J95K64J97Ln02j26J83M19j3j22k99l20N06L00j61j74
1677A56l57K2M73K80m21j92j11K36K88J12m00m19K38M09J27j82l12k00J92L38
1697B77J02l88j53m8K45L54Mo15n4J71J38J53k2m77r9K25K87L0j41l27l9M14K55
1720B92l39k23j50O7L62J37k94k90K6K22L77L0n51j97K12K78J63j64l38k79M19
1741b40K25R2l28k05Q1L28K07j56l47K4K12J61J59k72m46J07M10J86R4n06k03
1762d17Q9N28Pl15j11RR7M63j54l36k03R3K91J67l5m42o4L05L78k3j66m12j25
1785c76O05K36j36m07K5K4L08K30n11k0N3J49J86J03l73l39L13K28K14j17m13
$$ y = [158, 465, 225, -110, -298, 45, 198, 379, 78, -227, -241, 275, 403, 390, 91, -242, -162, 356, 498, 122, -3, -323, -26, 225, 435, 58, -194, 1, 265, 462, 465, -37, -163, 20, 439, 426, 304, 5, -315, 191, 491, 330, 156, -201, -179, 294, 574, 153, -39, -150, 86, 374, 486, 86, -333, -95, 314, 441, 259, -53, -253, -61, 277, 379, -9, -162, -210, 35, 389, 393, -222, -276, -105, 33, 186, 164, -313, -412, -187, 100, 130, -11, -338, -377, 37, 292, -47, -270, -420, -353, 9, 146, -148, -438, -412, -190, 187, 217, -334, -531, -319, -41, 122, -42, -380, -659, -240, -15, 77, -251, -456, -375, -47, 160, 4, -343, -319, -107, 54, 213, -59, -505, -398, 12, 198, 292, -214, -417, -328, 200, 207, -108, -219, -210, -113, 350, 196, -140, -343, -250, 41, 208, 173, -269, -333, -28, 350, 327, 161, -251, -376, 229, 465, 329, -78, -53, -29, 279, 509, -2, -22, 31, 180, 366, 469, 96, -243, 70, 298, 512, 395, -18]
1806a8j76L28L18k6l55j39P0J87L92k77m09q6K76J59K04k16l76L4K11K20J4k79
1828E6k48J20L40K14m01j95r4J10M95j39j67m05J94J88K88o9m99k9J38J59O1q0
1850C7m40nL92J13O9k27l95J36M04J13l10k49%RL95J72l79l59K35J99J06P0l08
1873b22l65L10K91J18k26k25j58L73L60j95k33j55m4K87J31k5m18j5L19J66K1
1894I5j62l78P5M08K22l04j87j76K16M31L3l38j33L7J51K38n7k57k79K21K09J55
1916B20q1l72jL44L17j58j93k50m8L44L48k66l03q1K88J29J38k11l85K42K25J24
1938C70K4j80m76K22L52Op9k13k0N1L99m2k94k53J23K82K16j20m58J3J63J68J80
1961D34k49m36J46K38J53K1k12k65O8K99K64m25j30N3J5L58Q1k32m21L0L25J71
$$ y = [-18, -194, 134, 452, 426, 71, -68, 2, 189, 581, 304, -105, -191, 85, 244, 448, 232, -144, -110, 101, 321, 335, 56, -192, -72, 268, 482, 81, -114, -208, -98, 397, 258, 91, -314, -120, 68, 356, 287, -212, -241, -103, 56, 117, 37, -403, -408, -16, 97, 166, -61, -456, -320, 84, 197, -113, -362, -362, -353, 42, 214, -165, -524, -289, -90, 16, 86, -222, -587, -277, 14, 132, -94, -319, -477, -104, 256, 61, -172, -327, -371, -84, 47, 22, -396, -411, -92, 74, 95, -67, -445, -370, 38, 260, -44, -231, -407, -191, 240, 273, -65, -198, -161, -10, 228, 171, -86, -365, -144, 65, 220, 139, -233, -234, 110, 427, 269, 76, -174, -222, 122, 470, 204, -99, -180, 108, 237, 375, 164, -221, 21, 246, 370, 394, 214, -262, -40, 312, 318, 239, 26, 6, 57, 456, 414, 120, -133, -10, 272, 488, 368, -90, -77, 86, 254, 434, 185, -251, -105, 133, 286, 307, 95, -170, -102, 197, 461, 36, -94, -41, -26, 332, 413, 181, -240, -210, 115, 286]
1983B86j57k58k32K75L19o6q3l14j94L92L83k11l43o9k2L25K64m47k56O9L8L58
2005E7L6j81l59J61K97J06j79j66j37J3N15o5j89k49K3N0L54k1l38j56J39K85
2027dM2O6m83o9L51J76q2j73j51N9M04N2k30k13o9K66J18J69l95Pm5J43K92j0
2051B21m68j35K89L30Lr2j88k71L47L00K6l85j46N0K88J60j60k59P2J47R3R7j34
2074A85k71J7K76O6M2k28j48J06K91J00k90j47m1J39K47J02l63j22J8K94J79j42
2096C10l33r8J55L27j69j52r5j72K82K36j71j4j38j08M19R1k08k63j7N4J43J41
2118B20j24l07J72K05%o8l10j68M38K05k53j52j6m0J38K79l4n24N4K30O2R7j17
2141a3l54J01L17l1J35k96r3j16L70J48j78k73p6L0L97J37n21j54J36K60J37J3
$$ y = [286, 129, -129, -361, -86, 233, 167, 84, -230, -424, -32, 351, 140, -203, -272, -294, 31, 295, -152, -408, -339, -301, 57, 93, -88, -447, -286, 11, 117, -62, -228, -365, -352, 163, 98, -91, -340, -317, -267, 87, 66, -272, -428, -289, -4, 38, 104, -379, -448, -97, 79, -3, -176, -327, -268, 136, 188, -42, -255, -324, -58, 60, 229, -166, -159, -204, -61, 231, 221, -247, -382, -93, 237, 240, 148, -40, -311, 36, 336, 362, -23, -169, -119, 169, 329, 169, -90, -18, 129, 222, 319, 185, -86, -69, 207, 273, 315, 87, -61, 45, 336, 436, 146, -1, -42, 97, 344, 446, 83, -39, -21, 273, 452, 310, -23, -121, 34, 361, 192, 40, -55, -227, 55, 291, 120, 106, -32, -140, 279, 370, 162, -101, -118, -64, 79, 220, 96, -211, -39, 166, 166, 98, -212, -380, 58, 263, 10, -142, -158, -198, -60, 219, 185, -339, -285, -55, 7, 104, -13, -367, -266, 51, 20, 155, -141, -234, -350, 20, 168, -10, -283, -359, -329, 68, 205, -316, -470, -334, -74, 63, 76]
2163G6m23j66K80K82Pr8l63J47K65J91k44j97L8k1J94K36k52k19k4J19K18J51
2185A97j19l78J44J92N5L0k00j58L1M74J8l34o0j02L26J74q5l54n1J62K99L4j64
2208A31k54P8M17q1j15l4k24k3K39K03m8k33k02J9M38R8j97l00PK29K53j07j61
2231A33l93K95L76m1j23j83j64K70J16j00l7r9J21m0J93k44l7q1M4J97J49k44
2253A08j02r6K64Q7L1k70l61J92L62J4j34k46j49K63K16m2k08p3P0L0K05k37k07
2276b83N1J16J53J28j64k98n8K43L42j12l59j72J49K75J49k83j28n6J73K43rl87
2298b87j41J55K39N9n5k58o1K37J62k8j67j15j06J46J95pn1k9j54K06K80j80l57
2321c17k1K17J88R9r5m06P2N35j43j2k23j44K56K89j18k43n4N1J69R6p9j15j35
$$ y = [76, -347, -513, -233, 49, 56, -42, -405, -258, 7, 198, -46, -243, -205, -226, -32, 204, -48, -267, -291, -172, 46, 197, 78, -300, -156, 36, 91, 121, -79, -237, -206, 268, 286, -48, -108, -210, 116, 290, 205, -149, -200, -38, 261, 295, 131, -123, -45, 372, 291, 176, 142, -82, -105, 134, 337, 289, 56, -146, -127, 311, 409, 212, -88, -81, 148, 401, 294, 133, -260, 35, 411, 370, 247, 64, -100, 170, 286, 186, 149, 50, 171, 131, 324, 80, 43, -38, 6, 203, 352, 108, 6, -90, 174, 261, 292, 22, -339, -147, 215, 229, 95, -151, -300, -37, 179, 137, -71, -144, -74, -44, 161, -76, -283, -232, -116, 37, 165, 1, -297, -355, -112, 230, 118, -241, -413, -264, 11, 160, -123, -251, -307, -134, 109, 100, -287, -428, -273, -34, 25, -30, -288, -349, -112, 50, 22, -145, -260, -366, -220, -25, -32, -83, -112, -266, -60, 220, 40, -317, -338, -121, 67, 166, 71, -335, -263, 272, 129, 117, -106, -250, 6, 295, 177, -66, -120, -69, 100, 196, 117, 2, -133]
2344a33J99k3K33p2l14L9Q0J98K8k12m9q4K50K90j56k87j1K3K20J47l16j73J79
2367E6K16N8j90l4k34K41J38O8j10k99j21K43K71Q8l31k9pM0K33L3l65j97K90
2390E8R0J42j44l64J4L61J09o7m03jP6K60n8p6k34K22J08j42K23k49j5o1K31L2
2414A12N6l12k65K36K36O2j84k02j0L76J68k91k57Q2m6J47J01q5k24J44K67j20
2436iR0j52l63L53P5L7J3k07k24J57K20J48k55qk64J76M69p4m97N5N3K87j9n5
2460Fk79r5L61K79j37k33N7p0J82Q4k52J7R0o7J49J07j82k69J34J68J26J24l12
2483a2j52K04K59k7O4m72j02K50M24j56l24Mj5M31j14q3j59q0J95R7q7J0j88K4
2507iL15n2j11P6l05P2K87J19k63j61n5J52K43M3m96O6J31J9K54j11m90J74K05
$$ y = [-133, 66, 43, 276, 204, -110, -71, 9, 207, 235, 23, -26, -110, 140, 430, 274, -13, -24, -1, 219, 366, 50, -123, 56, 272, 330, 140, 106, -128, 113, 251, 319, 209, -90, -211, 32, 303, 391, 60, 31, 24, 64, 297, 330, -35, -232, 58, 148, 290, 146, -218, -204, 157, 266, 199, -204, -205, -129, 131, 73, -3, -237, -15, 93, -49, 174, -75, -90, -151, 80, 112, 168, -144, -409, -173, 63, 125, -59, -261, -271, 105, 273, -18, -275, -193, -239, -92, 9, -76, -300, -156, 111, -9, 81, -71, -434, -81, -6, 31, 44, -163, -387, -230, -10, 138, -117, -125, -389, -213, 256, 182, -315, -260, -207, 80, 61, 6, -273, -368, -7, 272, 135, -98, -41, -111, 71, 155, -97, -80, 10, -57, 92, 199, 17, -252, -118, 50, 176, 300, -12, -164, 40, 299, 272, 336, -136, -238, 12, 436, 280, -44, -40, -55, 376, 262, 179, 20, -60, 135, 232, 145, 155, -33, -9, 306, 254, 143, 219, -86, -14, 273, 392, 129, -32, -87, 65, 308, 351, -145, -79, 52, 71, 325, 214, -276, -102, 103]
2530A03J16q8j14j76M2J83P8j43o7L3j1J57o6J61l38L7q1K98Q2k74k96K07J76
2553A9K26j63l04o8K28J74r6j13k13J26J90K34l13j99J53O2O2R0p7j88p2M6K84
2576H8rj20l06Q0J70J57J1l51m1J18L19L3k95j71K07Q9J10O8m76m7L16N0O6j77
2600a11n6nK12Kj83J67j13p1J53K7j9k36M5J40J72J04r7m74J56K96J23p5l10m
2624a57K63K69k38j67j12J59J74R5r1j79L5P7M9m3L0p3l0O0K7N3j24q7j87L26
2648A29K44k06k17k5k9L63J27m40p1J67J43O8p7j50j99K37J28j7q6j64k8K23N5
2671A75j1p0j60m8J18K44j93p8k66K00J58J24r7m02R3K56J03j89j88J00N1L29
2693B49j65j49j01k2J50O8k2j49R1m5mK5K26k29j68J1K04Q7j0l63o1L30O9j44
$$ y = [103, 219, 131, 17, -159, -117, 66, 144, 1, -66, -33, -44, 113, 47, 208, -130, -93, -174, 124, 206, -68, -364, -157, 19, 245, 82, -222, -290, -62, 112, 16, -97, -310, -184, 6, 240, -73, -272, -119, -57, 5, 95, 18, -170, -242, -196, 88, 79, -41, -347, -267, -97, 60, 71, -280, -321, -203, 116, 149, -146, -317, -110, -21, 89, 157, -319, -366, -50, 0, 66, -111, -167, -172, 40, 42, -141, 26, -87, -158, -5, 22, 3, -233, -188, -48, 124, 228, 131, -343, -187, 109, 232, 157, -153, -157, 106, 375, 137, -30, -142, 17, 191, 286, 195, 16, 51, 128, 177, 134, 164, 91, 61, 121, 148, 201, 77, -10, -197, 129, 373, 167, -50, -75, -104, 259, 386, -54, -125, 42, 185, 253, 176, 26, -173, 64, 192, 175, 89, -75, -103, 120, 175, 164, 94, -66, -114, 4, 248, 55, -23, -289, -89, 69, 193, 96, -306, -213, 43, 146, -43, -231, -131, -80, 249, 84, -65, -166, -188, -38, 30, 8, -141, -50, -95, -99, -74, 152, -77, -245, -234, -30, 57, 47, -316, -377, -47, 22, -122]
2717a22j28j15R0L82Pk01j69P8J96K9O1l84K1K22nN8q2p0j28R6J79m5O0j05j25
2742b00k0L14J7k19l9J08l5L86k05k36j76L47J53j21r4j65J76K28m5j03k05J7
2764a17J35J11l6j94J28l3j12K89k0j02n0j9J05QKj02j57K21L40j33k60k03J53
2787d6K98J91k84k71J04K19L4r4j26j05K81Po3L2r2j84M0K84L0N7l70rN9K03r
2812A86r8k32N0J85K75j93l30K9J21J35k3Kk20P3K20l8k24J7K4o4J95K3j49j6
2836e2p7k0R5J71k74q5M1J20J88r3k65o8K18J63j31n9k58J39J90J77k47j40R8
2859a69J00N5J19l70P1Q9j5J14L3j26j73J0J76L6P7o5j83k8K76N4j15j70J2K36
2883D4J35j69j20j57J54K99j37q0k12J62J57J18j87k4k6OQ9Q4J6j68p7O9J14J07
$$ y = [-122, -250, -365, -275, 107, 114, -87, -256, -178, 18, 47, 108, -276, -255, -33, -38, 20, -62, -132, -260, -164, 15, -30, 30, -75, -200, -220, 94, 111, -108, -147, -39, -74, 312, 107, -129, -305, 42, 195, 74, -20, -185, -9, 219, 174, 71, -134, -117, 18, 129, 93, -101, 27, -6, -118, 171, 151, 49, -1, -20, 85, 93, 95, -7, -164, 57, 397, 264, 4, -199, -46, 252, 443, 159, -112, -8, 211, 245, 151, 25, -80, 201, 208, 145, 177, 85, -99, -59, 225, 255, 312, -58, -67, -8, 195, 186, 88, -144, -94, 91, 366, 173, -157, -128, -7, 128, 105, 107, -113, -40, 180, 142, -82, -65, -41, -105, 90, 113, -36, -52, -129, -149, -54, 117, -157, -242, -201, -81, 107, 14, -251, -319, -101, 62, -69, -128, -386, -247, -57, 120, -127, -267, -169, -69, -14, 105, -265, -194, -105, -120, -6, 27, -99, -272, -262, -86, -50, 27, -38, -221, -249, 27, 81, -34, -204, -192, 44, 179, 10, -110, -267, -113, 186, 49, -31, -243, -81, 76, 194, 7, -17, -43, -37, 52, 136, 152, -16, -93, -24, 90, 197]
2907A97k23j60L60l8J04l9q9k66J58K70m9m6k67O4J88J95l63R6j14J14N1J31j44
2930A30j78J06R9J35j02m0j49RN0K32j08j46k11K01J55J71l23j31m6J72K16m7
2952A95k82L5K1J58J78l01o1r7J70K01j57lj79k8K03l5j29l6j8rK39N3j62k18
2976b62j8J85J50J51l43k23K55M5J94k72j35q9K01K56j54m4r0J40j08M9qp3N7
2999a36M2M9P8j67q0J23o4J64j27J18k44n3K65N0r4n5q8J75R6P7l64l3J69J16
3023A7Q7r9j22PK21p7J37q9j06j53J08J97r6r7ml5K34r4J01j54j22J79R9J45k71
3048A3j58J03K09J14j29k20P5J30J63p9j72j02m5J56J34J1j90j5L4Q9J62j04k08
3071b9OJ81R0j27j15n7J29O0K18k49j44J6R9Q4k0r2k37J58J59O5j92J8l8J2P4
$$ y = [197, -26, -186, 174, 136, 240, 201, 112, -154, 4, 274, 225, 179, -88, -24, 164, 359, -4, 92, -22, 92, 143, 274, 130, -48, 58, 157, 292, 190, 150, 1, 10, 60, 292, 184, 38, -173, 28, 183, 354, 31, -100, -146, 26, 242, 195, -87, -52, -31, 127, 305, 4, -57, -154, 16, 217, 60, 57, -122, -150, 53, 18, -111, -147, -165, -174, 65, 118, -44, -262, -280, -95, 55, 206, -137, -360, -105, -60, 134, -138, -273, -362, -161, 95, -59, -103, -193, -53, -161, -112, -120, -193, -136, -94, -45, 33, -134, -214, -91, -155, 9, -118, 0, -244, -297, -32, 18, -76, -131, -219, -44, 52, 129, -235, -268, -99, 17, 104, 5, -117, -110, 111, 34, 171, 82, -24, -177, -69, 128, 32, -65, -69, -104, 130, 36, 137, -17, -139, 40, 139, 284, 13, -145, -42, 167, 281, 152, -68, 7, 137, 300, 221, 49, -53, -98, 58, 192, 203, 13, -2, 32, 121, 283, 179, -29, -23, 158, 248, 121, 6, -51, 78, 138, 356, 107, -37, -21, 78, 162, 142, 50, -187, -29, 130, 195, 3, 21, -17, -5, 69]
3096F9k7ol7j63K62J3J8j39m6q3J35K18k20j32MJ04j9K37j98j65J06j0R3j78J29
3121c5j58R5J87m8r9j16L7o5J35J33j12r1j4J66J35j19q5j48P2J93N9k67j65J44
3145a66OJ11n2O0j29JK43J2j50j88R6JJ42K4k14p1K18K7LO1j5j93J09J68j00P3
3171G7j70k47L40J65q0j94lQ4O3J00j62rn3M8J28N0j8j36J54R0Pk30J13j94J60
3196H3J51k5k54k3P5J68R8n3k47J04j23J07J53r9k26Q4J83M7Q6k44l8m2J85K2
3220A72n8r4p3LK01L3j98m3L0J04J81q1k67k0qK26Q6j84j67P0Q4N8P3j95m0J22
3246A5J31J32k08j54j79K90mr9K0k23J24J35R3j29J00j62M8J24q2r8r2K2J25J81
3270A10n5k26k1n0L15p5O4k87Q4K4J60q0o8j0p6J36J66q9j94k6J24OJ69j98n2
$$ y = [69, 42, 36, -1, -164, 98, 111, 129, -10, -56, -139, -4, 214, -6, -138, -134, -30, -49, 188, -10, -175, -69, -79, 14, -164, -35, -193, -98, 89, 41, -58, -174, -137, -202, -67, 66, -46, -137, -151, 15, 150, 31, -54, -202, -130, 63, 122, -145, -310, -166, -160, -49, -101, -41, -170, -169, 74, 86, -64, -252, -156, -155, -13, 11, -203, -274, -56, -29, -26, 35, 20, -173, -64, 104, 4, 77, -93, -340, 0, 165, 85, -109, -112, -28, 35, 135, -27, -36, -89, -41, 87, 137, 119, -17, 137, 227, 234, 4, 117, -77, 83, 234, 209, -45, -68, 7, 175, 273, 220, -27, 77, -46, 61, 214, 115, -111, -27, 156, 203, 289, 45, 7, -35, 150, 172, 114, 20, -53, -50, 151, 184, -14, -57, -27, 77, 258, 177, -90, -110, -118, 108, 194, 10, -157, -87, -3, 55, 128, -67, -107, 15, 146, 278, 70, -84, -263, 27, 23, -76, -56, -279, -155, -20, 73, -56, 44, -118, -70, 54, -28, -126, -218, -196, -71, 110, 55, -171, -192, -242, 73, -2, 62, -225, -141, -117, 43, -37, -105, -115, -191, -55, 111, 22, -172, -198, -74, -68, 101, -97, -149]
3295a49K9J23m2J88k01j64J50K18j04k3k78J4K25R8m2o4r4j6K60l6j0j19oJ23
3319H0Q0l5n0j07n5J17J10k07K05k70K73o7M2j38j13J14j61K93K9j41n7m8K45
3342A39J6K1j99pj9L34j69n6j00jK26N8k4l49J12pJ20Q5n2l01J61J14J47j38o0
3367E1j40N5K09m6j11J33k48J00J58o4j48MN5n6J63J40l59J3J30j8o2J32k15L6
3391h8K27k64K32k83J54n5P0Q4m4j08j14R5J19J00k19r8qK90m4q5j39j82K57J44
3415D1n4k22K7n5J98Q4l2j02q1m6J76J43r0j82J7J12K9N5m7j22r0K41J17lj93
3440g9j07Q3Q3N1o1j74P0J42K2J25k54m6J47J7J28p7j70o7J16J18J03j67l5p8
3464a10K98m2m2j79J03oL8K0r7o1k3K48m1J0r6ON5l1J17k5j65l3J23M1O0j2j98
$$ y = [-149, -120, 3, -39, 149, -52, -216, -66, 152, 48, 25, -253, -239, -14, 84, 42, -22, -116, -132, 128, 92, 82, -37, -43, 80, 160, 125, 75, -32, -87, 30, 140, -67, 138, -132, 141, 74, 116, -22, -135, -21, -182, 111, 140, -1, -58, -106, 139, 155, 176, -23, -30, -49, 285, 116, 60, -40, -41, 185, 243, 219, -130, -18, -25, 95, 180, 128, -173, -12, 102, 249, 111, 51, -89, -34, 175, 129, 18, 151, -97, 3, 161, 97, -51, -47, 8, -48, 115, 255, -104, -91, 39, 21, -41, 91, -124, -88, 139, -125, 107, -176, -22, -77, -7, 77, 33, -75, -189, -94, 25, 125, -94, -192, -200, 90, 46, -39, -178, -360, -103, 41, -13, -235, -208, -263, -65, 19, -13, -115, -196, -242, -66, 77, -13, -195, -178, -66, -37, 18, -29, -151, -241, 0, 117, 114, -79, -186, -103, -20, 31, -30, -204, -134, 8, 30, 155, -99, -145, 2, 19, 147, 70, -100, -167, -51, 67, 170, 3, -32, -110, 188, 146, 104, -75, 28, 22, 60, 80, -17, -78, -101, 147, 106, 116, 20, 26, 81, 50, 167, 142, -23, -56, 67, 108, 168, 156, -42]
3491d2k1K77j99l2pO7R7j7N0kk64K04l1M4jj0j38m9K45j3j10k6o2N5J69o3r4J8
3519D5q8J16J21j01q5j04J7K10J7j69n4j10J38QN0k46PJ70J02K8jj51k09K95J10
3544A16n9qk69J09J49j68P9L4j75R8J15n2M9j43m6M5K42j94P4j21l5J41j5n8m6
3569a38j7J43O6j15J34l20J70O6J34j81r9l1J31J1N4j31l8J03J25m8N0o9j58R4
3593f4R3Q8j38mn2Q6Q4j5j52J5J21M2J09k01j28KJ46L2N4J9j57l1M8J97r6n9q1
3620d2R3J47j3k67J48p5J03J00r2j90L0K78k62K16K4k89K4J8L21j44j04r6P3K04
3644B05l3o0l5j02j3oJ70j48M3J1K1O5j24qn7N9P1J7n3j01L2q5K78p6j12k4j38
3671b03K25Q2j32j95J63M4J48L3p9k08L1l9J98m3j62l7MK21o5m2l8j20J64k6L8
$$ y = [-42, -63, 214, 15, -17, -24, 43, 140, 123, 173, 171, -93, 111, 80, 124, 123, 113, -25, -74, 171, 158, 48, 22, -40, 15, 184, 121, 27, 45, -43, 73, 194, 93, 8, -96, -79, 131, 148, -21, -75, -185, -47, -39, 11, -235, -228, -58, 44, 72, 71, -80, -289, 6, 116, 57, 49, -220, -111, 38, -130, -51, -17, -192, -94, 21, -31, 18, -125, -171, -126, 116, -78, -4, -125, -160, -19, -34, -92, -138, -155, -12, 54, -61, 73, -247, -77, -11, 123, -58, -157, -188, -57, -46, 8, -123, -161, -58, 67, 19, 69, 0, -158, -64, 29, 117, -21, -25, -77, 9, 93, 78, -74, -59, 62, 104, 213, 12, -116, -114, 32, 64, 118, 137, -20, -51, -3, 194, 98, 39, -42, 51, 198, 185, -82, 66, -9, 94, 194, 102, -88, -58, 220, -42, 174, 198, -91, -67, -49, 272, 128, 24, -72, 1, 205, 172, 112, 77, -25, -38, -44, 126, -22, 21, 32, 53, 118, -6, -14, -71, -12, 59, 76, 23, -78, -46, -131, 147, 71, -41, -65, -203, 22, 104, -28, -223, -60, -16, 132, 165, 86, -122, -91, -130, 68, 25, -137, -174, -170, 51, -14, -56, -94, -214, -50, -76, -38]
3696c8j08j09PK00J19m5r1k18L44j82J87O6m27J14J12P8r1J3n3j12K05J11j01
3719a9j26J1Q5P9Lp0q1MP3N0Oq1j0P2n4O6Q5j90r4L31j0p4q2k5J0NK20j81l9m6
3749h2J01J38p5mj91J75J75l0j51j4m7l0J20J05j32M5j69K00J78k48j16j8LJ59
3773I2R1n9j0r7Q1M9j62J32q3p4J09J26j87%l2P9J29Qk71k3O0K31j51P3p4j67
3799a30K31n5k1M2o8j04J15R1n5j31j6O5R6L5L0k29J15o3m2K42j90r3L9J42M4
3824I0j58J08k23J32O5J41k85L1j29K53j61M6ln6P8N4N0j14rr4J80J8Oo8L3r8
3850a13nJ47q1J2j04Q6O8P3r0j44J48M0k6m3j9j5K2N6Q8j34L2p2K4J76j23l6p
3877d0J15j6N6o3m8k4J18q9J32j24j4l9Q0pl3j2N8j14J85m6n5k4O4nj0J9l3q5
$$ y = [-38, -146, -255, -248, -48, 71, 26, -65, -283, 61, -121, 66, 132, -295, -181, -69, 9, -82, -69, -122, -234, -29, 82, -19, -145, -134, -49, 30, 33, -37, -118, -114, -41, 9, 15, -66, -76, -4, -58, 8, 93, -97, -191, 140, 130, 56, -26, -51, -41, -36, 184, 3, -36, -82, 19, 157, 82, 78, -113, 62, 237, 207, 56, 42, -5, -35, 85, 190, 58, 103, -66, 134, 312, 64, -52, -70, -67, 92, 183, 124, 114, 17, 98, 147, -15, 117, 34, -40, 69, 195, 8, 8, -24, 55, 184, 192, -79, -102, -42, 189, 38, 111, 37, -130, 101, 46, 25, 67, -1, -105, 10, 101, 46, -85, -101, -36, 60, 95, 125, -104, 11, -52, -94, 148, -42, -135, -96, 46, 90, -68, 40, -183, -51, 14, 155, -130, -99, -228, 25, -136, -90, -93, -149, -71, -17, 33, -81, -90, -184, -4, 14, 20, -48, -15, -113, -118, 29, -52, -40, -144, -58, 10, 83, -7, -151, -3, 37, 11, -32, -51, -66, -44, 12, 100, -34, -2, -74, -50, 126, 3, -33, -40, 75, 59, 115, 52, 4, -20, 98, 9, 141, 17, 3, -36, 44, 37, 4, -8, 50, -64, 121, 75, 20, -4, 60, 55, 45, 64, 31, -54]
3905e4Q7K4Q3R5j38j17R8Q5r4M9j22M8p9L28l93J0P4LK29m9qj82q8J97R0j35M1
3932H2j28Q8J07k2K2j82J10j19J96j11Mj78J42j3O0N7j30p2JJ12O2q1j42N8J26
3957D9j8L7j63l5o4K99M7k58k9N8r7J75N0j34J6K1KL7K6j18j48K46o6N8Rj71R9
3984g2Q1j1oj01k5L7L1Q5J02k06n1J65QK7p8j13K9J15q5J41j26q5J5R8J0j13Q2
4011d6r9J82J29r0j17m7M3P3J06L6l76Q9O4J89k29J57j01l5J03Q7j4k29Q4RK01
4036A69p7j08M5n4R6N7K6k09Q6M3m9J31j5j40N1JJ93j61K3l0L4N0j6K1j52P3J7
4063A05j9N3m1j35m5J50K3j4k6j70K20l0O3j47j13J67Q2j27J31j19q0n2J19O6
4087F1j92P4j73K27M4n8N2j96o1K50k9l9k0l2N7p5J57m8p3lj25K73J7j61q2J62
$$ y = [-54, 33, 57, 140, 235, 97, -20, 78, 163, 69, 118, -4, 44, -35, 293, -100, -90, -16, -13, 216, 167, 159, -23, -111, 86, 176, 41, 82, -46, 42, 149, 127, 149, -33, 77, -42, 154, 43, 47, -131, 11, -2, 58, 115, -15, -87, -86, 26, 88, 7, -135, -77, 49, 31, 68, -95, -130, -194, 105, 152, -106, -135, -77, -174, 1, 51, -83, -67, -46, -44, -7, 19, -99, -247, -1, -67, -9, 0, -171, -72, 9, -2, -8, -109, -134, -97, -66, 19, 121, -85, -136, 29, 37, 64, -14, -127, -98, 17, -68, 73, -53, -138, -123, -25, -15, -128, -46, -145, 37, 166, 76, -41, -88, -45, 28, 134, 170, -206, -117, -53, 136, -93, 64, -37, -72, 31, 118, 104, -125, -41, -32, 169, 92, -16, 29, -25, 71, 128, 154, -55, 31, 74, 25, 156, 141, 1, 52, 53, 246, 85, 108, 78, 112, 162, 146, 167, 15, 88, 105, 86, 139, 98, -37, -82, 68, 91, 77, 51, -119, 101, 71, 134, -13, -126, 41, 123, -4, 127, 8, -72, -124, -5, 61, -131, -57, -230, -3, 41, -17, 35, -161, -222, 28, -1, -40, -60, -92, -35, -110, 47, -1, -74, -77, -202, 71, 88, -73, -155, 7]
4113Gm1o1K93j81j38N8P6Q7k23kr1R4K27o4k13K8J68j23M6K3j08J45q8J20m1j43
4139a45K6o2J44K43j22j30j30J46J2Q3j40M4K8n4Q2q3K7j0p3J12N9m8n0lJ17P1
4165A44j33k6j26J36J07J7M8j83M7q8J78K6j10K1m5O3M3K1j30j7l3K27m0j34L2
4190D5L4m2P4Pm2j75J49O4m6Jq4j7Q5O9O3j50j82J40R4l6N3j5r7M0Q2K3J8j63
4218hr6J39O5Lj86K9j4J63n2N0k16L9J15N1k7j2q2Om7J53q7j7rML0P8j12R5j21
4247f6q8J34j8J3k42K31L1j0mj20mK3J53l5j62N5L5j4kR0j49P7L0p2J35p4r5Q7
4275f1j8K1J04n5r5m6J73l2p9j3K2K3J64j09k8j01J30l8J01J0j08k7J4Q0J5p6
4301b9j93J71M9R7%r4O8j15j0K49l5j51p3R0L0J28j13j74M5J24K4l0j31J09r2
$$ y = [7, -34, -95, 198, 17, -121, -63, 13, 100, -123, -125, -216, -122, 105, 41, -172, -144, 24, -99, -53, -30, -138, 7, -81, 39, -2, -145, -119, -181, -37, 206, 84, -46, -176, -30, -18, 65, -75, -31, -3, -57, 25, -58, -31, -41, -114, -2, 57, 9, -41, -44, 73, 144, 11, -15, -141, -5, 102, 119, 167, -16, 31, -57, 121, 147, 37, 58, 13, 76, 119, 140, 10, -7, -40, 187, 147, 13, 45, 79, 37, 111, 118, 76, -99, 50, 114, 68, 69, -15, -32, 53, 122, 185, 35, -147, -7, 87, 51, 104, 89, -8, 32, 114, 137, 155, -8, -104, 35, 100, 103, -83, -54, -68, 95, 43, 93, -123, -84, 31, 82, 55, 43, -39, -33, -80, 73, -14, -31, -40, -36, -6, 72, -40, 55, -66, -154, -20, -38, -25, -267, -36, -5, -15, -19, -139, -143, -120, 33, -2, -164, -109, -74, -88, -90, 0, -149, -72, -42, -114, 21, -53, -148, -61, -79, -58, 46, -9, -104, -150, 23, -9, -88, -101, -79, -56, 108, -1, -29, -130, 0, -38, 63, 73, -35, -62, -48, 32, 47, -29, -222, -51, -2, 95, 95, 1, 69, -46, -56, 193, 158, 7, -66, 24, 54, 182, 69, -105, -60, 64, 88, 58, -73, 36, -56]
4326e6J64l2j21K27k93J42o0J12q2j2J42p6M4L7r8N6j9J2N3k06J47j54K43O5k27
4351Ho0N6J8J0J06k17l7M4J22M0l8l5J45k26J31M6l2j08N3o0J62j68O7j46lJ79
4377E7l3M5j26N2j50K39j01l9j24K5K24k4oo7j19O7L7J32j05p9n1j0J80m1p7k
4403i6N6J9m8j6QL1r4Q2J71j66p3j4J52J26p2j59O0o3J05K8p7Lk3O4L0J2n1N7
4431E2j30J24M0p0j30n0K15k3j9N1j86J24j1R1mj71N4J07j29J54L2k26R6r8L43
4456B36o8j28m3p3J05L7k0k1K9p4M3N6R0k05J6J15oN7j66p9J89RM3l3n6j65J53
4483D1j5M4p1mJ0M3RM7j56qJ40o7R3J1j82Q1J55j07j13R5j04jP8N5q8p2nPR1J32
4513A39j52m3L8o2J20l1r9L0J26q3Q4q1p1K6K9n3Q7K3j19LJ59j12%K3pn4J02Q5
$$ y = [-56, 108, 76, -45, 182, -111, 31, -29, 83, 1, -11, 131, 55, 99, 136, 38, 94, 75, 87, 140, -66, 81, -73, 170, 235, 8, -52, 4, 22, 32, 138, -79, -116, -72, 50, 90, 52, 17, 162, -64, 67, 113, 81, -27, 26, -34, 128, -40, 27, -119, -122, 57, 24, 69, -57, -5, -155, 84, -17, -56, -180, -155, 69, 45, 39, -28, -147, -80, -43, 89, -16, -95, -146, -156, 24, -17, -94, -96, -40, -21, -69, -85, -77, -46, -140, -58, 113, -53, -126, -140, 12, 138, 66, -93, -33, -96, 9, 37, -40, -37, -60, 4, 34, 46, -5, 52, -78, 46, 86, 16, -114, -164, 51, 28, 9, 60, -126, -2, -13, 78, 74, -97, -43, 64, -65, 89, 121, -105, -9, -107, 236, 168, 40, -3, -76, 29, 66, 46, 25, 54, -20, 23, 79, 169, -36, -20, 95, 89, 146, -20, -99, 90, 99, 142, 109, 53, -112, 41, 26, 70, -1, -5, 5, 48, 57, 104, -52, -60, 80, 13, 106, 117, -65, 16, 171, 64, -49, 46, -58, -59, 19, 74, -14, -86, -91, -84, 7, 139, -13, -56, -18, -80, 40, 9, -90, -60, 66, -17, 67, -14, -85, -59, -30, -83, 4, 27, -92, -89, 70, -42, -42, -19, -26, -80, 22, 107]
4541A07r6j42O9M1R1l0j79Q5K8M2r0Mo5N6m0J73l3L2n9r6J09O8pk70P9K44n6j6
4569D9k1k16Q2J66Qj80nO7P5K3k7l5O1Km0L4n1M1j59J67j03N9K5M3m8n9J26j81
4597i7J08N1m5k0J44m7m8Rj10K49p3o5j27K2N4M6J38k0j76N3K7n0M4l7%k6J04
4624A08J73k18j72J89l8J39q8j02k17K06N4M8Mj90R4J09m7o6J4p5N3K07j15n1
4648A9r6j32J69J18r8j05Q7n8o8L01q5j83n0M9J36pK3l8o3M8J53o8n2p5n2P1l0
4675h6M4Qj47P9J03j7mj62L8J71m6j05J17j21P6P5j42k2r8J62J11j55M2n6N5Q6
4701FK0L0p0j13Q1J27j31N2k2r0p0K81o5k1N9q9j8M6m3P9o2k7J18M5j01n3q5J07
4729iL0l2J5r0J20o8J47k7l2J7j5QM1mj77L7J81j31N1o2l4J19P8j06j05J04q2
$$ y = [107, 11, -131, -62, -21, 70, 40, -139, -54, -26, 16, -74, -70, -135, -79, -119, 54, 21, 53, -6, -102, 7, 75, 68, -202, -123, 121, 65, 49, 28, -188, -106, 60, 68, -112, -117, -50, 25, 48, 21, -14, 47, 49, 9, 43, -8, 33, -126, 41, -62, -3, 22, 65, 17, -42, 84, -97, 11, 62, 17, -3, 141, 94, 46, 55, -55, 194, 121, 56, -71, -49, 5, 51, 189, 169, -7, 46, 73, 23, 67, 30, 30, 4, 108, 281, 63, -109, 80, 42, 181, 93, -9, -226, -20, 34, 82, 86, -104, -10, 99, 52, -14, 0, -75, -22, 185, 70, 19, -77, -209, -40, 78, -20, -125, -38, -96, -164, 137, 52, -131, -181, -132, 4, -3, 20, -18, -81, -33, 120, 52, 0, -75, -127, -56, -86, -42, -34, -181, -102, 1, -16, -20, -182, -144, 27, -19, -124, -7, -128, -52, 23, -119, -141, -239, -77, 34, -121, -79, -135, -80, 6, 26, 56, -14, -127, -46, 81, -50, 2, -20, -110, -180, 101, 36, 15, 74, -15, -33, 13, -30, 49, -13, -40, 78, 123, 22, -31, -116, -9, 21, -11, 4, -86, 34, -34, 113, 86, 54, 71, 56, 64, 105, 101, -76, -39, 142, 11, 62, 0, -34, 85, 163, 57, -48, 56, -26]
4756b6L7J57k1j99N0OR0k2o3m3mP0jL1n0n8k4j2pQ5M9o4lnJ91q1o4k1O3j27J17
4787E1j16K7J22Mo9O4o6j09J14J4J4M3l8r3j13K74j53o5p8K13M7j32J2J3k6m8
4813i4J07l2k6l9K9K6M0m6nq2m9K78j25lj38L5O8J45j02L5j00n5k6J56j1M0q6
4840f0K9j9k2P7Ln4N2K7r7m0P5O4j41J81q1k14K99p5K8k6k0L6J5J2l2K1K1n8N3
4869E4j1j0M5ll8N3Mm0%j73J29Q6L2Jj20k8P5N7o6j0l9l7J11J15j54K1q1m9J09
4898C3J30j11J3l6J06l3j11q7J4K13j22R8r8rj68J70O4jq8K6o0J96j07O4j89J21
4924B8Rj47K05q7M9j18O2r4K20k05N4o2O5l2J3pm4l0J76j11Q0j07O1nk2O4j76
4951a61M4J8l1J41p2Mj45J61O4pL4j72K8J61l9q6J8pn9J09q8J7j01J01RQ5m3m4
$$ y = [-26, 11, 168, 147, -52, -2, 4, 94, 72, 9, -34, -38, 32, 31, 62, 12, -46, -70, -82, -89, -4, 45, -19, -22, -27, 164, 83, 19, -2, 61, -66, 51, -65, -38, 84, 88, 19, 83, 17, -92, 22, 36, 50, 93, 55, -38, -151, 123, -30, -95, -173, 40, 87, -45, -33, -20, -46, -94, 13, -19, -45, -84, -55, -29, 11, -35, -40, -122, -171, 107, -18, -21, -159, -124, -56, 89, -13, 22, -78, -133, -159, -3, -14, 26, -60, -31, -50, -72, 5, 8, -46, 6, 33, -64, -104, -29, 35, -106, 75, -6, -220, 79, 4, 32, 6, -14, 22, 37, 49, 17, 38, 59, 1, 54, 43, 33, 78, 75, 37, 90, 94, 54, 54, -119, 10, 96, 128, 129, 9, -19, 56, 113, 47, 37, -2, -39, 72, 187, 33, 54, -27, -76, 33, 163, 52, 65, 29, 135, 102, -9, -96, -82, 131, 9, 107, 9, 0, -168, 2, 66, 65, -23, 3, -57, 139, 32, 96, -93, 28, 37, -110, 95, 8, 57, -61, 1, -93, 127, -78, -24, -86, -21, -53, -40, -47, -91, -121, 55, -56, 24, -83, -22, -27, -49, 15, -161, -117, -99, -130, 11, -61, -57, -202, -41, 23, 16, 50, -122, -94, 67, 28, -58, -40, -47, -106, 3, -85, -68, -169, -68, -59, 26, -17, -61]
4979f1L8l0Q1l8nR2m1Om4m6j3O9j14K13j24M4q7N3m5M2J8n8K6J1J54j49n8N4P4
5008F2j32P6jL4p4K8M5M8oj03J6l0J08o1J0Jj04K47j18n2q1pM4K38k2j29n4J5
5036bR4oLo9lj3n3P5M7N3j84M9K06r7k1o4n2O0J28k21L7L5L7J38j25q9J2L1J21
5065A27j32J4k3m9R0j2K0o0m1r7J2J44Kk4pq1J7J78n2N5k24K19j10j0KM7k2K1
5093DL0j21Q6j16O1m9J67r6M4lp4rL8j8L1N4j08J01r6J04k4r1J59l7q2j30J41
5120c4K5P2q0m2n1N8M8Kn8M3n1J48j49J00j22n9J58M8k9j05J31m5j7r5K22k31
5146a13J53k6j23J73M9j96J1J92j07P0j08j06J45J01j52J98q2j1l9k8J72j48l8
5169a3j0m0J19l8k0N1K1K7n4O2nn6n0J01R5r7j47L6J02oMr9j8K23j97J09J3j64
$$ y = [-61, -23, -53, 28, -10, -15, 77, 36, 42, -2, -48, -61, 8, -106, 107, -17, 27, -60, -7, -52, -10, 8, -50, -24, -13, 141, -8, -66, -12, 62, -70, 6, 5, 39, -35, -7, 38, 86, 80, -23, -7, -37, 71, 10, 20, 21, -83, 164, 46, -6, -87, -94, -50, 188, 166, 37, -17, -2, 92, 86, 89, 20, 17, 4, -49, 26, 73, 126, -58, -9, 197, 100, 79, 15, -37, 23, 151, -70, -33, 2, 39, 177, 52, -37, -25, 6, 127, -5, 9, -14, -63, 27, 15, 35, -25, -66, -163, -151, -7, -5, -29, -36, -117, -100, 78, 26, 81, -143, 76, -34, -44, -42, 5, -17, 4, 34, -87, -1, -117, -56, -105, 62, -34, 10, 7, -67, -76, -38, -56, -25, 29, -79, 22, -74, 30, 6, -85, 74, 37, -45, -175, -34, -9, 63, -17, -59, -110, -52, -4, -2, -60, -17, -68, 80, -69, 31, -91, -150, 8, 56, 27, -78, 53, 8, -9, -104, 118, -113, 40, 14, -109, 64, 113, -83, -72, 120, 13, 83, -25, -131, 14, 115, -37, 161, 79, 68, 29, 1, 173, 25, -13, -23, -63, 56, 18, -2, 49, 70, 97, 43, 105, 100, 44, -6, 95, 190, 93, -54, -18, 84, 78, 82, -17, -35, 188, -9, 100, 113, -51]
5197e1J26m7L9jo2pN8k1L9l3j30l8J16Q8j3p2j07J42r1O7J8p7Q0L9j07K3J8J4
5225A0j70R0J67q9o3L6q2kJ59O9k45J09j1M6M7j08j01k1O3P3J27j38j55m1K01
5250b9k1p3p6J41p1oR2O9q8o0J29l6j7L9j4n4m1J3K1mL6P0j13J39p9N9m9Q5r6
5279c4M2n9J03m5P0m1N7j31q3J61Pm0nkO0K8n4K3j4N5j74K24o0n1J0j28J07j2
5307A4N0j43k2L28k18J13j42k9K25j38J7J9lp5j5K3N1lj78K30r0O2o8o0L7M6N1
5334H2m6m9L7N3k12K12l8J1m2r3J39p7N7n1l4J23J1Om4j42J31o9K3m3J41r8r9
5361a11J98j04J01j21M4j23J34L3j77Q8O0l8J15l3p7J4J0n5L6Q7j82n6K76q2j87
5386a50j3M5m0O5J11r4n7L9l1J08N8q9J0l7J09ln8Q1q9Pq6J44r6J68j69R0Mj00
$$ y = [-51, 75, 28, 67, 66, 4, -3, 55, 34, 73, 40, -90, -128, -12, 76, 63, -9, -116, 26, -65, 2, 20, -57, 23, 62, -45, -22, -4, 10, -160, -70, 97, 8, -55, -19, -101, -103, 56, 125, -120, -11, -22, 24, 71, -37, -138, -159, -96, -23, 104, -34, -189, -230, -29, -50, -123, -199, -58, -129, -135, -43, 26, -62, -122, 7, -29, -46, -7, -21, -75, -116, -103, -82, -86, -50, 20, -93, 46, -33, 26, -23, 62, -34, 8, -51, 52, 7, 77, 36, 93, -38, -121, 40, 47, 7, 2, 0, 60, 88, 34, 57, 43, 98, -76, 148, 88, 37, 47, -81, 26, 14, 64, -79, -101, 227, 9, 122, -20, -49, 176, 38, 55, 74, 71, -4, -19, 4, 55, 52, -126, 104, 14, 76, 8, -52, -15, 31, 82, 36, -13, 24, 77, -135, 77, 39, 50, 8, -85, 54, -23, 34, -17, -51, 72, 83, 89, 45, -97, 34, -35, -12, -55, 86, -12, -111, 87, -17, 84, -37, 7, -116, 18, 51, -126, -38, 22, -16, 99, 66, -11, 3, 13, -42, -6, 81, -101, -157, 119, 37, -150, -163, -118, -158, -93, 18, -76, -133, -94, -125, -17, 41, -48, -38, -75, 34, 31, -27, 54, -35, -28, -114, 30, -66, 102, -67, 23, 27, -73]
5414g3J13p1n7O0L5K10k56J18l4KjkmQl8n6J97j2k68M1J55k7K7j57J42K3L6k9
5442H2Nj97J11O1l4L4q4k3rO0LJ50k33RJ8J08j25J12p6Q1K6j3j3K8k3kj01Q8K7
5471G0j61oJ43l0J2P0q3p8J56m5l9J0J28qj16K8k5m5J71o8q1l8J18k37J18K75
5497B39j56r5o4N2L6K3rM5k30P4J49j13N6K3j87J90m2K6o3k4m4J09n4m8O8RN2
5524B2r5N2N9j63L8M7K0J03j28qj34J69J4j8j05J20K8rM1k00J52N2q6J0K1L6j8
5551B0k0Oo7PK0k8Q8P0j69N8P1p3J64m6n3L3j48J40j37K9J57j30N9r5J79j55J46
5578A26j74o7K69j12l2l5N4k7J02m0r6k1J10M0J00n9j55L6M4N0rj21p9K5J50J9
5604I8q8n0L5l1J03j02J30k35K42l8q9N6r6J80j54J54j31k3J0ol5R0N5j07R1n7
$$ y = [-73, 40, -31, -88, -28, 7, 217, -39, 79, 45, 47, 46, 44, 40, 48, 10, -46, 151, 139, -129, -88, 67, 40, 67, -90, 52, 75, 111, 82, 87, -110, 1, 62, 28, 62, -22, -45, -54, 6, 9, 159, -74, -65, -47, 61, -64, 48, -28, 53, 79, 66, 53, 81, 58, 56, -45, 43, 70, -91, -97, 46, 16, 28, 98, 15, -63, 93, 48, 9, 19, 147, 139, 23, 51, 26, -19, 152, 84, 3, -35, 83, -154, -36, 239, 83, -12, -76, -24, 12, 35, 26, 71, -159, -85, 64, -49, 7, 30, -157, 33, -9, 17, -46, -70, -114, -5, -59, -107, -39, -30, 22, -73, -21, 38, -125, -87, -40, -20, 83, -45, -53, -187, -18, -4, -22, -127, -7, 21, 12, 53, -147, 5, 57, -29, -19, 2, 38, 20, 0, 6, -61, -54, -34, -62, 26, 96, -73, -15, 56, -17, 147, 101, 48, 81, -67, 73, -64, -35, 122, -8, 51, -44, 135, -20, 126, -48, -115, 154, 42, 10, -25, 29, 2, 104, 64, -32, -53, 57, 97, 197, 138, -17, 19, 63, 113, 104, -17, -96, -71, 79, 98, 10, -40, -5, -36, 67, -35, 95, -140, 102, 64, -25, 31, -65, 115, -39, 115, -16, -39, -29, -35, -70, 20, 75, -32, 59, 2]
5630Bm3JJ86j43k6R8r6oJ8p0J17o6Q5r4K8l7P8j01N5Qm7M4Q9j15o7L6j62K05J88
5659A65j33q5j1R0O4j31m2R5j0n9P5n0N1N5j91Q4MK54k34q9P6l8N3j74J67j15
5685a29lJ26r7J51k5j35J50m0Kml0k7qnQ3n7j59K85j34N9n6K9r7K65p2j43J22
5712E1j28J12nP4r7r5J45r5J33n5K0j27P8K0m2P1m3n3j30K23o6k7K8m7O5k2J5
5739CJ03j09mK4oq3J1J87j57J31j54L5q8O0Rl1J7k9R6m8J73j16N1j11q1O1j3M1
5767b8PK0Mpl7P6j28l7L3J64j88R4o2O3K1m8Rj0MM7n2Q5q9J44l1j3j7J9q3jK1
5798b0qP8m9j31m3O8K8P6n5k2n2J07K7pj02J31n2r2J12o8n0R5Q1j99J35L2RlO
5827C2N8j69m1O3Q4m4j2Q6j94J64l3J17q8o8R8q5J09j12P3j33R0l8M7j36N7K9
$$ y = [2, -41, -40, 146, 3, -23, 75, -21, -27, -9, -79, 38, -28, 57, -37, -9, -46, 32, -69, -14, -6, -53, -9, 80, -35, -102, -66, -228, -23, 165, 32, -53, -64, 26, 90, -41, -83, 12, 2, -57, 18, -32, 19, 74, -117, -33, -29, 225, -9, -98, -22, -60, -7, -181, -14, -129, -132, -6, -103, 48, 23, -112, 38, -2, 0, -4, -34, -61, -69, -74, 9, -48, -207, 78, -56, 3, -53, -24, -121, 144, 72, -71, 51, -77, 35, 30, 104, 7, -88, 57, -38, 95, 40, 60, -67, 11, 31, -11, 60, 17, -36, -166, 57, -9, -36, -8, -55, 10, -12, 3, 106, -3, -7, 17, 11, -72, -61, 126, -31, 100, -54, -19, -107, -47, -38, -69, -52, -81, 15, -33, 140, 24, 75, -36, -117, -56, -69, -28, -21, -1, 3, -4, -41, 35, -93, -130, -97, 67, -121, -27, -89, -26, -5, -53, -44, -54, -50, -3, -55, 30, -59, 85, 54, 41, 24, 43, -40, -41, -20, -28, 50, 1, -130, -173, -105, -77, -1, -56, -78, -130, -23, 4, -3, -105, 26, -26, -118, -6, -74, -124, -29, 52, -147, -12, 20, 29, 26, 32, 90, -79, -120, -57, 27, -17, -29, 57, -137, 27, -6, 111, 23, -45, 53, -32, 77, -35, 38, -95, -5, -43, 4, -132, -75, -46]
5853d6M1J64j06l5l4L7LN0r8l1L4MQ5m9o3o0J34m0K11j06j58J62q1LNO6p9J7n2
5882b2N6n7jJ36j82N1O9m6J02K7j27N5p1p0Q8m8J40R6j73j15J00N3J8m4m6k9M2
5909BP5k1k3p0O4q7J38Rj53QJ31k22P3OP8q9P0J15l16J36O6j5L0k1NPmm5N3Jp7
5940g6Q6m0l0J1O3j19m8J65r2l1O5P2j18n6J43O8j01k2M7m4NJ13Jj07M4n5J61
5967A05p1p3j4J1j3J10m8J7p0J57j17J20r2K4j1l3M5o1qL3J9Q0j97J38j77L1J39
5994D4q5J85j95J19j13J47L1j07L3L8k38K35o8L0o9M6k3O6J3o5j24J33j51J06
6018a2K0l3n9J02O8M5j21O0K6q6J5l2k3J8M7l0jLl5l8J8K6J12M7j10k1J00j46
6046d0N5l6K6K1j8n6J4N3Jm0j97K75j06P7r8j08J61l6n8J8Q3j62K06j62N6M8Q6
$$ y = [-46, -5, 159, 53, 18, -16, 21, 24, 74, -24, -55, -21, -17, 68, 19, -44, -104, 30, -10, 201, 95, -63, 99, 18, 21, 26, 92, 13, 30, -22, 34, -23, -24, 112, -70, -19, 50, 4, 106, 133, 6, 61, -10, -80, 8, -40, 100, 196, 23, -92, 8, 61, 79, 35, -11, -40, 2, 77, 56, 33, -37, 27, -60, 78, 87, -66, -58, 73, -149, -76, -70, 8, -81, -11, 104, -212, -76, -10, -25, 5, -16, -11, -4, -8, -53, 0, 1, -76, 10, -30, -60, -49, 14, -105, -153, 12, -80, -111, -46, 26, -92, -148, -5, 63, -38, -60, -13, -57, -52, 61, 62, -45, -1, -56, 105, 34, -39, -53, -42, -55, 55, 7, 24, -46, 111, -6, 114, 22, 46, 35, 2, 47, -14, -22, 11, 30, 110, -87, 51, -126, -95, 44, -41, 144, -51, 68, -45, 102, 133, 26, 59, 97, -141, 94, 26, 56, -13, 33, 10, 76, 89, 24, -100, 33, -118, -12, 8, -25, -84, 18, 86, 131, 10, 70, 96, 10, 25, -7, -30, -12, 35, 5, 4, 7, -28, -66, -48, -22, 90, 137, 27, 6, 106, -40, 15, -21, 5, 26, 8, -48, -34, 19, 20, -20, -217, 58, -48, 29, -69, -177, -16, -52, -110, -92, -9, -171, 35, -127, -71, -23, 63]
6073F3K0q9Q2j49J19r8J8Ml1J0n9L0J10J8k8PJ4j00K8o7J10n4k7L2J18l6o0pJ51
6102A29k8j68J17m8Lj03J93r4j06O4K4R8j25k2J3J35Nn5j40J1M7J27n4j02O5K80
6128B66k52K1j6n5J9M0Q5r2J7o3J23J7L7j39m8R1Rj14jM5M5ok7M1m9OM6L6l0o5
6158a3P1k6n6Q9n9M2p8o7J11O1m8N5p6Q8K8j36k4J8k6l4J42M3k7k42K66j64P5
6185A3Pj87J54J8j01O1j0J14n6n2R5J2m9j08J21M7m5o6J2q2M1J68k88J97j48J35
6211CK4J9R2q5q8j37K06M5J1j22q6L9J18m2r4J12N2q4J77k23O0k0n8r0K13q6P4
6238C0j43J42k6M1j30P8l5m2k1k1J65q0O0m2j0J12k94J33R7O6Nj76qJ81k7j52
6264i7Q0K7o9r6J88K8K2Mj09J0P2J5m9o9J25r5J8rK1J62k68m3J34J13j46R7M7
$$ y = [63, 83, -6, 76, -73, 46, -52, -34, -30, -61, -51, -110, -80, 30, 48, 20, 27, 41, -59, -31, -98, 12, -42, -69, -37, 81, 45, -15, -22, 129, 101, -67, 50, 2, 5, -98, 95, 1, -105, -41, -17, 81, -44, -66, -53, 82, 87, 32, -108, -97, -50, 77, 23, -79, -14, 266, 14, 35, 19, -36, -17, 23, 108, 16, 33, -30, 93, 110, 147, 8, -40, 51, 60, -54, -55, -10, 35, 29, 2, 43, -6, 0, 46, 82, 52, -13, 58, 32, -24, 65, 6, 48, -30, -97, 14, 75, 27, 82, 6, 94, 122, -14, -38, -20, -46, -80, 62, 105, 78, -164, 102, -62, 13, 20, -167, -13, 5, -96, -35, -45, 69, 13, -39, 56, 68, 19, -89, 32, 79, 34, -32, -20, -102, -61, 107, -181, 16, -132, 3, 27, 46, 138, 53, -35, -172, 34, 79, 90, -32, -118, -79, 39, -3, -97, 15, 67, -17, 160, -63, -3, -23, -81, -171, 42, -44, 30, -113, 29, 3, 44, -86, -8, -43, -85, -106, -127, 38, -42, 18, -24, -34, 78, -216, -83, 14, 80, 85, -91, -99, 82, 55, -97, -17, 10, -59, -155, 33, 61, 83, 87, -22, -12, 60, 75, 26, -43, 82, -13, 5, -4, 17, 179, -89, -132, 2, 115, -31, 66, 113]
6291A13p8R3j76Q8Q6n7l7O3Po4j01NP1m3Q1or4J2R9j04P8r0K7J2l2q5J11L7k1
6320ej07J86lm7j2N7r5o7O4P3L0l2m6k9lj7K5k6K8N5N2o5k6m4n9J00R5J24l02
6349i6P1Nj35R1O7R2j73M4J65j95J0J54r9MKr6j02K27J8j91PJ16r0L8K4M6M9r7
6377d4nn9K3J49j06R5j10N7n3O4J15k29O7j18J20m4J44k8%q7n7J02j3K7l7M8q6
6404f5L3l4k7J4L8J00j37O1k9%R3j28J27m9N7Q8j78O1rl6L4M8j6k8K3j08J33l4
6432C2p0L5p6O6j6N6n0J04j04M3l3P6n1N4l1J7j33M0R4Lk7J44o4j20O4L5o4l0
6460fk1p9J42k9j6k9o4R3Qn4J04j7m6n3J62q8r5j5Q7p3O1L8k2On4MnJ4KM2k47
6491b50K39l9J4J13p6O8p4j45K01n1o3RL4R5j34Mo9Q3KP5j23P6Q2o9p0J07p0j4
$$ y = [113, 35, 128, -48, 40, 126, 69, 32, 95, 102, 38, -63, -58, 13, -30, 51, 45, -49, -37, 62, -42, 36, -54, -27, -15, -47, -132, -21, 16, -5, -112, 74, 71, 24, 12, 69, -26, -93, -29, 44, 74, 42, -4, -33, -36, -53, -28, -54, -26, 29, 81, 16, -10, -54, -113, -13, 82, 206, -96, -25, -20, -155, -64, 3, 95, -78, -34, 131, -64, -54, 100, 1, 5, 7, -89, -191, 36, 54, -137, -130, -14, -104, -66, -42, 4, 53, -44, -49, -108, -85, 64, -42, 53, -57, 0, -53, 11, 126, -103, -36, -154, -34, -78, 66, 38, 38, -49, -106, -4, -17, 10, -27, 21, -65, -32, -66, -93, -79, -41, 59, -78, -17, -46, -46, 47, -81, 46, -3, 54, 142, -36, 25, 16, -20, 14, 62, 46, 18, 41, -67, 66, 32, -38, -3, -79, -13, -29, 27, -23, 81, -23, 20, -13, 63, 12, 66, 35, 52, -81, -41, 53, 56, 29, 173, 109, -11, 53, 88, 24, -6, -27, -106, 36, 7, -9, -38, -102, -9, -1, -55, 49, 32, -14, -67, 95, 7, -88, -103, -16, -89, -28, 10, -12, -6, -60, -56, -61, -47, -45, -3, -250, -11, -50, -36, 77, 1, 69, -5, -150, 51, 0, -63, -54, -20, 75, -59, -55, -124, -41, -39, 36, -87, -11, 71, 2, -68, 39, -31, -45]
6519d5O8n2Q6l8p1R9LQm0p5L4L1R0O1k09J15L1j20L8j38J7J04J6J2j8r8R9l8M8
6548A8J07n9j07J3m0J04J00j53R9j36N0K1n4R3r0Q4Q0j01j02J4M3n7J26p1O4p1
6574b5J3K5r5k1K07mq9K7r3P9p9N1N2L4k5n0N2l3L2lP6j81N7j13K01O4r2jo8Q2
6604H0J06j02l8p7L5k6q8k9P4N6J19j07P0j12L6OKp3J64j57O0j4j3Mp5J28j41
6631a12O9j3pJ58q3j13J01L6kk8j05J00K8j33R9l4R4k2j32Q0J28j26j3J6m2r0
6657a46J08RQJ27k09Q5r4Q7k4K3O3K1j45M1P8p3L5Jj7O3j08J42j98J23j9k5R2
6684D8j75J14N8j8J10j06r6J34j36Q1j14K0L2M8N9LJ44k00k7j04J82K4m6q5L0
6709b0j9L6J0M5L7q3K3K6r1n1O5M8N2k2k0k10J80Ojo2O8k6q4O0Q6M1o0p0j22J66
$$ y = [-45, 23, -29, 57, 19, -52, 47, 50, 58, 18, -57, -23, 8, 98, 159, -50, 65, 96, -24, 14, -124, -107, -3, 13, 25, 7, -91, 8, -30, 18, 125, 66, -41, -28, -68, 36, 136, -17, 82, -54, -4, 17, -37, 56, -34, 50, 130, 29, -73, -59, -16, -73, 53, -18, 46, -25, -12, 13, -82, -103, 104, 100, 11, 38, -55, 24, -55, -4, 48, 82, 57, 7, 59, 26, 58, 55, 131, -50, 7, -106, 95, 159, 67, 66, -2, 80, 186, 84, 46, -31, 4, -22, -110, -139, -65, -9, 110, 3, 73, -39, -3, 3, 5, -68, 96, -61, -1, -15, -28, -24, -99, 29, -112, -43, -56, -63, 95, 12, -101, 0, 36, 34, 6, -99, 1, 29, -104, -5, -39, 55, 33, -99, -19, 109, -17, -30, -14, -56, -146, -38, -29, -21, 106, -103, -18, -112, -25, -49, -26, 37, 58, -87, -46, 32, -41, -6, -5, -22, 41, -67, 75, -123, 0, -19, -44, 48, -127, -13, 45, 27, 137, 31, -65, 69, -67, 14, -100, -80, -48, 0, 59, 62, 206, 6, -21, -125, 57, 81, 35, -50, -20, -39, -3, 7, 52, 89, 6, 29, 55, -36, -87, -22, 26, 78, 56, 36, -174, 6, 12, 11, -51, 17, -9, -93, -33, 53, 94, 34, -36, -158, 8]
6739HJ43n8r3k6o2J84j30p3J47j2r3N0j55J58L8o3M5P1r4k6j8j0J05k8j18NJ48
6766D3l0j3p5J19n7j14K23o4j89J64N2j18J63j50J05l2k4j44J25o2P5p5J22p9
6790c5J14q8j8j0P7P0k88N0J60j99J66n2o8K05j11P2o8L9k1q2J6K8k3M3o6K1L4
6817c4J45jj41j43K55j4k5r9j8n2J59K5j62J80M4j03J24p9r4L0k4O5j6mLM6j32
6844f5J06J34p4j38Q6k0r0J74l8o0m3K5O8J1rq3K1m2J10p5P4rj26R7P9j35J0N4
6872D2r9K03j56p1k1N1k2O9N5J2j05n6K03q2p5q0P1J51m5j30J82o2m2L7K0j10
6898f0K2J01k5k5j34J04l7m7M1l5J26M8m0q3j1J63j25j67K24oJ3j92J01M8M5Q2
6924A31l4j31N5q5R1Mj04K5o3J08L2o3j0j8P0PJ4J87l63J57m1K0N1J4j19l9O8
$$ y = [8, 151, 93, 0, -26, -88, 96, -34, -107, 40, 28, -65, -15, -170, -12, 26, -37, 8, 79, -15, -41, -59, -69, 36, 8, -110, -105, 43, 13, 0, -75, 44, -13, -127, 96, 32, -157, 7, 59, -59, 104, -46, 59, 27, 3, -141, -16, -78, -3, -78, 44, -35, 79, -9, -27, -37, 40, 110, -178, -128, 32, -167, -1, -53, -121, 84, -27, 45, -23, 16, -5, -87, -71, -43, -66, -23, -89, -68, -34, 111, 110, -31, -174, 81, 67, 42, -57, -75, -127, 32, 57, -105, 75, 119, 16, 140, 61, -33, -3, -27, 38, 22, 18, 21, 67, -65, 41, 175, 101, -37, 49, 29, -61, 113, 75, 15, -28, -3, 65, 76, 67, -16, 5, -37, 73, -2, 72, 63, -63, 34, 113, -22, -12, 42, -57, 146, -10, -81, -102, -51, -73, -4, 51, 63, -42, -98, 105, 23, -52, -132, -61, 90, 45, -85, 97, 35, -7, 30, 50, -60, -38, 63, 38, 13, -121, -17, -54, -101, -60, -95, 31, 79, 39, -44, -55, 108, -17, -184, 40, 34, 47, -145, -44, 4, 49, 131, 97, -34, 21, -64, 27, 31, -73, -48, -111, -3, 29, -34, -44, -62, 8, 15, 29, 216, -147, 10, -31, -11, 40, 54, -65, -104, -36]
6951c6qK9M5p0L7J17r7pK2M3p7Kk6p7P5J34p4p9L6M2j0q5K3j08J51Q8M7q8j86
6980a37J53m3j7QJ18M9q4J2nj00L1R0r5L0R6j29JM5m6J2o0R1J4l6Oj51J65N9q9
7009a2J27p3pP8l0j55M7J11k1j05R3j62R5Q8l9J14j86J73j08p1J51q2j7r3P8J7
7035A1j33J58k6N6j55Q1k2m9J65R1j53O5j40O3j69J93n6O3K4p3r3J38n8K2k2l4
7061e3L4j5M0q1K3Mp6J23O8j67P0p3N3pm0J16k3r6J00j4J8J9j42J48k0o3N1n5
7089e8J12j01r1O6P9Ok4R8Q9j58q8N4Q1n2J59k13NM6k0Kj8J4K0o7O4k2L1k4M7
7118C7mj25N5L2M8km8R6o2M3N9l2j2j70J20J9J1q1K0P6J8n1j03R3P9n1rq9J47
7147A14L2l51L39o4J3j52J35n5J9Nrk4Nn0K1J32j17J26j14L5o7R0j14P5nj36J05
$$ y = [-36, -44, -15, 30, -40, -3, 114, 17, 10, 32, 75, -2, 0, -26, -103, -28, 106, 32, -47, -11, 31, 21, -64, -41, -149, 2, 90, 137, 49, -137, 16, -27, -44, -36, 82, 131, 47, 59, 54, -46, -15, 75, -20, 10, 106, -23, -22, 23, -23, -11, -71, 20, 34, -2, 4, -147, 18, 77, -12, 115, 42, 35, 113, 83, -72, -25, 86, 65, -40, 53, -109, -14, 74, 35, 149, -37, 136, 28, -43, 108, 26, 9, -84, -6, 11, -122, 36, 10, 66, -89, -8, -30, -79, 86, 177, 24, 89, -51, 12, -157, 36, -20, 43, 67, -6, -99, 39, -19, 3, -19, -53, -19, -34, 6, -75, -52, -48, -124, -1, 67, -100, -30, -103, -50, -57, -97, 19, -4, -100, 0, -14, 4, 23, -119, 29, 9, -54, -3, -58, 54, -47, -138, -72, 7, 13, -11, 87, 176, 18, -70, -16, 65, 13, 172, -41, -36, 10, -10, -8, -26, -12, 8, -59, 5, -17, 14, -10, 37, 33, -92, -37, -5, 43, 41, -7, 89, 27, 70, 129, 97, 85, -85, 35, 54, 65, -16, 4, 80, 98, 47, -56, 37, 116, 65, 56, -33, 114, 146, -205, 134, 70, 83, -69, 66, 11, 30, 35, 26, 2, 7, -43, -22, 110, -7, 119, 5, 40, -27, 63, -51, 24, 19, -117, -12]
7174a2j5N8L9n7MNO1j2n4K9k4J03j15m0n8Q5L5K7M2N2j30k0n3P4k6N7j5l4M9n
7204E0o1J3j8M2lO0j41k5J49j29l1O7N8n2q1J03J4J5m0Q3K0J3N2j36r4M3J54j3
7232A12lk67J91M8j32m5J17n%j4N2j56J16K4k1J2o0N2j8j36K21n3j16n0n7K07
7258A9k1P4j1P9j41J03j66Q8j44J19j21J24q2L2Q3k3RL8o7P2L5j01M6l5O4J9j3
7285G9j26J69j76J25K5q2K4k0j19K08l8j03Q4k0q0N8m4O5K2K7k9l2n3Mo4M2j8
7312g2mk1J03N5j00J02r7pPN3q0l9K00q3j94M30j38q6j4j30J18r1O0k6L5p9J83
7339H5r5kr3J50n4q0O2O8j21Q6k9K1J42k9k35J25J3p0m2P1N5q5j0M5j9J4o7J96
7367A02m5J3o9m8Kok1nK2j8R5j39Q9%J21kj22m4J07o6N4J6K0m3o4r1J49L6o9R6
$$ y = [-12, -27, 31, 70, 13, 17, 22, 83, 71, 17, 46, 22, 125, 10, -30, -88, -3, 32, 59, 101, 153, 23, 3, -50, 24, -2, 55, 40, 6, 55, 50, -11, 2, -16, 26, 23, 83, -58, -83, 66, -63, -94, -27, 31, -21, -102, 1, 15, 30, -10, 73, 93, 106, 158, 22, -72, -29, 125, 112, 109, -158, 33, 81, -51, -96, 21, 16, 16, 2, 54, -102, 14, 38, 17, 29, -31, 21, 3, -133, 88, 35, -81, -131, -188, 19, -2, 72, 61, 140, -1, 102, -64, 24, -120, -1, -122, 2, -80, -48, 35, 12, 21, 59, -8, 64, 99, -2, 44, 9, 73, 92, 79, -47, 122, -54, 71, 96, 14, 38, 18, -101, 107, 69, -34, 50, 30, -50, 8, -36, 29, 51, 78, 49, 17, -36, -32, -96, -54, -72, -76, -97, 6, 61, -39, 63, -34, -41, -34, 19, -61, -100, 100, 17, -177, 253, 115, 29, 15, -115, 3, -88, -28, -54, -19, -98, 85, -10, -12, -105, 45, -9, -89, -27, 41, -80, 6, -23, -2, 140, 111, -124, 1, 14, -56, -98, -27, 28, -57, -67, -22, -41, -27, -94, 102, 57, 70, 1, -47, -45, -51, -72, -77, -55, -73, 22, -117, -28, -28, 93, 91, -31, -75, 32, -34, 20, 36, 56, 13, -51, -142, 7, 43, -26, 70]
7397G0r6j8J02p2M4m9O0K9qm6O5n5L4R0j80jL5o9J04q7J46r1P1j34Q7k6Pl4OM6
7427C0K9j18M1O0o1nK8J28j68L0J0N9J7j38K0P7l6r1O2oj6m3P8O4j21pk1J21L5
7456E8j04q6J49l8J2m9j1J8l8P9j0P2q4K6j1J01q1p0MJ0jJ22l1m4o5P7l8J43r5
7485A5q1N3n5j4J46J17k47P4%O0p2N3qk36J80J39p3j19n8J53J9o7q6N3R1o4J04
7512G7n9p1k9Q3L4l2n0oJ52K5j14qJK5Jj4L4j00OJ46p7o3j9R3o5R8k9mN6j62J7
7543e4K5J1j48J85j12J19J40j02m1p2O2m6pJ7N2n5p9L7P1L5o8j0R1q7N3oM9l0
7571C0Kj39J39o1P1j14J31J27l2j01m5J47j02nj18p5J33K8PL7n7r6N0J31j60N6
7597a6n9J45l1k5J2N3j12k9N5k1PN6j95JJ08P2nl3OK1J2q6l2Q2m9J38p8k3J10
$$ y = [70, -26, -44, 58, -14, 30, -19, 41, 70, 62, 16, 81, 26, 60, 150, -30, -31, 4, -65, 39, -48, 98, 7, 78, -56, 31, 5, 12, -22, -16, 30, 59, -59, -18, 42, -19, -24, 4, 132, -36, -6, 4, 63, 80, -58, -38, 39, 3, -88, -26, -32, -48, -91, -13, 51, -70, -77, -98, 23, 58, -46, -132, 17, -21, -9, -58, -69, -51, -89, -10, -20, 52, -32, -6, -17, 84, 3, -67, -63, -53, -54, 68, 37, -7, -72, 5, -33, 110, 15, -66, -13, -68, -82, 64, 181, -66, 8, 8, 68, -4, 49, 41, -195, -15, 124, 51, -68, -126, 27, 46, -21, -107, -54, 37, -27, 77, 18, -53, -82, 1, 35, 3, -47, -53, 99, 124, 10, 2, 3, 28, 29, 15, 49, -51, -45, 101, 24, -39, -58, 35, -30, 68, 39, 35, 91, -71, -54, -29, -18, -166, 19, -93, 26, 166, 64, 23, -49, 13, -33, -40, -23, 29, -26, -105, -68, 3, 38, -30, -40, 51, -36, 17, 11, 60, 30, 32, -107, 32, -29, 42, -72, 59, 186, 154, 53, 8, 155, 53, 48, -70, -145, -12, 16, 23, 60, 3, -93, -43, 88, -72, -16, -75, 70, 39, 14, 26, 79, -33, -62, -7, -28, -21, 35, -160, -159, -51, 21, 16, -17, -11, 10, 22, -64, -96, -14, -63, 75, -3, -26, 84]
7626H4j37N9N1k1P3j69J08k0j44L6nJ72j68N2j8K9J4j7L0j41J62j06J43rp2O9
7652E5M4o6j16J02K6K0m5J9K8j08M1J13j49LJ22j5l4n2M3L4m4L5n4j46K34j09
7678a9J60k13J10l3k6l3K1j0N8j18J3K29j09o7j7OJ47o6k1K8l8Ol9n7J27j3r3
7705f7M7R3k6lk1M0l0l1O0l0n0N9o1J3L2l2j4j2%N8k5o4OJ02Jk9nN4p3J3m8J19
7737G6j28l1J71j67K15nj93m1J96j64P1K7k9j85K81j39L7N3Q8n2m5j01M5j7K3
7762a4l3l4l3Q0o1J11O7j29N4j39J31k6O0r0R5l2j61J14J3q4R7K1nM8M8j27J18
7789H9j14L7j01k5J06J1jn6M2J07p6j33J18pn8J51j14J9J4j06J27q7J30j9Qj74
7815a12J24p1mP0N3l3p8K7R1j32N6k5l3J26O3j17J8J8LJ6p8P5L4k2j23J09nK8
$$ y = [84, -53, 6, 57, 36, 109, -60, 48, 28, -116, -80, -85, 87, -81, -29, -47, -18, -4, -21, 9, -132, 30, -76, 67, 58, -14, 55, 99, 33, -83, 19, 45, 65, 20, 39, 67, -41, 0, 113, -36, -33, 89, 74, 40, -12, 31, 65, 21, 56, 2, -144, 90, -19, 141, -72, 38, 5, -21, -54, -33, -43, 15, -103, -90, 139, 30, -37, -54, -48, 99, 33, 12, 40, 2, 8, -31, -88, 39, 26, -67, -20, 73, 47, 44, 23, 63, 33, 2, 62, 32, -18, 41, -20, -7, 25, -7, -21, -33, -33, 25, 0, -64, -58, 44, 45, 16, 11, 65, -8, 5, -43, 76, -52, -83, 88, -79, 136, 131, -62, -103, 93, -71, 0, 27, -2, -187, 94, -45, -8, 45, 133, 81, 36, -65, -20, -37, -14, -47, -81, -114, -34, -95, 16, 83, -46, 8, -131, 0, -26, 34, -56, 39, 7, -154, -40, -27, -111, -14, 7, 2, 50, 98, -29, 89, -25, 12, -89, -114, -8, 3, 2, -54, -12, 95, 19, -114, 4, -3, -61, 90, -24, -5, 9, -97, 30, -57, 73, 54, 62, -112, 12, -59, -63, 7, 60, 27, -51, -24, 67, -65, -9, -34, -67, 59, 122, 5, 23, 41, 44, 60, -18, 57, 91, 69, -54, 55, 50, 78]
7843G8o3j01N3P7j8nK0Mk8N3j07j9L1j7J88k09P3k2q0M1J07o1L9k5R0q1J6RL9
7872H2j24m4J15l7l2M9r9Q7K2j7m9O5K7nR3m7p9k0J10k0n5k4OJ07j78M0p3J94
7900I4j39O1k5J11jo3l6l6Q2j2k1j62K0J15M4l6N1m7l3O4Mm2l4M6m3Q4j78Q1M
7929d7P2Q9k08R8P1p0L7J56j59j31rM1J74r6j5j8p5J83k05K06o8J8n5R7q1K6M
7956C5m2k2P2L3p3K1O8q5q6O4L9p3m8J37N1n5j50J19L9j05n4L5N6l2P7j05Q9l2
7984b7Q4r0n8Q8m9J9L7L0q2J8J61p7o6k8J07j16j0M7N2j01L4KP1j3m6%J29o0p7
8013b1K1O9k8pj5q5L4n1J29K4l2j98N9O0Q7nP0j71pJ81j28o9R0J1o0M7m1N2m7
8042c1n2L6R3J5Nl4M0r3j4J09j27m8J13m2L5k5pM7n4k5L9l3L7l0k0N7J02q8P6
$$ y = [78, 15, -86, -33, 44, 26, 21, 41, 45, 17, 70, -37, -56, -25, -42, 146, -63, 10, -12, -92, -51, 56, -5, 34, 9, 99, 18, 34, 43, 82, -42, -86, 29, -8, -40, 9, -90, -3, 19, 2, -47, 18, 45, 40, 133, 86, 7, -13, 97, 77, 22, -2, 4, 111, -67, -27, -100, 94, -45, 16, -9, 102, 101, 38, 2, -34, 48, 36, 15, -147, -127, -12, 32, -4, 47, 0, -33, 31, 35, -7, -41, 5, -38, 46, -132, -51, -47, 25, 114, -94, 4, 75, 5, 42, 198, 39, -92, -101, -60, 114, 18, 3, -15, -90, 93, -112, 94, 26, 44, -11, 86, 5, 31, 35, -7, -29, 43, 76, 3, 24, 92, 7, -79, -15, 24, -49, -97, 40, 91, 36, -114, 5, 44, -61, -115, -80, -24, -56, 21, -84, 5, -27, 57, -33, -91, -3, -52, -33, 4, 34, -48, -30, 131, 54, -12, -40, 67, -49, -59, -12, 40, -61, -27, -25, 46, 33, -13, -13, 116, 56, -21, 0, 69, 41, 34, 19, -66, -32, -83, 46, 70, 38, -160, -101, -41, 46, 41, 111, -60, -67, 114, -14, -83, 7, 18, -42, 5, -36, 16, -31, -83, -47, 46, 61, 66, 32, 72, -21, -35, 74, -53, -101, 12, -30, 5, -20, -27, 20, -34, -59, -20, -53, -16, -46, -66, -9, 93, 5, 81]
8071H1j43k2N3O7m9k3j0J02q9r6P6J13j47N4l6R6j19J74q4M8n1p8J05P7j40J38
8097I7o0N4j00j31J71j4L4qm0p1N3m9QP9o6M3l2j19J23L6n8K3O2j9k4o8J00j8
8125FRk9K2M2j23J34l1n8R3l4j08J8J15j66K31j94OM5J16j06J22q2Q7j49LL9k1
8152a3J16nl1Mk11J17k6J75j23n9Q0j41J89j77J19l0lM9N1j02O0q4k0Q8o5J09
8178F7j87J60K8k7K4o9N1N8l8j22N4n3L0
$$ y = [81, -62, -84, -31, 36, -13, -36, -46, 56, -33, -129, -53, 60, -87, -33, -69, 27, -92, 82, -2, 46, -5, -83, 22, 99, -41, 97, 37, 91, -9, -140, 31, 17, 51, 43, 3, -68, -15, -64, -56, 23, -43, 0, -32, -151, -28, 8, -50, -27, 35, 16, -8, -76, 24, 6, 15, -14, 8, 50, -73, 61, 30, -28, 65, 31, -77, -59, 56, -110, 121, -73, -67, -22, 94, -12, 110, 28, 115, -34, -31, 8, -13, 103, 98, 67, 71, -140, -23, -49, 126, 3, -56, 24, -117, 72, -105, 14, -16, -19, 30, 81, -21, 39, -45, -65, 23, -42, 67, -120, 40, 68, 41, 65, -4, 47, 105, 67, -55, -1, -54, -24]
8191b4
$$ Imaginary data points
##PAGE= N=2
##DATA TABLE= (X++(I..I)), XYDATA
0@%%%%%%%%%%%%%%%%%%%%%%%%KpJ0j0J1j2J2j3J4j6K1k5K6k6L0l5L7m1M6n1N6
45B9o3P1p8Q7r9J12j26J45j71K05k52L24m42O72j295N350K1658r475k7055j2863
65b3266J5397K3762L961k0075j8483N558K1103J0359j1154j9045k864J5891J4731
78A5875m216j6803r155Q714J6786N021j3920j5345K043J6130J0892o644j6933
91g555o075J2213J4772q99j4457j0061N991J4743N147j1354j2764J900J3285P813
105A2699o900j3316l174J1267J1083l409j2598o223P415J1769J468j1255q591
118i765N024J0652L385p382r008N32R468N871n256q797j887O908P486j064q523
133b356n720M151Q502L285o132r081q38R461P701l911j0580m466O910J0736Q78
$$ y = [0, 0, 0, 0, 0, 0, 0, 0, 0, 0, 0, 0, 0, 0, 0, 0, 0, 0, 0, 0, 0, 0, 0, 0, 0, 2, -5, 5, -5, 6, -6, 6, -7, 7, -9, 12, -13, 13, -13, 17, -18, 19, -22, 24, -27, 29, -34, 37, -41, 46, -53, 59, -67, 78, -93, 112, -140, 184, -258, 414, -881, 4469, 26127, 16652, -10403, -23266, -7869, 15893, 19854, -221, -18704, -13146, 7957, 18316, 7162, -11883, -14747, 1144, 15875, 11659, -5144, -14299, -5585, 11201, 16222, 2302, -13043, -11000, 5130, 16022, 9378, -7555, -13630, -1417, 13355, 12456, -2001, -12062, -6071, 8672, 13819, 2465, -10299, -8399, 4886, 12699, 5799, -7517, -10691, 576, 11659, 8250, -4348, -10571, -3156, 8613, 10081, -1174, -9765, -4741, 5911, 9296, 1914, -7094, -6562, 2906, 8777, 3521, -5276, -7163, -255, 7231, 6167, -2356, -8076, -3925, 4577, 7862, 1730, -7351, -8189, 1272, 8973, 5062, -5518, -9984, -3074, 7662, 8540]
148H540j0915q765M884J1744M094q523j0798N45J1751P296o129j0841k566Q316
162a367R385j255j0419o180N302R545K567o787q212KQ486O168l107q104l920M509
178c387Q154K075p125o844J453P435M745l104q153k617O398P191o98p354n240
193g071L396Q179K574o392o672J322O773M274l320o946j591O201M952k002n564
208a887k264L198N049R6m595k850K082L385J230k108l131j9K912J807j390j934
224d19r01J184K334N69k447j991J027K377J516j625l202m16L680K361j927l534
240a414j126K825L924p01m803k060L234M084l4m284l461K243N216R26m296l780
256c507Q97M420K905k610n082o08L957L182n91l642k657J408M054J296k648l060
$$ y = [8540, -2375, -11140, -6256, 5488, 9582, 1059, -9739, -9194, 2557, 9853, 3724, -7117, -9683, -1367, 8018, 6763, -3656, -9836, -4534, 5011, 7578, 791, -7421, -7419, 1067, 7235, 4128, -3976, -7896, -3387, 4767, 6842, -283, -7127, -5674, 1761, 6506, 3402, -4751, -7368, -970, 6221, 5523, -1831, -7071, -3675, 4504, 7078, 686, -5986, -4664, 2109, 6383, 3063, -3883, -5474, 727, 5679, 3677, -1887, -4151, -953, 4096, 4192, -403, -3253, -1171, 2214, 3444, 1336, -1795, -1814, 1098, 2905, 1515, -419, -1320, -136, 2198, 2767, 320, -1671, -644, 1733, 3249, 1624, -1578, -1994, 1686, 4047, 2120, -1414, -2540, 285, 4209, 3508, -1295, -3355, -121, 3963, 3929, -355, -3816, -1573, 3643, 4569, 273, -3507, -2610, 1810, 4715, 2105, -2977, -3585, 372, 3554, 2963, -679, -3336, -1928, 2126, 3422, 774, -2286]
272b286p33K757L382l80m074k305J959L557J611k587m473m85M520L594j801m734
288b478k370L252M828L77m863l356J786M340J985k950m043k3M012K273j722l082
304b034r00J865K737M0k634j227P13J548J228p58k003n68J419J331K44q56j649
321a504l71J941J445q80j673m26J005J447J76j831p56J279J188j46j111j120J049
338b88J655k90j697m64J390J059m28j391p26J265J730q08j619j51J078J234m8
355A501j672j016J213J662j79j127q57j71J329J202n69j610l08M49J362Q97r66
372A140j846j89J419J437K33j916k138J162K787N61j796k385K0K301K194j169
388A815l186n68K204K207K9k763k035J394K703M82j733j814k98J603J922l78k181
$$ y = [-2286, -3019, -262, 3120, 2740, -1334, -3639, -1680, 1877, 3488, 901, -3572, -4057, 463, 4057, 2256, -2478, -4848, -1596, 3232, 3609, -1254, -4610, -2824, 1516, 3501, 551, -3492, -3515, 497, 2770, 1048, -2034, -2934, -1069, 1668, 1708, -926, -2153, -1440, 108, 1336, 578, -1425, -1993, -574, 757, 1001, 145, -1504, -1875, 66, 1511, 631, -1042, -1468, -463, 984, 1160, -671, -1427, -148, 1040, 894, -217, -1337, -288, 1367, 1077, -620, -1084, 306, 1365, 937, -454, -1180, 85, 1815, 1007, -612, -763, 315, 1549, 1501, -171, -1187, 26, 1688, 1509, 382, -475, -646, 683, 1885, 1316, -294, -602, -153, 1209, 2106, 1140, -706, -895, 524, 1961, 2194, 278, -1860, -698, 2089, 2650, 854, -1531, -1511, 790, 2984, 1815, -1371, -1939, 265, 2472, 2501, -262, -2297, -903, 1800, 2282, 549, -1265, -1563, 40, 1962, 1584, -597]
405e97p45N86J288J002o87j668o30J127J280L65j194j774K57J794J204j126j663
422a181o65J289J723j49j963q74J106J237K80j163j163L06J477P7o20l00n5Q9
440e49L11J56k83P2R6n31n3Q37%j39n53m03N49R50k92p65k41N43K50K39k16o56
462f78J6O29K01p6p0m89k69N63O01K2l74p07l39J213J051p18j105n51Q49J507
482A276M08j584j596R46J613N70q38j576l49J741J166n84j332o12N31J297O26
499A703j126j215J05R60P73J55j033j121L67J302Q11m90j420p81R64J718M1j419
517B94j166K37J417J180q91j718j99J228R42q2j028r72L67J515N7r30l28m00M91
536A4Q03M9q78l05l9L32Q44m2r31n23K29P06N10k16j155m86P74J036k41n87o67
$$ y = [-597, -1342, -756, 532, 1534, 847, -821, -1451, -324, 956, 1321, 127, -1647, -1390, 404, 1608, 482, -1181, -1846, -557, 1166, 1017, -946, -1820, -714, 523, 803, -360, -1523, -1217, 260, 337, -283, -583, -638, -549, -238, -82, -365, -293, -197, -728, -781, 56, 56, -83, -636, -1039, -490, 460, 168, -597, -838, -295, -45, 194, -22, -678, -662, -33, 168, 92, 22, -467, -736, -173, 428, 450, 76, -631, -970, 243, 1294, 576, -529, -1080, -231, 1276, 1684, 100, -1496, -550, 1063, 1633, 795, -781, -1130, 611, 1777, 1193, -139, -751, -220, 1077, 1703, 577, -638, -533, 427, 1200, 1355, 322, -799, -432, 870, 1681, 1191, -229, -1010, -46, 1672, 1713, 294, -872, -635, 782, 1962, 1071, -647, -846, 382, 1324, 1242, 214, -758, -391, 1124, 1181, 251, -77, -477, 14, 817, 866, -12, -317, -356, -24, 820, 778, -153, -676, -447, 259, 769, 553, -602, -1088, -314, 722, 481, -106, -773]
557g73o0R97N34p25n85p7L23L00M75n29o28K12P4L34M66l95p99n5N91N09J31n85
579b65j081K59J141O57q60q03l70P34J276l24j088n22N20P47N38l80j153k14R80
598b08O01Jm44q68j30R52Q78l58q76n54K56J223O61j056j087K49P62Q60J67j601
618e72o49Q13J260K50p83r81k24J135J023l20j232k91K95R14O24p72p65M3M82
637B50M54M07n92r80J13R91L42j05n77p16K96J195J93q68p08j22P88R07k80j130
657a42k72N80N25J28j85q41r7O28M14k9j96p55j55O63N55q9n81n87r0R24P28q01
679C25r30R2L97Q27K64j000j015N69R47K37l83q09l38N78Q23j40n07o10l51P28
699b96R44j20r57n56K18Q22N73m04j054k61P68O85K1o10r85N5J280M30n04q22
$$ y = [-773, -833, 164, 698, -27, -612, -689, -366, -66, 409, -120, -748, -536, -462, -128, 338, -57, -856, -911, -320, 189, 320, -265, -1346, -1087, 54, 711, -149, -952, -1322, -588, 688, 364, -724, -1246, -726, 21, 559, 179, -974, -1188, -208, 393, 394, -50, -918, -1048, -96, 782, 424, -452, -1006, -750, 473, 1134, 78, -1009, -760, 2, 862, 1029, -572, -1221, -408, 852, 1102, 319, -662, -886, 249, 1272, 952, -280, -571, -276, 638, 1262, 490, -275, -232, 250, 704, 1111, 519, -461, -348, 643, 985, 880, 303, -413, -117, 1078, 1271, 403, -305, -427, 361, 1268, 988, -142, -414, 166, 691, 819, 634, -207, -304, 324, 738, 709, 513, -242, -397, 266, 821, 732, 151, -436, -526, 398, 1126, 325, -605, -513, -116, 711, 975, -25, -1040, -471, 476, 713, 330, -479, -817, -239, 584, 444, -63, -673, -1024, -296, 648, 528, -429, -985, -767, 55, 628, 224, -830, -1091, -323, 362, 383, -227, -1212, -1157, 123, 553, 49, -773]
719g73m71O03J098J29j135o93L26P88O04l61j032l21P67O14J08k93q05l05R93
738a59P40k65p38n75rJ171O41o20r32j58N29R34J69r12q20N24P77L44k13q19l70
759g61N92Q48q4n12m33o1N96P51l16p69k37K32O32O58m32r61l08Q08N02P5m01
780D19p17j67R59M89l05o01l91K66O50L70o32n73l2L67O47J06q21l87M04N71J38
801G60n7q22l00N10Q58l09k45n69l01O72O03j31p21m76J39Q19N32o73r02L9P73
822A99M90j2o25q10L49O80K33l08m99l60L38P82Mp47l50O4L11Q01j44j006l85
843i95N62N94K50l63r10q6Q17M92j66o21o48K35R42L64o51o86j5N55N25J24n94
864b75p53K11N99M04L4q06l35M47P04K7l68n89j80M83Q68k49q06q8m5P10N10m73
$$ y = [-773, -1244, -641, 457, 586, -549, -1242, -916, -128, 476, 115, -917, -1238, -471, 143, 251, -42, -847, -1152, -159, 581, 316, -422, -997, -1006, 165, 806, 186, -746, -904, -375, 559, 728, -184, -1004, -480, 297, 641, 428, -391, -761, -169, 679, 595, 83, -350, -411, 185, 936, 620, -149, -386, -154, 478, 1136, 704, -257, -565, 243, 745, 820, 419, -298, -465, 494, 983, 678, 77, -314, -48, 602, 972, 340, -233, -265, 102, 749, 855, 34, -353, 51, 622, 760, 703, -119, -419, 91, 949, 640, 395, -174, -475, 197, 800, 669, -52, -528, -389, 430, 962, 289, -613, -574, 199, 689, 677, 52, -758, -409, 271, 504, 196, -303, -663, -325, 457, 461, -286, -636, -572, -261, 540, 396, -610, -995, -433, 161, 411, 48, -862, -948, -131, 361, 195, -426, -1074, -839, 103, 467, -184, -870, -885, -330, 195, 319, -275, -1028, -817, -218, 186, 220, -586, -921, -474, 230, 257, -111, -700, -880, -397, 471, 222, -584, -672, -717, -7, 503, 30]
886C0o21r3N91N14p6l70o58J88Q65K53m03l93l20J83Q57J03p68k46JM29N96J2
908F74q34m71N84M00M11k28o96l49Q03M27j90k44o66J40N80O22m31n99k54M95
928A74N50R7n41o89K66M73L26J31p49n56L96P60J67l28n18k20K99P45r7o67k20
949b01q3N36N67l36p15j54M12M13N5k88p15J27O38K47k94l98m78L52O52J36n34
970f1l94p9K01Q07k8p71m21M00K63L57l5p41k17K94N43Rl23m72j84O60N65l59
992A4m76l05J71N47L71o17m70M0M83K96J68n53o57L83O18K36l47m15m17M14P29
1013B13m9l74m99K1L50O13q4o76k04L01L59M57l97o88pO28L69j27l28l58K7P45
1035B92J35l18l42k40L56O45j0m64m53O7N04L52N0o12n54N39N98M8k23n56j61
$$ y = [30, -591, -684, -93, 421, 345, -25, -683, -495, 370, 623, 220, -173, -493, -310, 547, 650, -118, -364, -363, 66, 662, 674, -160, -631, -47, 353, 764, 536, -160, -509, 294, 721, 531, 287, -379, -239, 341, 963, 532, -67, -321, 174, 724, 821, 280, -409, -143, 330, 656, 787, 38, -518, -122, 638, 805, 477, -41, -261, 38, 783, 686, 19, -201, -284, 252, 819, 483, -232, -386, 26, 439, 494, 206, -509, -382, 256, 503, 209, -189, -667, -315, 337, 473, -61, -455, -534, -333, 474, 446, -325, -746, -346, -83, 274, 239, -502, -719, -425, 118, 127, -196, -668, -852, -192, 373, 14, -462, -767, -596, -49, 322, -295, -765, -725, -242, 54, 222, -331, -988, -605, 13, 249, -98, -513, -930, -516, 213, 164, -210, -709, -688, -338, 275, 191, -485, -689, -388, -29, 428, 31, -657, -664, -36, 333, 206, -122, -480, -453, 292, 427, 109, -233, -473, -117, 528, 518, 54, -399, -332, 172, 524, 574, -38, -592, -53, 545, 593, 370, -186, -347]
1056c47N05O40k12o31k13K26M16M82n60n12J6J69N69K33o17m31J62O40J43k51
1076D27k67m41K52O98J52o89j69j88L21O79p7p71l89L66L40L18j62p03j48O27
1096A76L60mn24l68q0O73K54l34m82j03J28N75J76m87m58M0L18L73M1m88m69L49
1118c34M63Q1j30n73k45N33M91k03n12k26j15O68N07m51o22m4K07N69K64m50o74
1139g96J75M58K80j05l58m25J37P66Qj67n55n8K84N85L1n77k79J22L17M23j34
1160A32p33k29M99M98J12l29n13l1P28L39k83l30l19R4N77L83n21m51J07L13K90
1181C33J35m22m36J49N81J40k74l32k69L43O28m8n24k32m0M18N80k02o77PJ72
1202C0M91L16m36o19L5L44L53L7m48m87K58O70P6l07l65k10J89P40l8n25m55K00
$$ y = [-347, 158, 798, 586, -45, -258, -32, 384, 866, 306, -206, -190, -21, 548, 781, 164, -267, -105, 535, 678, 427, 160, -281, -29, 669, 821, 132, -37, -225, 96, 775, 698, -73, -462, -96, 244, 562, 400, -303, -451, 176, 536, 532, 8, -360, -440, 233, 487, 153, -329, -432, -304, 271, 447, -40, -498, -458, -140, 233, 274, -214, -683, -334, 129, 210, 80, -493, -738, -205, 286, 83, -429, -655, -770, -102, 405, -46, -668, -712, -505, 64, 328, -122, -796, -621, -163, 117, 12, -346, -771, -634, 132, 140, -27, -582, -640, -356, 229, 260, -317, -596, -474, -157, 266, 132, -601, -830, -331, 167, 279, -50, -563, -594, 134, 473, 190, -140, -459, -365, 212, 595, 74, -377, -270, 43, 333, 468, 46, -390, -241, 340, 480, 206, -126, -395, -52, 576, 528, 4, -228, -268, 150, 730, 528, -149, -142, 30, 521, 837, 401, -218, -183, 161, 514, 551, 103, -384, -126, 544, 620, 313, -52, -262, -73, 667, 629, 104, -351, -151]
1224a51L84K39Q4p82j85M28L26J21k00n94j52N04M74k75l05k21P6L34M66m42m56
1245c27j18L16M06J11n37n29L18L29K37p2m29l63L02N89J5l25l88r0J72O49j39
1266A27n74r6J6N71K71m30m36r6L82L12N0k84n57J13O39J23k28k73k74J49N34
1287C9J52m07l09n1K89K63K06o28k08K47K66K51q0m46j69L96M40n2k55m42k7M86
1309c9N33l99m58ml0M52L37k48n48J11M54J12J36l80n03L53N66n1j54k81k59K10
1331i0O59q0l69k31OK60M44p9n51k46L26L69K30l12n23j41O39K33j44k83m31J52
1353a62O23K9k64k82m8J47L70J67m93m34K78L86Q3Ml97l93M61M83K2m10l22l16
1375d68O70L51k93l66l83M11L04K30l12m56j15L52K93k7k10m11J20M85K5j12l26
$$ y = [-151, 233, 472, 556, -226, -411, 17, 343, 464, 264, -330, -482, 22, 496, 221, -84, -305, -229, 105, 571, 129, -327, -445, -129, 277, 388, -149, -678, -360, -31, 206, 134, -295, -658, -356, 233, 248, -77, -465, -555, -383, 266, 127, -447, -543, -527, 44, 315, -115, -551, -647, -265, 47, 97, -187, -744, -631, 8, 131, -97, -370, -644, -495, 39, 191, -216, -525, -576, -287, -24, 182, -446, -654, -407, -141, 110, 30, -416, -585, -189, 251, 199, -56, -498, -525, -39, 494, 95, -363, -367, -397, 55, 392, 144, -404, -293, 161, 273, 409, 29, -474, -121, 445, 394, 240, -41, -300, -90, 569, 489, 120, -111, -105, 155, 599, 520, -31, -277, 49, 418, 648, 336, -187, -328, 311, 544, 400, 117, -314, -162, 461, 490, 226, -56, -104, 43, 413, 580, 87, -347, -69, 317, 400, 404, 7, -386, 75, 558, 580, 170, -152, -468, 202, 553, 260, -106, -489, -78, 226, 456, 144, -312, -427, -75, 218, 191, -19, -430, -310, 175, 200, 88, -238]
1396b38l17K13M44K03n29k70LL57M54k59m94k81K75M49J52l41l49j93O00K48j41
1417a4k30l46m8N72L22m14l20j37J75M01L53l05n78O6K22M44J14o09m53L65O35
1438B15r7j08l87q3J83N47j67l39j54j1L60L71k20m17j48L05L15L06l83m17q8
1459d17N36K28n6k57m20R9M67M28m19l72p2J35M93J15n46j87K05L41J84Jn11k23
1481b48M27L14mk54l51k3M18K51j28l31j77m2N04J68k33m54J78J06M85k4m27m10
1503b55K68L73O7j79j70k83J65N86k34l65n8O2J42L98j7o26j69K72J86K99l12
1524A50m71J7K85L69j58k31m74Q4O30Lj60l26r0J27L25K03n55k12R6L65K78j58
1546I7m43j52J91K94O4j88l18j31L28L20l1l35r5o5M47K06k34m94p4L22K64K29
$$ y = [-238, -555, -342, 102, 305, -224, -494, -491, -134, 320, 61, -433, -714, -439, 10, 162, -179, -528, -721, -121, 127, -14, -244, -590, -638, -66, 256, -158, -478, -615, -440, -39, 314, 9, -569, -503, -281, 163, 277, -332, -785, -420, 215, 118, 10, -377, -460, -277, 270, 103, -236, -390, -401, -41, 330, 110, -307, -455, -150, 165, 471, 88, -329, -417, 119, 347, 291, 34, -386, -287, 180, 608, 189, -183, -255, -120, 373, 488, -58, -245, -40, 301, 485, 486, -25, -248, 179, 493, 489, 235, -116, -139, 279, 530, 402, 71, -106, -148, 356, 524, 291, -163, 15, 121, 606, 582, 155, -255, 13, 386, 453, 274, 104, -179, -14, 572, 338, -27, -85, -23, 119, 517, 500, -126, -295, -23, 163, 462, 150, -321, -304, -19, 350, 192, -39, -513, -429, 201, 204, 44, -282, -372, -245, 80, 283, -272, -484, -388, -23, 255, 97, -346, -498, -307, -13, 51, -137, -455, -586, -258, 62, 31, -304, -399, -464, -17, 189, -45, -539, -613, -291, -27, 202]
1568B02k38m82O0M02J38j34j57n13L70N77J9k96m20J05K25L93l8n40k2J75J28
1589d6J40P4n22J08J67K85K5k21l97K5M14L89k33k20j94J7N14J36l09l17J7K75
1611A27L83o8l19l70J71N22kj58l15r8K75M14m1m69Qj61M08J07K4m18k36K45J91
1634B20M23k42n63Q7L53L06l51r4m13J97M74K9l17j22k28K00M72O5n15k57L6L28
1656H8K84j00m32j66K96K94j38O8l84r5K52K73j18k47k45K3M61K72m31k21j10
1677c76K21L39o4k06m41K78K63R1Q5m59l36L92L48p7j68l44pK43K96q1k49j80
1699d32J24K69K34j64n11j8J79L16M1j87k33l8N29L0k37j45k04J84L63R2l59k19
1721c86o0L72K24Qm11k72L73K07R6O5m16k31M39K57k5k45k58L1L40K56k29l08
$$ y = [202, -36, -518, -458, -56, 82, -52, -209, -722, -352, 225, 244, -52, -472, -367, -142, 251, 213, -327, -349, -174, -46, 94, 168, -354, -246, -79, 206, 231, 10, -387, -362, 52, 441, 208, -12, -206, -189, 325, 461, 152, -165, -148, 127, 510, 442, 123, -247, -76, 446, 444, 286, -29, -127, 148, 562, 521, 52, 60, -101, 307, 414, 438, 20, -216, 29, 220, 643, 401, -162, -75, 278, 584, 233, 139, -274, -77, 397, 426, 109, -13, -241, -41, 431, 496, -19, -276, -240, 88, 372, 272, -160, -326, -30, 264, 126, 194, -190, -285, -33, 240, 122, -125, -370, -347, 114, 386, -45, -266, -376, -155, 184, 120, -86, -527, -249, 14, 105, 190, -269, -605, -213, 135, 58, -110, -454, -461, -218, 78, -3, -252, -432, -308, -39, 195, 31, -480, -498, -319, -3, 38, -149, -382, -420, 109, 139, -98, -243, -447, -263, 100, 192, -167, -386, -446, -74, 150, 158, -253, -525, -152, 55, 151, 216, -200, -431, 8, 265, 240, -5, -263, -232, 108, 364, 135, -173]
1743a73p2J81L79J84l84l65J54K49K60r4m83j86L89L99M4k49j87k39K71M57j51
1764C84l57j69K10J61K18o7l62p8J30K42J80j41m28m3M34J51j97l76o4K00K82
1785C10J26l31j27j17J29K85N5k29m68K40M28O7j12m25r9L04J71J26l48j04k09
1806c28K10M28j86k57k53K75K27K91l53l58N9K93K7L8k09m02J57L92j0j18j84
1827b61k01K43L48m0l71j54J75J58J51m2l34o2J49K74R7q1n34k9L60K68j63l00
1849c49j43J11L81K07k29l26L9m6M94R6m56j77J57K34Q2K0k96l23L32L21J7r4
1871E2k38j14K81L60p8l86j02J59K52K12k22l62j69K92L02J14k23l60J90K81Q3
1892C24o8k87j02J07L46O9j70l49P9o5M29J31m12n7J16K48M7l8n12OL60J33J30
$$ y = [-173, -245, -64, 315, 499, 115, -250, -96, 153, 413, 319, -164, -350, 39, 438, 482, 233, 46, -193, 78, 535, 384, 27, -142, 68, 229, 447, 380, 18, -60, 70, 312, 492, 351, -77, -120, 314, 465, 268, -108, -172, 28, 310, 436, 105, -22, -139, -10, 275, 330, 101, -367, -127, 301, 368, 256, -169, -268, 36, 207, 333, -15, -119, -328, -118, 310, 124, -133, -386, -111, 116, 407, 54, -304, -245, 48, 75, 113, -96, -498, -341, 51, 41, -77, -261, -462, -219, 129, 89, -282, -436, -261, -103, 48, 6, -328, -390, -241, 33, 130, 49, -485, -514, -154, 114, -49, -349, -492, -381, 0, 207, -22, -348, -309, -355, 139, 235, -221, -398, -241, -7, 75, 95, -201, -524, -192, 129, 146, 52, -186, -300, -19, 341, 263, -123, -225, -66, 186, 398, 176, -186, -355, -63, 239, 353, 130, -230, -40, 241, 324, 256, -31, -133, -26, 320, 389, 219, -130, -51, -116, 313, 444, 32, -25, 91, 339, 386, 348, -164, -158, 202, 335, 465]
1915D65k24k28j74L12L58k96l33O4LL95K63m89k41Q2K71J67j36k49k73K42L96
1936C75Lk26k92j76K93L29Kl06j63l1K48L52k57k87k88L90Q4J26j00m96Q2L53
1958A5N4k8m2l56j7K91J32r1j83j12K02L01l1k74l22L08l7K38K2l26l61M39J38
1981d0L0j38l74J07L16L02k19k87J5O7K31J72k00m20J6L77J39J52l81k03J4M80
2003A56p3n3l40j72L02L13R5l36p3k3J32K52K8l54J6O0J96Q4j8m11p3L51K98o9
2027B88k28k93J21M34N1j88k26q6O7L65J77n39k55L35J45K58j33k86j29L00J50
2048C28o3L5k76k48M24L27j67k26k43j9K95L68k87l31J13O7J71Q9p4m04R3K40
2070B12J02O2k31l84J85L59r9j10j65j12J80K69M5m55j13J10K79P4o0l37j55J14
$$ y = [465, 241, 13, -161, 151, 509, 213, -120, -56, -53, 342, 605, 116, -125, -43, 228, 395, 259, 10, -263, -21, 375, 378, 152, -140, -316, -23, 306, 308, 2, -161, -192, 56, 408, 151, -136, -424, -34, 50, 176, 76, -420, -338, 15, 69, 41, -1, -357, -374, -83, 49, -42, -225, -337, -135, 166, 135, -139, -461, -153, -190, 48, 70, -256, -617, -178, -40, -10, -148, -522, -415, -99, 203, -16, -303, -288, -221, 10, 182, -18, -438, -422, -45, 94, 246, -135, -338, -324, 156, 83, 30, -310, -482, -180, 133, 228, -108, -181, -204, -72, 180, 208, -146, -130, -70, 126, 210, 192, -219, -292, 59, 357, 288, 60, -233, -112, 322, 373, 185, -41, -127, -60, 305, 482, -57, -312, 23, 168, 426, 293, 7, -122, 178, 328, 265, 300, 24, -224, 200, 527, 360, 134, -109, -128, 167, 535, 248, -83, 30, 97, 268, 357, 283, -121, -28, 212, 314, 376, 145, -239, -54, 305, 206, 96, -69, -181, -1, 268, 313, -142, -255, -145, 134, 208, 148, -189, -344, -230]
2092b30K94J34j96k06j72L37J48j44j67k13K86J14N4j75j94J44j20M18j36j77
2112b01k53K99J87Qql47j23K05M29j04j42l36m8L76J15n6l75qJ40K88J45l32k46
2135c87k8L52J83P9k83m02K61K35K06k53j16j83K39L17j7j15l22m1L00K48M7m89
2157a69j22K04K50K7j70k38q2L50L61j19l07l8J06J87P8j14l77J35J08J77K17
2178D64k99k12QJ88Q2N7k41k10J89J79J70j52j82j58K72L29j09l37j80J61K74
2199B93J60j15n55K52J23M7L2q9k80K0L25N3j36n6q4m6L43Lj81j98n9K4K83o6
2223I3l43j00K88K19p0R6l93k45L31K78J8k97j72O7J68K52k33j62J2N1J80Q6j30
2246fl37J29J43R5L4k24j89J84J73R5j35k73j24J58M28j06k05k33J29J26J71n1
$$ y = [-230, 64, 198, 2, -204, -376, -39, 109, -35, -202, -415, -129, -15, 39, -136, -330, -186, -306, 112, -24, -201, -454, -155, 32, 40, 32, -315, -438, -233, 196, 92, -50, -386, -434, -58, 57, 1, -374, -382, -242, 46, 191, -141, -387, -415, -63, 120, 199, -84, -486, -225, 10, 216, -37, -153, -336, -97, 220, 203, 88, -234, -275, 25, 273, 320, -169, -291, -87, 163, 190, 20, -218, -300, 50, 411, 292, -15, -53, 53, 240, 318, 204, -173, -38, 70, 247, 464, 165, -47, -39, 149, 231, 288, 47, -163, 26, 205, 375, 223, 41, -117, 155, 484, 375, 38, -142, 19, 293, 453, 338, -217, 35, 158, 205, 237, 148, -132, -112, 213, 266, 130, 74, -10, -56, 287, 290, 109, -89, -148, -124, 159, 93, -250, -350, -62, 157, 87, 183, -210, -455, -124, 154, 172, -125, -297, -230, -62, 190, -43, -205, -193, -142, 38, 124, -6, -343, -214, -71, 24, 58, -166, -355, -171, 2, 97, -38, -311, -435, -277, 151, 45, -160, -393, -264, -138, 33, -18]
2268a8k89k0K51M2j3j58j63K2L24k4o3J47k91O2J59J58j71o9j08K9K65J41k22
2291il48R5L23J70j60l01o5J51L51j16j5k29r2L92K9k3k10O4j09K42J13j93j09
2314d9m1R4J27K50k41k44K8L51o8O0r9k63J13L91n9k45j21L8J69P3j28j31o4J64
2338A05J20J73j29l13m2K03J26m8j05o0r8J97K01J1l89rM8J55K39l86k06J13Q5
2361iK32J8k98j83J72J97j7j81m9j40L03K33j13j76r7nL3J58O6l08p7M9J26L32
2385B66l97j59j7K92P0J08l80l9mL52o6j39k34J72O0K16O5m71m6K01J17J21o1
2408B7k99j5R9K47j89N8k63n4K72L02j56k35n7M9K66J57k95k96J44K91P3L9m04
2431b39M1J24K04J6j53j9l21M11J78j93k7K2l34L05K22L6j66k39J38J54J21j49
$$ y = [-18, -307, -327, -76, -34, -47, -205, -368, -346, -22, -46, -109, 38, -253, -191, -32, 126, -45, -114, -222, -193, 72, 213, -9, -357, -262, 61, 231, 71, -230, -295, -144, 207, 91, 76, -153, -245, 147, 176, 153, -57, 7, -102, 140, 253, 60, -49, -90, 4, 131, 381, 140, -104, -76, 275, 207, 267, 168, -95, 18, 409, 350, 105, -16, 22, 191, 264, 136, 5, -59, 105, 225, 398, 269, -44, -86, 117, 243, 195, 90, 30, -68, 129, 330, 341, -48, -57, -9, 146, 385, -1, -207, -94, -9, 223, 241, -57, -240, -68, 129, 112, -69, -118, -258, 45, 278, 165, -11, -108, -113, -80, 78, 144, -164, -241, -192, -66, 266, -131, -290, -307, -15, 55, 163, -217, -256, -260, 92, 26, -113, -347, -175, -115, 101, 166, -305, -351, -150, -33, 88, 27, -272, -287, -188, 59, -130, -72, -335, -389, -117, 185, 29, -206, -263, -214, 52, 209, -86, -382, -238, 53, 126, 165, -239, -198, -74, 130, 146, -7, -26, -347, 64, 242, 49, 22, 44, -290, 15, 237, 273, 107, -132, 6, 160, 281, 132]
2453A32l12l7K43K35rj51k52J03L51M7l16j8k9J05J16J10k45p3m9K62P0j35Nl18
2477a65R8L36k7L4j82k40K94L04j14j72l08nL43Q8k19k21j14L16L66j19k01k44
2499a52J54K09n3j14M7l74K08K84j1j73j99k8N6L80j02k40j88P8K13J72j78k54
2521b65j43L00K45Q9l30l26J80L67j7k65m1j33J38J45R8j84j01l1K3K08K25l53
2543a71o2j6J26K16r9l08k3J66K37j5j50j67q5K55L04k23l11L7K06M9J45k48q9
2566b26J1J95J59j27ok39K9L29M6j52P9l30J45K59J0j33k23LL25J19j50l37m8
2589b62L51J4Q7k65O7l2J30J92j32j34j26K02L6J55j56j08K5k8J79Q1k12j13K9
2612b0K48J12j09p4k12N5K54M1j74j06k42N85Lk37j50jL8J36J35k95j07J05k8
$$ y = [132, -180, -217, 26, 261, 252, 101, -151, -48, 303, 350, 34, 16, -13, 92, 208, 318, 73, 0, -49, 213, 283, 148, 153, -165, -67, 269, 242, 276, 94, -146, 148, 452, 338, 166, -142, -147, 196, 284, 65, -156, -270, 46, 412, 293, 92, -152, 2, 211, 158, 44, 91, -283, -75, 209, 198, 25, -174, -202, -146, 234, 132, -108, -296, -218, -5, 167, -11, -265, -408, -108, 137, 226, -104, -430, -250, 117, 100, -165, -206, -339, -201, -56, 42, -142, -243, -274, -251, -43, 182, -171, -233, -249, -123, 93, -6, -314, -337, -171, 66, 51, -99, -266, -351, -96, 208, -15, -326, -289, -83, -34, 111, -137, -226, -215, -20, 139, 12, 6, -233, -204, 125, 171, 19, 98, -232, -87, 172, 182, 49, -174, -171, 154, 273, 123, -214, -262, 89, 103, 190, -75, -8, -40, 90, 282, 150, 16, -110, 92, 128, 283, 127, 19, 44, 16, 195, 276, 64, -49, -20, 228, 340, 231, 157, -55, 0, 254, 295, 121, 15, -227, 358, 361, 124, -26, -27, 11, 147, 282, -13, -120, -15, -43]
2635d3K08N7j20k20K4L42L9j76j77j61L7K81J92k42k30m4J90J70m5l69m1K34K52
2658A58j18j19j45O1J19J09j61N7j76L7J32P8m3j38K0M7N3p2O3k95K9J28K70R7
2682A91l00k88J76L22n7j13j42j47L42J61j52l25J26J23l2J20m0k89K77p5Q3k8
2704f7L8j57KQ9J04J7j85j68J01K15L34k56k34j41K24K03J4j40j28P6J75J18l18
2727h4o5O1J42N3P9k40K0M5Q5K24j69r5j7q8J04L04j18l39J09J77P2J18k61k27
2751a10P8L04Q8k47k8j78K37K44k14k62m8K72N5J30j43k59q4J88J19J03j77p3
2773en4K7N2J29q4j26n5K84J3r1j71o9J15K86m8l31q8J84Q0km0r0p0Q6J12j34
2799i0Q3j75j0N4K20m9q3n5j78K51J0J5j96j87K45Q2K62k93k52O2M03q3r2j95
$$ y = [-43, 165, 222, 102, -118, -94, 248, 287, 111, -66, -227, -190, 91, 283, 41, -189, -233, -43, 127, 82, -287, -328, -94, 158, 40, -79, -224, -163, -44, 65, -96, -39, -215, -178, -46, 32, -11, -149, -129, -82, -29, -101, -38, -333, -304, -176, 94, 191, -109, -397, -221, 101, 44, -69, -211, -358, -16, 145, -7, -332, -206, -83, -115, 5, -35, -324, -47, -122, -39, -67, -29, -186, -184, -95, 9, 26, -159, -327, -226, -11, 323, 67, -167, -308, -84, 119, 133, -7, -135, -59, 116, 234, -84, -149, -88, 54, 107, 186, -54, -34, 11, 96, 320, 151, 56, 39, -49, 55, 359, 241, -98, 11, 188, 260, 378, 117, -110, -32, 272, 360, 113, 85, -93, 144, 388, 174, -88, -136, 136, 191, 321, 178, -81, -165, 23, 142, 245, 68, -5, -59, -32, 20, 149, 65, -61, -116, 168, 181, 90, -81, -150, -35, 251, 203, -128, -216, -32, 48, 46, 6, -84, -154, -68, 44, -90, -7, -182, -192, -138, 82, 33, -50, -105, -283, -32, -22, -7, -203, -390, -145, -63, 199, -94, -346, -284, 119, 36, -56, -251]
2823b51p2K22J99j68j39K3M1m1K83m5j57p3J0RJ55Q8k10j46K20Q2l1j13j03j01
2847c18L07J26k4k10n3J59J11P0k37j44K4K35M3N7j85p3K17j7m4O6j39m9J25J72
2871B19j08Kl08J00J75J67q3k56J7J75qK12j21k14m7K31K76k78k08j5J25K63j70
2894A46j41j8L9M8R3L9k44J18p0O5K20r6j78o7Q2K9J90j06j01k23K21K33j45k20
2918h6q2O2L03K7j65k68O0J79R4O4k21j20j0L06j52Q0j18j00MJ72R3k04o8k8J57
2943b1K49j32l36mJ56N0J17J7l52RL63j35M7j44j86M7K95q2o6j8oq2R3K78l25
2968a68l8J11p8R2J79k21j20J37K4K14p9l58M4K40K11j11l0j49M9J00J55j87k01
2991a84P2J01Q7q4n2j00R9J22K2l1l1j35lN7J60K4j71j18M0L24j7k25j17J72J09
$$ y = [-251, -323, -101, 98, -70, -209, -186, -145, -186, 97, 52, -105, -178, -168, -159, -4, 84, -126, -272, -52, 30, -1, -114, -217, -318, -11, 115, 91, -119, -172, -13, 98, 168, -69, -213, -189, 46, 89, 146, -39, -112, 105, 88, 44, 110, -29, -78, 47, 219, 111, 113, -195, -95, 80, 247, 164, -92, -75, 100, 92, 304, 183, -31, -78, 153, 429, 151, -57, -72, 53, 316, 146, 5, -13, 26, 74, 167, 206, -38, 80, 10, 75, 295, 199, 21, -46, 36, 65, 255, 149, 48, -175, 46, 279, 134, -86, -168, -106, 197, 224, 59, -209, -149, 30, 124, 188, -33, -153, -163, 143, -9, 71, -47, -147, -143, 29, 122, -82, -150, -178, -21, 228, 96, -240, -244, -88, -38, 79, 96, -256, -247, 116, -19, 28, -116, -302, -255, 40, -42, -108, -126, -132, -214, -121, 157, -168, -206, -95, -173, -81, 98, -123, -243, -106, -82, 132, 53, -305, -261, -21, 190, 79, 49, -100, -51, 49, 204, 17, -184, -112, -11, 76, -8, -60, -160, -61, 61, 83, 52, 21, -114, -117, -60, 100, 124, -47, -165, -125, 199, 182, -43, -160, 12, 121]
3016A21K02k50j88j0J58J25L8j16r2J01k5K35j89J5j25qJ09k4L5m4j61P9J61J38
3040B85k61J0q2J07J40K1j10k56J48L18j81r5j07l0J74J38o3k26R9J15j19J12
3062A37r2j04K4J17Po7L8j53n5K05M8k7n1j34J23J31p2k09j0o3K01J59Jk05j98
3087b49R7J96o5k0j69l6J49mJ12j55M0l5J28J23j35k77K0K9K84M8j81j26N9R2
3111g5J11j11k27O5K12J53j21j64L9m2J2J13J4j82J28j20K20L9l6j85q9L00j72
3134a18J18L5j89R1J4K32j16j2k66L9K54O0j43j50J12O1J24kj89m1P5Q0K0J0q4
3159A5j38J09J08j2j49J14m7k2K04r3m3n9m3K71O3j81r3M2J20k7J19k46j38J74
3183D8R5J33j79j67M5J23O6Q8k29j7K9NK56p0k77M8kJ53J21k69j18O3J22J31r1
$$ y = [121, 323, 73, -115, -125, 33, 158, 196, 80, -12, 89, 64, 299, 110, 125, 0, -8, 101, 77, 112, 68, -93, -14, 147, 285, 24, 34, -48, 59, 199, 220, 110, -146, 2, 320, 139, 44, -63, -93, 81, 219, 156, -70, 29, 144, 25, 137, 45, -59, -35, 82, 89, 22, 60, -93, -148, 57, 105, 78, 27, -107, 16, 147, 75, -134, -144, -207, -6, 153, 154, -51, -249, -152, 44, -21, -41, -210, -246, -97, -101, 11, -144, -104, -139, -11, 112, -23, -300, -280, -251, 33, 81, -100, -226, -167, -75, 36, -75, -302, -237, -25, 128, 7, -157, -118, -160, -148, -35, -21, -203, -75, -195, 25, 64, 28, -157, -246, 54, -118, 0, 35, -154, -63, -49, 183, 67, 55, -211, -172, 82, 142, -1, -151, -39, 22, 146, 144, -45, -86, -11, 69, 89, 99, 15, -123, -14, 94, 82, -67, 47, 0, -22, 182, 89, 46, -13, -56, 215, 278, 97, 4, 46, 166, 139, 258, 12, -126, 48, 143, 276, 97, -70, -25, 98, 164, 252, 23, 6, 35, 40, 296, 226, -51, -3, -5, 148, 269, 0, -118, -55, 67, 198, 107]
3208A07k46J3lK83j04j01j4j01J63J67p3j96j05M6K04QMk34k2K9K74j23l2n8q2
3233a96J49J31o5m5k05J38j8K04r2j47Q1rJ35q7M7k22L7J85N0r0j84L6l0K13O4
3258H0k35Mn4K44pR1l31M6L1J06QJ8q9o4J36%Q1p3o5j20K11J92k11o6p5K28N5
3285A41P1k59%M3M0L8J28k29j70J05K67o9k9q9q9K00K28j98j40j6N2J00O6K6k66
3310d9R9JJ64K5q9j97L4P9N2K7L6j69j72L53Q8j84j01j06J34N4L7k9j45K4P3J03
3336A42m2j67k3N7J49J23k26j07J9J47J25j98j04LJ15M0J10j96p8JJ60%j5j25
3360i0q2L1K10p8O8j24k00J09J55k3k6o0m9MK04l3j99j01P1K36M8k74J15q1K2
3385a47J22j00P6k40J53m0K69k00j0p3l7K63J3r5j59K4L5J53j54J52j36J70n2
$$ y = [107, -139, -126, -129, 154, 50, -51, -65, -166, -3, 164, 91, -105, -210, -164, 40, 48, 52, -182, -204, -175, 99, -24, -56, -114, -196, -47, 84, 19, -26, -231, -93, -111, 93, 1, -146, -65, -74, 61, -26, 21, -201, -164, 21, 71, -19, -203, -167, -197, 16, 80, -155, -151, -205, 39, 32, 123, -208, -162, -131, -25, -17, 1, -88, -152, -16, -16, 65, -8, -73, -193, 18, 210, -1, -67, -142, 86, 141, 212, -47, -47, -4, 36, 74, 202, -27, -197, -92, 175, 106, 77, -12, -101, 99, 327, 129, -11, -27, 25, 125, 191, 217, -49, 50, 51, 215, 240, 151, -46, -12, 67, 119, 146, 182, 13, -159, 194, 282, 98, -3, -109, 25, 79, 116, 87, -58, -34, 39, 142, 100, -67, -90, -33, 116, 239, 13, -94, -75, 72, 197, -1, -105, -102, 13, 53, 163, -33, -111, -110, 50, 50, 35, -90, -172, -141, 69, -9, 59, -65, -265, -156, -1, -24, -50, -110, -159, -155, 49, 16, -183, -284, -213, 23, 71, -203, -88, -169, -147, -25, -125, -49, -289, -136, -176, 93, -107, -117, -190, -227, 36, 49, -46, -205, -181, -146, 7, -147, 5, -131, 39, -13]
3408a3mK3j54r8K26J84k08QKj20K34J12k98QN7M4m3J15q1r9N4J17R3q6j68l3J85
3435E7J36P9k15j5k04L18J56j10k10m9K0K14p8pj11OK7K52q7j08j59O0J95L4j07
3460I4q4o2L3K26j2k11J9k6J55q3J24j06k40J55Q0O9p2q0j39K14P8Qj79L1O1K5
3486G8N9j76l6k8P6R4J3m2j67J24q9R8o8P4j42J66P7j1r4k02Q3L0L1J32j89j77
3512b86K34k1P8L8k73J21oJ78q8j72P9o9J10P2l8q7J6j75K51J0j05O3j8n0J24
3537a4N1j23m6n0J9J11K6j56K1O1J45K7j30j16L2J79M2m6k25M2J39J45J4j44r2
3562h8j9O1J19k7O1j84l6J63R3p8q9l3J53j10J77j01j43R7R6J08k17RO9p0j3J69
3588A67j02qr7J53M5q3r8J14p1R0J48j93J6l0o7J04J75k38m6oJ43k8J35k08M4
$$ y = [-13, -17, 6, -148, -246, -20, 164, -44, -36, -34, -154, 80, 192, -106, -98, -41, 3, -40, 75, -6, -105, -51, 66, 159, 73, -95, -128, 57, 193, 272, 57, 42, -162, 156, 312, 202, -8, -57, -37, 177, 99, 92, -19, -13, 14, 266, 179, 71, -88, -28, 167, 201, 94, 10, -52, -19, 207, 195, -16, 3, -23, 132, 49, 173, 67, -173, -18, 62, 131, 59, -21, -160, 54, 132, 140, -39, -8, 53, 78, 137, -39, -75, -103, -27, 67, 80, 38, -129, -5, -94, 4, -64, 10, -132, 34, 111, 100, 6, -196, -113, -83, -52, 80, -109, -286, -52, -73, 5, 43, -230, -109, -115, 63, -25, -197, -118, -187, -77, -5, -43, -130, -114, -289, -38, -28, -133, -70, -88, -138, -14, 37, -86, -132, -182, -163, -52, -26, -182, -161, -100, 45, 72, -58, -174, -142, 37, 79, 33, -192, -150, -11, 134, 148, 4, -88, -107, -46, 73, 46, 107, -77, -113, 50, 143, 65, -24, -57, 96, -14, 163, 62, -81, 16, 112, 220, 3, 12, 81, 11, -2, 167, 65, 57, -40, 113, 158, 75, -23, 91, 20, 110, 258, 65, 81, 51, -16, 88, 263, 25, -21, -27, 116, 88, 223, 15, 59]
3613E9Lm7L4j16n8RJ27K02l6j37r2L5J19k9R6l43P8J10N1j08L1p1O6mL1l3n9q4
3641a66O0N8J31k36j30N9P7K80m5k29j0k4j5N7J30q2j53J44J26r8l8M2j85J10
3665a37Q1L0j2l2K0P9J4l1j99J05L4QK8j22J4J1J98mj1j72j71J99J96p9k18J55
3691a6j96K22J02Lk46o1J78oR6p7r7n4K04k7K4j0r5J10J26J9j71r9n6P2K28J4
3717A87j49n7M5K3P5L7k29Q6L7RR7r9j11O7R7J43j82p4L6M6l8J74p0k01%L6J99
3744A84j9J5k24J16kj8l1l0jO3J05m1j8jj71J61Qj93P8j47J08J38J8m0k80J06
3770a16J65n0K8J0j01N0j4J43kj44o7j09J34J06j76J5N9m2P1N3j57J6J19m4J78
3795A25j20j27q8J20J5P3q1p5J06J3O0n7j09j19J68Q7R6q8q1q3K11K6k53J18j74
$$ y = [59, 62, 15, 49, -67, -125, -116, 11, 213, 177, 40, -52, -17, 102, 73, 169, -174, -96, 14, 65, -43, -12, -83, -17, -21, 10, -23, -82, -166, -106, -48, 83, -153, -283, -224, -147, 133, 88, -141, -151, -175, -190, -133, -3, -85, -238, -94, 32, -66, -104, -62, -247, -137, -56, -26, -38, -70, -50, 29, 43, 12, -187, -82, -48, -40, -12, -134, -120, -109, 89, 85, 74, -98, -269, -70, 126, 47, -171, -16, -212, 10, 112, 115, -131, -192, -14, -20, 76, -1, -98, -152, 52, 25, 49, 39, -56, 54, 180, 199, 28, -71, -127, -55, 173, 187, 38, -19, 26, 49, 124, 161, -68, 18, 55, 64, 161, 62, -49, 18, 115, 258, 76, 2, 38, 84, 46, 220, 150, -51, -51, -15, 184, 165, 180, -44, 72, 70, 52, 21, -9, -10, 53, 158, 117, 99, 98, -73, 88, 96, -97, -19, -166, -58, 80, 98, 58, -222, -116, 49, -1, 27, 37, -64, -14, -28, 115, 113, -31, -98, -207, -73, 33, -143, -128, -69, -111, -40, 13, -144, -128, -9, -53, 125, 5, -122, -210, -90, -75, -2, -83, -158, -52, -39, 21, -36, -145, -264, -96, -9, 87, -1, -82, -165, 46, 72, -181, -63, -237]
3820b37J91J03Oj95m0J36J3J51M2k09j15J15P0K7J1r1j42J95K8M0r9o0k9P9J94
3845A84j98m8M6n2J25J98j70r0J1L0j4J38j18j25R7J67J0r6p2j08M1K21l8j18
3869B1R2n4K2Q3L8k64N1J38J4M4k2k28m7K39k8k5Q7k21R0L6J25r6k02R4l2J53
3895A08p3o6mJj1K00rk53P4N1K0K9j13n7J06jN4o5o0j49K18J91j22n8Qj55J25
3922a1j0L0Q8k07K11j21R5j12n0m8N6Q7J5m6j1j69J65J8N4k22J38Or4J08m3Oj47
3949b14K42r7J05j52N2j31K04%p7o9Q1j20K74m7j38J33o1q7J55K8q0r5R9K5k5
3974EO6j61Lk4L30l31Q9l4nN6J05j6j65Q6Kn5K78k52j33J2J65k9J27j71j23J24
4000e1P4J84j91l1J49J7nj5j53J24r3J14j03J09k17L7R3K3N6jr0j82L55k02L9
$$ y = [-237, -46, 57, 63, -132, -172, -36, -23, 128, 170, -39, -154, -39, 31, 58, 69, -22, -164, 31, 59, 99, 0, -60, -89, -10, 184, -14, -62, -16, -68, 57, 255, 85, -5, 6, 36, 22, 160, 42, -83, 14, 181, 191, 95, 23, -85, -44, 177, 139, 21, 113, 59, 81, 164, 202, -62, -11, 127, 141, 185, 163, -65, -112, 127, 99, 74, 161, -60, 30, 66, 191, 95, -107, -13, -45, 108, 35, -31, -35, -34, -45, 155, 146, -107, -33, 18, 38, 67, -46, -103, 3, 2, 56, -9, -69, -218, 0, 191, 69, 11, 19, -136, -11, -21, 9, 97, -110, 101, -20, 75, -37, -87, -135, -79, 8, 23, -23, -34, -203, -38, -20, 34, -188, -50, -44, -138, -30, -73, -67, -214, 28, -69, 36, -116, -64, -195, 9, 9, -68, -137, -56, -176, 98, 51, -87, 46, -15, -102, 53, 81, 1, -94, 5, 30, 5, 71, -90, -87, -111, 219, -112, -23, -57, -62, -6, 99, 83, -82, 4, 6, -49, 229, -23, -156, -144, 21, -8, 119, -52, -175, -51, 23, 207, 16, -15, 134, 151, 146, 131, -22, 102, 9, 123, 20, 129, -88, -51, 42, 65, 121, 120, 30, -152, 203, 1, 40]
4025D0k3P9j44J32l0N5r7P2P4%N2k16N7L1m7lL2j37J7N9J35j48J1j07L7Q4O0n5
4053B0j17J14r0J92p3j36j06Q4J78r2M9j30n6K9K82K2k81J20j42kK40n1j68o9
4077a83J5J85O9k0j67JK8N6m4N3q3m9J81k1r0K7j1j57J71N1m6r6R9o0R7J20k17
4104i1J8J1K8J0L4l1j2n3J38j21Q4m4p1P3J05l5j07n3J22l5O5J89j38j62K8J20
4130G2J7j24J1n2O0J12mj79n9K80j84M6K1J23j29r3J88m3L0k35L03l9j70J43j30
4155c5j06J54MJ01j37M6r1J88L7j07j62j02J76J11Q6j35N3P4j24l3J49j57k1J22
4179I1L4k2q0k2k7j21J90J11k29k0K1J76M5j00j03qP5O2O9j47K9k16L75k25o4
4204a06K21k20P8Q2N5j11j72J05o0J27jk0o9M5N9k6M1j78l0J19P2j25K5m0n7K36
$$ y = [40, 17, 96, -48, 84, 54, 109, 12, 84, 158, 158, 210, -6, 51, 82, 35, 32, 64, -73, -56, 3, 138, -10, 1, -106, -69, 15, 75, 20, -97, 17, -73, 119, 46, -90, -196, -112, 66, -26, 23, -107, -163, -134, 148, 170, -111, 9, -133, -135, 105, 54, -114, -183, -168, 17, 86, 66, -101, -100, -72, -16, -60, -7, -90, -139, 42, 21, -69, -42, -53, -210, -39, 12, -34, -130, -31, -91, 6, 126, -91, -73, -62, -34, -24, 10, -21, -33, -86, 52, -69, 15, -29, -100, -27, 78, 43, -64, -117, 5, -30, 35, 224, 86, -76, -48, 72, 89, -35, -24, -76, -16, 96, 92, -87, -146, 134, -50, -4, 17, 140, 11, -82, 106, 63, 93, -142, 161, 122, -48, 95, -35, -141, 13, 17, 118, -19, 27, -64, 124, 161, 54, -108, -210, -34, 77, 163, 28, 81, 155, 31, -2, 147, -10, -31, 91, 125, 103, 23, 1, -26, -147, 43, 154, -75, -95, -74, 102, 147, 47, -56, -64, 11, 73, 142, -5, 24, -192, 183, -42, -106, 115, -105, -27, 55, 110, -1, -173, -68, -128, -1, -2, -22, -91, -46, 13, -13, 28, -150, -180, -61, 11, -114, -89, -129, -186, 50]
4230E0Q2n5j50j47J83j9N3j5p7M1m0J24q1R5j72O7J33p3lj04O4K9Q9j07k6J2j5
4257f2L9m6J19j49L4L4K9J2pp0QP2Q6oj30K0J1k4R7j4j8JN4k7Q6j90r1L13j91
4286a0K21k8m4j29P9N8n0L7j40o7R1Q9j51J48m1kK4lR8j30j9J00Lj10k9O5j91
4313a31J77N0j06Q2j18q3K65n7j26K7J76l20J55J02j76O8j47J27J81j79m2R2p6
4336e9K4J00j3j06p6R9R3p5m9q6J60M1mo4n5N8K3Kp4n6K1N8k9L5L3j15J2K9J07
4365C4k6j16N6j38J90N6j21r4j0J25pJ20K6k67Q6O7J02j31Q3j65L8J77K2j18j15
4390a26pJ11J07J32k90K1J56j28R0rj38k3R3M3j5L3k4j36J71P2l0j63N3j6J1K30
4416B18k61j5J74j98J40P8j12L6m4J11j4J04j77q2O6J15Mo0j9n6L2J16l9q5J02
$$ y = [50, 132, 77, -73, -220, -37, -56, -3, -18, -95, -54, -94, 30, -51, 44, -128, -61, 72, -1, -4, -108, -44, -15, 74, -33, -59, -47, -62, -23, -69, 50, -99, -65, -31, -2, 10, 3, -67, -59, 13, 99, 93, -37, -17, -6, -30, 67, 53, 35, 36, 90, 63, 149, -41, -132, 181, -10, 211, 183, 139, 10, 89, 147, 97, 134, -6, -73, 18, 107, -44, 104, 63, 61, 85, 82, 180, 50, 31, 131, 134, 24, -5, 60, -131, 46, 96, -10, 72, -46, -129, 136, 79, -47, -20, 156, -164, -9, 93, -83, -15, -162, -35, 146, -33, -75, 17, -59, -35, 65, 52, -54, -130, -31, 62, -13, -62, -148, 12, 53, 49, -15, -70, -12, 11, 13, -61, -117, -96, -38, -67, -32, 1, -114, -102, -73, 34, 8, -108, -52, -190, 0, 56, -65, -159, -169, -44, -51, 69, 95, -172, -86, -19, 83, -48, 35, -130, -92, 85, 107, -11, -126, -133, -22, 85, 217, -73, -52, 104, -24, 66, 57, -81, -104, -11, 32, 17, 50, 26, -110, 61, 133, 103, -60, -7, -23, -12, 218, -43, -58, 116, -82, 58, 136, 24, 60, 16, 127, 113, 217, 40, -42, 24, 139, 143, 83, 64, 8, 40, 156, 117, 32, 134]
4441A34j41O2J03j16n9o7J62j8K0p6j7L1J46j16L3%k16M3Q9L2P7k03N0j01J46
4466bK6j47J9J10l4J4J91j88j40R0K21k04J2jM7r6J26j24Lk0J15r1J42n3j90J24
4492e0J2n7K6M4n4M6M2l8j04J22p4J2J29p6j92K2O0L07j99J86k36n6J14Q1j71
4517a04K5O8o2R7jk4r7K1OO3J94k98j9Q2J3M2M7k25J51j9R6K00k00j21J74p0M3
4544H2pj46O9p6J81o6J00k1o0rK0nP7q3n8J6J12P9j94OR8KO4k61J08n2J1J54l9
4573A02j52J30L9J7m0m0Q6j66j03J69R4j28M9q4J11M0q3k2J2n6J04J17j45r2N3
4598A2n3k3P3k9N0o1R0k2r3k2l2J38J1O1j13M4k17J76n2M0o5N0K0Kj7P1j81P5
4626f7P6j5l8j6m0K4J29r8o0O3m0K3K30j91p0m5L1K5K8Ko8J87j52J1M0l5R7r7
$$ y = [134, -7, 55, 158, 42, -17, -84, 78, 60, 80, 4, -13, 18, 164, 48, 81, 81, -135, -92, -3, 29, 106, -97, -47, -148, -2, 24, -123, -104, 6, -28, -14, 177, -11, -151, -61, 160, -44, -32, -33, 14, -82, 44, -80, -77, -97, 18, -73, 69, 16, -174, -50, -38, -95, -69, -25, -79, -33, 9, -29, -133, -11, -85, -73, 56, -20, -212, -190, -130, 177, -22, 164, -72, -128, -14, 67, -104, -79, -11, -73, 24, 23, -1, -98, -77, -71, -8, 186, -112, -131, -49, -36, 6, 53, -172, -21, -40, 56, 256, 56, -65, 109, 39, 82, 75, -71, -2, -78, 103, 37, 137, 116, 56, 47, 67, 62, 139, 56, -2, 14, 126, 205, 11, 17, 115, 117, 181, -80, 28, -24, -13, 141, 102, -50, 80, 119, 136, 96, 56, 142, -24, -127, 42, 136, 8, 57, -27, 84, 124, 41, 19, 31, -25, 79, 196, 51, -41, 12, -41, -64, 9, -20, 30, -31, 59, 37, -56, -78, -110, 28, 39, 100, -13, 31, -186, -10, -62, -22, -87, -37, -17, -15, -32, 39, -142, -67, 9, -6, -44, -60, -100, -76, 53, -45, -105, -42, -82, -59, 171, -20, -90, -135, -104, -79, -51, -49, -117, 70, -82, -71, -31, -66, 31, -66]
4654f6K3m0J40r7o2N6N1Nm4k0pJ43n1Nrj50O6l7J44M2j62J5j09J62o7J19r4ql6
4683h8N2K0m0k5L1J96n4j16k8M2k6J5J34p5J6m5%Q3q2o2L0m5K41q7R1j03j19j0
4711e4J65j2j87J24J9pQ1lp1r1K29j76J00r3Ok6K2m2L9j9o0J69m1n8l3k6k0J24
4739E9l2kk9j00N7J12j35Rj2m5Q5N5o8L6k9n8M3R1l5q3r7J53M4P5q4j01P5n2O2
4768fj4lrJ4J6M3j00o4J06m8pJ63k08Q0Kp2R8R4r5n4R4m7L9l5l0M1K5N3k9j41
4798i4L2m7RO6j30J26K2n3OJ17k6j76l2J16K2%q1P0P6P3n1j55N4L7P1r6K33k61
4826g2j2J63r1L6r4R7l5JP6L3q7J1K2j11J71n3J5o4j9K09j27L5j61K0J5Q4n8O2
4854F6j19L2K38j52m1%o2L9J67kj23p3j28M9J58m0K1p2K66r3L6j68k0j2J26j4
$$ y = [-66, -43, -83, 57, -40, -102, -46, 5, 10, -34, -54, -61, 82, 31, 36, 27, -123, -57, -94, 50, 92, -70, -55, -164, -2, -69, 50, -44, -52, -88, -36, -16, -56, -81, -50, 146, 92, -24, -52, -10, -36, -21, 113, 38, 54, 9, 9, 92, 10, -52, -22, -67, 174, 87, 178, 75, -44, -54, 111, 99, -88, 36, 55, 48, 129, 126, 55, -36, 193, 17, 117, 24, 30, 4, 26, -16, 23, 4, -56, 113, 72, 14, -19, -45, -65, 59, 27, 25, -4, -104, -47, 65, -70, -61, -73, -118, -33, 22, -46, -10, -39, -97, -54, 37, 2, -81, -178, -25, 19, 94, 10, -91, -16, -68, -6, -20, -23, -32, -18, -2, 41, -59, -123, -17, -65, -72, 91, -117, -37, -35, -107, -9, 85, -10, -64, 30, -17, 22, -13, -43, -2, 23, 76, 47, -94, -62, -109, -100, -34, -164, -38, -16, -69, -63, 54, 28, -148, -180, -64, -42, -42, -123, -53, 23, 96, 45, -110, -56, -19, 52, -44, 189, -72, -84, 79, -12, 24, -70, 27, -8, -7, 69, 102, 15, 26, 48, -63, 108, 55, 70, 6, -13, 196, 69, 104, -57, -37, -22, 62, 4, 66, -53, -21, 217, 65, 24, 24, -38, 1, 168, 166, 43, -30, -158, -109, 49, 9, 30, -42, 224, 131, 167, -1, -21, -33, 93, 79]
4880G9m3Nk04J37L3J27j04Rm6J02k8r2n9N1P8k8M5J3q2k9J2Q2l0kj90M5J85r0
4908b4j2M5q0QR8J12l09RJ43oo9M1p9k1Q1R0o7J56k32j6Q8j29J14J40j17p6J85
4935G3o7np5k7L5j0RJ02r8k8M1L7P1j88J12r3J44N3m0m9J08j50JO7o5J06j42K
4963g6Q3O1j26n0R4r6R1j9N2j23J42J75k28J07k4j38J20M5j13O9J1m0K6O5p5j4
4989A9j7R0m1Pk2k16R8N8P7k4N8k8l6P2o3j00O3M4M6OJ14k10N8j21J82j22J23
5016A15k4j80K61j38J2m4k4K4N0l0q5N0Mp7J46Qj55J89j80Q1o1K08k98PJ51pO
5043IJ9j53L8J2QJ13r3o8M8J41O3j46j58J0J48p8O3o9p5J46L5n5M6j04n2PQ0N9
5071fn7lJ72k50Q9J63k07l6M9Q9l4n1m0R9N6L2K0r7j09Q8M8P7k10L9J1K7K1k6
$$ y = [79, 36, 41, -163, -26, 7, 134, 30, 39, -7, 95, 67, -25, -84, -33, 45, 17, 62, 75, -7, -36, -24, 58, 28, 26, -164, -119, 66, -24, -36, 9, -71, -63, 35, 147, -162, -153, -10, -16, -85, -44, -123, -144, -63, 27, -40, 116, -116, -132, -44, -173, -59, 81, -36, -112, 73, 6, 1, -74, -101, -66, -76, -67, 35, -63, -91, -50, -13, 58, -130, -18, -111, 33, 86, 46, -3, 105, -45, -44, 23, -42, 64, -78, -76, 7, 68, -58, -108, -14, -110, -19, -38, 14, -109, 33, 208, -20, 87, 63, -75, 45, 90, -23, 46, 57, 17, 43, 108, 33, 19, 2, 92, 51, 58, 36, -180, -82, -24, 53, 29, 87, 59, 23, 95, 32, -68, -5, 39, 85, 91, 205, -5, 53, -68, 114, -8, 115, 91, -89, 172, 34, 46, 2, -22, 2, 52, 22, -63, -13, -9, -86, 60, 68, -87, 102, -78, 3, -58, 150, -148, -141, 10, 3, 9, 28, -125, -87, -75, -67, 46, -47, -115, -67, 74, 137, -9, -167, -157, -9, -87, -24, -93, -168, -22, 13, -42, 4, -100, -152, -145, -65, -6, -63, -66, 106, -144, -55, 108, -99, -135, -86, 3, -31, -82, -122, -23, 33, 65, 85, -12, -121, -33, 15, 92, -118, -79, -68, -41, -20, -46]
5099d6J9q9J70J19j73R3j93M3J49n9L5j04K25j90J5KK8n1K4j03J11J3L1m2o1O4
5125C0Q4l6o8M4n1J2j11J99m9q0n2J05J63J0k29M1l3L6N9n5m7J04m9M7Rl1p0K1
5153Cp2K9J04K0qJ02r2q9O2l3O3j5l3Q0r6L7j03Oj5j11l2K19N9Jl4j20nn7K20
5182I0o1JJ9n0o0N3P8j54mj9K18j84P0j42O2J3J6N0j16J20k3J03p6O0j59lQ8q9
5210i9K73l55j5J11m6J72r6j5Q9k02J70j1k6j2K8Q3Nn5j5Q8j20m8P4Qp1L9L9J19
5238A12j40L9j16LJ75m0m9L6r4mJ15j43J70j38J03p3J30q4N0p0O4K2K2m2p4J26
5264A00l6q0O6j16R6j02K40q5r0J3J8o1J53K5k43K21K1q1J7J2j05O2r3N2kN9j20
5291e9O4k1P3m4J0J03k8r8J20j44N3j1N8Lj12Q1r3p3K1L6J41j21j01J05J40j20
$$ y = [-46, -27, -116, 54, 173, 0, 93, -100, -57, 92, 33, 68, -36, 189, -1, 14, 16, 44, -7, 17, -86, 25, 38, 69, 27, -34, 30, 114, 78, 10, 54, 3, 15, -96, 103, 54, -26, -78, 27, 190, 200, -29, 12, -21, 15, 74, 19, -28, 76, 27, 74, 83, 52, -18, 3, -69, -40, 64, 84, 76, 178, 86, -3, 59, 26, 89, 74, 41, 121, 25, 62, -41, -35, -50, -161, -193, 26, 85, 86, 52, -68, -73, -130, 90, 29, 30, 49, -1, -61, -8, 70, -84, -88, -107, 111, -73, -3, -145, -83, -70, -54, -4, -120, 0, -23, 80, 4, 64, -95, -98, -10, -99, 174, -181, -196, -85, -131, 41, -55, -70, 19, -183, -13, -24, -50, -62, -34, 49, 54, -1, -16, 72, -48, -96, -22, -14, -85, -46, -7, 112, -28, 11, -105, -102, 73, 33, -16, 20, -74, -78, 37, -106, 64, -74, 29, -44, 86, 2, 52, -18, 46, 68, 90, 48, -26, 100, 64, -16, 50, -66, 30, -72, 168, 83, -7, 6, 24, -37, 116, 141, -102, 119, 140, 59, 76, 88, -17, 45, -48, 4, 2, 61, -59, 5, -16, 57, 13, 23, 126, 98, 0, 120, -24, 29, 18, 76, 79, -33, 48, -45, -118, -97, -61, 80, -41, -142, -37, 103, -17]
5317a7L0j19l3R1J59p2j38j04K01k3J9P6j98k8P6N4Q1j84l0Q0J4J46j11l3n5p1
5343a89K69j14L4r1j1N7jQ9q7l4M7M9M3j17J3j07J55k2r1O6n2J7j00K43j07k1
5369f2j1q1J99n2N6k10P5K8K7J20j59R3j03J20R3p5K6o9r6M0J00q2J88j71R0p6
5395HJ00p4j50J32p1Q8j8J15j56R7N1L8k32Q7OJ1K7K1M2j21P5N4p4J4Kj24J19
5422F7P0q5jo4Q4q0N2L3j20Qk3J76j52J1n1K2N5J09j01qn5N1M8q1N5j58R3J17
5450G2k4j03M5l8N7J8j6m6K1r4L8P4j6k8J20j37P7j12J36j28L9L2O1M9j44RO8
5477C0j62J64j75J79o5o2J7M5kj80J72N0j15Q4m0m8n1K57j45O4j5m3Q9k3qJ2q6
5504e7q6J68j19L5P3p9O6N1k3Kn8J4J9n0j54K42m5j1r0J84j70J33P4k18J51qm5
$$ y = [-17, 13, -106, -139, -48, 111, 39, -99, -203, -2, -25, -6, 70, -128, -156, -80, -26, 55, -129, -159, -79, -65, 81, -30, -63, -118, -189, 80, -34, 0, -91, -102, -45, -46, 43, -44, -78, -31, 18, 61, -56, -43, -150, 5, -17, -108, -42, -94, -77, -177, 66, -41, -62, -73, -154, 45, -7, 49, -161, -86, -58, -31, 89, -70, 23, -80, 40, 133, 58, 84, 15, -81, -41, 59, -23, 165, -6, 84, 8, 108, 34, -116, 16, -55, 33, 15, 130, -26, 71, 122, 160, -72, 15, 21, 32, 59, 80, 122, 1, 76, 130, 56, 70, 72, -52, 67, 137, 52, 51, -13, 71, -9, 43, 76, -44, -36, -59, 117, -35, -24, -75, -53, 2, 111, 10, 2, -53, -2, 46, -35, 20, -138, -45, 72, 48, -55, -10, -48, 9, 27, 11, -35, -14, -108, -70, 4, -12, -40, 80, -57, 20, -92, 44, -84, -45, -13, 48, 97, -47, -38, 30, -132, 32, -143, 36, -29, -91, -74, -29, -31, -211, -39, 11, -104, -20, -60, -108, -159, 98, -47, 17, 2, -41, 48, 25, 17, 29, -57, -143, 25, -94, -59, 14, -65, 1, 52, 29, 31, -27, -13, 6, -44, -198, 44, -1, -12, -102, 82, -88, 45, 119, -99, 52, 44, -1]
5531aJ3J5l6N3M7j04r8J21Q6j5R5k57N4J87j47j0l0M0k4PR9o2r8q5K20o6q7QN9
5560a6Q7j74J29l3Q0j90L7K18j54r6J74kkO0j20Rp4Q1l4L1L9Pj27O0J38j38O2
5587E2l9jj2L8j7k7j42J6J01N7M8k06j1R5J28m0j4l6l3jRL2o3J7n5J19%j12J41
5616D4Pj7l5lq5J5l5J34P0j13l8k1P0j0j09O4l2M8J25j00L2j03p4R9PjP2o4j0
5645f3J65p2q5k4M8J08m0L0n7N9r3N5N4l5m0r7R5j7J18j29rN8j39J05P6j33P6
5672A4R1j31O3Qj11P7L1j61N1J9OM7l0N7m1j96K38qj16K03n3l3j3P6n3n4J40j87
5700f6j8J02rL8J5n3J06j19J17p9q5N5M3L6n2j6N9o7L0M4j81J67j11o1J52J2o4
5727ek5QK8n8k8L4P2Mo5J70j82q9R1M4P7n3j4p1j5J45j42P7j16J14n4P8o6Pkj06
$$ y = [-1, 12, 27, -9, 44, 91, -13, -111, 10, 96, 81, 176, -81, -27, 160, 13, 3, -27, 13, -11, -4, 95, 33, -65, -150, 70, 4, -83, -75, -16, 71, -103, 26, -7, 73, -117, -80, 138, -16, -112, 62, 60, 58, 118, -2, 7, -67, 14, -20, 11, 50, 57, -70, -10, 128, -10, 52, 13, 12, 0, 38, 21, -6, -148, -132, -31, 26, 74, -132, -143, -48, 80, 40, 26, -10, -43, -44, -35, -3, -66, -49, -104, 15, 15, -97, 44, 51, 34, -1, -4, -89, -74, -109, 25, 95, -18, -56, -77, -7, -17, -126, -62, -94, -46, 79, -21, 11, -92, -166, -67, -60, -61, 11, -53, -63, 102, 30, -55, -79, -31, 77, 37, 67, 10, 69, -24, 31, 85, 50, 10, -87, 8, -9, 109, -20, -29, 29, -110, -5, 71, -62, 14, 105, -26, 37, 45, -66, 11, 42, -119, -68, -49, -43, 4, -26, 31, -10, -206, 32, 24, -92, 111, 58, 25, 12, 88, 35, -19, 121, -66, -84, 18, 9, 47, 62, 9, 115, -4, 113, 34, -51, 4, 47, 83, 31, 15, 74, 7, 37, 81, -100, 67, -44, -105, 47, 59, -5, -30, -22, 6, -52, -80, -46, 26, 30, -35, 135, -47, -136, -45, -1, 76, 23, 9, -62, -77, 68, -74, 3, -113, 1, -53, 25, -41, -34, -36, -142]
5757a42J49m5j14K24j73J48jk13J50l7L9J7L4j25J65k03J75Jp0O2j95J66J0j30
5781a08K10k03P9k1N0l2M2l5rm2J0R7o7l2j5J02j1R2j64Q3pjP4r7j68R8R3j3K
5810GLm6L5N0m9Q9j75PM0J03k9q4R5o8j07K28l4P8q5j06J32K2j36N6n2P5P7j20
5838Fj9j01J06J30q8l6L6J6LN3Rj78J60j37O2l4O7j28O1QJ4J61j33l6JN7Q5k28
5866h3L3J41j43NK26j65j30J51j25J40nP2j18j27N3J27j64M7J07j08J40j4j13
5889e3k0O4q1K1J28j23J15nk7pL0o8n6J36p6o4J15p1J10k6j7l3p9N4o2N7K1ok5
5918d8M7L6Rn7l1M7J1k1mK5j00mR0j3n6nojJ00p3K0N9m0N4%J5q5K9N2k6K7P1j57
5951c5N3j07J16R2q7L7J1j8p5l1J51j47J07p2QJ39j30r7J57j1n6R5k53J57o4M0
$$ y = [-142, 7, -38, -152, 72, -101, 47, 46, -167, -17, -54, -15, 2, 36, -89, 76, -127, 48, 49, -21, 41, -154, 12, 22, -108, 102, -101, -22, -43, 7, -25, 17, -18, -27, -69, -59, 38, -29, -61, -76, 26, 15, 107, -57, 26, 19, 18, 92, -5, -173, -75, 18, 5, 7, 10, -36, -1, 49, 0, 89, -86, -79, -39, 64, 35, -49, 46, -22, -129, 99, 65, 143, 58, -48, 84, 106, -30, 26, -26, 49, 126, 6, -13, -114, -8, 122, 34, -2, 34, 50, 53, 106, 115, -63, 97, -40, 22, -12, 55, -73, -12, -4, 10, 171, 38, 2, 3, 60, 145, -83, -50, 91, -52, -47, 179, 14, -116, 35, -90, 50, 45, 117, -1, -128, -75, 52, -112, -65, 42, -66, 74, 60, -53, -73, -9, -90, -69, 59, -64, 51, 46, 19, 12, 42, -26, -82, 54, -22, -86, 29, -42, 68, 42, 25, -8, -87, -33, -95, -38, -17, -23, -48, -1, 35, 44, -13, -44, 3, 14, -7, -11, 14, -86, -90, 0, -13, -69, -74, -80, -81, 19, -54, -34, 25, -15, 39, 39, 54, -31, -2, 50, 24, 51, 122, -35, 18, -89, 27, 119, 32, 69, 80, 62, -13, -44, 107, -40, 67, -5, 3, 142, 12, -85, 72, 61, 5, 100, -153, 4, -60, -20]
5977b0N8QP4k6m2L7j60R9j4Q6q7oN5j2q6J15M5j34j8p9J63j5j5j19J07O9nm6m
6006B8K7k6kJ4j03J17j03r3K64p0j7j02M1QJ0J9r9J32j2j0l5N9j07K2M7j21J28
6033A6P5l11K57rj15K09j71o6RJ48M4j61Q6j55L4R8j4J9L2J1Rm2J21j4k33J63
6059D0o0J47K2j17%j90J29J7J01m6l3j53J80P2j13j51J70k3J58q5j16R0j3M0M4
6084A10j07o9n3J54j3m1kj9oR3M8q3K7L8k1N8r6j2M8j41K0L6P5l9o6Q8P9r0K8
6113D4m5L9l5r7J57q1M9M5l0q6J96j20qjkK2R0k02L6J18j06R3k6l1J55p2j2k13
6141a23R1J21q2J06q8m6JK4Q7p4%k1o4J93j04L6o7L3q1M3m6LP0n5M0L3l0J0r3
6170h3q3J45J07k04K00j22J38j37K8o4Q3j25J46k6j6J5M6j42n3J04j28K5P1j1
$$ y = [-20, 38, 46, 120, 94, 52, 89, -71, 28, 14, 100, 13, 7, 62, 50, -36, 79, 124, -10, -28, -107, 56, 41, 26, -93, 14, 83, 78, 32, 28, 55, 29, 27, 41, -62, 55, -48, -141, 123, 53, 36, -66, -25, -17, -7, 12, -87, 45, 33, 23, -12, 47, -60, -38, 9, -112, 16, 91, -220, 37, 28, -87, 122, -49, -115, -106, 42, 86, -75, 11, -144, -110, -12, -26, -7, 25, 36, 45, 3, 124, 110, -123, 40, -20, 127, 149, 32, 32, -158, -29, -12, 89, 43, 10, -143, 37, 109, -4, -155, 15, -8, 150, 65, -51, 39, 26, 66, 110, 3, -66, -119, 35, 22, -19, -21, -40, -46, 47, 95, 12, 39, 77, 56, 114, 18, 6, 54, -87, -67, -31, 44, 5, -61, 27, 106, 16, 44, -1, 38, 3, -94, 63, -18, 31, 76, 46, -40, 156, 36, 28, 27, 25, 47, 137, -65, -29, 89, -17, 76, 50, 19, 174, 102, 90, -123, -32, 89, 7, 113, 25, -21, -20, 4, 91, 17, 17, -4, -68, 125, 21, 57, -10, 23, -58, -15, -61, -58, 12, -43, -3, 30, 0, 10, -83, -166, -21, 86, -118, 82, -40, 98, -39, -11, -75, 8, -117, 29, 3, -13, 2, 48, -94, -147, -43, -171, -146, -75, -86]
6194h6O4L8Q4o5j44R2p9PP7n5N3OJ7j04J07R9r9k2M4K1j79mQ9J5K2l1L0J4M5N4
6224A10j62j4k2K4mO4j55K22L4p0o1mQ8M4K9l7k7K4k09j6J23Q2L6j73J4M6MJ3
6252Ck3r4O9M6j21K22o9l9k0K10k20rJ6M3k5P5k4k1N1m7k1L9K0M5j33m0J44J27
6280B04k66L6K3N7L3m2j14m9J53J00j31nj0m8J32n2l7j11J43o8J57o4n4l4pk7
6306h1O9O5o4nk5j6P8Lk5m8j55J77M5k3j8O4l3j6Nk6o4J39k5L4p9m8J8J17j53
6335i0Q1L1j07k1P8P3l2j11M9J8L7m8J18j06J84r2J4n2N6j2j7j00p9J07R4q4R7
6362H6j40J18j17R6n4L8o4MmOJ25k35J70j76J68r8J29R6k04O5r8J49j4L7j40P8
6388B1qP7j17J23q7%j02R4P7o3K1j58R6n7P7K5j01J35K7j57J20j4RK1j49J86L0
$$ y = [-86, -22, 16, 100, 35, -109, -17, -96, -89, -12, -67, -14, -8, 9, -95, 12, 111, 12, -10, 34, 55, -124, -128, -39, -24, -2, -33, -3, 11, 56, 110, -52, -66, -88, -64, -68, -4, -159, 63, 97, 27, -34, -38, 50, 94, 123, 86, 59, 83, -126, -142, -19, 63, 99, -74, -60, -14, -10, 3, -20, -114, -45, 1, -120, 102, 33, -6, -26, 184, -36, -45, -29, 14, -11, 64, 40, 19, 70, 23, 2, 41, 61, 106, -27, -67, 77, 204, -62, -26, -3, 54, 87, 45, -69, -118, 35, 135, 4, -1, -11, -59, 73, 21, -16, -127, 16, -52, 105, 41, -13, -47, -54, -81, -12, 53, -11, -16, -41, -57, 21, 24, -1, -49, -204, -27, 18, -5, -23, 41, 8, -8, -3, -29, -93, 46, 21, 55, -24, -72, -54, 63, -90, -9, 22, -85, -106, -28, 45, 13, -98, -49, -31, 6, -42, 76, -30, 154, 62, 76, 24, 80, 68, 51, -49, -128, -21, 73, -11, 86, -54, 64, -53, 43, -11, 27, -37, -33, -37, -31, 94, -141, 29, -147, 21, -77, 52, 148, -56, 9, -89, 60, 46, 83, -57, 21, 13, 90, -27, 96, 9, 9, -93, 1, 78, 15, 36, -122, -26, -83, -6, 19, -82, 53, 80, -77, 43, 29, 38, 59, -90, 96, 126]
6415A26m7j58R6J20k54J15l7K9J9n4J20j22L4R7q1J61k53P0J5j4K0O9r1K7n1K9
6441a5J24j06j55J21N6O2j37nP0Ro4K17j84Q0j37O9O6m8j8p2qR5j65J48j02QL1
6468f0J11j09J27j38J6n6O5Q7q1Q2n9O5j71J62j5o2P6j07j8J10j17PJ8k9P9Qm4
6495e3O4J22j25R5q5j21K60j07Rj37L6M3K7PJ23j43J9J2o2M1p3qL3R7J22k10%
6522a4l7jM2Rm4J37n7o2J66j12M8N9r7jJ25j60o7%J55L5j22q8M8p2O4M6J7K8l5
6551A0K1J03j74Q9j66Q4J3Q5l3m2j3R3j42R6j55J78l6K3J51j75Jm2OMrO9j27k1
$$ y = [126, 79, -79, 17, 137, -117, -2, -39, -10, 9, -45, 75, -47, -13, 84, 3, 164, -89, -19, -4, -18, 2, 71, -20, 7, -44, -15, 109, 3, -152, -31, 25, 87, -50, -55, 15, 24, -40, 177, -7, 73, -64, 5, 71, 23, 5, -67, -75, 20, -145, 3, -99, -91, -60, 51, -58, 69, -69, -53, -109, -44, 43, -38, 44, -15, 50, -121, 41, 26, -36, 40, -67, -85, 25, -92, -85, -67, -96, -17, -9, -53, 11, 133, 8, 103, 18, -103, 157, 50, 59, -78, -42, 1, 28, 35, 158, 15, 34, 46, -16, 25, -48, -56, -23, 74, 196, -14, -14, -51, -52, -10, -1, -45, 92, 35, -27, 139, 27, 75, 134, 37, 36, 161, 1, -66, -66, 89, 124, 2, -86, -38, -110, -46, 0, 17, 45, 10, 31, 134, -40, 49, -117, -33, -20, 65, 32, -10, -23, 70, -72, 24, -131, 47, 11, 34, 185, 10, 11, -31, -25, -21, -30, 39, -88, -109]
$$ [...]
8191e2
##END NTUPLES=NMR FID
##END=
