##TITLE=1H_Pr 4921-All
 CDCl3, 8 sc, 
 26.6.2019
##JCAMPDX= 6.0         $$ Bruker NMR JCAMP-DX V2.0
##DATA TYPE= NMR FID
##DATA CLASS= NTUPLES
##ORIGIN= UXNMR, Bruker Analytische Messtechnik GmbH
##OWNER= root
$$ XWIN-NMR		Version 3.5
$$ Wed Jun 26 16:19:51 2019 Russian Standard Time (UT+4h)  she@DPX200
##.OBSERVE FREQUENCY= 200.13155
##.OBSERVE NUCLEUS= ^1H
##.DELAY= (6, 6)
##.ACQUISITION MODE= SIMULTANEOUS
##.ACQUISITION SCHEME= undefined
##.AVERAGES= 8
##.DIGITISER RES= 18
##SPECTROMETER/DATA SYSTEM= spect
##.PULSE SEQUENCE= zg30
##.SOLVENT NAME= CDCl3
##.SHIFT REFERENCE= (INTERNAL, CDCl3, 0, 15.7039)
##AUDIT TRAIL= $$ (NUMBER, WHEN, WHO, WHERE, WHAT)
$$ ##TITLE= Audit trail, XWIN-NMR		Version 3.5
$$ ##JCAMPDX= 5.01
$$ ##ORIGIN= Bruker BioSpin GmbH
$$ ##OWNER= she
$$ F:/spectra/data/she/nmr/H-F/1/audita.txt
$$ ##AUDIT TRAIL=  $$ (NUMBER, WHEN, WHO, WHERE, WHAT)
(   1,<2019-06-26 16:18:36.31 +0400>,<she>,<DPX200>,
      <created by zg, POWCHK disabled, PULCHK disabled
       configuration hash MD5:
       00 E9 B6 7A A2 85 ED C7 34 08 36 98 17 FE 4E 26
       data hash MD5: 16K
       F1 47 A7 21 F6 EE BE D7 88 D9 BB A3 AD 13 95 E2>)
$$ ##END=
$$ 
$$ hash MD5
$$ 10 51 6F 0A F0 F5 5D D5 66 30 94 84 6A 44 0D 86
##$RELAX= 
##$RELAX= 
##$RELAX= 
##$RELAX= 
##$RELAX= 
##$RELAX= 
$$ Bruker specific parameters
$$ --------------------------
##$DU= <F:/spectra>
##$EXPNO= 1
##$NAME= <H-F>
##$PROCNO= 1
##$TYPE= <nmr>
##$USER= <she>
##$AMP= (0..31)
100 100 100 100 100 100 100 100 100 100 100 100 100 100 100 100 100 100 
100 100 100 100 100 100 100 100 100 100 100 100 100 100 
##$AQSEQ= 0
##$AQ_mod= 1
##$AUNM= <au_zg>
##$AUTOPOS= <>
##$BF1= 200.13
##$BF2= 200.13
##$BF3= 200.13
##$BF4= 200.13
##$BF5= 200.13
##$BF6= 200.13
##$BF7= 200.13
##$BF8= 200.13
##$BYTORDA= 1
##$CFDGTYP= 0
##$CFRGTYP= 5
##$CHEMSTR= <none>
##$CNST= (0..31)
1 1 145 1 1 1 1 1 1 1 1 1 1 1 1 1 1 1 1 1 1 1 1 1 1 1 1 1 1 1 1 1 
##$CPDPRG= <>
##$CPDPRG1= <>
##$CPDPRG2= <>
##$CPDPRG3= <>
##$CPDPRG4= <mlev>
##$CPDPRG5= <mlev>
##$CPDPRG6= <mlev>
##$CPDPRG7= <mlev>
##$CPDPRG8= <mlev>
##$CPDPRGB= <>
##$CPDPRGT= <>
##$D= (0..31)
0 1.2 0 0 0 0 0 0 0 0 0 0.03 0 0 0 0 0 0 0 0 0 0 0 0 0 0 0 0 0 0 0 0 
##$DATE= 1561551515
##$DBL= (0..7)
120 120 120 120 120 120 120 120 
##$DBP= (0..7)
150 150 150 150 150 150 150 150 
##$DBP07= 0
##$DBPNAM0= <>
##$DBPNAM1= <>
##$DBPNAM2= <>
##$DBPNAM3= <>
##$DBPNAM4= <>
##$DBPNAM5= <>
##$DBPNAM6= <>
##$DBPNAM7= <>
##$DBPOAL= (0..7)
0.5 0.5 0.5 0.5 0.5 0.5 0.5 0.5 
##$DBPOFFS= (0..7)
0 0 0 0 0 0 0 0 
##$DE= 6
##$DECBNUC= <off>
##$DECIM= 24
##$DECNUC= <off>
##$DECSTAT= 4
##$DIGMOD= 1
##$DIGTYP= 9
##$DL= (0..7)
0 120 120 120 120 120 120 120 
##$DP= (0..7)
150 150 150 150 150 150 150 150 
##$DP07= 0
##$DPNAME0= <>
##$DPNAME1= <>
##$DPNAME2= <>
##$DPNAME3= <>
##$DPNAME4= <>
##$DPNAME5= <>
##$DPNAME6= <>
##$DPNAME7= <>
##$DPOAL= (0..7)
0.5 0.5 0.5 0.5 0.5 0.5 0.5 0.5 
##$DPOFFS= (0..7)
0 0 0 0 0 0 0 0 
##$DQDMODE= 0
##$DR= 18
##$DS= 0
##$DSLIST= <SSSSSSSSSSSSSSS>
##$DSPFIRM= 0
$$ [...]
##$SUBNAM2= <"">
##$SUBNAM3= <"">
##$SUBNAM4= <"">
##$SUBNAM5= <"">
##$SUBNAM6= <"">
##$SUBNAM7= <"">
##$SUBNAM8= <"">
##$SUBNAM9= <"">
##$SW= 24.9336996594482
##$SWIBOX= (0..15)
0 0 2 0 0 0 0 0 0 0 0 0 0 0 0 0 
##$SW_h= 4990.01996007984
##$TD= 16384
##$TD0= 1
##$TE= 0
##$TE2= 300
##$TE3= 300
##$TEG= 300
##$TL= (0..7)
0 120 120 120 120 120 120 120 
##$TP= (0..7)
150 150 150 150 150 150 150 150 
##$TP07= 0
##$TPNAME0= <>
##$TPNAME1= <>
##$TPNAME2= <>
##$TPNAME3= <>
##$TPNAME4= <>
##$TPNAME5= <>
##$TPNAME6= <>
##$TPNAME7= <>
##$TPOAL= (0..7)
0.5 0.5 0.5 0.5 0.5 0.5 0.5 0.5 
##$TPOFFS= (0..7)
0 0 0 0 0 0 0 0 
##$TUNHIN= 0
##$TUNHOUT= 0
##$TUNXOUT= 0
##$USERA1= <user>
##$USERA2= <user>
##$USERA3= <user>
##$USERA4= <user>
##$USERA5= <user>
##$V9= 5
##$VALIST= <valist>
##$VCLIST= <CCCCCCCCCCCCCCC>
##$VD= 0
##$VDLIST= <DDDDDDDDDDDDDDD>
##$VPLIST= <PPPPPPPPPPPPPPP>
##$VTLIST= <TTTTTTTTTTTTTTT>
##$WBST= 1024
##$WBSW= 4
##$XGAIN= (0..3)
0 0 0 0 
##$XL= 0
##$YL= 0
##$YMAX_a= 105670
##$YMIN_a= -121266
##$ZGOPTNS= <>
##$ZL1= 120
##$ZL2= 120
##$ZL3= 120
##$ZL4= 120
##$ABSF1= 10
##$ABSF2= 0
##$ABSG= 5
##$ABSL= 3
##$ALPHA= 0
##$AQORDER= 0
##$ASSFAC= 0
##$ASSFACI= 0
##$ASSFACX= 0
##$ASSWID= 0
##$AUNMP= <proc_1d>
##$AZFE= 0.1
##$AZFW= 0.1
##$BCFW= 1
##$BC_mod= 2
##$BYTORDP= 1
##$COROFFS= 0
##$CY= 11.3945322036743
##$DATMOD= 1
##$DC= 2
##$DFILT= <>
##$DTYPP= 0
##$F1P= 18.9103706918063
##$F2P= -1.10871071338519
##$FCOR= 0.5
##$FTSIZE= 0
##$FT_mod= 4
##$GAMMA= 1
##$GB= 0.15
##$INTBC= 1
##$INTSCL= 1
##$ISEN= 128
##$LB= 0.24
##$LEV0= 0
##$LPBIN= 0
##$MAXI= 10000
##$MC2= 0
##$MEAN= 0
##$ME_mod= 0
##$MI= 1.114404
##$NCOEF= 0
##$NC_proc= 0
##$NLEV= 6
##$NOISF1= 3.799351
##$NOISF2= 2.8
##$NSP= 1
##$NTH_PI= 0
##$NZP= 0
##$OFFSET= 15.70392
##$PC= 1
##$PHC0= -8509.21
##$PHC1= 26.80098
##$PH_mod= 1
##$PKNL= yes
##$PPARMOD= 0
##$PSCAL= 0
##$PSIGN= 0
##$REVERSE= no
##$SF= 200.130013532006
##$SI= 16384
##$SIGF1= 3
##$SIGF2= 2
##$SINO= 400
##$SIOLD= 16384
##$SREGLST= <1H.CDCl3>
##$SSB= 0
##$STSI= 0
##$STSR= 0
##$SW_p= 3612.71676300578
##$SYMM= 0
##$S_DEV= 0
##$TDeff= 0
##$TDoff= 0
##$TI= <>
##$TILT= no
##$TM1= 0
##$TM2= 0
##$TOPLEV= 0
##$USERP1= <user>
##$USERP2= <user>
##$USERP3= <user>
##$USERP4= <user>
##$USERP5= <user>
##$WDW= 1
##$XDIM= 8192
##$YMAX_p= 0
##$YMIN_p= 0
$$ End of Bruker specific parameters
$$ ---------------------------------
##NTUPLES= NMR FID
##VAR_NAME=  TIME,          FID/REAL,        FID/IMAG
##SYMBOL=    X,             R,               I
##VAR_TYPE=  INDEPENDENT,   DEPENDENT,       DEPENDENT
##VAR_FORM=  AFFN,          ASDF,            ASDF
##VAR_DIM=   8192,          8192,            8192
##UNITS=     SECONDS,       ARBITRARY UNITS, ARBITRARY UNITS
##FACTOR=    0.0002004,     1,               1
##FIRST=     0,             0,               0
##LAST=      1.6414764,     0,               0
##MIN=       0,             -121266,         0
##MAX=       1.6414764,     105670,          0
$$ Real data points
##PAGE= N=1
##DATA TABLE= (X++(R..R)), XYDATA
0 0 0 0 0 0 0 0 0 0 8 -8 8 -9 15 -16 18 -24 30 -34 41 -48 57 -66 77 -88 102 -118 134 -151 171 -192 218
31 218 -247 275 -308 344 -384 428 -475 526 -583 646 -716 792 -876 971 -1076 1197 -1332
48 -1332 1485 -1666 1875 -2125 2432 -2813 3308 -3969 4915 -6378 8963 -14898 59004 -38237
62 -38237 -74941 101337 -15522 -60620 81398 22419 -89052 63133 54276 -94322 19635
73 19635 98493 -79319 -42430 94890 -34809 -74789 87461 13838 -83382 54076 32381
84 32381 -104976 27323 90158 -77567 -30393 91848 -42734 -58656 88691 -5921 -90459
95 -90459 63119 38316 -91038 30485 72550 -76258 -4050 91367 -60674 -58662 92834
106 92834 -5787 -78047 68871 31523 -82934 41759 61294 -82372 3343 87198 -61089
117 -61089 -39497 96027 -20871 -74388 77853 24565 -85184 40870 48680 -82017 16568
128 16568 82119 -70220 -34854 89575 -33973 -70895 73029 5121 -82215 53826 39032
139 39032 -93591 15197 73471 -72235 -26732 77603 -49858 -59351 81961 -4240 -82861
150 -82861 56699 31971 -89043 23633 64224 -73160 -11872 77717 -51660 -46232 82622
161 82622 -14417 -72273 68626 26638 -87282 30395 61245 -67007 -248 69305 -57589
172 -57589 -31256 86841 -23334 -68898 69345 19041 -79486 38610 47667 -73370 9447
183 9447 67677 -61984 -28428 78725 -30847 -58797 69647 3582 -78316 45905 40189
194 40189 -74780 14200 57850 -68414 -19436 77541 -38250 -53429 68888 -4460 -69163
205 -69163 54780 28068 -79873 23844 59810 -67112 -12809 73521 -38920 -36970 72299
216 72299 -16702 -65065 64364 25203 -76129 32083 55239 -66163 -791 70973 -44988
227 -44988 -30714 71157 -23071 -55821 68978 14843 -75057 38832 47533 -69467 3222
238 3222 61012 -52325 -21868 70804 -32089 -53797 66728 5056 -72443 39170 33691 -70059
250 -70059 13007 54974 -59267 -16748 67683 -36781 -48049 63027 -5348 -64973 47221
261 47221 27003 -68182 21973 50465 -61399 -8706 66642 -38676 -38237 64819 -8500 -54121
273 -54121 54214 19500 -64201 32273 47060 -62873 -595 66633 -38214 -27435 65100
284 65100 -16129 -48283 58858 12095 -64162 37358 41283 -62941 6704 60541 -45039
295 -45039 -21733 62016 -27241 -46621 59292 3647 -63023 40353 32636 -65143 10825 51016
307 51016 -52737 -15733 60007 -34665 -42189 61089 -2872 -58859 42661 23807 -63899 19128
319 19128 45320 -55388 -5230 62137 -37556 -35310 61593 -7332 -51215 46881 17057 -57797
331 -57797 30299 41883 -55667 3183 60351 -39716 -28413 60304 -12746 -43766 51324 10961
343 10961 -54620 35484 35561 -58378 6804 54249 -42742 -21184 56895 -20012 -38902 51733 210
356 210 -56132 36956 27304 -60080 10547 48158 -45822 -14595 53032 -29752 -36239 52000 -7088
369 -7088 -54091 40874 22827 -57590 16618 41659 -49409 -6267 51848 -35254 -29146 57564
381 57564 -9170 -48457 45519 18617 -54031 23563 36451 -49493 4026 53122 -37404 -21768
393 -21768 59444 -13350 -43726 47346 11776 -50593 30839 31518 -50820 10224 50031 -42300
405 -42300 -19006 55085 -19884 -39128 47421 3208 -49025 33953 23576 -54688 12433 43585
417 43585 -46302 -14572 50650 -25610 -33373 47332 -5508 -48220 36284 17769 -54312 16471
429 16471 39102 -45208 -6901 47686 -30169 -26605 49286 -10697 -43500 41940 15137 -49909
441 -49909 22394 35127 -44901 1260 45927 -33316 -18775 52240 -13482 -38423 44759 10808
453 10808 -47428 26968 28926 -45584 8517 43727 -38187 -14585 51319 -19376 -36343 44240
465 44240 2955 -45608 30511 21594 -48834 12456 38637 -43784 -12199 47795 -25073 -32605
477 -32605 43876 -4675 -43606 34036 14907 -50656 16741 35465 -44768 -6896 45654 -27765
489 -27765 -25727 44411 -10781 -39329 39239 11710 -48209 22538 33444 -43168 -338 42642
501 42642 -30303 -17623 46598 -14091 -34611 43015 8900 -45538 25243 27672 -42892 5546
513 5546 38861 -33380 -11693 45897 -19729 -32525 42558 2233 -45023 26394 21541 -42843
525 -42843 10035 33401 -38458 -8915 43211 -25966 -31188 41395 -2824 -41022 29318 14878
537 14878 -44359 15035 30182 -42617 -5469 42364 -27025 -24643 42620 -7399 -36738 33699
549 33699 10139 -42890 21452 28971 -41718 2010 43297 -28224 -18704 43226 -11642 -31461
561 -31461 38469 6308 -41069 27511 27346 -41341 5796 38643 -30945 -12562 42110 -17797
573 -17797 -28064 41317 1541 -40989 27554 20012 -42851 8760 33096 -35040 -8643 39853
585 39853 -23312 -26281 39120 -5262 -39963 28371 14499 -41805 12989 28316 -37376 -3222
597 -3222 38388 -27652 -23202 40091 -6858 -34875 31127 10460 -37793 20025 25616 -38254 2555
610 2555 39186 -26848 -16661 41555 -9568 -28623 35564 6607 -36797 24911 23647 -38224
622 -38224 7327 37745 -28430 -11611 40398 -14155 -25366 36771 867 -35831 28458 19663
634 19663 -40113 9794 33467 -31953 -8589 36968 -21013 -22655 38312 -5586 -37225 28629
646 28629 14927 -39963 11812 27035 -34698 -3100 35931 -25584 -20148 38667 -8557 -34023
658 -34023 30806 10571 -38396 16724 24615 -34658 2650 34726 -27353 -15145 40549 -10119
670 -10119 -30453 32639 7734 -34073 21893 20375 -35568 8355 35004 -29446 -12573 38741
682 38741 -12751 -25673 32888 1572 -32831 25081 16211 -37397 9921 30381 -32165 -8982
694 -8982 35713 -17692 -23170 32871 -4557 -32551 26055 10752 -39052 12444 27342 -33403
706 -33403 -6417 32962 -21927 -18704 33537 -9992 -31529 29869 9024 -37781 15581 24024
718 24024 -33408 415 32145 -25253 -14461 36340 -11281 -27960 32491 5715 -35059 20175
730 20175 20918 -33652 4920 30927 -27206 -9477 36875 -14974 -25850 32768 2331 -33271
742 -33271 22224 15456 -34928 9534 28370 -30925 -8397 34214 -17954 -22869 31429 -4018
754 -4018 -31141 24965 11160 -36454 11929 24948 -32314 -5134 32220 -20868 -18813 31782
766 31782 -7268 -28089 27340 7798 -35295 15619 23873 -30798 -322 31322 -21599 -12990
778 -12990 33875 -10081 -24566 31649 6370 -32696 19161 21863 -29615 5223 29519 -23598
790 -23598 -7786 34880 -13280 -22617 32807 3535 -31107 21093 17295 -30954 8807 26567
802 26567 -28119 -5997 33503 -17642 -21745 32332 -1802 -30600 22245 11180 -33059 11330
814 11330 22384 -31674 -3278 31935 -20791 -19457 30772 -5670 -27491 24525 6627 -32793
826 -32793 15641 21785 -31658 -281 30964 -21578 -14381 31690 -8655 -22914 28756 4839
838 4839 -30475 19847 20382 -30681 4237 29342 -22317 -9447 31587 -11500 -19800 30613 1218
851 1218 -30266 21004 16898 -30489 6701 25507 -24767 -5489 30062 -16636 -19430 30247 -2675
864 -2675 -29919 21306 12156 -30935 9253 20982 -28470 -3684 28152 -20615 -17529 30229 -6418
877 -6418 -28021 23039 7866 -30405 12998 18419 -30188 914 28586 -21969 -13945 31041 -8094
890 -8094 -23700 25520 4251 -28876 18470 17625 -30028 4649 28108 -22404 -9382 31232 -10962
903 -10962 -19962 28237 1198 -27701 21463 15002 -30650 7101 25488 -23829 -6029 28958
915 28958 -15073 -17940 28876 -3250 -27773 21528 11187 -31316 8504 21111 -26400 -3086
927 -3086 26708 -19382 -15901 28989 -6685 -26621 22335 7804 -29482 11646 17980 -27003 972
940 972 26362 -21148 -12465 30214 -7832 -23621 24271 5190 -26630 15943 15840 -27266 5748
953 5748 26812 -21615 -8813 30453 -9369 -19798 25543 1816 -24968 19789 13389 -28523
965 -28523 8215 24747 -23613 -6592 28838 -12783 -17330 25778 -3208 -25144 21371 9627
977 9627 -30458 8925 21668 -25286 -4632 26014 -17360 -15211 26266 -7685 -24577 23233
989 23233 6675 -30150 11241 18772 -25967 -368 24729 -19687 -11552 27931 -9453 -22548
1001 -22548 25212 5432 -27775 14263 16664 -24923 4657 24480 -20759 -7361 29634 -10449
1013 -10449 -19597 26116 3041 -25000 17200 13657 -25106 8038 22791 -22760 -5473 28205
1025 28205 -12823 -17278 25509 -606 -23752 18846 9272 -27238 9771 19683 -25156 -4336
1037 -4336 25860 -15777 -15498 24968 -5348 -22879 20476 5934 -28082 11607 17947 -25604 -964
1050 -964 24154 -17975 -11697 25852 -8575 -20793 23468 4051 -26721 15308 16234 -25198 2908
1063 2908 23321 -19818 -7201 27409 -10645 -18144 26125 2470 -24815 17243 13818 -24774
1075 -24774 6646 21707 -22081 -4237 27193 -13445 -17140 25460 -709 -24086 18309 9473
1087 9473 -25488 9306 18752 -24692 -2780 25228 -15979 -15431 24772 -4430 -22070 19113 5515
1100 5515 -25994 11403 16775 -25686 -933 23996 -16992 -12020 24409 -7062 -19058 21696
1112 21696 2786 -25256 14738 16234 -24726 2296 23065 -17282 -7705 25032 -9251 -16300
1124 -16300 24453 1354 -23988 17425 14418 -24598 5385 21395 -19129 -4283 24585 -12743
1136 -12743 -14994 24924 -1687 -23640 18081 10458 -24859 7574 17683 -22088 -1984 23720
1148 23720 -16436 -14236 24672 -4730 -22936 18656 6541 -24789 10012 14866 -24450 288
1160 288 22983 -18303 -12154 24772 -6951 -20269 19883 3599 -23502 13981 13547 -24830 3965
1173 3965 22834 -18414 -8339 24586 -8586 -16610 22504 1364 -22244 16790 12498 -24084
1185 -24084 5996 21024 -18981 -5025 23708 -11137 -13869 23458 -1721 -21932 17805 9693
1197 9693 -24310 7634 18233 -20639 -3121 22037 -14826 -12976 23050 -5457 -21697 18518
1209 18518 6263 -24359 9209 14663 -22590 13 20997 -17917 -11053 23756 -7412 -19787
1221 -19787 19515 3799 -22721 12743 12864 -23148 3758 21587 -18201 -7758 24484 -8712
1233 -8712 -16584 21575 1320 -20874 16119 11248 -23014 7054 20346 -19553 -5070 24012
1245 24012 -10581 -13796 22061 -2013 -20153 18392 8398 -24125 8694 18400 -20670 -3121
1257 -3121 21363 -13847 -11391 22192 -5921 -19912 18836 5878 -24125 9089 14750 -21460
1269 -21460 -525 19863 -16394 -9163 22628 -8019 -18483 20133 3757 -22859 11672 13118
1281 13118 -20581 3244 18997 -17590 -5988 23725 -8909 -16416 21361 2484 -20423 14552
1293 14552 10729 -20950 7062 18439 -18653 -3796 23918 -10703 -14046 21458 -764 -19028
1305 -19028 16126 7402 -21907 9222 16487 -20843 -2281 22007 -13610 -12192 20811 -4625
1317 -4625 -18581 17612 4013 -23241 10208 14364 -21957 -384 19905 -15353 -9480 20934
1329 20934 -7946 -17120 19243 2524 -22398 12054 12645 -21542 2739 18874 -16309 -6254
1341 -6254 22058 -9377 -15191 21162 1447 -20695 14302 11499 -20408 5797 18173 -17568
1353 -17568 -3166 22370 -10906 -13267 21739 -542 -19118 15640 8419 -20362 8049 15547
1365 15547 -19748 -1871 20694 -12739 -11969 20558 -3887 -17619 16142 4445 -21536 9903
1377 9903 13512 -21209 -370 19465 -14853 -9885 20107 -6643 -16570 17911 1970 -21133 12216
1390 12216 12021 -21630 1932 18683 -15428 -6593 20452 -8915 -13819 20250 431 -20174 14458
1403 14458 11143 -20339 5373 17430 -16576 -2778 21102 -10745 -11928 21536 -1366 -18894
1415 -18894 15595 8406 -19998 7379 15206 -18144 -958 20047 -13466 -11034 21285 -3947
1427 -3947 -18277 15872 5016 -20279 8857 12296 -20026 736 18506 -15341 -9768 20299
1439 20299 -6092 -16508 16433 2210 -19635 11026 10464 -20809 3011 18117 -15980 -7220
1451 -7220 20045 -7529 -13175 18005 225 -18496 14058 9709 -20157 5167 17007 -15600
1463 -15600 -3869 19711 -9346 -11130 19239 -1729 -17661 15834 7865 -20206 6978 15086
1475 15086 -17243 -1662 18535 -12328 -10024 20023 -4703 -17372 16197 5273 -20031 8312
1487 8312 12282 -18590 404 17260 -15000 -8528 19693 -6838 -16558 16675 2708 -19354 10432
1500 10432 10053 -19412 2845 16726 -15777 -6368 19779 -7564 -13664 17360 1030 -17456 13386
1513 13386 8814 -18809 5444 16508 -15660 -3744 19689 -8568 -11015 18463 -1195 -16086
1525 -16086 15353 7367 -18972 7175 15199 -16354 -1951 18047 -10942 -9490 18132 -4016
1537 -4016 -16180 15458 4883 -19531 7858 12494 -17461 -430 16582 -13503 -7739 18548
1549 18548 -6806 -15612 16020 2822 -19082 9424 10214 -17864 2462 15334 -14998 -5738 19037
1562 19037 -8408 -14126 17098 1406 -17124 11848 8588 -17580 5867 15171 -15890 -3204
1574 -3204 19446 -9070 -11166 17826 -452 -15555 13753 6387 -17854 7725 14203 -16840 -1516
1587 -1516 18422 -10350 -9843 17762 -3655 -14698 14744 3714 -18803 8889 12153 -17786 -538
1600 -538 16258 -12076 -8158 16762 -6444 -13688 15328 1444 -18514 9828 10748 -18040 1500
1613 1500 14907 -13475 -5477 16713 -7543 -12159 16878 809 -17259 11429 8938 -16410 4186
1626 4186 14283 -14008 -2633 17716 -8820 -10595 17523 -320 -15506 12754 7132 -16325
1638 -16325 6588 13048 -15630 -443 17444 -10570 -9230 17277 -2795 -14312 13783 3982
1650 3982 -16977 8169 11079 -17140 262 15917 -12149 -7950 16525 -5302 -13682 14192 1583
1663 1583 -17255 9882 9771 -17497 1543 14729 -13083 -5940 16358 -7242 -11787 15658 -142
1676 -142 -15918 11353 8559 -16819 3773 13762 -13327 -2747 16657 -8419 -9769 17224 -1106
1689 -1106 -15067 12297 7486 -15889 5891 12520 -14081 -875 16325 -10218 -8436 16837 -2574
1702 -2574 -14136 12249 4588 -15929 7313 9966 -15872 771 15005 -11987 -7724 16106 -4432
1715 -4432 -13160 12910 1867 -15729 9064 8304 -16535 1960 14236 -12826 -5885 15687 -6408
1728 -6408 -10999 14031 -298 -14836 11287 7426 -16485 4234 13726 -12670 -3306 15267 -7368
1741 -7368 -8802 15782 -1935 -13851 12755 6398 -16056 6074 12587 -12885 -715 15146 -9210
1754 -9210 -7089 16300 -3770 -13516 13364 4468 -15409 6559 10288 -14368 303 13526 -11596
1767 -11596 -6657 15637 -5182 -12890 13072 1997 -15315 7626 7931 -15037 2140 12672 -12803
1780 -12803 -5342 15419 -6156 -11401 13352 678 -13828 9544 6890 -14892 4059 12500 -12703
1793 -12703 -3215 15459 -6694 -9256 14146 -721 -12513 11536 5852 -14621 6059 12087 -12768
1806 -12768 -1409 14516 -8256 -6878 14805 -2881 -12281 12559 4213 -15027 6732 10013 -13699
1819 -13699 -6 13024 -10538 -5939 14506 -5094 -11980 12803 1902 -14819 7550 7900 -14504
1832 -14504 1696 12110 -12219 -4270 14333 -6626 -10966 13295 763 -13920 8616 6287
1844 6287 -13984 3847 11457 -12693 -2699 14636 -7085 -8959 13710 -568 -12006 10765 4921
1857 4921 -13479 6233 10757 -12463 -907 14548 -7422 -7022 13528 -2301 -10943 11562 3094
1870 3094 -13933 7120 9668 -13343 -194 12912 -8983 -5868 13116 -4809 -10457 11968 1405
1883 1405 -14689 7372 7763 -13776 1004 11253 -10451 -4073 12872 -6870 -10023 13039 -23
1896 -23 -13638 8312 6320 -13118 2947 10306 -11384 -1951 13682 -7653 -8283 13762 -809
1909 -809 -12089 9967 5252 -12862 5268 9774 -11705 -310 13408 -8060 -6900 13887 -2024
1922 -2024 -10601 10804 3625 -12497 6838 8450 -13178 857 12617 -9513 -5919 13069 -4060
1935 -4060 -10142 10986 1096 -13087 7625 6826 -13473 1377 11513 -9923 -4525 11846 -5840
1948 -5840 -8656 11652 -459 -12790 8650 6074 -13393 2795 10323 -10370 -2233 12353 -6966
1961 -6966 -7296 12784 -1262 -11481 9696 5229 -12237 4876 9247 -10850 19 12546 -7740
1974 -7740 -5961 13257 -2157 -10691 10234 3389 -11857 6028 7819 -11889 1041 11565 -9547
1987 -9547 -5410 12548 -3936 -9655 10668 1364 -11874 7119 6061 -12562 2045 10646 -10321
2000 -10321 -4327 12041 -5165 -8660 10821 -733 -11694 8507 4868 -13032 3289 9866 -10323
2013 -10323 -2583 11504 -6174 -6704 11688 -1659 -10755 10133 4884 -12139 4859 9239 -10207
2026 -10207 -299 11442 -7105 -4857 12654 -2673 -9918 10595 3683 -11178 5749 7541 -10572
2039 -10572 1054 10510 -8986 -4456 12294 -4378 -9558 10279 1760 -11573 6134 5724 -11567
2052 -11567 2172 9672 -10068 -3667 11768 -5590 -8800 10607 -201 -11147 7307 4510 -12138
2065 -12138 3552 9282 -10610 -1885 11829 -5850 -7089 10810 -1351 -9602 9137 3597 -11620
2078 -11620 5298 9114 -10583 -360 11169 -6680 -5461 11296 -2418 -8750 10146 2369 -11376
2091 -11376 5972 7752 -10580 705 10319 -7777 -3860 11491 -4165 -8604 10757 1321 -11623
2104 -11623 6269 5837 -11106 1483 9196 -9346 -3302 10964 -5437 -8265 10415 -129 -10711
2117 -10711 7106 4579 -11172 2806 8400 -9932 -2018 11064 -5965 -6797 10717 -978 -9441
2130 -9441 8294 3442 -10779 4878 8391 -10095 -291 10808 -6274 -5016 10694 -2058 -8378
2143 -8378 9217 2579 -10713 5867 7537 -10375 359 10111 -6983 -3914 10749 -3993 -7880
2156 -7880 9995 858 -10893 6304 6255 -10901 1387 8708 -8253 -2913 10140 -5632 -7267
2169 -7267 10289 -504 -11035 6652 4660 -10743 2403 7760 -9341 -1483 10119 -6618 -6360
2182 -6360 10589 -833 -9767 7888 3886 -10037 4474 7206 -9670 126 10843 -7029 -5264
2195 -5264 10725 -1670 -8019 8597 2734 -9563 6191 6357 -10212 1149 10085 -7572 -4452
2208 -4452 10395 -3016 -7590 8831 837 -9827 6464 5390 -10690 1480 8874 -8021 -3280
2221 -3280 9819 -4493 -6836 9607 -963 -9997 7235 4123 -10804 2684 7991 -9086 -1857
2234 -1857 9726 -5956 -5968 9843 -1643 -9438 8314 3703 -10191 4015 7438 -8928 28
2247 28 9876 -6797 -4416 10523 -2193 -8261 8920 2426 -9433 5199 6326 -9091 1170
2260 1170 9305 -7634 -3685 10647 -3040 -7435 8910 1277 -9480 6313 5038 -10253 2161
2273 2161 8616 -7836 -3003 9612 -4378 -6940 8988 -459 -9279 6612 3994 -10484 2397
2286 2397 7637 -8629 -2092 9441 -5135 -5383 9476 -1601 -8890 7637 3177 -10269 3774
2299 3774 7125 -8378 -260 9120 -6050 -4083 10043 -2572 -7923 8817 3065 -9111 4672
2312 4672 6406 -8667 1211 8684 -7240 -3084 10310 -3264 -7572 8748 1028 -9032 5144
2325 5144 4501 -9303 2093 7759 -8604 -2817 9840 -4693 -7005 8400 -52 -8722 6048
2338 6048 3287 -9973 2869 7149 -9106 -2135 9483 -5404 -5655 8825 -1130 -7883 7521
2351 7521 2400 -9609 3912 7159 -8807 -503 9294 -5345 -4369 9155 -2319 -7159 8694
2364 8694 2136 -9275 5016 6394 -8398 742 8438 -6362 -3106 9216 -3694 -6592 8659
2377 8659 1050 -8940 5491 5187 -8982 1568 7485 -7860 -2270 9268 -4925 -6614 8651
2390 8651 -247 -8802 5826 3517 -9045 2554 6698 -8589 -1305 8493 -5522 -5698 8671 -1172
2404 -1172 -7818 6863 2717 -8925 4305 6501 -8760 22 9094 -5466 -4590 8886 -2030
2417 -2030 -6966 7921 1849 -8745 5537 6219 -8840 1003 8745 -5897 -3030 9166 -2985
2430 -2985 -6087 8438 675 -9029 5696 5184 -9082 1253 7452 -7257 -2262 8676 -4756
2443 -4756 -6015 8877 -305 -8828 5778 3765 -9146 2286 6492 -7669 -1455 8169 -5647
2456 -5647 -5577 8951 -1224 -8392 6508 2646 -8906 3727 5818 -8073 -127 8541 -6075 -4334
2470 -4334 8991 -1619 -6960 7280 1823 -8107 5002 5411 -8426 1217 8775 -6206 -3317 8731
2484 8731 -2705 -5859 8073 573 -8076 5796 4465 -9191 1591 7574 -6812 -2565 7957
2497 7957 -4357 -5351 8467 -678 -8612 6216 3505 -9286 2270 6761 -7645 -1210 7958 -5400
2511 -5400 -4610 8179 -1441 -8141 6541 2923 -8844 3355 5721 -7668 206 7719 -5957 -3543
2525 -3543 9114 -2412 -7225 7551 2232 -7958 4463 5277 -7916 1736 7858 -6817 -2772
2538 -2772 9142 -2590 -6383 7686 1032 -7575 5584 4186 -8032 2309 7196 -7357 -2245
2551 -2245 8299 -3919 -5759 7762 -543 -7893 6011 3079 -9073 2336 6794 -7701 -1679
2564 -1679 7893 -4713 -4834 7806 -1791 -7432 6737 2138 -8931 3322 6010 -7663 -405 7881
2578 7881 -5710 -3564 8509 -2531 -6695 7587 1932 -8061 4456 5083 -7566 1430 7713 -6529
2592 -6529 -2196 8858 -3256 -6305 7876 971 -7695 4947 4452 -8029 2422 6776 -7105
2605 -7105 -1908 8538 -4058 -6039 7787 -251 -7588 5517 2855 -8588 2671 5946 -7566
2618 -7566 -1424 7773 -4903 -5221 7745 -1711 -7251 6316 1716 -8736 3512 5800 -7974 -584
2632 -584 7898 -5155 -3813 7863 -2523 -6055 7542 1562 -8288 4947 5787 -7530 834 7465
2646 7465 -5829 -2290 8548 -3448 -5699 8284 760 -8140 5324 4417 -7695 2121 6401 -6603
2660 -6603 -1291 8226 -4462 -5364 8141 -477 -7783 5531 3035 -8219 2627 5480 -7709 -728
2674 -728 7770 -5521 -4747 8114 -1434 -6959 5931 1868 -7951 3818 5189 -8050 85 7790
2688 7790 -5589 -3568 7955 -2151 -6072 7331 1071 -7678 5050 5030 -7975 1262 7786 -5658
2702 -5658 -2515 8281 -3133 -5296 7720 512 -7640 5944 4420 -7603 1813 6792 -6535
2715 -6535 -1612 7505 -4169 -4694 7657 -881 -7629 6027 2895 -8184 2381 5560 -7383 -733
2729 -733 7362 -5216 -4667 7992 -1525 -7014 6136 1888 -7956 3612 4891 -7833 271 7408
2743 7408 -5708 -3655 8049 -2507 -6154 6510 1452 -7437 5135 4432 -7705 1374 7357 -6071
2757 -6071 -2503 8081 -2761 -4957 7756 289 -7225 5717 3750 -8149 2197 6910 -6578
2770 -6578 -1233 7425 -4035 -4713 7772 -1336 -7354 6120 2868 -8412 2055 5658 -6940 -657
2784 -657 7042 -5304 -4064 7798 -2098 -7068 6311 1763 -8134 3389 4742 -7121 162 6617
2798 6617 -5813 -2827 7988 -2374 -6352 6630 1310 -7560 4296 4311 -7387 1855 6980 -6349
2812 -6349 -2310 8058 -3152 -5377 7117 664 -6706 5458 3422 -7821 2763 6579 -6651
2825 -6651 -1477 7754 -3904 -4389 7317 -893 -6606 6085 2383 -8180 2945 5498 -7531 -1148
2839 -1148 7011 -4753 -3962 6953 -2175 -6560 6519 1238 -8199 3411 4891 -7063 9 6739
2853 6739 -5623 -2812 7703 -3035 -5767 7230 829 -7495 4379 4372 -7382 1317 6350 -5875
2867 -5875 -1725 7967 -3259 -5092 7477 318 -6839 5166 3588 -7294 2816 6065 -6369
2880 -6369 -1100 7792 -3877 -4601 7296 -578 -6552 5470 1914 -7393 3411 5218 -7443 -520
2894 -520 7018 -4647 -3805 6909 -1937 -6459 5905 975 -8051 3577 4458 -7685 -39 6648
2908 6648 -5317 -2912 7109 -2966 -5641 6842 679 -7604 4636 4377 -7199 1241 6380 -5620
2922 -5620 -1626 7302 -3416 -4513 7674 28 -6815 5027 3568 -6947 2160 6071 -6426 -949
2936 -949 7644 -4285 -4087 7382 -678 -6435 5656 2730 -7319 3099 4795 -7048 -567 6844
2950 6844 -5040 -3979 7332 -1719 -5797 5553 1097 -7049 3984 4005 -7228 519 6692 -5335
2964 -5335 -2981 7251 -2545 -5480 6068 624 -7073 4910 3936 -7380 1308 6442 -5289 -1939
2978 -1939 7077 -2877 -4482 7379 -156 -6607 5435 3655 -7520 2255 5968 -5670 -751 7091
2992 7091 -4021 -3790 7326 -943 -6492 5733 2641 -7122 2924 4928 -6344 17 6780 -4875
3006 -4875 -3687 7004 -1883 -6216 5890 1435 -7146 3526 4193 -7139 1038 6191 -5771 -2727
3020 -2727 7134 -2430 -5527 6075 646 -6482 4542 3362 -7173 1397 5842 -5739 -1763 6968
3034 6968 -2647 -4129 6449 -602 -6126 5255 3236 -6709 2460 5707 -6150 -975 7021 -3726
3048 -3726 -3711 6701 -1252 -5804 5452 2223 -7209 2821 4774 -6214 -163 5874 -4507 -2675
3062 -2675 6928 -1979 -6030 5804 1295 -7207 3369 3888 -6642 486 5871 -5684 -2634 6795
3076 6795 -2628 -4986 5943 447 -6962 4209 2904 -6561 1805 5555 -5879 -1668 7113 -2998
3090 -2998 -4298 6558 -9 -5628 4866 2725 -6923 2638 5405 -6114 -723 6717 -3640 -3656
3104 -3656 6470 -1116 -5508 5575 1984 -6921 3155 5000 -6408 -467 6152 -4457 -2807 6513
3118 6513 -2211 -5417 5940 680 -7055 3576 3848 -6836 400 5797 -5186 -2094 6668 -3005
3132 -3005 -5044 6232 355 -6435 3920 3321 -6428 1281 5145 -5638 -1083 6772 -3386 -4188
3146 -4188 6717 -173 -6315 4882 2641 -6327 2360 5140 -5916 -343 7122 -3928 -3825 6588
3160 6588 -1196 -5377 5112 1665 -6101 3176 4786 -6176 355 6263 -4462 -3117 6348 -2098
3174 -2098 -5245 5464 618 -6412 3493 3613 -6893 344 5370 -5272 -2183 5858 -3007 -4308
3188 -4308 6041 -271 -6712 4312 3127 -6350 1341 5138 -5164 -1113 6312 -3408 -3707 6673
3202 6673 -436 -5862 4819 2712 -5991 2167 4673 -5372 -249 6456 -3706 -3068 6766 -693
3216 -693 -5079 4663 1883 -6256 2793 4156 -6083 476 5941 -4661 -2938 6188 -1591 -5118 4990
3231 4990 647 -6089 3514 3287 -6580 392 5291 -5037 -2583 6124 -2396 -4401 5470 -173 -5889
3246 -5889 4336 3126 -6837 1325 5422 -4863 -1682 6073 -3087 -3588 6465 -756 -5489 4739
3260 4739 2507 -6140 2024 4641 -5199 -240 5991 -3342 -3027 6518 -1506 -5162 5193 2043 -5868
3275 -5868 2858 4039 -5562 233 5341 -4644 -2656 6326 -1648 -5310 5090 1157 -6083 3212 3002
3290 3002 -5758 1103 5146 -5090 -2256 6257 -2364 -4363 5369 95 -5439 3789 2566 -6321 1711
3305 1711 4927 -5019 -1340 6180 -3115 -3810 5932 -286 -5194 4613 2132 -6006 2181 4685 -5077
3320 -5077 -696 5586 -3124 -2820 6045 -1067 -4968 5036 1875 -5952 2841 4061 -5376 68 5304
3335 5304 -4179 -2195 6027 -1802 -4536 4908 695 -5797 3054 3196 -5778 867 4756 -4756 -1535
3350 -1535 5983 -2794 -4419 4956 239 -5305 3568 2294 -5649 1526 4373 -5464 -913 5806 -2818
3365 -2818 -3871 5384 -336 -4757 3961 1979 -5608 2442 4616 -5160 -316 5476 -3002 -2911 5590
3380 5590 -1091 -4184 4525 1412 -5478 3004 4043 -5253 2 5159 -3770 -2415 5490 -1920 -4294
3395 -4294 5202 523 -5838 2956 3298 -5452 658 4397 -4287 -1844 5169 -2730 -4057 5403 25
3410 25 -5497 3641 2765 -5724 1004 3786 -5208 -1133 5692 -3171 -3646 5524 -501 -4972 4062 1901
3426 1901 -5162 2491 3978 -4890 266 5606 -3271 -2441 5573 -737 -4303 4602 1194 -4881 2909
3441 2909 3436 -5466 400 5170 -3724 -2417 5423 -1545 -3589 4701 361 -5188 3226 2922 -5577
3456 -5577 382 4576 -3837 -1768 5030 -2247 -3530 4649 -44 -5389 3824 2569 -5450 1353 3772
3471 3772 -4553 -920 5096 -3108 -2999 5328 -511 -4837 3837 2151 -5167 2329 3858 -4555 38
3486 38 5026 -3437 -2394 5610 -887 -4326 4506 1355 -4736 2912 3173 -4829 875 4999 -3647 -2252
3502 -2252 5530 -1299 -3914 4738 454 -4775 3357 2600 -5545 1011 4498 -4444 -1714 4688 -2101
3517 -2101 -3593 4460 -380 -5032 3494 2124 -5263 1006 4191 -4211 -908 4992 -3055 -3052 5158 -804
3533 -804 -4753 4095 1672 -5248 1792 3601 -4177 34 4434 -3351 -1899 5181 -1160 -4006 4547
3548 4547 1191 -5067 2467 3216 -4534 805 4778 -3662 -1753 5553 -1565 -3656 4544 754 -4631
3563 -4631 2748 2453 -4583 978 4206 -4062 -1383 4940 -2137 -3621 4349 -100 -4785 3165 1859
3578 1859 -5095 1311 3997 -4503 -1543 4455 -2719 -2631 4366 -841 -4356 3821 1608 -5076 1964
3593 1964 3671 -4196 -430 4669 -2641 -1843 4805 -1352 -3905 4328 1533 -4891 2487 3102 -4421
3608 -4421 150 4304 -3513 -1560 4740 -1970 -3405 4489 780 -4671 2505 2482 -4564 599 3880
3623 3880 -3948 -1288 4694 -2541 -3488 4279 89 -4458 2788 1963 -4720 1520 3630 -4214 -835
3638 -835 4710 -2763 -3039 4534 -676 -4105 3704 1405 -4661 2258 3401 -4392 -221 4458 -2747
3653 -2747 -2221 4941 -1053 -3752 4003 1163 -4955 2599 3168 -4492 371 4564 -3206 -1638 4537
3668 4537 -1617 -3386 4346 398 -5102 2655 2637 -4700 608 3597 -3674 -1120 4160 -2455 -3378 4200
3684 4200 -228 -4551 3091 1740 -4500 1428 3036 -4052 -672 4468 -2691 -2742 4374 -804 -4034
3699 -4034 3263 1345 -4240 2092 3084 -4261 -193 4809 -2945 -2025 4617 -675 -3390 3869 951
3714 951 -4029 2707 2822 -4255 683 4499 -3200 -1658 4927 -1088 -2830 4097 67 -4135 3150
3729 3150 2299 -4455 865 4179 -3487 -1519 4190 -2073 -2694 3953 -208 -4255 3058 2016 -4636
3744 -4636 999 3598 -3806 -1103 3835 -2849 -2445 4515 -733 -4014 3345 1360 -4604 1688 2632
3759 2632 -4170 114 3961 -3078 -1665 4243 -1187 -3588 3751 854 -4037 2466 2584 -4080 504
3774 504 3955 -2875 -1414 4520 -1417 -2892 3529 523 -3648 2611 2283 -4362 818 3795 -3610
3789 -3610 -1310 4373 -1990 -2459 3734 -384 -3942 3047 1480 -4929 1119 3291 -4036 -800 3761
3804 3761 -2418 -2252 4055 -849 -4039 3374 1327 -4424 1676 2782 -3947 -105 3640 -2840 -1735
3819 -1735 4241 -956 -3229 3623 975 -3577 2066 2483 -4028 938 3780 -3117 -1321 4313 -1507
3834 -1507 -3206 3896 529 -3715 2654 2031 -4380 1166 3512 -3404 -1085 4502 -1894 -2962 3803
3849 3803 -362 -3661 2791 1237 -4469 1179 3063 -3955 -958 3718 -2429 -2369 3773 -1089 -3493
3864 -3493 3291 962 -4267 1641 3101 -3862 -235 3923 -2573 -1533 4031 -1100 -3003 3655 851
3879 851 -4097 2376 2639 -3752 289 3806 -3017 -1178 4197 -1994 -2758 3835 344 -4100 2529 2353
3895 2353 -3876 734 3161 -3358 -796 4193 -2094 -2663 3968 -122 -4022 2497 1684 -3964 927
3910 927 3023 -3908 -438 4090 -2682 -2341 4122 -741 -3515 2886 1105 -4116 2040 2550 -3888 57
3926 57 3702 -2757 -1950 3984 -1078 -3005 3445 532 -3947 2709 2523 -3789 544 3658 -2634 -1465
3942 -1465 3978 -1639 -2479 3826 425 -3725 2920 2289 -4019 727 3181 -2998 -678 3977 -2013
3957 -2013 -2708 3978 -327 -4050 2835 1161 -3798 1107 2784 -3600 -688 3631 -2465 -2268 4124
3972 4124 -526 -3516 3063 952 -4113 1572 2556 -4021 158 3949 -2815 -1914 3822 -864 -3305
3987 -3305 3166 907 -3795 2467 2385 -3801 683 3556 -2613 -1562 3947 -1233 -2737 3656 175
4002 175 -3719 2807 2038 -4036 873 3370 -3116 -1092 3722 -1527 -2102 3656 -531 -3764 2905 1678
4018 1678 -3943 1407 2728 -3493 -596 4111 -2223 -2152 3676 -969 -3914 3038 1221 -3939 1572
4033 1572 2511 -3302 -71 3628 -2657 -1748 3806 -977 -3010 3243 831 -3535 1780 2085 -3619 996
4049 996 3713 -2813 -1328 4310 -1571 -2599 3717 218 -3459 2475 2056 -3813 1209 3272 -3082
4064 -3082 -1098 3898 -1872 -2612 3443 -167 -3538 2923 1302 -4092 1335 2988 -3457 -821 3428
4079 3428 -2046 -1924 3387 -1054 -3398 2962 1242 -4006 1666 2851 -3444 -149 3429 -2535 -1858
4094 -1858 3763 -1251 -2886 3257 571 -3812 1895 2479 -3478 704 3498 -2672 -1198 4242 -1255
4109 -1255 -3091 3572 435 -3500 2352 1981 -3644 978 3051 -3409 -714 4224 -1884 -2411 3567
4124 3567 -25 -3152 2514 1310 -4021 1376 2846 -3509 -798 3811 -2210 -2379 3258 -546 -3178
4139 -3178 2836 950 -3966 1843 2372 -3841 -345 3254 -2579 -1358 3707 -1081 -3071 3598 723
4154 723 -3827 2327 2368 -3675 534 3213 -2628 -1255 3804 -1496 -2755 3433 629 -3219 2362 2349
4170 2349 -3474 825 3044 -3203 -784 3945 -1932 -2769 3726 96 -3581 2689 1355 -3377 1094
4185 1094 2616 -3539 -588 3666 -2206 -2345 3607 -569 -3402 2779 1135 -3805 1921 2322 -3656
4200 -3656 -77 3597 -2441 -1776 3547 -814 -2703 3349 475 -3593 2291 2324 -3861 415 3619 -2458
4216 -2458 -1490 3608 -1125 -2488 3733 338 -3510 2148 2112 -3603 779 3163 -2528 -637 3800 -1686
4232 -1686 -2217 3833 -109 -3225 2678 1942 -3467 1136 2480 -3156 -496 3443 -2396 -2351 3532 -589
4248 -589 -3424 2668 1003 -3755 1344 2454 -3328 106 3276 -2729 -1765 3475 -645 -2923 3078
4263 3078 538 -3422 2122 1969 -3722 464 3750 -2861 -1320 3536 -1406 -2481 3477 194 -3347
4278 -3347 2762 1819 -3495 749 2856 -2714 -750 3521 -1790 -2067 3408 -177 -3383 2762 1640
4293 1640 -3763 1021 2709 -3071 -466 3517 -2208 -2055 3803 -710 -3403 2821 826 -4037 1470
4308 1470 2311 -3598 145 2999 -2647 -1528 3755 -1118 -3001 3021 705 -3546 1981 1773 -3160
4323 -3160 314 3382 -2850 -1082 3988 -1248 -2714 3222 569 -3260 2264 1923 -3636 859 3609
4338 3609 -3014 -797 3441 -1441 -2406 3091 -50 -3401 2767 1601 -3665 1192 2940 -3058 -663
4353 -663 3499 -2085 -2060 3147 -688 -2973 2859 1050 -3814 1289 2370 -3353 -263 3161 -2410 -1302
4369 -1302 3333 -1025 -3135 3110 619 -3663 1702 2262 -3237 255 3002 -2628 -1282 3653 -1133
4384 -1133 -2758 3327 619 -3186 2301 1898 -3109 806 3101 -2893 -806 3475 -1339 -2306 3235
4399 3235 71 -3408 2622 1303 -3275 1239 3049 -2823 -703 3459 -2140 -1806 3606 -384 -2689
4414 -2689 2606 898 -3796 1402 2636 -3132 -484 3205 -2351 -1753 3330 -1165 -3062 3067 893
4429 893 -3536 1404 2021 -3514 383 3026 -2399 -940 3685 -1432 -2371 3032 323 -3430 2114 1978
4445 1978 -3280 549 2683 -2446 -305 3560 -1433 -2100 3532 83 -3060 2438 1458 -3215 1440
4460 1440 2497 -3279 -254 3502 -1935 -1758 3190 -306 -2987 2370 959 -3557 1416 2089 -3145
4475 -3145 -246 3169 -2200 -1838 3218 -952 -2513 2576 559 -3341 2024 1871 -3654 144 2959
4490 2959 -2550 -1372 3148 -1476 -2438 3095 191 -3342 2332 2066 -3036 912 3110 -2357 -374
4505 -374 3295 -1334 -1957 3420 -48 -3158 2461 1537 -3190 917 2595 -2584 -240 3138 -1972 -1940
4521 -1940 3223 -762 -2763 2481 1012 -3367 1375 1916 -3232 234 3017 -2430 -1831 3451 -1288
4536 -1288 -2897 2668 318 -3143 1789 1926 -3415 718 2935 -2375 -1168 2983 -1066 -2416 2788
4551 2788 131 -2908 2069 1676 -2988 746 3114 -2715 -852 3210 -1428 -1930 3356 -210 -2990
4566 -2990 2518 1006 -3240 1208 2856 -2673 -146 3165 -1593 -1605 3352 -406 -2987 2595 1181
4581 1181 -3185 969 1910 -3068 36 2908 -2364 -1856 3165 -853 -3031 2702 606 -3552 1839
4596 1839 1871 -2998 372 2615 -2381 -1383 3489 -1015 -2274 2541 129 -2754 1970 1408 -3350 876
4612 876 2979 -2611 -519 3403 -1127 -1952 3271 52 -2805 2240 1069 -3295 1341 2620 -2789
4627 -2789 -228 3414 -1839 -1607 3169 -791 -2663 2401 902 -3368 1325 2444 -2904 -16 2584
4642 2584 -2525 -1295 3056 -751 -2613 2881 400 -3230 1724 1777 -2848 159 2555 -2733 -1130
4657 -1130 3283 -1350 -2369 2911 102 -3020 1781 1573 -2915 904 2675 -2874 -301 3103 -1343
4672 -1343 -2148 2803 212 -2543 2159 1109 -3079 1049 2400 -2551 -360 2757 -1944 -1702 3163
4687 3163 -524 -2678 2324 701 -2911 1470 2083 -2938 -87 2813 -2230 -1350 2905 -1030 -2421
4702 -2421 2449 685 -3176 1356 1970 -3039 63 2262 -2154 -1260 3044 -1427 -2268 2938 -47 -3155
4718 -3155 1896 1541 -2851 709 2308 -2376 -530 3073 -1380 -1899 3309 -7 -2917 2347 1159
4733 1159 -2749 1166 2311 -2555 -257 3057 -2042 -1700 2986 -361 -2260 2403 662 -2907 1429
4748 1429 1881 -3125 45 2817 -2174 -1514 2664 -968 -2559 2468 311 -3207 1715 1539 -3263 339
4764 339 2735 -2155 -1093 2828 -1389 -2347 2615 120 -3161 1799 1540 -2839 381 2486 -2453 -655
4780 -655 2873 -1900 -1765 3047 -8 -2553 2166 1315 -2602 1282 2346 -2137 -10 2977 -1793 -1437
4796 -1437 2801 -365 -2613 2534 931 -2881 1434 1793 -2559 196 2766 -2035 -1449 2971 -625
4811 -625 -2470 2411 408 -2846 1483 1581 -2873 314 2607 -2015 -1040 2768 -1415 -1996 2450 -45
4827 -45 -2571 1661 1424 -3129 556 2759 -2432 -617 2657 -1147 -1363 2592 38 -2459 2633 1281
4843 1281 -2889 1022 2452 -2460 -429 2942 -1885 -1570 2779 -565 -2402 2618 696 -2820 1262
4858 1262 2181 -2355 -201 2617 -2150 -1279 2779 -907 -2521 2370 277 -2757 1597 1364 -2905 53
4874 53 2342 -2173 -1137 2609 -1133 -1900 2341 189 -2524 1591 1257 -3080 693 2623 -2434 -947
4890 -947 2746 -1005 -2003 2335 -211 -2417 2075 1165 -3016 1108 2420 -2361 -488 2893 -1231 -1559
4906 -1559 2886 -392 -2136 2335 719 -2684 1356 2087 -2382 -30 2532 -1909 -1220 2792 -801
4921 -801 -2281 2610 298 -2590 1240 1432 -2517 242 2208 -2189 -731 2498 -1337 -1907 2405 -31
4937 -31 -2933 1507 1434 -2652 644 2106 -2226 -604 2754 -1395 -1952 2623 340 -2134 1677 1117
4953 1117 -2393 1033 2205 -2593 -401 2746 -1675 -1498 2622 -385 -2015 2367 410 -2534 1280
4968 1280 1778 -2579 -125 2360 -1788 -1160 2790 -870 -2068 2287 177 -2743 1375 1571 -2587 229
4984 229 2302 -1762 -944 2361 -1279 -1974 2282 53 -2609 1601 1321 -2640 462 2036 -1951 -340
5000 -340 2639 -1251 -1731 2532 -109 -2397 1913 1100 -2409 897 1932 -2334 19 2574 -1335 -1275
5016 -1275 2609 -493 -1913 1800 379 -2419 1555 1932 -2380 23 2301 -1873 -1368 2528 -671
5031 -671 -1862 2047 252 -2354 1679 1534 -2688 51 1958 -2041 -891 2249 -1100 -1963 2145 -76
5047 -76 -2215 1751 1411 -2662 107 1727 -1737 -513 2223 -1302 -1466 2347 -159 -2401 1826 1154
5063 1154 -2254 983 1916 -2075 -22 2258 -1637 -1304 2530 -403 -2101 1891 950 -2355 859 1587
5079 1587 -2440 507 2462 -1684 -1147 2597 -452 -2152 1632 301 -2207 1476 1285 -2811 485
5094 485 1948 -2080 -1068 2238 -1026 -1610 2024 265 -2151 1663 985 -2542 587 1950 -2035 -550
5110 -550 2455 -999 -1443 2335 -206 -2014 1809 777 -2348 803 1765 -2164 11 2391 -1571 -1176
5126 -1176 2236 -314 -2096 1853 540 -2508 903 1572 -2142 5 2293 -1779 -779 2292 -758
5141 -758 -1818 2266 297 -2251 990 966 -2220 331 1858 -1715 -959 2458 -686 -1853 2063 64
5157 64 -2326 1615 1026 -2291 672 1742 -1841 -420 2126 -1252 -1636 1948 -189 -2116 1620 664
5173 664 -2196 1030 1759 -1875 -259 1972 -1042 -1111 2281 -697 -1745 1901 564 -2186 1089 1683
5189 1683 -2101 -179 2182 -1384 -883 2227 -1008 -1746 2104 150 -2136 1088 1179 -2029 447 1671
5205 1671 -1885 -459 2344 -1073 -1871 2231 466 -2156 1337 765 -2251 526 1795 -1912 -568
5220 -568 2238 -1215 -1508 2211 -226 -2008 1765 602 -1869 961 1782 -2132 -275 2099 -1239 -1352
5236 -1352 2206 -313 -1534 1782 457 -2377 1552 1513 -2120 207 2261 -1230 -1165 1877 -725 -1659
5252 -1659 1911 253 -2152 1092 1273 -2060 40 1884 -1601 -583 1903 -1376 -1493 1767 88
5267 88 -2439 1228 1087 -2159 704 1416 -1776 -307 2123 -1194 -1326 2233 -157 -1915 1584 932
5283 932 -2273 944 1256 -1988 -256 2175 -1588 -1209 2300 31 -1767 1622 650 -1988 1381 1417
5299 1417 -1979 412 2102 -1503 -904 2282 -421 -1695 1760 296 -2032 1582 1120 -2346 104
5314 104 1898 -1630 -715 2019 -1151 -1758 2258 -377 -1806 1324 852 -2188 283 1363 -1934 -86
5330 -86 1752 -1340 -1247 1852 -65 -1891 1647 677 -2030 812 1491 -1870 -108 1574 -1471 -1004 2138
5347 2138 -351 -1960 1844 553 -2059 1059 1235 -2162 420 2174 -1513 -980 2341 -403 -1661
5362 -1661 1506 234 -2047 1207 981 -2076 356 1769 -1839 -555 1933 -715 -1330 1694 334
5377 334 -2163 1170 674 -2314 488 1677 -1877 -418 1877 -1025 -965 1791 -550 -1621 1839 495
5393 495 -2446 494 1358 -1830 42 1917 -1421 -692 2329 -151 -1687 2033 481 -2018 1251 1298
5409 1298 -1731 416 1756 -1587 -612 2114 -648 -1653 2140 270 -1836 1465 1175 -2006 592
5424 592 1741 -1877 -905 2021 -1042 -1437 1767 78 -1968 1135 454 -2198 641 1282 -1727 -484
5440 -484 2185 -1220 -1353 2194 -163 -1511 1533 452 -1887 1021 1295 -1949 -240 1750 -1362 -971
5456 -971 1798 -480 -1376 1637 241 -1923 1401 1218 -1893 283 1572 -1509 -561 1922 -420 -1426
5472 -1426 1996 204 -1870 961 1006 -1827 411 1491 -1603 -343 1901 -988 -1536 1904 -89 -1836
5488 -1836 1203 603 -1741 558 1479 -1946 -365 2182 -1094 -1353 1772 -265 -1558 1396 675 -2017
5504 -2017 804 1341 -1811 -141 2008 -1233 -761 1983 85 -1595 1711 474 -2180 1359 1368 -1981
5520 -1981 94 1603 -1734 -808 1690 -398 -1073 1513 -114 -1745 1356 793 -2131 329 1616 -1707
5536 -1707 -568 1805 -1170 -1146 2053 -242 -1708 1415 967 -1763 194 1297 -1852 -504 1657 -1261
5552 -1261 -963 1931 -158 -1480 1461 527 -1695 787 1560 -1753 175 1798 -1481 -920 1973 -186
5568 -186 -1288 1791 303 -1606 1095 1101 -1932 487 1895 -1336 -468 1666 -740 -1242 1868 -146
5584 -146 -1949 1311 720 -2200 521 1469 -1526 -376 1874 -857 -1022 1764 -231 -1808 1403 893
5600 893 -2091 476 1188 -1732 17 1739 -1246 -973 1768 -494 -1949 1411 710 -2027 891 1052
5616 1052 -2156 -69 1707 -1541 -707 1839 -843 -1319 1651 298 -1667 1023 778 -1683 380 1769
5632 1769 -1302 -723 2340 -649 -1405 2081 328 -1792 1325 1122 -2000 758 1553 -1525 -571 1936
5648 1936 -946 -1146 1453 -186 -1748 1462 653 -1892 910 1606 -1675 -394 1803 -815 -1111 1485
5664 1485 -502 -1844 1708 438 -2206 849 1484 -1864 285 1686 -1241 -594 1781 -679 -1503 1478
5680 1478 204 -1859 1265 1091 -1606 321 1489 -1244 -214 1985 -859 -1143 2040 290 -1959
5695 -1959 1379 657 -1727 493 1288 -1741 -120 1640 -898 -889 1590 -190 -1745 1284 376 -2129
5711 -2129 645 1429 -1819 -271 1851 -1094 -1053 1774 -633 -1509 1304 240 -1803 689 1227 -2007
5727 -2007 -179 1639 -1171 -717 1875 -643 -1051 1859 168 -1592 949 1257 -1703 450 1572 -1505
5743 -1505 -352 1507 -1080 -1296 2055 -5 -1673 1243 901 -1749 402 1518 -1518 -41 2075
5758 2075 -923 -748 1973 -242 -1717 1349 670 -2018 966 1187 -1609 66 1746 -1343 -982 1755
5774 1755 -622 -1272 1327 350 -1822 1166 1080 -2011 101 1881 -1403 -634 1571 -950 -1229 1420
5790 1420 380 -1668 1546 1173 -1775 387 1482 -1293 -389 1896 -724 -894 1614 -250 -1336 1469
5806 1469 879 -1587 634 1311 -1332 -335 1690 -1081 -566 1700 -193 -1610 1042 733 -1703 669
5822 669 1539 -1459 80 1948 -1601 -850 1874 -284 -1809 1342 248 -1377 680 719 -1856 88
5838 88 1500 -1442 -448 1847 -448 -1194 1523 142 -1725 1226 942 -1734 529 1377 -1563 -147
5854 -147 1581 -801 -1156 1751 115 -1445 1441 914 -1769 742 1412 -996 -76 1759 -1154 -542
5870 -542 1622 -485 -1440 1478 678 -1995 916 1270 -1869 -135 1580 -1425 -656 1865 -749 -1227
5886 -1227 1394 62 -1760 567 1200 -1793 -128 1514 -1414 -336 1535 -647 -1488 1701 94
5901 94 -1898 1251 567 -1576 631 1425 -1520 -650 2034 -978 -854 1525 113 -1571 1417 595 -1656
5918 -1656 659 1275 -1446 -87 1819 -1117 -942 1464 -423 -1543 1642 312 -1649 619 1012 -1850
5934 -1850 150 1546 -993 -624 1387 -581 -1606 1527 -93 -1811 1050 1038 -1870 232 1266 -1491
5950 -1491 -557 1727 -656 -983 1688 427 -1566 1184 869 -1375 634 1106 -1733 -181 1667 -903
5966 -903 -1028 1679 24 -1429 1370 669 -1269 890 1235 -1332 -46 1777 -1093 -1058 1815 -365
5982 -365 -1534 1293 180 -1698 852 1230 -1611 -255 1900 -1305 -759 1518 -685 -1124 1303 253
5998 253 -1770 877 907 -1536 598 1459 -1067 -436 1383 -604 -867 1748 43 -1542 1465 856 -1529
6015 -1529 547 1532 -1411 -271 1776 -1183 -475 1425 -51 -1458 1516 740 -1532 1116 870 -1323
6031 -1323 188 1416 -863 -693 1744 -555 -1331 1174 388 -1435 690 968 -1735 298 1482 -1170
6047 -1170 -321 1812 -624 -1115 1516 72 -1588 1036 901 -1585 213 1290 -1283 -211 1420 -912
6063 -912 -1023 1686 57 -1486 1244 512 -1430 900 1395 -1354 -379 1576 -1156 -676 1346 -79
6079 -79 -1221 1207 622 -1431 652 1087 -1395 227 1665 -1189 -555 1844 -418 -1433 1293 182
6095 182 -1632 883 882 -1672 231 1372 -1128 -684 1482 -354 -1284 1511 176 -1320 1216 525 -1584
6112 -1584 255 1281 -1668 -303 1627 -768 -1297 1458 -203 -1544 1418 522 -1823 843 1259 -1420
6128 -1420 -135 1659 -1092 -965 1517 -239 -1228 1349 121 -1540 816 1346 -1443 -322 1380 -887
6144 -887 -548 1736 -415 -1358 1576 164 -1456 678 590 -1439 207 1224 -1441 -376 1538 -949
6160 -949 -1361 1688 -105 -1892 766 883 -1664 227 1241 -1343 -313 1262 -669 -676 1550 -328
6176 -328 -1304 1017 609 -1483 573 1237 -1094 -156 1379 -1110 -667 1404 -206 -1355 1322 508 -1399
6193 -1399 1153 1237 -1530 86 1420 -1041 -240 1598 -191 -1098 1336 182 -1786 1066 954 -1331
6209 -1331 171 1184 -1093 -524 1387 -595 -569 1441 -2 -1502 987 797 -1668 143 997 -1526
6225 -1526 -34 1521 -1102 -1068 1525 -341 -1435 901 636 -1609 387 1152 -1303 278 1279 -1110
6241 -1110 -849 1577 -114 -1371 1036 620 -1238 729 865 -1542 -151 1530 -1130 -735 1684 -146
6257 -146 -1226 1497 199 -1418 1124 685 -1554 293 1543 -1209 -383 1332 -693 -1115 1667 45
6273 45 -1538 916 468 -1874 467 1486 -1462 -615 1432 -1230 -762 1587 -6 -1433 1315 743
6289 743 -1515 416 850 -1472 -45 1341 -1004 -961 1550 -439 -1028 1164 472 -1299 1172 1137 -1317
6306 -1317 191 1407 -1128 -948 1625 -482 -1165 1501 315 -1455 820 684 -1259 225 1458 -1300
6322 -1300 -377 1523 -697 -861 1020 -148 -1179 919 487 -1336 401 1153 -1177 -197 1276 -965
6338 -965 -1005 1347 -439 -1250 1237 428 -1478 544 914 -1060 -465 1366 -1037 -652 1522 -440 -1243
6355 -1243 1182 218 -1440 837 888 -1177 731 1394 -1163 -432 1393 -431 -1242 1523 215 -1266
6371 -1266 1138 1164 -1368 530 1224 -1147 -93 1556 -429 -886 1482 101 -1322 721 447 -1287
6387 -1287 418 1301 -1337 -107 1430 -691 -768 1112 -103 -1536 1107 222 -1478 725 883 -1258
6403 -1258 284 1598 -713 -714 1453 -483 -1196 1247 67 -1504 740 814 -1514 188 1351 -937
6419 -937 -314 1362 -592 -925 1469 100 -1497 803 571 -1260 404 1267 -1268 -128 1275 -829
6435 -829 -711 1246 -150 -905 956 401 -1521 410 635 -1351 5 1488 -775 -606 1490 -138
6451 -138 -1336 982 296 -1226 841 1053 -1152 92 1537 -1208 -404 1341 -548 -911 1040 32
6467 32 -1342 902 1029 -1315 -25 1447 -956 -544 1371 -570 -1034 1547 -159 -1179 1113 591
6483 591 -1291 573 1164 -1171 -196 1196 -828 -681 1176 -31 -1514 1023 575 -1529 416 789
6499 789 -1165 -67 1342 -880 -613 1216 -353 -1358 1249 253 -1177 565 692 -967 -161 1134
6515 1134 -1225 -534 1511 -431 -1051 1143 71 -1328 634 461 -1302 7 1521 -1160 -154 1509
6531 1509 -563 -947 1140 236 -1020 970 692 -1574 314 993 -934 -56 1256 -655 -873 1440
6547 1440 -118 -1142 1001 252 -1429 301 1006 -1376 -66 1362 -966 -1025 1281 -378 -1228 1433
6563 1433 144 -1545 631 588 -1213 377 1045 -1097 -590 1492 -467 -932 1286 230 -1133 400
6579 400 784 -1357 122 890 -1147 -452 1486 -467 -1160 1109 319 -1104 858 455 -1061 340 956
6596 956 -1235 -206 1355 -1096 -896 1383 -438 -1018 892 206 -1260 758 867 -1432 131 1436
6612 1436 -819 -465 1201 -267 -762 978 212 -1261 904 943 -1288 -15 1016 -976 -363 1249
6628 1249 -538 -859 1242 -199 -1303 787 774 -1025 174 888 -1125 -287 1371 -522 -611 1528 -104
6645 -104 -1275 1000 370 -1209 378 1036 -1208 -147 1150 -727 -569 1321 -140 -1194 1192 367
6661 367 -1402 830 854 -1245 -36 1401 -924 -722 1151 -378 -814 1249 240 -1270 514 712
6677 712 -1281 454 1119 -772 -82 1268 -697 -524 876 205 -1201 1029 824 -1296 462 1000 -685
6694 -685 -250 1423 -772 -495 1262 -25 -1139 1007 689 -1126 332 985 -1215 -63 1261 -639
6710 -639 -598 1466 -198 -1153 891 382 -990 700 845 -1170 127 1265 -986 -579 1242 -340 -1073
6727 -1073 894 150 -1123 729 455 -1105 89 757 -1121 -655 1069 -512 -1162 1113 -35 -911
6743 -911 927 611 -1142 468 1219 -999 -314 1076 -656 -904 1396 -134 -973 1003 491 -1532 564
6760 564 1241 -1025 135 1130 -681 -459 1313 -180 -1123 983 325 -876 581 690 -1233 134 836
6777 836 -1112 -572 1233 -377 -1056 960 113 -1131 607 675 -1350 695 1137 -1377 -42 1410 -489
6794 -489 -697 855 90 -1063 631 830 -1250 357 982 -1438 -58 1232 -802 -494 1103 -8
6810 -8 -780 1015 247 -1110 548 713 -1116 175 1349 -630 -505 1267 -252 -935 1223 -31 -981
6827 -981 749 779 -1094 -81 974 -809 -93 1261 -246 -1057 987 149 -1218 1149 650 -1303 283
6844 283 908 -1185 -14 1097 -510 -922 1117 15 -1146 733 400 -1111 773 889 -955 108
6860 108 1379 -569 -497 1059 78 -1112 1129 285 -1125 647 929 -912 -102 1341 -582 -282 1157
6877 1157 -687 -991 948 190 -1062 733 441 -1303 202 1198 -716 -395 1249 -231 -769 894
6893 894 -28 -1163 953 818 -1185 276 782 -966 -338 1118 -752 -934 1382 -77 -1375 954
6909 954 424 -1315 252 986 -1223 -247 1126 -889 -416 1134 -191 -980 965 563 -869 675 798
6926 798 -1124 92 1439 -943 -307 1225 -401 -1097 1183 9 -1171 885 461 -1441 288 1346
6942 1346 -839 -346 1192 -249 -915 763 -30 -1314 1114 479 -1363 -32 694 -856 -180 1483
6958 1483 -635 -546 1099 -216 -1212 1053 618 -1183 648 1213 -1060 -194 1016 -870 -530 1291 -297
6975 -297 -1111 1002 168 -1364 331 507 -914 186 1258 -778 2 1557 -286 -1000 1081 570 -1277
6992 -1277 559 482 -1308 127 937 -1116 -601 1368 -704 -903 1159 10 -1244 632 293 -1235
7008 -1235 418 970 -965 -455 1474 -602 -655 1193 156 -938 934 377 -1191 299 1116 -998
7024 -998 -317 1331 -856 -476 1264 -737 -1145 1336 532 -1390 451 703 -982 293 1108 -874 -454
7041 -454 1234 -391 -1033 1300 332 -1187 841 794 -1122 85 742 -1000 -216 1127 -546 -812 1003
7058 1003 185 -1150 679 416 -1272 545 878 -1214 -93 1299 -695 -1198 1156 -187 -1191 1142
7074 1142 228 -1292 592 755 -1212 85 1419 -253 -414 1083 -355 -984 1221 283 -1145 722
7090 722 668 -1182 127 1056 -810 -403 986 -545 -959 1015 109 -1056 866 576 -1353 110 1035
7107 1035 -1141 -63 1217 -463 -1018 1053 -35 -1351 974 461 -1610 94 1045 -1048 -272 1251
7123 1251 -929 -581 1138 -252 -1049 562 400 -1115 481 706 -1014 -47 1255 -722 -380 1249
7139 1249 -334 -777 1036 188 -1034 575 794 -1175 308 1243 -991 -353 1130 -173 -786 1243
7155 1243 117 -1219 570 518 -1129 192 891 -992 -259 1271 -602 -639 1368 -178 -1179 889
7171 889 414 -1338 386 628 -1013 -157 1279 -936 -834 1292 -123 -1129 797 500 -1486 559
7187 559 764 -1196 -99 820 -1071 -575 1263 -191 -1133 905 185 -1460 586 487 -984 209 1201
7204 1201 -708 -453 1253 -521 -968 1403 -108 -821 998 567 -1459 328 1277 -1061 -477 1324
7220 1324 -485 -687 1024 153 -1216 916 446 -1278 466 907 -1067 -43 1058 -748 -702 1123
7236 1123 -301 -1050 1350 412 -1440 670 796 -1292 -345 1261 -851 -329 1463 -703 -808 1265
7252 1265 348 -1186 598 878 -1254 495 1162 -1016 -681 1498 -616 -872 1464 117 -1038 837
7268 837 669 -1134 56 1204 -1189 -31 1404 -665 -440 1300 -180 -1227 936 139 -1355 184
7284 184 956 -1034 -200 1345 -841 -729 1209 -400 -1285 1057 246 -1132 685 891 -1195 -124 1253
7301 1253 -1029 -544 1441 -761 -920 1087 -234 -1284 784 972 -1558 -133 729 -905 -211 1405
7317 1405 -414 -744 1207 75 -1269 647 738 -1024 315 643 -1113 -136 1181 -791 -944 1303
7333 1303 43 -1415 735 442 -1185 453 811 -1362 -13 1270 -659 -744 1233 -264 -955 466
7349 466 -55 -1399 707 693 -1099 -49 979 -1179 -670 1248 -467 -722 962 268 -1323 873 593
7366 593 -1204 116 1236 -822 -323 1441 -549 -805 1118 -33 -1208 825 621 -1508 448 1338
7382 1338 -1013 -359 1286 -560 -919 1420 -29 -1100 672 48 -1029 310 1067 -1674 -73 1015
7398 1015 -742 -554 1257 -59 -1304 743 120 -860 530 430 -1213 -148 1115 -1069 -521 1527
7414 1527 -403 -1030 1174 -2 -1104 946 513 -1424 155 1298 -988 -305 1368 -397 -828 1530
7430 1530 93 -1135 878 565 -1261 166 1208 -1259 -356 1437 -533 -726 1461 -23 -1414 1092
7446 1092 300 -1270 591 882 -1197 -194 939 -811 -665 1427 -156 -1256 1078 562 -1321 335
7462 335 684 -992 175 1163 -1192 -537 1531 -315 -1086 1299 88 -1063 903 622 -1463 165
7478 165 942 -1069 -522 1450 -312 -1065 1345 -46 -1051 863 617 -1294 377 908 -1071 -249 1305
7495 1305 -603 -741 1027 -272 -1149 1282 135 -1286 502 914 -955 125 1328 -940 -526 1281
7511 1281 -223 -1042 1282 201 -1271 398 866 -1208 -74 1220 -959 -778 1500 -606 -1034 1331
7527 1331 238 -1323 587 694 -1153 376 980 -943 -505 1183 -553 -1024 1210 89 -928 1007
7543 1007 553 -1100 695 1327 -1249 -383 1469 -820 -942 1053 -162 -1182 1001 479 -1086 813
7559 813 709 -1412 -36 1528 -743 -782 1454 -248 -929 1328 90 -1554 705 666 -1306 -20 1260
7576 1260 -647 -408 1224 -681 -925 968 63 -1412 1168 485 -1431 186 1072 -1385 -22 1090
7592 1090 -553 -690 1432 256 -1329 1014 860 -1042 757 1297 -1273 -375 1294 -857 -717 1248
7608 1248 -38 -1265 952 539 -1212 538 843 -1152 70 1428 -1142 -670 1365 -496 -1132 956
7624 956 61 -1193 599 604 -1273 -89 1262 -1063 -715 847 -524 -875 1294 132 -1434 592 622
7641 622 -1530 382 1010 -1022 -390 1572 -634 -840 1307 -240 -1123 1110 687 -1740 391 1028 -1212
7658 -1212 113 1385 -987 -761 1360 -299 -1376 1109 236 -1569 567 701 -1198 290 1349 -822
7674 -822 -573 1303 -514 -1258 1130 276 -1628 746 673 -1376 429 1223 -1254 -691 1149 -503 -898
7691 -898 1271 38 -951 703 712 -1442 537 1070 -1321 -195 1142 -671 -664 1536 -374 -1206 928
7708 928 482 -1414 265 1026 -975 -82 1449 -562 -725 1390 -225 -893 975 289 -1385 681 824
7725 824 -1008 -52 1117 -986 -711 1693 -210 -833 1107 421 -1285 948 684 -1151 333 1154 -994
7742 -994 -355 1493 -543 -886 1175 122 -1250 640 445 -1369 263 1195 -1128 -432 1154 -618
7758 -618 -858 1472 46 -1074 1202 525 -1220 463 978 -1098 -130 1446 -932 -538 1270 -296
7774 -296 -1097 960 190 -1327 515 1212 -1293 -94 1092 -796 -556 1298 -300 -683 1064 283 -1285
7791 -1285 718 804 -1120 -160 1003 -1157 -569 1327 -611 -874 1301 349 -1355 755 732 -1356 333
7808 333 1111 -1059 -135 1403 -722 -619 1266 27 -1178 818 587 -1037 409 1155 -983 -249 1099
7825 1099 -645 -635 1358 -146 -999 1081 142 -1280 962 1126 -1195 59 1264 -1032 -721 1429
7841 1429 -319 -1121 1153 91 -1266 1067 485 -1124 50 1226 -863 -374 1163 -445 -700 1335
7857 1335 12 -1471 810 539 -1418 535 1025 -1144 -202 1104 -816 -831 1273 -248 -1290 708
7873 708 503 -1050 480 913 -760 -245 1350 -713 -736 1568 -90 -1039 1120 581 -1130 801 913
7890 913 -1088 79 1246 -1074 -557 1109 -404 -1116 1080 73 -1281 588 384 -1397 -7 885
7906 885 -1159 -449 1063 -485 -744 1101 -121 -1100 850 503 -1276 240 1023 -882 -179 1081 -563
7923 -563 -684 1298 75 -1245 929 330 -1506 339 1064 -1077 99 964 -821 -422 1295 -209
7939 -209 -1149 1111 353 -1154 539 1060 -1205 65 1081 -648 -252 1215 -557 -1116 1071 96 -1134
7956 -1134 870 897 -1180 236 950 -1136 -516 1154 -528 -1082 1045 124 -1096 1020 738 -1323 255
7973 255 936 -1206 -395 911 -792 -863 914 -125 -1083 1042 444 -1293 183 1037 -885 -236 1488
7990 1488 -718 -478 1593 -134 -1336 1091 405 -1146 403 828 -1346 222 1477 -842 -617 1127
8006 1127 -353 -942 888 151 -1309 733 885 -1567 153 1082 -1019 -693 1214 -543 -1004 968
8022 968 -100 -1128 909 640 -1134 177 791 -1047 -277 1552 -858 -1022 1248 -281 -1024 793
8038 793 404 -1179 559 985 -1246 5 1207 -516 -688 1074 -297 -1039 1188 526 -1321 754
8054 754 807 -1062 267 1149 -720 -613 1371 -581 -637 952 336 -1429 691 868 -1262 165 949
8071 949 -893 -260 1399 -744 -834 1281 158 -1370 640 267 -1242 553 846 -1385 -370 1010
8087 1010 -782 -690 1267 -220 -1137 856 144 -1098 327 874 -1148 119 1460 -825 -429 1214
8103 1214 -450 -706 1244 362 -1136 626 799 -1096 162 1093 -762 -242 870 -479 -880 748
8119 748 -151 -1270 609 728 -1148 -235 1185 -1132 -259 921 -800 -748 1167 -69 -1384 738 381
8136 381 -951 495 815 -1378 -276 1201 -811 -761 1292 526 -1037 711 463 -853 424 1124 -851
8153 -851 15 1091 -782 -1016 1103 -135 -731 1060 609 -814 679 771 -1283 122 1348 -796 -436
8170 -436 1215 -172 -1139 916 -46 -1309 841 757 -1554 383 999 -885 -263 1357 -500 -973 845
8187 845 -317 -972 666 797
8191G97
$$ Imaginary data points
##PAGE= N=2
##DATA TABLE= (X++(I..I)), XYDATA
0 0 0 0 0 0 0 0 0 0 0 6 -8 8 -8 8 -10 15 -16 16 -22 25 -29 34 -38 43 -51 59 -67 75 -84 95 -108 118 -133
33 -133 148 -167 184 -207 228 -251 279 -311 343 -379 420 -465 519 -577 644 -721 812 -923 1055
52 1055 -1222 1433 -1722 2128 -2741 3769 -5798 11208 -52015 -121266 74901 18126 -90235
65 -90235 45269 40859 -99989 16492 69898 -89483 -26124 97061 -60273 -81238 86832
76 86832 -37 -93875 64348 44489 -94772 17918 60418 -86792 -2341 105670 -54613
87 -54613 -63756 91470 -6551 -79704 72192 29476 -94439 39725 72151 -78557 223
98 223 91546 -53903 -39177 91166 -28445 -77657 85444 31813 -87126 44742 62345
109 62345 -78677 8317 80225 -64148 -29317 92969 -32447 -65828 85971 11240 -90044
120 -90044 54308 53109 -87332 9141 72310 -65574 -16738 88520 -46898 -63435 84694
131 84694 -470 -86365 57550 41254 -82916 26903 66279 -77998 -11641 90722 -45515
142 -45515 -52323 81919 -10001 -70562 74086 33208 -84997 36024 64711 -74814 -467
153 -467 86351 -48527 -36809 84821 -17613 -62985 76200 20902 -79665 47989 55833
164 55833 -81256 5308 82416 -50379 -31415 74979 -29600 -53020 78591 5302 -82706
175 -82706 50052 46418 -80125 10701 67918 -60365 -21127 75094 -39101 -52359 74932
186 74932 -2174 -74299 53236 32451 -79730 22719 63173 -65640 -15045 70936 -44104
197 -44104 -41128 78645 -9625 -69633 58027 26694 -73608 32309 52767 -71292 -1842
208 -1842 75600 -47397 -37327 76763 -12882 -58841 59697 11006 -74176 43548 48563 -75163
220 -75163 3827 69670 -53559 -31008 72451 -25775 -56982 60315 2695 -70390 47073
231 47073 35746 -79794 9670 62079 -61372 -26594 67040 -33145 -47478 63254 -8580
242 -8580 -69669 49877 28321 -77616 16131 54681 -61028 -12608 66139 -39873 -39466 67177
254 67177 -11605 -62665 53052 22842 -68308 29033 50303 -60958 -1751 64339 -44015
265 -44015 -30734 69761 -14617 -55099 56963 17305 -62760 35147 40678 -63175 7157 60033
277 60033 -50613 -24726 69975 -20468 -50447 54992 5098 -62118 39028 31419 -67175 12261
289 12261 54896 -55070 -19757 64426 -29727 -46285 55582 -5161 -60520 44968 25759
300 25759 -66587 18467 49839 -58130 -12728 61685 -34989 -36525 60368 -10200 -54472 51829
312 51829 21598 -64014 25139 44622 -56399 -881 60200 -38259 -25246 65006 -15341 -50788
324 -50788 54436 16558 -59285 30787 38584 -54711 8409 55466 -44707 -19877 62720 -22886
336 -22886 -47535 53868 8821 -55729 34357 28762 -57668 12494 47208 -51618 -16924 59068
348 59068 -27997 -41529 52505 -261 -52906 36778 18941 -59416 18047 43477 -52743 -9866
360 -9866 57217 -30750 -33863 52506 -8586 -48289 43908 15951 -56751 26408 42081 -51749
372 -51749 -2244 54217 -34272 -24495 55285 -14320 -41714 51297 12594 -55047 30642 37230
384 37230 -52449 3870 49994 -37938 -16272 56327 -21265 -39420 51781 4471 -55498 32205
396 32205 29136 -53193 9555 43822 -44455 -12657 52759 -29675 -38326 50456 -2406 -51583
408 -51583 35258 21267 -52854 15651 37423 -49369 -7001 51384 -32037 -31267 51835 -6512
420 -6512 -45068 39077 14910 -51020 22862 35846 -47611 385 51254 -32189 -23243 51147
432 51147 -11462 -38616 44425 10143 -48159 30071 33230 -47616 5726 47240 -34633 -16702
444 -16702 49745 -17085 -33555 46805 3441 -47872 31665 27184 -49669 8915 40858 -39332
456 -39332 -11277 47507 -25669 -31969 47418 -3457 -47693 33055 20349 -48782 14075 35175
468 35175 -43514 -5814 46711 -30553 -27647 48839 -7099 -42835 37404 14866 -46640 21151
480 21151 32204 -44669 1803 47484 -31599 -21233 50029 -10277 -36991 39771 9618 -43543
492 -43543 28336 28787 -45769 7305 45555 -34143 -17596 46964 -15564 -31812 41831 2503
504 2503 -42906 30807 23004 -47648 8702 38731 -37495 -12832 43397 -21566 -28436 41090 -5409
517 -5409 -43301 31804 16861 -48342 11827 34531 -38490 -7757 39788 -27707 -24510 42539
529 42539 -10270 -40557 35373 14475 -44590 17103 29244 -40050 -22 39875 -30375 -18672
541 -18672 45842 -10921 -35229 37757 9809 -42018 22602 25488 -40693 6870 39527 -32942
553 -32942 -13547 45858 -15750 -32970 38365 3563 -40288 27094 20001 -42998 10761 35869
565 35869 -37895 -12837 41667 -21188 -28744 38133 -4070 -39078 30353 14225 -46043 12181
577 12181 31094 -39190 -7637 39462 -24627 -23431 39395 -8896 -36558 32738 10346 -43427
589 -43427 17766 29303 -37441 -428 38385 -26596 -16511 41064 -12236 -31792 37517 9995
601 9995 -38836 22319 25970 -35760 6407 35847 -29349 -10666 43072 -14134 -28024 38090
613 38090 4732 -36420 25328 19440 -37932 10632 33303 -33438 -8286 41024 -19443 -26781
625 -26781 36730 -1912 -35954 26675 13328 -39704 14189 28942 -37599 -6385 38047 -23474
637 -23474 -23191 35946 -7285 -33396 30671 8853 -40950 17700 27605 -37582 -1639 36252 -25202
650 -25202 -16377 38072 -11790 -29839 35220 7307 -38281 22381 24681 -36110 4452 34644
662 34644 -26649 -10579 38863 -15692 -26105 37096 3347 -36781 23775 20630 -35258 7866
674 7866 29449 -30406 -6527 37608 -20477 -25711 36306 -774 -35217 23938 13617 -36207
686 -36207 11683 25348 -34368 -4589 35472 -23577 -22128 35201 -5843 -32476 26522 9475
698 9475 -35908 15659 22731 -35435 13 35480 -24636 -18063 35654 -8295 -27579 29805 5201
711 5201 -34091 22265 22279 -35376 3686 33832 -25478 -12297 36098 -12959 -24236 34003 2586
724 2586 -33738 23778 18719 -35324 8025 30302 -28897 -8392 34824 -17344 -21655 34114 -3608
737 -3608 -34132 25388 14586 -36048 9842 25601 -31646 -3712 33303 -22373 -20434 34304
749 34304 -5823 -31215 26339 9728 -33837 15291 22560 -32515 521 32800 -23501 -15748
761 -15748 35126 -7784 -26716 29031 7032 -31444 19550 20404 -32598 5411 32843 -24028
773 -24028 -11739 34622 -10399 -22486 30631 2754 -30705 22913 17466 -33932 7350 29274
785 29274 -26317 -8733 31664 -15757 -20565 30896 -3294 -31670 23890 13346 -35114 8681
797 8681 24327 -29075 -5538 29590 -20924 -18603 31539 -7254 -30495 25525 9718 -34466
809 -34466 11850 21364 -30446 -613 29389 -23291 -14575 33895 -9372 -27673 28101 7613
821 7613 -31158 16966 19406 -30443 5336 30061 -24758 -10571 34396 -10700 -23344 29422
833 29422 3862 -28654 20902 16070 -31036 9122 27633 -26467 -8299 32381 -14472 -20577
845 -20577 29019 -1344 -27768 22046 10926 -33204 10040 24180 -28527 -6165 28904 -17874
857 -17874 -17521 28066 -6890 -27518 24079 7686 -33174 12438 21450 -28813 -1627 27101 -20749
870 -20749 -13616 29852 -9250 -24365 27019 6031 -30476 16040 19451 -28070 3238 26948
882 26948 -22170 -8611 32410 -11064 -21750 29316 3888 -28528 18963 15985 -28534 8404
894 8404 26029 -25123 -6284 31679 -14236 -19538 28828 -730 -27366 21077 11011 -30079
906 -30079 10123 22381 -28462 -4986 29380 -17397 -17667 27922 -5799 -26126 22957 6885
918 6885 -31002 12304 20286 -28960 -1664 27233 -18856 -13442 28310 -9225 -22994 25752 5027
931 5027 -29772 15856 18837 -27143 2415 25946 -19983 -8643 29488 -11007 -19954 27953 3172
944 3172 -27614 17908 16164 -26448 6242 23593 -22574 -5150 29620 -14192 -18740 28456 -206
957 -206 -26681 18305 11543 -27537 9093 20068 -26433 -3597 28226 -17141 -17389 27179 -4414
970 -4414 -25523 19757 6968 -28613 12359 17903 -28647 -829 27508 -19000 -14035 27379 -7542
983 -7542 -22478 23194 3932 -27350 16803 17148 -28082 3087 26538 -19537 -9498 27942 -9696
996 -9696 -18915 26323 2026 -25915 19468 15403 -27708 5489 24594 -20626 -5686 27310 -12915
1009 -12915 -16611 26948 -1471 -25780 19473 12101 -27548 7757 20630 -23179 -3398 25300
1021 25300 -17251 -15731 26191 -4973 -25437 20057 8101 -27525 9897 16755 -25621 -666
1033 -666 24697 -19668 -13356 26774 -6873 -22400 21623 4766 -25905 13746 15092 -25831 3545
1046 3545 24878 -19766 -9731 27385 -9046 -19019 23892 2541 -24157 18104 14020 -26496
1058 -26496 6276 23629 -20730 -6956 26482 -11745 -15818 25448 -1544 -23926 19952 11199
1070 11199 -27385 7830 20692 -22810 -4026 24708 -16115 -14654 25882 -5714 -24301 20600
1082 20600 7736 -27183 9601 16981 -24317 -692 23224 -18808 -12253 25948 -7641 -22197
1094 -22197 21744 5530 -25153 12209 14717 -23960 3263 23162 -19490 -9072 27221 -8210
1106 -8210 -18753 23177 3550 -22745 15985 13013 -24273 7124 22836 -20629 -6303 26261
1118 26261 -10006 -15938 23456 -138 -21834 18112 9983 -25725 8578 20533 -22177 -4583
1130 -4583 24024 -13689 -13969 23552 -4550 -21808 19937 6742 -26605 9722 17674 -23373 -1961
1143 -1961 22067 -16636 -11315 24419 -7771 -20575 21607 4690 -25551 12397 15881 -23284
1155 -23284 2033 21811 -18665 -7674 25718 -9527 -18143 23720 3281 -23387 15099 13483
1167 13483 -22814 6284 20842 -19758 -4653 25782 -11186 -16344 23700 281 -21947 16961
1179 16961 9663 -23995 8644 18931 -21974 -3221 23935 -13492 -14393 22712 -3601 -20829
1191 -20829 17967 5935 -24854 9969 16506 -23426 -1923 22313 -15928 -11935 22460 -7181
1203 -7181 -19158 20059 3730 -24376 12572 15172 -23093 1511 20947 -17028 -7820 23437
1215 23437 -9238 -16824 22562 2237 -22784 14766 13089 -22076 5058 19861 -18513 -4438
1227 -4438 24466 -11512 -15023 23863 -145 -21209 16749 9929 -22432 8022 17624 -20871 -2003
1240 -2003 23329 -14296 -13977 22990 -3587 -20893 17006 5787 -23113 10564 14888 -23413 -856
1253 -856 21857 -16200 -12140 22021 -6322 -18348 18564 2457 -23301 12628 13197 -23345 1712
1266 1712 20825 -16817 -8484 21973 -8096 -15648 20830 825 -21638 15246 12290 -22719 4482
1279 4482 19819 -17168 -4705 21779 -10877 -13143 22707 -1285 -20995 16779 10340 -22277
1291 -22277 6464 16888 -19294 -2110 21052 -14284 -12291 22512 -4021 -20492 17128 6395
1303 6395 -22649 8604 13821 -21227 -68 19956 -16671 -10579 22388 -6522 -19070 17989
1315 17989 3373 -21616 11785 12004 -22331 3169 20191 -17451 -7947 22616 -7790 -15847 19944
1328 19944 1173 -20169 14895 10847 -21938 5980 19737 -17281 -4780 22586 -9660 -12616
1340 -12616 21139 -673 -18824 16993 8931 -21667 7520 17522 -18656 -2693 21014 -12238
1352 -12238 -11321 21155 -4431 -18912 17704 6502 -22108 8609 14115 -19856 -711 19047
1364 19047 -15237 -9839 21417 -6553 -18001 17462 3895 -21280 10643 11711 -20654 2687
1376 2687 18644 -16663 -7442 21552 -7750 -15420 19004 1826 -19118 13412 10310 -20053 6024
1389 6024 18120 -17508 -4222 22023 -9102 -12978 19661 -730 -17523 16039 8435 -21166
1401 -21166 7876 17090 -18192 -2754 20329 -11487 -10706 20383 -4105 -17806 17282 5255
1413 5255 -21922 9014 14228 -19950 -1041 18509 -14488 -9178 19715 -7613 -17084 18140 3045
1426 3045 -21655 9801 11822 -19573 1567 16979 -15922 -6707 20580 -8803 -15195 18824 1814
1439 1814 -19803 12489 10293 -19177 5155 16421 -16826 -3708 21264 -9471 -12901 19546
1451 19546 304 -17469 14345 7793 -18957 7779 15193 -17937 -2022 20305 -11309 -11181 19215
1464 19215 -2959 -16558 15209 5002 -20283 8863 13418 -19544 -775 18617 -13350 -9571
1476 -9571 18458 -6157 -15447 16564 2280 -20280 10561 11884 -19823 1551 17153 -14923
1488 -14923 -6679 18915 -8030 -14090 18287 650 -19171 12575 10336 -19070 4569 16126
1500 16126 -15611 -3217 19721 -9323 -11757 19466 -437 -17641 14130 8357 -18344 6900
1512 6900 14562 -16760 -1443 19423 -11416 -10814 19027 -2623 -16097 14679 5214 -18830 8508
1525 8508 12368 -18513 -410 17944 -13176 -9546 17910 -5373 -15392 15035 2431 -18849
1537 -18849 10013 10847 -19301 1291 16945 -13921 -7425 17950 -7071 -12947 17042 303 -18083
1550 -18083 12309 10077 -18366 3813 15892 -14093 -3659 18066 -8925 -10665 18744 -991
1562 -991 -17063 13844 8491 -17821 5798 14478 -15252 -1044 17994 -11182 -9466 18911 -2750
1575 -2750 -16384 14626 5545 -18115 7681 11581 -16912 405 16690 -13592 -8477 18368 -4956
1588 -4956 -15435 14318 2981 -17754 9490 9696 -18278 1928 16088 -14379 -7183 17665 -6650
1601 -6650 -13377 15387 755 -16789 11421 8606 -18152 4091 15617 -14309 -4475 17783 -7536
1614 -7536 -10498 16548 -658 -15348 13786 7288 -17518 6089 14675 -14487 -2341 16910 -9371
1627 -9371 -8805 17559 -2891 -14818 14343 5523 -17476 6893 12132 -15720 -233 15407 -12276
1640 -12276 -7589 17118 -5354 -14756 14462 2823 -17555 8243 9850 -17078 1729 14622
1652 14622 -14404 -6357 17296 -7019 -13290 15072 922 -16356 10450 8135 -16967 4548
1664 4548 14075 -14312 -3945 17452 -7867 -10588 16179 -191 -14675 12745 6822 -16755 6472
1677 6472 13761 -14774 -2353 16970 -8956 -8589 16547 -2589 -13772 13963 4945 -16831 7200
1690 7200 11927 -15289 -631 15205 -10925 -7062 16128 -5261 -13816 14182 2931 -17298 8013
1703 8013 9860 -15519 1267 13416 -12818 -5618 16328 -7007 -12289 14799 1594 -15920 9469
1716 9469 7830 -15625 3801 13016 -13244 -3326 16748 -7691 -10250 15560 186 -14040 11266
1729 11266 6524 -15054 6528 12221 -14664 -1047 16768 -8730 -8945 15670 -2038 -12882 12743
1742 12743 3973 -15601 7999 11115 -15364 -517 15148 -10659 -7511 14873 -4624 -12083 13486
1755 13486 1691 -16355 8574 9272 -16092 526 13280 -11718 -5894 14642 -6888 -11039 14385
1768 14385 464 -15554 9604 8133 -15104 2984 12455 -12288 -2958 15202 -7855 -9772 15241
1781 15241 -322 -14059 11084 6902 -14064 5165 11449 -12748 -975 14817 -8667 -8304 15358
1794 15358 -1392 -12761 11643 4767 -14054 6784 9835 -13951 107 14590 -10350 -7245
1806 -7245 14499 -3696 -11848 12305 1574 -14641 7943 8444 -15245 1121 13116 -11511 -5650
1819 -5650 14142 -6074 -10581 12867 168 -14685 9361 7219 -15200 2856 12064 -11923 -3453
1832 -3453 14123 -7074 -8239 14489 -1074 -13557 10718 6307 -14078 4830 11326 -11850 -403
1845 -403 14402 -8355 -7277 14940 -2135 -12513 11473 4749 -13698 6354 9239 -12756 738
1858 738 13547 -9966 -6636 14717 -3690 -11614 11297 2491 -13111 7189 7111 -14258 1871
1871 1871 12430 -11294 -5790 13498 -5064 -10181 11373 319 -12995 8685 6057 -14564 3063
1884 3063 11558 -11348 -3691 13526 -6267 -8319 12714 -1474 -11995 10866 5426 -13848 4783
1897 4783 11118 -11496 -1674 12873 -7531 -6446 13660 -2726 -11502 11894 4390 -13363 5983
1910 5983 9581 -11828 382 12044 -9360 -5394 13626 -4480 -11242 11924 2295 -13434 6543
1923 6543 7431 -12807 1298 10913 -10722 -4405 13305 -5865 -10262 11706 577 -12771 7947
1936 7947 5604 -12958 3352 10627 -11434 -3149 13167 -6326 -8276 12253 -393 -11074 9451
1949 9451 4903 -12716 5053 10373 -11209 -1389 12534 -6944 -6173 12498 -2090 -10110 10808
1962 10808 3428 -12645 5952 8992 -11433 21 11995 -8250 -5238 12403 -3935 -10018 11168
1975 11168 1969 -13172 6451 7358 -12224 1383 10230 -10164 -3844 12276 -6090 -9458 11473
1988 11473 408 -12094 7322 5216 -12370 2989 9515 -11422 -2402 12196 -6732 -8025 11875
2001 11875 -688 -10734 8796 4160 -11661 5208 9086 -11168 -476 12827 -7026 -6398 11946
2014 11946 -1681 -9500 10075 2988 -11701 6643 8619 -11508 444 11751 -8053 -5084 11663
2027 11663 -3407 -8905 10409 1049 -11942 6982 6967 -11999 903 10232 -8897 -3896 10762
2040 10762 -5688 -8232 10938 -73 -12193 7492 5865 -11939 2058 9245 -9804 -2155 11182
2053 11182 -6790 -7282 11907 -1165 -11050 8500 4839 -11348 4094 8240 -10063 -231 11682
2066 11682 -7266 -5452 12483 -1512 -9760 9810 3455 -10618 6129 7256 -10897 1200 11446
2079 11446 -7964 -4680 11793 -3225 -8553 9702 1163 -10726 7033 6186 -11735 1730 9985
2092 9985 -9015 -4403 11007 -4941 -7938 10177 -644 -11093 7527 5066 -11999 2292 9027
2105 9027 -9320 -2581 10451 -6169 -6869 11065 -1430 -10489 8437 4520 -11021 3787 8513
2118 8513 -8952 -542 10744 -6820 -5102 11735 -2032 -9581 9140 3858 -10475 5168 7147
2131 7147 -9920 1190 10409 -7709 -4318 11536 -3241 -8528 9331 1771 -10109 6315 5838
2144 5838 -10782 1976 9440 -8919 -4121 10959 -4461 -8048 9291 -292 -10293 7299 4466
2157 4466 -11547 2614 8785 -9487 -2646 10211 -5428 -6472 9884 -1489 -9640 8427 3823
2170 3823 -11248 4087 8813 -9722 -950 10140 -6133 -4513 10931 -2280 -8824 9373 2960
2183 2960 -10777 5028 7518 -9341 724 9465 -7391 -3726 11138 -3707 -8519 9468 2043
2196 2043 -10322 5537 5689 -10147 1723 8504 -8556 -2839 11088 -4553 -7914 9135 366
2209 366 -9864 5891 3794 -10524 2779 7761 -9307 -2307 10202 -5510 -6867 9460 -958
2222 -958 -9113 7232 3119 -10238 4233 7957 -9408 -1047 10389 -6257 -4891 9850 -2188
2235 -2188 -8141 8943 2492 -10163 5365 7409 -9566 601 9458 -6794 -3635 10415 -3368
2248 -3368 -7036 9349 1454 -10368 5582 6004 -9596 1122 8060 -7938 -2893 9852 -4941
2261 -4941 -7269 9279 67 -9907 6210 4697 -9851 2426 7710 -9113 -1973 9742 -5900
2274 -5900 -6398 9113 -1002 -9052 7086 3537 -10059 4030 7126 -9071 -723 10128 -5878
2287 -5878 -5305 9707 -1450 -7619 7976 2443 -9402 5283 6603 -9174 250 9123 -6424
2300 -6424 -3817 9688 -2757 -6888 8891 1153 -9651 5974 5687 -9641 1037 8100 -7356
2313 -7356 -2857 9173 -4678 -6575 8980 -358 -9981 6071 4354 -10068 2380 6951 -7926
2326 -7926 -1722 9156 -5835 -6188 9895 -1008 -9267 6723 3566 -9421 3619 6585 -8558
2339 -8558 -98 9142 -6368 -4703 9697 -1280 -7778 7599 2476 -8855 5181 6014 -9111
2352 -9111 1052 9202 -6803 -3737 9747 -2432 -6582 8104 1192 -8497 6004 4894 -9486
2365 -9486 1921 8234 -7399 -3191 8849 -3993 -6156 8084 -493 -9113 6171 3836 -9817
2378 -9817 1976 7477 -7682 -2460 8639 -5266 -5342 8722 -1819 -8633 7021 3063 -9613
2391 -9613 3162 6321 -8154 -331 8386 -5764 -4425 9373 -2075 -7921 8007 2622 -8978
2404 -8978 4643 6253 -8197 1115 8552 -6460 -3388 9602 -2611 -6567 8078 1630 -8352
2417 -8352 5265 4979 -8824 1930 8056 -7668 -2706 9285 -3640 -6461 7866 -25 -8422
2430 -8422 6129 3683 -9308 2202 7208 -8033 -2347 8867 -4931 -5659 8016 -1621 -8259
2443 -8259 6871 2770 -9758 3067 6559 -7911 -835 8290 -5693 -4240 8909 -2070 -7387
2456 -7387 7823 2786 -8811 4429 6227 -7771 682 7901 -6064 -2671 9200 -2509 -6726
2469 -6726 8256 1703 -8310 5003 5006 -8089 2088 7770 -7236 -2308 9238 -3970 -6417 8034
2483 8034 370 -7979 5746 3365 -8712 2493 6743 -8017 -1931 8797 -4616 -5636 7733
2496 7733 -945 -7689 6235 2244 -9249 3826 6074 -8387 -980 8676 -5390 -4471 8439 -2037
2510 -2037 -6545 7548 1821 -8733 4676 5936 -7963 438 7983 -5799 -2897 8750 -2836
2523 -2836 -6021 8514 1138 -8071 5452 4925 -8240 1552 7253 -6635 -2051 8415 -4190 -5699
2537 -5699 8329 -220 -8556 5391 3867 -8515 2198 6168 -7560 -1577 8527 -5427 -5359 8233
2551 8233 -1248 -7701 5929 2522 -8385 3533 5398 -8160 -599 8361 -5367 -4483 8346 -2150
2565 -2150 -6842 6930 1788 -8204 4821 5386 -7737 762 8200 -6124 -3148 8113 -2764 -5594
2579 -5594 8053 816 -8203 5745 4555 -8351 1503 7188 -6398 -2026 7987 -4230 -5520
2592 -5520 8156 -188 -8032 5594 3837 -8398 2131 6110 -7136 -799 7718 -5124 -5125 8192
2606 8192 -1494 -7950 6048 2689 -8465 2821 5380 -7724 136 8082 -5745 -4411 8437
2619 8437 -1774 -7064 6787 1531 -7933 4529 4959 -8001 1249 7900 -5879 -3226 8710 -2243
2633 -2243 -6176 7330 813 -7483 5695 4457 -8010 1691 7746 -6639 -2094 8115 -3780
2646 -3780 -5103 7252 -451 -7622 6117 3223 -8463 2482 6655 -7154 -1623 7539 -5006
2659 -5006 -4547 7869 -2036 -7501 6429 2380 -8599 2877 5963 -7418 -361 7131 -5761 -3528
2673 -3528 8050 -2554 -6694 7045 1760 -7836 4454 4854 -7383 1136 7196 -6239 -2409 8782
2687 8782 -2663 -5839 7454 874 -7550 4991 4190 -7692 2428 7341 -6535 -1865 8400
2700 8400 -3339 -5422 7656 -462 -7206 5704 3074 -8167 2658 6061 -7381 -1475 7311
2713 7311 -4535 -4668 7546 -1639 -6827 6243 1686 -8375 3338 5459 -7484 -382 7035 -5651
2727 -5651 -3498 7845 -2427 -6405 7195 1324 -8228 3825 5022 -6810 668 6985 -6011
2740 -6011 -2455 8420 -3106 -5752 7911 1024 -7475 5253 4479 -7630 1991 6341 -6736 -1324
2754 -1324 8223 -3727 -5497 8111 -116 -7031 5396 2830 -7854 2845 6006 -7621 -881
2767 -881 7830 -4939 -4716 7352 -1505 -6754 6101 1647 -8274 3478 5096 -7878 -354 7481
2781 7481 -5375 -3622 7388 -2484 -5978 6708 1050 -7846 4576 4852 -7633 565 7052 -5324
2795 -5324 -2099 7636 -3092 -5233 7800 657 -7627 5070 4226 -7194 1903 6514 -6041 -1201
2809 -1201 7557 -4238 -4783 8006 -366 -7068 5608 2757 -7354 2732 5571 -6683 -366 7363
2823 7363 -4959 -4493 7972 -1542 -6859 5694 1890 -7611 3620 4358 -7630 253 7327 -5458
2837 -5458 -3619 7706 -2269 -6068 6469 722 -7406 4700 4141 -7875 1123 7104 -5572 -2361
2851 -2361 7689 -2647 -4823 7107 96 -6778 5330 3819 -7632 2000 6650 -6462 -1304
2864 -1304 7348 -3823 -4320 7479 -793 -7430 5966 2964 -7698 2508 5451 -6764 -885 6687
2878 6687 -5207 -3890 7505 -1673 -6797 6068 1770 -7450 2904 4329 -6948 -37 6779 -5718
2892 -5718 -3561 7429 -2302 -6394 6136 917 -7245 4153 3966 -7640 1235 6600 -6141 -2504
2906 -2504 7560 -2693 -4861 7061 61 -6512 5244 3740 -7537 1942 6426 -5902 -1477
2919 -1477 7881 -3501 -3982 7396 -891 -6332 6039 2781 -7542 2630 5710 -6826 -665 6502
2933 6502 -4652 -3605 7297 -2285 -6530 5997 1629 -7695 3101 4545 -6934 -18 6176 -5177
2947 -5177 -2649 7574 -2966 -6061 6626 920 -7309 3916 3849 -6654 1446 6294 -5704 -1746
2961 -1746 7780 -2806 -4976 6651 499 -6451 4704 3404 -6891 2468 6134 -6355 -940 7563
2975 7563 -3434 -4186 6921 -383 -6206 5528 2336 -7158 3183 5567 -6879 -657 7166 -4126
2989 -4126 -3908 6707 -1711 -5883 5831 1455 -7480 3426 4492 -7020 99 6196 -5129 -2936
3003 -2936 6779 -2846 -5438 6307 647 -7268 4350 4332 -7080 865 6154 -5923 -1953 7149
3017 7149 -3401 -4766 7089 404 -6571 4788 3186 -6815 2288 5584 -6340 -959 7333 -3659
3031 -3659 -3875 7062 -429 -5981 5388 2177 -6794 2868 5148 -6194 -507 6810 -4602 -3739
3045 -3739 6784 -1625 -5689 6038 1191 -6838 3410 4351 -7447 359 6119 -4942 -2607 6652
3059 6652 -2571 -5181 5963 291 -6984 3942 3846 -6936 1124 5919 -5485 -1968 6771 -3159
3073 -3159 -4223 6592 11 -6456 5156 3068 -6487 2200 5193 -5761 -432 7021 -3995 -3801
3087 -3801 7371 -843 -5744 5314 2433 -6542 2836 4462 -6642 79 6556 -5023 -3306 6600
3101 6600 -1355 -5685 5153 1495 -6564 3367 3819 -7046 838 6184 -5466 -2776 6706 -2336
3115 -2336 -4768 5321 24 -6445 4228 3282 -7125 1331 5701 -5500 -1684 6422 -2925 -4330
3129 -4330 5977 -463 -6211 5126 2968 -6732 2126 5296 -5660 -1095 6550 -3778 -2931 6477
3143 6477 -926 -5426 5611 2434 -6579 2887 4593 -5714 -177 6359 -4082 -2870 6506 -1994
3157 -1994 -5505 5315 1530 -6721 3459 3899 -6699 303 5575 -5405 -2652 6616 -2788 -5059
3171 -5059 5469 308 -6324 3904 3060 -6886 1438 5385 -5749 -2072 6233 -3187 -3892 6122
3185 6122 -523 -5594 4776 2453 -6466 2222 5282 -5500 -845 6412 -3040 -3365 6255 -942 -5250
3200 -5250 5729 2199 -6628 2995 4866 -5637 4 5970 -4117 -2633 6245 -1835 -5162 5775
3214 5775 1169 -6603 3121 3445 -6219 450 5105 -5012 -2210 6124 -2531 -5027 5660 197 -6521
3229 -6521 3496 3124 -6094 1525 5160 -5540 -1349 6375 -2986 -4214 5914 -120 -5510 4406
3243 4406 2673 -5903 2383 4848 -5853 -911 6513 -3565 -3279 6486 -517 -4867 5236 1860
3257 1860 -6095 2776 4271 -5768 -164 6120 -3757 -2579 6154 -1857 -4733 5206 591 -6239 3575
3272 3575 4015 -6008 528 5410 -4825 -2378 5636 -2761 -4620 5653 -49 -6620 3994 2845
3286 2845 -6229 640 4390 -5170 -1489 5946 -3093 -3903 5947 -156 -5703 4289 2103 -5676 2109
3301 2109 4476 -5190 -226 5847 -3389 -3284 6037 -592 -5329 4710 1865 -5409 2866 4090 -5600
3316 -5600 429 5922 -4154 -2755 5957 -1393 -4796 4921 806 -5710 3108 3317 -5915 490 5072
3331 5072 -4792 -2568 5435 -2515 -4064 5084 -223 -5975 4044 3019 -6026 1300 5099 -4735 -1495
3346 -1495 5369 -2929 -3396 5598 -414 -5524 4337 2283 -5682 2048 4485 -4965 -292 5435 -3375
3361 -3375 -2911 6060 -783 -4815 4633 1786 -5445 2872 4081 -5297 625 5415 -4107 -2458 5987
3376 5987 -1255 -4659 4750 1078 -5500 3030 2926 -5658 664 5247 -4566 -2352 5711 -2160 -4090
3391 -4090 4624 -169 -5414 3821 2537 -6078 1171 4456 -4893 -1316 5088 -2776 -3396 5284 -631
3406 -631 -4959 4169 2187 -5848 1810 4479 -4897 -507 4966 -3063 -2525 5343 -1159 -4756 4586
3421 4586 1936 -5546 2327 3894 -4855 414 5194 -3746 -2308 5785 -1828 -4497 4855 988 -5244
3436 -5244 2800 3021 -5007 1097 4618 -4496 -1957 5719 -2432 -4119 4832 30 -4940 3150 2201
3451 2201 -5534 1280 3964 -5246 -1071 5725 -2955 -3664 4878 -479 -4793 4259 1708 -5600 2164
3466 2164 4051 -4330 -334 5356 -2909 -2795 5345 -919 -4267 4706 1374 -5257 2602 3830 -4744
3481 -4744 161 5068 -3548 -2159 5371 -1271 -4073 5101 595 -5011 2664 3144 -5073 776 4410
3496 4410 -4325 -1480 5339 -2627 -4157 4593 203 -5006 3305 2290 -5408 1240 3844 -5097 -882
3511 -882 4906 -2989 -3216 4906 -471 -4746 3899 1745 -5318 1850 3728 -4844 -532 5255 -2763
3526 -2763 -2892 5114 -1002 -3997 4178 1272 -4828 2681 3607 -4629 411 4836 -3144 -2241 4817 -1372
3542 -1372 -3560 4513 608 -5029 2973 3201 -4751 536 4178 -3808 -1470 4816 -2222 -3597 4599
3557 4599 19 -5080 3178 2303 -4723 998 3656 -3956 -887 4644 -2657 -3160 5043 -651 -4643
3572 -4643 3656 1921 -4759 1656 3328 -4372 -254 4974 -3314 -2445 5502 -836 -4143 3930 1409
3587 1409 -4486 2592 3125 -4833 590 4876 -3494 -1840 5184 -1186 -3366 4187 729 -4282 3136
3602 3136 2541 -4784 848 4056 -3527 -1730 4398 -2163 -3464 4558 -193 -4897 3206 1859 -4920
3617 -4920 1105 3877 -4065 -1085 4398 -2697 -2796 4764 -620 -4559 3661 1617 -4673 1728 3288
3632 3288 -4034 -375 4419 -3184 -2400 4984 -791 -4047 3982 1094 -4588 2416 3167 -4310 594
3647 594 4423 -3182 -1753 4993 -1185 -3453 4063 674 -4148 2917 2655 -4714 893 4031 -3620
3662 -3620 -1680 4458 -1905 -3325 4380 -347 -4395 3184 2267 -4619 1112 3746 -4018 -1082 4265
3677 4265 -2431 -2641 4329 -770 -4085 3464 1432 -4987 1712 3673 -4039 -298 4352 -2729 -1823
3692 -1823 4684 -1161 -3390 3823 1316 -4279 2039 3072 -4179 585 3899 -3323 -1569 4602 -1753
3707 -1753 -3499 4192 700 -4338 3337 2393 -4340 733 3575 -3581 -1257 4741 -2165 -2914 4039
3722 4039 178 -4144 2691 1700 -4376 1250 3358 -4167 -950 4401 -2435 -3018 3913 -639 -3910
3737 -3910 3059 1230 -4761 1590 3147 -4198 -327 4056 -2980 -2114 4161 -1028 -3302 3928 683
3752 683 -4706 2470 2965 -4090 159 4318 -2957 -1131 4490 -1413 -3009 4131 422 -4223 2682
3767 2682 2472 -4155 764 3595 -3455 -934 4296 -2155 -3100 4203 169 -3873 2879 1596 -4333
3782 -4333 1252 3196 -4067 -537 4375 -2445 -2864 4062 -650 -3746 3073 1073 -4372 1799 2641
3797 2641 -4058 -272 4112 -2945 -2262 4114 -941 -3260 3732 830 -3892 2377 2796 -4017 23
3812 23 3913 -2964 -1699 3925 -1237 -2893 3877 324 -3967 2650 2571 -4403 731 3800 -3318 -850
3828 -850 4262 -1960 -2925 4067 -299 -3924 3055 1903 -4175 1029 3271 -3688 -373 4224 -2660
3843 -2660 -2476 4319 -302 -3851 2958 1352 -4197 1284 2549 -3626 -134 3891 -3201 -2359 4188
3858 4188 -990 -3507 3175 769 -3560 2075 2292 -3924 530 4278 -2992 -1807 4320 -1071 -2844
3873 -2844 3822 576 -3760 2858 2498 -3893 930 3794 -3160 -1028 4270 -1866 -2360 3932 -74
3888 -74 -3870 3181 1886 -4279 1036 3219 -3433 -976 3238 -2328 -1976 3772 -1033 -3718 3166 1614
3904 1614 -4357 1490 2320 -3663 90 3585 -2674 -1924 4322 -1234 -3452 3192 1026 -3854 2056
3919 2056 2285 -3826 688 3658 -3297 -1237 4440 -1741 -2951 3677 533 -3720 2363 1952 -3866
3934 -3866 998 3721 -3354 -1144 4031 -1682 -2503 3696 -251 -3582 2914 1520 -3987 1230 3024
3949 3024 -3747 -921 4244 -2532 -2526 3406 -609 -3809 3269 1062 -4306 1513 2836 -3909 -329 3695
3965 3695 -2661 -1621 3923 -1471 -2880 3447 985 -4166 2056 2559 -3634 462 3464 -2899 -1213
3980 -1213 4069 -1531 -2931 3522 665 -3699 2497 1987 -3523 839 3344 -3539 -723 3891 -1712
3995 -1712 -2563 3593 118 -3375 2517 1422 -4098 1259 2757 -3715 -813 4083 -2093 -2578 3590
4010 3590 -655 -3393 3103 941 -4315 1539 2722 -3644 -597 3830 -2587 -1882 3697 -1063 -3173
4025 -3173 3123 618 -4110 2152 2256 -3899 -32 3513 -3008 -1234 3994 -1416 -2833 3923 592
4040 592 -3745 2304 2177 -3225 826 3572 -2856 -541 3999 -1658 -2999 3771 271 -3581 2562
4055 2562 1608 -3727 986 3195 -3559 -423 3750 -2355 -2438 3466 -524 -3343 2573 1094 -4145 1444
4071 1444 2305 -3939 -211 3756 -2642 -1949 3708 -803 -3371 2647 742 -3943 2214 2306 -3903 36
4087 36 3629 -2889 -1560 4030 -1304 -2600 3444 235 -3635 2337 2243 -3648 918 3274 -2795 -1042
4103 -1042 3784 -1691 -2638 3811 -86 -3594 2707 1682 -3651 1156 3093 -3358 -297 3758 -2695
4118 -2695 -2386 3590 -827 -3731 2473 1162 -3589 1500 2048 -3637 24 3865 -2744 -1978 3940 -817
4134 -817 -3016 2923 872 -3563 1960 2242 -3804 356 3586 -2686 -1277 3793 -1053 -2719 3634
4149 3634 383 -3752 2517 1972 -3490 934 3685 -3063 -1149 3528 -1735 -2268 3566 -48 -3273
4164 -3273 2917 1653 -3774 797 2827 -2956 -495 3657 -2201 -2193 3855 -561 -3512 2786 1240 -3871
4180 -3871 1245 2563 -3386 -216 3379 -2778 -1557 3560 -1239 -3298 3256 891 -3856 1408 2156
4195 2156 -3601 410 3273 -3028 -1348 4003 -1055 -2919 3642 472 -3444 2325 1746 -3478 873
4210 873 3195 -2950 -973 3763 -1621 -2617 3460 64 -3210 2776 1211 -3877 1652 2855 -3101
4225 -3101 -860 3698 -2283 -2270 3339 -713 -3168 2832 881 -4011 1586 2438 -3266 -395 3208 -2352
4241 -2352 -1603 3487 -920 -3266 3403 564 -3914 1749 2123 -3430 117 3173 -2697 -1203 4001
4256 4001 -1424 -2498 3580 493 -3335 2306 2000 -3568 690 3165 -2728 -785 3741 -1215 -2357
4271 -2357 3485 112 -3211 2304 1518 -3574 1205 2825 -3167 -626 3663 -1967 -2361 3529 -337
4286 -337 -3001 2739 680 -3760 1534 2452 -3437 -448 3525 -2144 -1944 3173 -1106 -2863 2734 646
4302 646 -3839 1974 2723 -3439 166 2978 -2465 -1344 3577 -1484 -2473 3185 655 -3416 2372 2089
4318 2089 -3264 637 3127 -2566 -677 3923 -1820 -2340 3525 -37 -3177 2445 1801 -3365 1037
4333 1037 2689 -3346 -505 3854 -2182 -2256 3769 -540 -3031 2499 1081 -3640 1346 2475 -3212
4348 -3212 -188 3478 -2505 -2064 3215 -952 -2725 2900 674 -3709 1976 2393 -3847 -21 3615
4363 3615 -2726 -1350 3269 -1013 -2901 3284 483 -3147 2389 2028 -3408 506 3206 -2572 -868
4378 -868 3839 -1517 -2223 3508 -8 -3463 2646 1793 -3600 1037 2563 -2946 -616 3577 -1745 -2096
4394 -2096 3495 -336 -3170 2821 1156 -3367 1248 2454 -3153 -310 3261 -2454 -1673 3605 -893
4409 -893 -3250 2613 784 -3671 1590 2249 -3468 398 3271 -2476 -1517 3717 -1034 -2771 2981 -3
4425 -3 -3216 2146 1667 -3249 737 3004 -2534 -1224 3642 -1284 -2341 3419 -25 -3147 2721 1756
4441 1756 -3311 892 2784 -2848 -466 3123 -1975 -1676 3312 -735 -3097 2725 707 -3429 1126
4456 1126 2318 -3258 -154 2801 -2085 -1518 3551 -967 -2948 2736 770 -3581 1315 2080 -3378
4471 -3378 300 2847 -2710 -1288 3505 -1114 -2665 3108 667 -3487 1937 1618 -3111 659 2918
4486 2918 -2792 -917 3643 -961 -2275 3235 69 -2693 2530 1373 -3447 1189 2919 -3047 -851
4501 -851 3132 -1860 -1868 3388 -361 -2836 2546 1034 -3519 1396 2402 -2996 -423 2969 -2388 -1564
4517 -1564 3394 -1089 -2900 2748 316 -3483 1457 1955 -3324 97 2870 -2795 -1170 3299 -1046
4532 -1046 -2737 2988 378 -3178 1936 1972 -2965 817 2648 -2663 -781 3572 -1237 -2671 3134
4547 3134 341 -3192 2385 1486 -3087 1219 2854 -3048 -404 3338 -1854 -1855 3553 -441 -2785 2533
4563 2533 896 -3297 1471 2506 -3350 -296 3027 -2112 -1434 2825 -874 -2833 2521 831 -3396
4578 -3396 1417 2101 -3083 250 2797 -2170 -1175 2922 -1139 -2540 3013 298 -3578 1860 1682 -3153
4594 -3153 589 3027 -2552 -744 3473 -1537 -2162 3130 152 -2898 2556 1315 -2784 882 2570
4609 2570 -2695 -81 3222 -1838 -1897 3161 -99 -2797 2261 1210 -2889 1637 2022 -3040 215 2937
4625 2937 -2280 -1641 3017 -529 -2625 2638 345 -3157 1738 1786 -3522 363 3153 -2574 -1415 2821
4641 2821 -1252 -2073 2992 -41 -3129 2017 1957 -3532 814 2796 -1965 -1016 3029 -1354 -1866 2994
4657 2994 -147 -2829 2434 1399 -3272 820 2719 -2339 -78 3046 -1694 -1515 3328 -306 -2692
4672 -2692 2450 962 -3310 1345 1890 -2532 -268 2959 -1895 -1682 3086 -1015 -2883 2226 340
4687 340 -3386 1330 1954 -2921 351 2848 -2492 -1006 2638 -1185 -2178 2769 349 -3030 2084 1384
4703 1384 -3318 603 2618 -2452 -921 3113 -1288 -1977 3070 60 -2919 2358 1123 -2834 898
4718 898 2777 -2362 -242 2910 -1438 -1452 3155 -610 -2555 2365 1027 -2929 1044 2186 -2477 -289
4734 -289 2850 -2037 -1467 3308 -755 -2763 2527 419 -3125 1195 1773 -2907 127 2752 -2411 -1257
4750 -1257 2727 -1259 -2183 2814 387 -2891 1536 1742 -2784 776 2482 -2224 -851 3074 -930
4765 -930 -1880 2397 7 -2892 2248 1112 -3093 1466 2318 -2675 -483 2911 -1782 -1145 3257 -540
4781 -540 -2553 2446 938 -3154 1118 1935 -2750 -286 2598 -1739 -1193 2812 -886 -2067 2553 512
4797 512 -2891 1093 1832 -2738 44 2429 -2180 -1272 2903 -1002 -1939 2640 99 -2909 1930 1568
4813 1568 -3043 827 2187 -2023 -805 2911 -1494 -1829 2651 -22 -2502 2146 1139 -2433 985
4828 985 2390 -2424 -270 3247 -1728 -1599 2457 -176 -2637 2174 889 -2767 1162 2067 -2730 -117
4844 -117 2770 -1580 -1212 2589 -885 -2440 2482 507 -2911 1432 1811 -2864 -9 2452 -2127 -952
4860 -952 2781 -1348 -2040 2496 376 -2955 1499 1362 -2485 506 2414 -1931 -690 2664 -1418 -1746
4876 -1746 2868 82 -2597 2077 1155 -2641 755 2331 -2322 -339 2970 -1566 -1348 2770 -360
4891 -360 -2306 1808 651 -2357 1273 1985 -2403 102 2696 -1937 -1357 2953 -374 -2419 2368 470
4907 470 -2671 1290 1804 -2692 -7 2175 -1871 -1287 2546 -903 -1993 2176 114 -2696 1594 1778
4923 1778 -2715 463 2333 -2167 -719 2358 -964 -1601 2921 -85 -2394 1913 1317 -2636 810
4938 810 2186 -2342 -116 2537 -1502 -1561 2786 -308 -2290 2191 1123 -2563 1381 1657 -2178 174
4954 174 2523 -1773 -1322 2629 -738 -1979 2111 415 -2550 1270 1716 -2482 392 2545 -1957 -1142
4970 -1142 2483 -1032 -1930 2320 191 -2515 1635 1137 -2653 605 2071 -1990 -725 2680 -1032
4985 -1032 -1841 2585 14 -2232 1980 1005 -2547 688 1978 -1929 -409 2790 -1413 -1194 2622 -338
5001 -338 -2351 2072 962 -2801 1241 1785 -2239 -39 2413 -1589 -1230 2523 -651 -2042 2147 727
5017 727 -2782 1028 1308 -2751 362 2019 -1972 -932 2640 -1262 -2179 2081 250 -2564 1264 1054
5033 1054 -2626 467 2073 -2169 -893 2446 -1337 -1671 2335 -248 -2120 1947 896 -2233 1035
5048 1035 2393 -2062 -477 2221 -1258 -1046 2453 -263 -1937 2244 1054 -2712 1207 1883 -2460
5063 -2460 284 2237 -1564 -990 2092 -582 -2072 2161 458 -2662 1183 1451 -2321 -28 1943
5078 1943 -1689 -887 2594 -1000 -1984 2213 63 -2506 1136 1341 -2422 623 2030 -1833 -319 2446
5094 2446 -1266 -1744 2267 -56 -2347 1647 912 -2294 1063 1857 -2020 -202 2473 -1396 -1384 2301
5110 2301 -483 -1614 1759 730 -2315 1105 1855 -2279 22 2185 -1478 -935 2279 -455 -1416 2214
5126 2214 441 -2472 1226 1441 -2077 373 1522 -1601 -932 2270 -917 -1491 2147 -123 -2631 1409
5142 1409 1072 -2264 431 1805 -1838 -475 2059 -1210 -1387 2410 -284 -2481 1721 1028 -2260 935
5158 935 1752 -2198 -507 2313 -1241 -1295 2465 -185 -1883 1845 700 -1996 1003 1524 -2199 304
5174 304 2116 -1623 -871 2337 -782 -2018 1954 508 -2117 1121 1168 -2466 306 2325 -1973 -909
5190 -909 1996 -645 -1498 1836 22 -2102 1523 964 -2305 425 1742 -1768 -478 2036 -937 -1451
5206 -1451 2179 -285 -2256 1571 1081 -2106 494 1540 -1738 -26 2063 -1342 -1271 2492 -504 -2091
5222 -2091 1699 656 -2248 1036 1497 -2067 11 2014 -1209 -741 2409 -357 -2281 1822 254
5237 254 -2179 1006 991 -1570 289 1875 -1823 -758 2271 -734 -1585 1778 187 -2073 1112 723
5253 723 -2206 414 1615 -1739 -560 2246 -670 -1297 2168 -625 -2148 1645 737 -2454 613 1749
5269 1749 -2022 -537 1972 -1033 -884 2037 -424 -1845 2052 587 -2210 972 1557 -1576 -321
5284 -321 1710 -1531 -957 2266 -797 -1609 1861 385 -1942 908 1213 -2129 77 1794 -1777 -674
5300 -674 2133 -1018 -1695 1944 -183 -2540 1277 889 -2258 606 2048 -1949 -397 2084 -1166 -1720
5316 -1720 1963 -335 -1653 1476 437 -2218 543 1792 -1907 -271 2145 -1074 -916 2321 -486
5331 -486 -1612 1599 606 -1815 1006 1414 -1722 320 1725 -1461 -769 2127 -903 -1470 2113 560
5347 560 -2107 1164 1126 -2097 307 1740 -1693 -535 2042 -1185 -1358 1901 -270 -1912 1213 919
5363 919 -2023 354 1565 -1874 -399 2083 -1274 -1505 2300 -198 -1822 1588 768 -1953 872 1286
5379 1286 -1875 -190 2106 -1235 -974 2089 38 -1192 1948 347 -1910 1035 1545 -1995 -54
5394 -54 1680 -1391 -782 1822 -541 -1517 1645 240 -1704 1244 1480 -2155 499 1877 -1527 -566
5410 -566 2031 -1117 -1399 1598 106 -1893 1278 1015 -2194 563 1473 -1762 -556 1909 -1189 -1160
5426 -1160 1836 -119 -1860 1294 804 -2149 703 1439 -1966 -23 1874 -1346 -754 1811 -363 -1698
5442 -1698 1649 394 -1766 1160 1261 -1827 403 1858 -1632 -894 2234 -434 -1280 1838 -102 -1512
5458 -1512 1403 1300 -1972 690 1798 -1673 -386 1898 -813 -1202 1747 -290 -1798 1501 771 -2052
5474 -2052 636 1484 -1649 -370 1633 -1486 -1384 1834 -157 -1878 1591 690 -2146 640 1329 -1746
5490 -1746 -89 1932 -1149 -1025 1940 -185 -1688 1616 341 -1922 624 1130 -1789 161 1550
5505 1550 -1601 -644 1997 -628 -1640 1736 239 -1644 1246 817 -1970 862 1598 -1580 -687 2144
5521 2144 -1058 -1025 1809 -246 -1735 1327 729 -1948 471 1536 -1695 -360 2007 -1148 -1088 1686
5537 1686 -381 -1584 1360 561 -1979 791 1290 -2034 -206 1752 -1548 -774 2002 -571 -1441 1434
5553 1434 392 -1638 1171 1551 -1840 105 1929 -1307 -788 2071 -1024 -1285 2016 115 -1670 1025
5569 1025 1062 -1888 339 1542 -1554 -614 1998 -1043 -1362 1815 -30 -1618 1230 844 -1843 685
5585 685 1492 -1724 -440 1897 -1201 -1243 1591 -173 -1594 1369 618 -2394 790 1178 -1977 -94
5601 -94 1699 -971 -906 1907 -409 -1471 1505 260 -1936 1377 1363 -1811 -22 1683 -1297 -196
5617 -196 1878 -887 -1122 1898 357 -1690 1149 1057 -1898 366 1648 -1317 -512 1868 -1098 -1438
5633 -1438 2041 -47 -1963 1299 568 -1970 545 1659 -1872 -382 1536 -1106 -1385 1812 -514
5648 -514 -1792 1625 436 -1855 614 1319 -1616 105 1734 -1471 -847 1714 -689 -1427 1654 612
5664 612 -1887 835 1246 -1686 -3 1700 -1132 -485 1535 -652 -1277 1727 48 -1813 1074 1049
5680 1049 -1715 416 1444 -1558 -554 1853 -902 -1269 1821 15 -1563 1040 963 -1820 266 1201
5696 1201 -1710 65 1462 -1491 -813 1951 -408 -1728 1441 626 -1942 790 1173 -1655 -154 1542
5712 1542 -1428 -824 1802 -452 -1512 1778 386 -1465 1104 899 -1854 426 1606 -1418 -490 2000
5728 2000 -886 -1433 1577 249 -1555 1274 964 -1653 560 1957 -1489 -481 1842 -804 -838 1716
5744 1716 -65 -1635 1390 603 -1931 911 1368 -1765 -201 1679 -1193 -716 1759 -574 -1460 1495
5760 1495 449 -1805 964 1367 -1890 164 1527 -1374 -591 1656 -669 -1521 1330 -60 -1761 1099
5776 1099 918 -1534 204 1715 -1591 -213 2048 -923 -1221 1683 -85 -1683 1266 652 -1799 607
5792 607 1683 -1597 -358 1773 -918 -1098 1845 -124 -1512 1381 361 -2034 700 1305 -1614 -154
5808 -154 1829 -943 -1210 1739 -653 -1264 1465 469 -1792 793 1163 -1635 -298 1525 -1297 -755
5824 -755 1918 -647 -1223 1616 434 -1783 789 1177 -1312 413 1300 -1336 -367 1847 -848 -1266
5840 -1266 1697 89 -1451 1722 911 -1538 387 1190 -1494 -75 1951 -1266 -1071 1755 -63 -1735
5856 -1735 1194 656 -1920 740 926 -1998 -659 1997 -944 -928 1880 -621 -1283 1271 331 -1969
5872 -1969 998 972 -1577 82 1650 -1237 -891 1375 -787 -1152 1628 -221 -1685 1170 1137 -1488
5888 -1488 176 1107 -1436 -716 1702 -1034 -835 1594 -159 -1727 1177 752 -1876 713 1444 -1398
5904 -1398 -326 1877 -891 -792 1676 -272 -1551 1520 329 -1615 734 1129 -1782 -75 1619 -1127
5920 -1127 -835 1888 -633 -1393 1604 47 -1733 971 677 -1751 331 1789 -1367 -820 1478 -736
5936 -736 -1060 1154 234 -1586 1424 708 -1812 257 1528 -1277 -381 1810 -573 -914 1823 -384
5952 -384 -1411 1476 496 -1655 450 1375 -1310 -328 1481 -1116 -625 1902 -357 -1542 1387 507
5968 507 -1819 969 1027 -1688 -28 1117 -1107 -601 1838 -681 -1279 1543 128 -1842 824 1083
5984 1083 -1468 537 1303 -1538 -487 1329 -986 -1330 1568 438 -1866 1211 554 -1472 463 1486
6000 1486 -1370 -247 1710 -688 -1543 1534 -129 -1504 1150 636 -1510 672 1392 -1657 0 1504
6016 1504 -1081 -791 1576 -495 -1286 1332 410 -1660 1061 1065 -1860 -204 1558 -790 -564 1675 -707
6033 -707 -1495 1449 214 -1862 863 937 -1686 306 1301 -1452 -479 1885 -1206 -1336 1689 297 -1533
6050 -1533 954 676 -2009 321 1270 -1535 -304 1822 -1013 -966 1451 -109 -1173 1363 558 -1496
6066 -1496 856 1097 -1259 123 2048 -1047 -699 1686 -259 -1278 1375 556 -1504 1022 764 -1620
6082 -1620 182 1790 -963 -505 1359 -372 -1246 1440 -213 -1644 1106 901 -1819 441 1169 -1496
6098 -1496 -364 1670 -696 -1314 1571 -126 -1501 1157 621 -1563 444 1301 -1472 -510 1908 -886
6114 -886 -811 1629 -113 -1172 1216 436 -1352 795 1232 -1256 -47 1555 -1216 -736 1640 -39
6130 -39 -1177 1494 485 -1486 860 1044 -1852 11 1564 -1256 -651 1358 -722 -1306 1477 169
6146 169 -1122 834 994 -1883 495 1232 -1588 -557 1731 -800 -1213 1770 -79 -1560 1195 517
6162 517 -1490 228 1536 -1018 -127 1359 -1078 -816 1853 -46 -1660 1103 564 -1830 508 838
6178 838 -1430 -156 1811 -1010 -628 1853 -325 -1271 1481 622 -1616 622 696 -1582 294 1572
6194 1572 -1175 -673 1471 -740 -1332 1530 -52 -1413 750 394 -1380 434 1382 -1531 -282 1551
6210 1551 -842 -1003 1290 -15 -1621 1368 666 -1525 520 1082 -1281 21 1565 -734 -565 1608
6226 1608 -258 -1245 1169 329 -1771 930 1332 -1391 130 1378 -1013 -568 1652 -613 -1102 1138
6242 1138 322 -1549 1019 896 -1664 20 1448 -925 -678 1534 -752 -809 1380 23 -1430 1002
6258 1002 507 -1350 358 1348 -1278 -370 1785 -946 -876 1498 -85 -1376 1141 260 -1346 509
6274 509 925 -1664 -373 1305 -1037 -826 1345 -42 -1406 1111 515 -1565 660 882 -1398 297
6290 297 1333 -727 -912 1765 -221 -1405 1548 197 -1467 954 796 -1590 220 1132 -1118 -410
6306 -410 1460 -789 -1207 1238 193 -1601 987 966 -1559 642 1187 -1281 -309 1257 -814 -907 1435
6323 1435 -453 -1353 835 565 -1336 422 809 -1201 -15 1295 -892 -743 1706 -201 -924 1088
6339 1088 402 -1436 888 858 -1422 184 1371 -863 -422 1305 -431 -869 1388 108 -1345 939
6355 939 1099 -1638 277 1407 -1155 -470 1464 -533 -853 1580 -121 -1423 1160 820 -1386 581
6371 581 1241 -857 -109 1434 -973 -713 1565 -572 -1415 1184 413 -1499 559 658 -1363 93 1278
6388 1278 -1195 -684 989 -200 -1278 1272 284 -1248 723 962 -1242 335 1634 -1113 -773 1462
6404 1462 -542 -1191 1397 -11 -1236 945 722 -1274 363 1640 -1065 -729 1390 -465 -1025 1030
6420 1030 -410 -1339 1109 838 -1498 291 982 -1101 -332 1235 -444 -744 1466 -373 -959 1269
6436 1269 381 -1477 573 892 -1218 170 1244 -1054 -591 1570 -309 -1095 1118 216 -1390 605
6452 605 1121 -1120 245 998 -1234 -698 1451 -238 -896 1314 9 -1183 942 654 -1396 664
6468 664 1229 -1078 -261 1418 -484 -897 1402 104 -1212 892 514 -1175 646 771 -1358 -331
6484 -331 1081 -801 -699 1008 -324 -1014 904 -45 -1388 430 801 -1433 200 1138 -971 -856 1102
6501 1102 -444 -1207 1124 10 -1121 618 1104 -1217 -70 730 -1012 -461 1591 -584 -1009 1405
6517 1405 229 -1098 909 844 -1015 196 1172 -1194 -524 1456 -844 -539 1043 -143 -1032 742
6533 742 463 -1233 721 1104 -1390 -61 1450 -880 -511 1212 -175 -1244 1247 176 -1147 475
6549 475 687 -1259 -10 1271 -843 -422 1491 -119 -872 1313 -107 -1082 717 828 -1363 134
6565 134 1286 -1148 -74 1252 -138 -809 1365 112 -1108 813 960 -1214 -58 1085 -835 68
6581 68 1379 -1106 -635 1360 24 -1397 957 457 -1223 603 691 -1201 -133 1304 -884 -659 1234
6598 1234 -697 -1161 1147 466 -1190 522 784 -1449 44 1055 -984 -448 1426 -273 -1076 1056
6614 1056 -3 -1528 648 664 -1389 82 1243 -882 -323 1373 -527 -717 1214 -126 -1390 956
6630 956 770 -1355 368 1174 -1144 -143 1230 -908 -593 1490 71 -995 1175 430 -1442 215
6646 215 703 -1420 -7 1227 -976 -509 1522 -507 -911 993 197 -1264 569 781 -1167 500
6662 500 902 -842 -439 1161 -252 -1017 1110 -250 -1268 687 653 -1136 94 943 -1204 -499 1216
6679 1216 -646 -700 987 73 -835 653 468 -965 473 934 -1210 -151 1428 -779 -581 1286 -554
6696 -554 -966 1017 381 -1425 364 760 -1209 24 1086 -902 -218 1129 -569 -994 975 257 -1119
6713 -1119 499 788 -1346 265 1050 -1164 -139 1354 -219 -1088 800 -62 -1329 525 326 -1351
6729 -1351 146 652 -1008 -241 1197 -462 -469 1207 -214 -1106 705 517 -1165 622 713 -1054 -185
6746 -185 1351 -944 -672 1295 -10 -1056 1208 614 -1086 661 746 -1103 -27 1173 -1031 -396
6762 -396 1262 -375 -668 1311 309 -1258 737 415 -1338 -51 1117 -844 -483 1061 -894 -723
6778 -723 1193 -212 -1532 883 554 -845 417 800 -791 -139 1117 -684 -471 1047 -206 -1045
6794 -1045 862 124 -1291 201 873 -903 85 1296 -717 -500 987 -230 -1088 740 459 -1126
6810 -1126 630 567 -1028 234 1043 -1025 -486 1112 -328 -1302 1178 341 -1325 586 639 -1172 304
6827 304 1149 -1020 -645 1193 -753 -782 771 -149 -1144 669 337 -1356 474 967 -1004 -176 1143
6844 1143 -589 -702 1094 -178 -1106 653 266 -996 542 938 -915 96 1226 -854 -651 1343
6860 1343 -346 -724 1213 351 -1099 560 496 -1201 -56 1215 -1189 -593 1147 -508 -958 977
6876 977 -151 -944 692 556 -1256 512 734 -1039 -465 1051 -489 -917 1015 138 -999 814 599
6893 599 -1295 532 1059 -1015 -303 1144 -687 -716 1232 -299 -999 1133 402 -1341 547 862 -1164
6910 -1164 74 1064 -809 -195 1216 -328 -1020 1469 192 -1518 815 853 -1194 135 975 -1033
6926 -1033 -239 1393 -523 -975 1049 -59 -1107 756 441 -1037 448 1032 -1068 -477 1250 -701
6942 -701 -1045 1065 22 -938 944 303 -697 697 881 -751 -199 1094 -691 -772 1274 -226 -623
6959 -623 1176 246 -1113 505 851 -1281 185 995 -863 -152 1421 -323 -849 1110 473 -1231 907
6976 907 770 -1443 158 1016 -1026 -535 957 -597 -812 1207 86 -1316 824 839 -1487 -17 1052
6993 1052 -739 -213 1266 -579 -568 1192 -27 -1156 753 493 -1069 361 616 -1314 -93 1123
7009 1123 -671 -675 1235 -484 -1191 1159 429 -1139 901 919 -1300 198 1096 -559 -471 1118 -477
7026 -477 -562 1067 129 -937 1029 515 -1218 306 1270 -784 -163 1121 -585 -754 1024 -71 -1259
7043 -1259 824 423 -1121 443 902 -1047 -559 1266 -853 -944 1056 -251 -1322 900 508 -1163
$$ [...]
##END NTUPLES=NMR FID
##END=
