##TITLE=1H_Pr 4899
 CDCl3, 8 sc, 
 7.2.2019
##JCAMPDX= 6.0         $$ Bruker NMR JCAMP-DX V2.0
##DATA TYPE= NMR FID
##DATA CLASS= NTUPLES
##ORIGIN= UXNMR, Bruker Analytische Messtechnik GmbH
##OWNER= root
$$ XWIN-NMR		Version 3.5
$$ Thu Feb  7 16:02:12 2019 Russian Standard Time (UT+4h)  she@DPX200
##.OBSERVE FREQUENCY= 200.1313
##.OBSERVE NUCLEUS= ^1H
##.DELAY= (6, 6)
##.ACQUISITION MODE= SIMULTANEOUS
##.ACQUISITION SCHEME= undefined
##.AVERAGES= 8
##.DIGITISER RES= 18
##SPECTROMETER/DATA SYSTEM= spect
##.PULSE SEQUENCE= zg30
##.SOLVENT NAME= CDCl3
##.SHIFT REFERENCE= (INTERNAL, CDCl3, 0, 15.7039)
##AUDIT TRAIL= $$ (NUMBER, WHEN, WHO, WHERE, WHAT)
$$ ##TITLE= Audit trail, XWIN-NMR		Version 3.5
$$ ##JCAMPDX= 5.01
$$ ##ORIGIN= Bruker BioSpin GmbH
$$ ##OWNER= she
$$ F:/spectra/data/she/nmr/H-F/1/audita.txt
$$ ##AUDIT TRAIL=  $$ (NUMBER, WHEN, WHO, WHERE, WHAT)
(   1,<2019-02-07 16:01:03.71 +0400>,<she>,<DPX200>,
      <created by zg, POWCHK disabled, PULCHK disabled
       configuration hash MD5:
       00 E9 B6 7A A2 85 ED C7 34 08 36 98 17 FE 4E 26
       data hash MD5: 16K
       51 C4 30 70 4F 3C 11 DE EF C4 47 EE A4 8C A2 25>)
$$ ##END=
$$ 
$$ hash MD5
$$ EF D2 C3 CE 55 A4 CB D5 0A FD 7A 98 85 41 A0 08
##$RELAX= 
##$RELAX= 
##$RELAX= 
##$RELAX= 
##$RELAX= 
##$RELAX= 
$$ Bruker specific parameters
$$ --------------------------
##$DU= <F:/spectra>
##$EXPNO= 1
##$NAME= <H-F>
##$PROCNO= 1
##$TYPE= <nmr>
##$USER= <she>
##$AMP= (0..31)
100 100 100 100 100 100 100 100 100 100 100 100 100 100 100 100 100 100 
100 100 100 100 100 100 100 100 100 100 100 100 100 100 
##$AQSEQ= 0
##$AQ_mod= 1
##$AUNM= <au_zg>
##$AUTOPOS= <>
##$BF1= 200.13
##$BF2= 200.13
##$BF3= 200.13
##$BF4= 200.13
##$BF5= 200.13
##$BF6= 200.13
##$BF7= 200.13
##$BF8= 200.13
##$BYTORDA= 1
##$CFDGTYP= 0
##$CFRGTYP= 5
##$CHEMSTR= <none>
##$CNST= (0..31)
1 1 145 1 1 1 1 1 1 1 1 1 1 1 1 1 1 1 1 1 1 1 1 1 1 1 1 1 1 1 1 1 
##$CPDPRG= <>
##$CPDPRG1= <>
##$CPDPRG2= <>
##$CPDPRG3= <>
##$CPDPRG4= <mlev>
##$CPDPRG5= <mlev>
##$CPDPRG6= <mlev>
##$CPDPRG7= <mlev>
##$CPDPRG8= <mlev>
##$CPDPRGB= <>
##$CPDPRGT= <>
##$D= (0..31)
0 1.2 0 0 0 0 0 0 0 0 0 0.03 0 0 0 0 0 0 0 0 0 0 0 0 0 0 0 0 0 0 0 0 
##$DATE= 1549540863
##$DBL= (0..7)
120 120 120 120 120 120 120 120 
##$DBP= (0..7)
150 150 150 150 150 150 150 150 
##$DBP07= 0
##$DBPNAM0= <>
##$DBPNAM1= <>
##$DBPNAM2= <>
##$DBPNAM3= <>
##$DBPNAM4= <>
##$DBPNAM5= <>
##$DBPNAM6= <>
##$DBPNAM7= <>
##$DBPOAL= (0..7)
0.5 0.5 0.5 0.5 0.5 0.5 0.5 0.5 
##$DBPOFFS= (0..7)
0 0 0 0 0 0 0 0 
##$DE= 6
##$DECBNUC= <off>
##$DECIM= 32
##$DECNUC= <off>
##$DECSTAT= 4
##$DIGMOD= 1
##$DIGTYP= 9
##$DL= (0..7)
0 120 120 120 120 120 120 120 
##$DP= (0..7)
150 150 150 150 150 150 150 150 
##$DP07= 0
##$DPNAME0= <>
##$DPNAME1= <>
##$DPNAME2= <>
##$DPNAME3= <>
##$DPNAME4= <>
##$DPNAME5= <>
##$DPNAME6= <>
##$DPNAME7= <>
##$DPOAL= (0..7)
0.5 0.5 0.5 0.5 0.5 0.5 0.5 0.5 
##$DPOFFS= (0..7)
0 0 0 0 0 0 0 0 
##$DQDMODE= 0
##$DR= 18
##$DS= 0
##$DSLIST= <SSSSSSSSSSSSSSS>
##$DSPFIRM= 0
$$ [...]
##$SUBNAM2= <"">
##$SUBNAM3= <"">
##$SUBNAM4= <"">
##$SUBNAM5= <"">
##$SUBNAM6= <"">
##$SUBNAM7= <"">
##$SUBNAM8= <"">
##$SUBNAM9= <"">
##$SW= 20.0189088683792
##$SWIBOX= (0..15)
0 0 2 0 0 0 0 0 0 0 0 0 0 0 0 0 
##$SW_h= 4006.41025641026
##$TD= 16384
##$TD0= 1
##$TE= 0
##$TE2= 300
##$TE3= 300
##$TEG= 300
##$TL= (0..7)
0 120 120 120 120 120 120 120 
##$TP= (0..7)
150 150 150 150 150 150 150 150 
##$TP07= 0
##$TPNAME0= <>
##$TPNAME1= <>
##$TPNAME2= <>
##$TPNAME3= <>
##$TPNAME4= <>
##$TPNAME5= <>
##$TPNAME6= <>
##$TPNAME7= <>
##$TPOAL= (0..7)
0.5 0.5 0.5 0.5 0.5 0.5 0.5 0.5 
##$TPOFFS= (0..7)
0 0 0 0 0 0 0 0 
##$TUNHIN= 0
##$TUNHOUT= 0
##$TUNXOUT= 0
##$USERA1= <user>
##$USERA2= <user>
##$USERA3= <user>
##$USERA4= <user>
##$USERA5= <user>
##$V9= 5
##$VALIST= <valist>
##$VCLIST= <CCCCCCCCCCCCCCC>
##$VD= 0
##$VDLIST= <DDDDDDDDDDDDDDD>
##$VPLIST= <PPPPPPPPPPPPPPP>
##$VTLIST= <TTTTTTTTTTTTTTT>
##$WBST= 1024
##$WBSW= 4
##$XGAIN= (0..3)
0 0 0 0 
##$XL= 0
##$YL= 0
##$YMAX_a= 194488
##$YMIN_a= -158895
##$ZGOPTNS= <>
##$ZL1= 120
##$ZL2= 120
##$ZL3= 120
##$ZL4= 120
##$ABSF1= 10
##$ABSF2= 0
##$ABSG= 5
##$ABSL= 3
##$ALPHA= 0
##$AQORDER= 0
##$ASSFAC= 0
##$ASSFACI= 0
##$ASSFACX= 0
##$ASSWID= 0
##$AUNMP= <proc_1d>
##$AZFE= 0.1
##$AZFW= 0.1
##$BCFW= 1
##$BC_mod= 2
##$BYTORDP= 1
##$COROFFS= 0
##$CY= 11.3945322036743
##$DATMOD= 1
##$DC= 2
##$DFILT= <>
##$DTYPP= 0
##$F1P= 18.9103706918063
##$F2P= -1.10871071338519
##$FCOR= 0.5
##$FTSIZE= 0
##$FT_mod= 4
##$GAMMA= 1
##$GB= 0.15
##$INTBC= 1
##$INTSCL= 1
##$ISEN= 128
##$LB= 0.24
##$LEV0= 0
##$LPBIN= 0
##$MAXI= 10000
##$MC2= 0
##$MEAN= 0
##$ME_mod= 0
##$MI= 1.114404
##$NCOEF= 0
##$NC_proc= 0
##$NLEV= 6
##$NOISF1= 3.799351
##$NOISF2= 2.8
##$NSP= 1
##$NTH_PI= 0
##$NZP= 0
##$OFFSET= 15.70392
##$PC= 1
##$PHC0= -8679.047
##$PHC1= 14.60019
##$PH_mod= 1
##$PKNL= yes
##$PPARMOD= 0
##$PSCAL= 0
##$PSIGN= 0
##$REVERSE= no
##$SF= 200.130013532006
##$SI= 16384
##$SIGF1= 3
##$SIGF2= 2
##$SINO= 400
##$SIOLD= 16384
##$SREGLST= <1H.CDCl3>
##$SSB= 0
##$STSI= 0
##$STSR= 0
##$SW_p= 3612.71676300578
##$SYMM= 0
##$S_DEV= 0
##$TDeff= 0
##$TDoff= 0
##$TI= <>
##$TILT= no
##$TM1= 0
##$TM2= 0
##$TOPLEV= 0
##$USERP1= <user>
##$USERP2= <user>
##$USERP3= <user>
##$USERP4= <user>
##$USERP5= <user>
##$WDW= 1
##$XDIM= 8192
##$YMAX_p= 0
##$YMIN_p= 0
$$ End of Bruker specific parameters
$$ ---------------------------------
##NTUPLES= NMR FID
##VAR_NAME=  TIME,          FID/REAL,        FID/IMAG
##SYMBOL=    X,             R,               I
##VAR_TYPE=  INDEPENDENT,   DEPENDENT,       DEPENDENT
##VAR_FORM=  AFFN,          ASDF,            ASDF
##VAR_DIM=   8192,          8192,            8192
##UNITS=     SECONDS,       ARBITRARY UNITS, ARBITRARY UNITS
##FACTOR=    0.0002496,     1,               1
##FIRST=     0,             0,               0
##LAST=      2.0444736,     0,               0
##MIN=       0,             -158895,         0
##MAX=       2.0444736,     194488,          0
$$ Real data points
##PAGE= N=1
##DATA TABLE= (X++(R..R)), XYDATA
0 0 0 0 0 0 0 0 0 0 0 0 0 0 -8 8 -8 8 -16 16 -24 24 -32 33 -41 49 -57 68 -81 90 -105 121 -139 159 -180 204
34 204 -232 261 -294 330 -369 410 -459 507 -564 624 -691 763 -843 930 -1024 1127 -1244 1368
52 1368 -1508 1665 -1838 2033 -2256 2509 -2805 3152 -3565 4070 -4699 5515 -6611 8178 -10605
67 -10605 14919 -24917 100670 -15621 -42825 194488 -37343 -73720 85481 -72770 -132869
78 -132869 82554 -53388 -137342 85978 44482 -88743 64673 28885 -65400 78017 31140
89 31140 -84762 98571 64011 -121640 45749 93546 -109933 -4489 48715 -142471 -4988
100 -4988 123148 -117378 -54264 163590 -21927 -64549 127835 -7479 -76789 96097 -20811
111 -20811 -110498 88151 19577 -116974 51811 40376 -91296 36154 27370 -90764 52227
122 52227 46901 -109903 51828 119424 -72717 8146 94782 -68593 2059 87929 -116759
133 -116759 -66232 105930 -73104 -97195 98857 -12264 -69930 98896 5674 -65997 108464
144 108464 22189 -102148 75920 47815 -106706 32453 51347 -85776 27840 43554 -103942
155 -103942 27942 89384 -102492 -30241 91716 -52225 -22461 82636 -51974 -18465 113711
166 113711 -39832 -63584 98921 -14813 -89365 56201 -12660 -79970 66552 4043 -82894
177 -82894 89153 54353 -94939 49219 72552 -87216 5477 47245 -91857 10202 77746
188 77746 -92921 -21319 112035 -41307 -47680 75729 -33595 -44340 72636 -35614 -55771
199 -55771 92743 -1006 -69011 77168 23199 -66924 48248 3090 -81384 52053 17443
210 17443 -103925 45241 68693 -89679 6673 70675 -65164 4077 71418 -73903 -9958
221 -9958 107407 -42563 -45655 91924 -12925 -57756 50643 -30345 -67032 53045 -18297
232 -18297 -72758 67936 30784 -56603 53940 38122 -50253 42413 17091 -85883 31132
243 31132 42485 -94502 5016 75412 -55315 -4001 70438 -50887 -9506 81728 -54000
254 -54000 -47116 85823 -20064 -63635 62919 970 -53864 50349 -7305 -66039 53940
265 53940 13452 -77705 39191 42755 -54451 29494 38978 -51259 34385 45335 -76141 7253
277 7253 66638 -64522 -25035 60231 -43448 -22729 62409 -43022 -35054 78457 -22306
288 -22306 -59473 67694 9272 -56772 46153 11843 -51565 47282 16336 -68062 36202
299 36202 39352 -66684 8907 42480 -47742 9087 39565 -53538 8519 60880 -53170 -20648
311 -20648 65013 -31169 -34317 48385 -28011 -30930 60826 -20385 -47095 68366 9324 -59816
323 -59816 42923 20670 -51958 31125 14798 -60234 32608 36953 -63702 12535 52632 -47891
335 -47891 -7365 38805 -44220 -4747 47241 -45737 -15269 66321 -23117 -30186 57468 -8527
347 -8527 -32339 44049 -18777 -44580 51295 -2650 -59079 44040 24901 -52928 24612 24436
359 24436 -48657 22028 26716 -59319 12678 50970 -45879 -6209 52515 -27630 -12085 39134
371 39134 -35484 -17943 50362 -28291 -34447 54272 -1636 -34333 41210 -291 -35475 37009
383 37009 -6324 -56137 33696 16945 -56297 21305 35040 -37807 18021 34224 -40211 13710
395 13710 42864 -48268 -10854 49403 -30655 -22540 40720 -21014 -19356 41405 -24366 -31595 48772
408 48772 -7231 -43578 38351 10477 -34261 31341 7739 -38850 32368 15224 -53995 17327
420 17327 32872 -43136 3783 33220 -30721 7522 37192 -36946 -4311 46883 -31519 -26283
432 -26283 39591 -16298 -26004 33241 -14590 -25326 42444 -6222 -38771 38209 11994 -40405
444 -40405 22522 15688 -32011 23710 17263 -39511 20560 32212 -42215 -614 33792 -31586
456 -31586 -9349 25829 -31473 -5965 38859 -26928 -17745 46728 -9287 -25867 35274 -3993
468 -3993 -24359 32548 -6861 -35376 35530 9209 -42399 21918 20760 -35797 10868 16701 -35337
481 -35337 13402 27083 -38068 3031 39438 -25283 -9639 32154 -19970 -11481 27450 -25510
493 -25510 -18146 38463 -11667 -25764 37349 4552 -23896 27565 959 -29118 25722 1379
505 1379 -43436 18641 19553 -36469 8669 25602 -24238 8532 24028 -29809 2935 33176 -28502
518 -28502 -13793 32913 -14667 -14902 26675 -13563 -14227 31523 -13270 -26112 33567 2079 -29618
531 -29618 23999 7847 -26267 20040 4888 -35404 17354 15533 -39100 6409 28262 -23424
543 -23424 4368 29049 -18054 4570 30423 -25278 -11661 30363 -20206 -24584 22406 -10704
555 -10704 -17753 25010 -7924 -18783 33000 2117 -29368 24250 11841 -27494 13516 10336
567 10336 -26025 15319 15396 -32268 7276 26451 -26534 -5737 24326 -17517 -4785 22784 -18607
580 -18607 -6660 30900 -14331 -18491 26966 -4946 -21555 19355 -4636 -20036 23277 -192
592 -192 -27179 23948 13460 -27672 12797 17357 -22734 7621 14845 -25769 6422 23661 -26259
605 -26259 -5361 26445 -16371 -11198 19703 -14522 -9765 23069 -14328 -15415 29826 -1223 -19513
618 -19513 23767 4405 -18617 17853 583 -25325 17541 7593 -30855 9556 18885 -22179
630 -22179 3430 17897 -18672 2774 18780 -22631 -3932 25202 -15563 -11852 22806 -7226
642 -7226 -10080 20315 -8445 -13317 23996 -5534 -22571 20679 5238 -21787 14074 7003 -19950
655 -19950 13201 7358 -26230 8934 16864 -23983 32 20533 -13595 548 19035 -14978
667 -14978 -1485 22329 -16516 -13240 21595 -8836 -15803 17629 -4422 -12109 21592 -2490 -19022
680 -19022 21581 5299 -25075 11000 9285 -21324 6785 9541 -20486 7963 16897 -20255 845
693 845 22107 -13225 -4479 17676 -9782 -3812 17725 -13247 -10098 20541 -9212 -17555 16087
706 16087 -2459 -16228 14839 -528 -15428 19549 6997 -20902 13631 14625 -19552 3356
718 3356 12205 -17243 1496 12502 -18460 -555 19706 -13162 -6942 18257 -7107 -7418 14649
731 14649 -9296 -8892 17543 -7619 -15426 18438 950 -16418 13825 3289 -15903 12949 4552
744 4552 -19615 12060 13178 -19970 3581 16352 -14056 -736 13156 -14491 -2602 14992
756 14992 -14770 -8327 17876 -6764 -10201 14697 -3007 -7448 15627 -3918 -11778 17151 651
769 651 -17664 12122 5916 -15569 8065 5671 -16537 7969 9369 -19271 3020 15477 -13954
782 -13954 -2811 15044 -9307 -2309 14322 -10712 -6617 16331 -8134 -12172 14448 -1426 -10697
795 -10697 12762 -413 -10181 14571 1043 -15884 11229 6295 -17170 4629 7485 -13858 4818
808 4818 8676 -15143 3460 14519 -13776 -2913 15311 -8149 -4941 13117 -7138 -4850 15633
821 15633 -6554 -10737 14993 -1748 -14231 9551 128 -12545 9238 1638 -13319 10926 7696
834 7696 -14233 6117 11437 -11839 1930 8970 -11801 1175 10902 -12927 -2747 14396 -8389
847 -8389 -6618 12795 -4531 -6223 11905 -5066 -8713 13825 -1697 -13266 10785 3007 -12788
860 -12788 7124 3209 -12023 7768 5992 -13691 5532 11554 -11395 688 10998 -8920 -607
873 -607 9565 -10238 -3054 12330 -8653 -7588 12534 -4000 -7924 10274 -2900 -8187 11391
886 11391 -1180 -11766 11356 3860 -12403 7605 6546 -10252 5482 5949 -11940 3201 8434
899 8434 -12978 -1059 11028 -8323 -3054 9839 -6150 -2563 11227 -6465 -6457 12234 -3379
912 -3379 -9325 9447 -428 -8123 8707 -62 -9475 9393 2949 -11967 5927 6596 -10620 2952
926 2952 7047 -9408 2865 8220 -10641 -537 10681 -8865 -4638 9608 -5489 -4772 9439
939 9439 -4490 -5061 11591 -2097 -8325 10125 1202 -9459 6589 1162 -9558 6418 1857
952 1857 -11023 5544 6330 -10690 2283 7977 -8084 1265 7973 -7767 454 10555 -7737
965 -7737 -3599 10416 -4724 -6223 8308 -3168 -5856 8820 -2316 -7870 9073 1328 -9336
978 -9336 6181 2909 -8622 4562 2886 -9034 4594 5676 -9324 2206 8501 -7534 -442
991 -442 7544 -6494 -1327 8002 -6865 -3341 9989 -4008 -5988 9218 -746 -6305 7138 -1624
1005 -1624 -7597 7091 137 -9755 5310 3912 -8467 3705 5288 -6448 3972 5812 -7669
1018 -7669 1893 7760 -7493 -1249 7584 -5813 -2969 6680 -5885 -3867 8111 -4467 -5969 8690
1032 8690 -376 -6900 7137 1584 -5923 6755 1628 -7787 5142 3847 -8879 2356 5072 -6814
1046 -6814 1030 5200 -6314 969 6577 -6849 -1353 7538 -4678 -3238 6918 -3335 -3478 7021
1060 7021 -3005 -5352 7682 -802 -7455 6129 1479 -6608 4927 2401 -6546 4780 3951 -7906
1074 -7906 2290 5273 -7121 -243 4855 -6040 -661 5608 -5850 -1135 7115 -4192 -3337 7214
1088 7214 -2037 -3976 6395 -1589 -4115 7190 -797 -6584 5783 1790 -7372 2919 2344 -6831
1102 -6831 2364 3062 -6583 2631 5707 -6107 153 6579 -4261 -1156 5270 -4186 -1882 5718 -3787
1117 -3787 -3607 6666 -1574 -4247 5549 -259 -4461 5093 -336 -5878 4795 1496 -6762 3462
1131 3462 3496 -5801 1823 3872 -5361 1606 4765 -5659 27 6075 -4279 -1965 5661 -3016 -2380
1146 -2380 5241 -3235 -3609 5960 -1716 -5061 5516 336 -4691 4064 1015 -4861 4087 1683 -6464
1161 -6464 2738 3214 -5785 1298 4457 -4598 829 4690 -4358 -43 5545 -4140 -2563 5275 -2729
1176 -2729 -2952 4483 -2093 -3295 4618 -1594 -4611 4582 630 -4652 3685 2142 -4122 3029 2532
1191 2532 -4436 2888 3461 -5322 363 3597 -4527 -800 3634 -3559 -400 4509 -3285 -1679 5499
1206 5499 -1905 -3039 4462 -901 -3302 4232 -217 -3724 4404 541 -4664 3385 1945 -5086 1729
1221 1729 2187 -4550 1667 2907 -4317 1037 4309 -3587 -962 3923 -3098 -1645 3523 -3310 -1906
1236 -1906 4399 -2139 -2554 4854 37 -2830 4094 175 -3392 3105 380 -4592 2572 1561 -4623
1251 -4623 1147 2716 -3772 336 2719 -3676 322 3662 -3176 -836 4550 -1779 -1562 3567 -1548
1266 -1548 -1786 3572 -1690 -3051 3603 -595 -3547 2630 529 -3043 2449 956 -3565 2535 1868
1281 1868 -3924 1403 3059 -3354 355 2984 -2946 -300 2910 -2955 -952 3639 -2036 -1993 3047
1296 3047 -1037 -1785 3203 -747 -2082 3217 -238 -3513 2523 793 -3511 1644 1371 -3079 1733
1311 1733 2006 -3292 1321 2918 -3122 -271 2969 -2372 -517 2687 -2205 -1208 3077 -1994 -2085 2819
1327 2819 -705 -2345 2220 -340 -2086 2423 210 -2397 2512 1230 -2679 1416 1604 -2732 744
1342 744 1334 -2779 518 1685 -3137 -379 2816 -1684 -883 2777 -1409 -902 2915 -1180 -1821 2860
1358 2860 -322 -2412 2003 123 -1973 1522 284 -2085 1810 613 -2610 1600 1519 -2284 579
1373 579 1497 -1860 161 1716 -2316 -478 2659 -1791 -1036 2475 -1081 -1215 2590 -481 -1166 2345
1389 2345 -300 -1903 2070 437 -1780 1131 401 -2026 1201 553 -2445 1123 1159 -2224 356 1976
1405 1976 -1411 236 2128 -1591 -196 2117 -1603 -888 2324 -750 -1332 1807 -426 -1419 2091 -62
1421 -62 -1785 1638 289 -2122 1062 739 -1979 1073 1031 -1576 762 1508 -1680 241 1640 -1639
1437 -1639 -193 1755 -1620 -350 1629 -1068 -741 1967 -757 -1405 1483 -392 -1444 1153 7
1452 7 -1252 1520 74 -1713 1161 795 -1409 623 1027 -1216 627 1042 -1663 255 1346 -1171
1468 -1171 -181 1256 -1027 -506 1358 -810 -714 1299 -696 -1083 1387 -99 -1328 1082 186 -1220
1484 -1220 1395 199 -1370 1123 734 -1415 318 977 -1303 167 914 -881 72 991 -1252 -385
1500 -385 978 -540 -510 1312 -639 -836 1156 -475 -866 1186 -117 -776 878 356 -966 766 391
1517 391 -895 649 505 -1078 389 817 -1242 94 783 -670 56 1209 -934 -258 1230 -693
1533 -693 -566 1120 -286 -590 936 -83 -464 735 60 -1097 677 275 -1003 501 448 -665 542
1550 542 428 -732 201 716 -798 123 804 -707 -291 692 -583 -497 709 -264 -381 963 -120 -907
1568 -907 688 -76 -477 756 49 -723 659 -8 -646 465 631 -668 84 469 -517 314 460 -675
1586 -675 173 524 -307 -272 978 -559 -189 535 -396 -264 590 -164 -173 574 -238 -268 553 228 -485 210 212
1607 212 -726 331 262 -666 66 404 -659 -28 301 -714 -167 688 -645 -59 402 -418 -88 332 -214
1626 -214 -397 681 -170 -402 428 47 -468 296 87 -220 363 45 -544 310 166 -702 301 514 -340
1645 -340 167 378 -454 -5 707 -415 -334 561 -167 -266 253 32 -310 212 28 -130 504 36 -330 232
1665 232 -10 -546 7 105 -302 256 83 -521 62 186 -193 69 349 -52 93 447 -212 -137 530 -247 -226
1686 -226 489 -81 -251 170 -129 -223 117 91 -318 19 58 2 170 122 252 -149 19 -419 127 369 -234 -4
1708 -4 205 -199 -216 142 -193 -178 186 -242 -352 248 255 -481 -34 242 -248 144 85 -38 222 109 -172 -217 133
1731 133 63 -120 -158 -300 158 31 -192 -144 314 -125 232 202 -73 14 113 -249 -151 204 -6 -106 -121 52 -139
1754 -139 -161 59 -108 -76 128 -19 254 214 165 307 263 194 -256 -77 0 -121 213 -250 -56 195 219 73 32
1777 32 163 -39 -15 99 -316 -30 -58 -83 -145 286 -70 -224 235 -3 125 272 -20 -180 160 15 -234 203
1799 203 39 10 67 -84 -208 -13 218 -79 5 234 -19 -20 0 -11 -160 169 -23 -240 -3 268 -304 -167
1821 -167 428 -44 -152 7 14 -19 298 -390 -115 108 34 56 152 218 -123 -55 -23 -114 67 -40 9 -4 63 -45
1845 -45 -14 204 -35 -76 122 33 45 224 -88 -172 269 -376 -1 299 -301 -44 255 -65 -335 408 -68 -380
1867 -380 383 70 -140 315 143 -240 272 5 -107 54 22 -177 -11 60 -205 -208 184 -272 -55 207 333
1888 333 -323 246 -67 -315 309 -93 -208 193 107 -516 220 -2 -42 83 170 -218 220 80 -204 -68 13
1909 13 -113 200 125 -406 -189 296 -258 -104 70 77 -449 269 29 -339 134 1 -310 46 38 -696 60 172
1931 172 -343 71 141 -223 87 47 -131 -129 387 -114 -141 264 -345 -238 395 -212 -262 211 4 -66 255 -48
1953 -48 -346 267 250 -407 387 327 -396 222 318 -446 -40 150 -343 -113 124 -326 212 680 45 -59 292
1974 292 232 -231 133 118 -179 357 -39 -277 471 89 -219 214 191 -551 164 132 -445 127 177 -372 122 442
1996 442 -138 -294 373 -171 -309 395 -231 -145 500 -60 -158 570 43 -378 236 160 -352 335 0 -492 248
2017 248 396 -499 -5 192 -603 -28 282 -567 148 410 -593 12 478 -300 -253 224 -529 -305 364 -107
2037 -107 -558 481 304 -211 419 -277 -294 134 160 -454 340 45 -662 76 574 -498 4 332 -453 33
2057 33 440 -506 -410 402 -247 -91 265 -238 -491 649 24 -510 702 179 -466 489 208 -591 412 394
2077 394 -467 79 103 -507 -4 190 -426 142 265 -220 129 589 -56 -146 693 -258 -439 630 52 -367
2097 -367 405 -91 -405 538 180 -471 480 -4 -486 196 399 -539 82 130 -671 -146 233 -690 65 705
2117 705 -243 -237 544 -336 -306 477 -361 -123 597 29 -458 447 32 -312 221 -131 -549 402 59 -688 208
2138 208 262 -667 227 24 -482 141 536 -522 -117 382 -217 -195 556 -341 -387 371 -409 -232 417 213 -417
2159 -417 457 95 -497 286 -211 -620 535 255 -696 155 688 -482 -6 343 -474 71 563 -362 173
2178 173 517 -451 -357 546 -276 -475 325 -162 -562 546 -83 -771 563 111 -526 443 220 -482 95 271
2198 271 -776 139 419 -523 -202 405 -322 -284 499 -533 -366 315 -345 -266 534 -220 -326 465 -19 -400
2218 -400 662 -146 -639 604 81 -514 429 117 -406 192 344 -371 171 308 -564 239 467 -515 25
2237 25 804 -327 144 821 -147 -57 542 -63 -287 807 -387 -589 447 -19 -272 487 238 -471 435
2256 435 313 -626 -14 489 -577 11 545 -472 -269 274 -639 -1 376 -303 -147 655 -172 -196 301 -41
2276 -41 -358 434 -69 -497 240 68 -453 203 176 -265 253 203 -681 35 315 -600 -116 431 -259 -525 409
2297 409 -421 -244 629 -181 -390 569 -400 -261 286 -165 -245 437 188 -417 316 88 -663 301 205 -490 106
2318 106 443 -302 378 322 -387 -124 414 -487 -225 446 -395 -404 545 -114 -393 339 -106 -433 272 31 -412
2339 -412 581 -237 -404 570 296 -674 302 203 -322 228 275 -507 90 350 -421 198 407 -298 -157 228 -583
2360 -583 -248 372 -204 -58 265 -3 -295 350 -48 -531 428 214 -374 288 -147 -642 229 35 -464 -39
2380 -39 160 -384 -7 233 -323 -45 545 -325 -20 531 -367 -179 648 -225 -404 308 -91 -250 223 -64
2400 -64 -566 153 -63 -179 266 -14 -511 191 318 -432 103 325 -479 279 399 -182 236 273 -442 -203 97
2421 97 -178 -105 527 -81 -387 357 -484 -239 179 123 -283 463 44 -477 343 164 -430 -93 -26 -359 100
2442 100 206 -437 88 454 -315 16 410 -168 241 291 -288 -64 290 -186 -67 156 -335 -559 246 -226
2462 -226 -395 297 30 -329 373 463 -466 70 186 -333 197 208 -705 -92 289 -81 -290 612 -171 -314 497
2483 497 -309 -179 337 -125 -185 293 -77 -650 485 143 -26 353 136 -250 386 233 -342 325 325 -347 191
2504 191 373 -392 200 271 -24 -136 239 -439 -86 339 -20 -290 386 -116 -437 395 17 -496 460 -96
2524 -96 -331 158 130 -314 272 80 -376 11 188 -328 99 460 -414 114 119 -309 -27 441 -198 -271 259 -254
2546 -254 -241 157 191 -398 540 20 -320 249 -56 -359 284 -45 -127 339 368 -404 72 300 -474 26 200
2567 200 -21 38 534 -356 -76 333 -423 -161 457 -317 -431 360 -168 -299 206 -26 -386 383 -199 -237 341
2588 341 303 -381 143 85 -371 192 1 -223 283 178 -278 156 -192 -272 -152 467 -314 -23 83 95 -153
2609 -153 117 18 -419 437 -41 -169 431 -174 -308 290 37 -536 199 329 -416 143 239 -388 62 177 -211
2630 -211 -96 272 -386 35 293 -322 -158 770 -13 -146 459 -369 -161 152 187 -406 491 7 -151 410
2650 410 85 -248 -49 78 -149 45 281 -44 -257 397 -480 -57 250 -582 -273 457 -304 -106 345 -66
2670 -66 -359 524 -21 -320 204 188 -386 49 87 -215 70 -165 -232 -107 418 8 43 216 -274 3 344 -266
2692 -266 -64 179 -353 -347 187 74 -101 351 -257 -195 461 -34 -334 74 201 -422 119 -114 -485 379 316
2713 316 -260 10 197 -429 -4 395 -335 -54 253 17 46 254 84 -127 198 -108 -151 338 -63 -363 261
2734 261 62 -498 214 -8 -422 -148 462 -131 234 333 -380 110 295 -94 37 64 -540 -103 468 -56 -275
2755 -275 99 109 -311 145 -115 -227 154 -98 -317 261 21 -252 297 104 -572 -62 267 -198 325 295 -474
2776 -474 13 101 -262 -224 339 -111 -163 331 -50 -92 347 -31 -15 250 -54 -234 254 -71 -215 68 -22 -522
2798 -522 215 188 -143 -71 240 -94 227 353 -362 212 194 -240 48 124 -4 136 196 -230 -100 248 -152 -285
2820 -285 175 -58 -364 10 13 -141 45 247 -231 136 332 -268 14 494 -205 -330 418 -287 -68 158 -129
2841 -129 -291 406 -9 -340 359 -159 -56 577 -49 -16 264 45 -17 59 -44 -478 119 -111 -323 344 34
2862 34 -396 -20 260 -211 30 -18 -363 77 135 -228 -92 132 -364 93 347 -59 -233 136 -39 -240 165
2883 165 204 -2 221 -137 -451 -70 173 -322 228 187 -282 -211 209 -65 71 178 -379 -164 167 -62 -83
2904 -83 411 -45 85 72 -124 85 253 -87 10 146 -21 -210 202 279 -37 284 11 -68 -170 94 -273 -23
2926 -23 411 20 -197 91 -221 -85 229 -82 -183 229 55 -201 41 147 -55 220 -18 -225 142 -98
2946 -98 -278 31 -80 -206 11 51 -312 -43 166 -275 -110 52 -91 -160 73 -145 20 398 -161 -177 449
2967 449 -301 122 378 201 -137 167 213 -290 132 199 -147 190 -44 -95 -165 100 -194 38 220 -294 -12
2988 -12 -92 144 57 134 -79 -292 478 -147 -66 420 -71 -109 152 262 -199 -13 -76 -131 160 248 -399 -4 298
3011 298 -167 43 343 -217 -82 449 -259 -144 140 -22 -50 283 -284 177 17 -168 -339 -39 -204 0
3031 0 34 -33 -3 -24 -5 -278 -63 13 -65 74 242 -53 85 -26 -93 -95 103 -181 -35 195 -174 -223 257 215 -102
3056 -102 69 -236 -342 128 -146 -174 156 -48 -199 144 45 -287 -206 103 -404 166 71 -51 129 170 -73 89
3078 89 261 -120 114 -17 -123 -125 121 -134 -228 82 -4 -261 110 -40 -148 -111 119 -41 196 -19 -285 -64
3100 -64 345 -102 25 214 -171 389 40 -59 -151 -82 -126 -73 38 -37 -169 173 274 -2 -6 40 -48 143 -222 -346
3124 -346 109 66 -226 244 -92 -65 -194 312 -393 -27 268 -214 -102 366 -46 -128 53 -346 -238 -207 -185 18
3146 18 -208 -16 -189 221 87 -211 68 -293 -214 -102 97 -26 -19 91 -127 -107 147 68 123 169 -305 -231 142
3169 142 -88 -48 29 35 -89 302 142 131 189 -189 -408 -114 12 -109 149 265 -224 127 200 -372 79 218
3191 218 -113 150 373 -118 139 41 -144 -243 202 -19 -109 322 -337 -157 -59 -163 -53 186 -18 127 204 -91
3213 -91 -246 318 191 -352 57 112 -79 -56 256 -294 -105 119 -124 102 18 -36 -243 46 118 -75 159 3
3235 3 66 -63 -135 -212 96 -109 -129 224 -114 0 148 493 -343 39 -114 -275 153 62 -313 13 112 -95 -61
3258 -61 81 -76 -259 54 -276 -269 26 107 -88 224 137 -199 229 55 -333 45 -4 -233 104 117 -88 -162 40
3281 40 -154 -6 158 -50 178 137 -66 -7 202 39 -77 130 -188 -20 167 -79 -260 129 143 -163 207
3302 207 239 -137 127 -111 -285 -5 344 -308 53 -162 -174 191 223 -20 -173 105 -262 -222 375 -187 -98 422
3324 422 -155 -88 326 37 -166 289 -10 -51 -46 200 -210 -97 -14 -275 77 150 31 140 303 -164 107 335
3346 335 -132 80 270 159 -3 267 149 -45 7 -91 -251 -24 74 -167 61 295 -140 -300 -171 -328 103
3367 103 291 -283 83 370 -328 -135 140 -145 99 346 -196 28 109 -265 -274 -137 -132 108 121 -3 -48 232
3389 232 -162 -265 29 109 -220 204 -143 13 238 -135 -143 386 -40 -193 -60 256 -159 222 448 -69 -21
3410 -21 15 -56 -88 224 -17 -226 76 -3 -350 357 11 -149 162 207 -119 153 124 -195 -115 21 -344 -55 -6
3433 -6 -155 85 -111 -260 268 158 -211 -9 47 166 -85 166 -35 -74 242 -200 -300 315 29 -86 56
3454 56 -68 -206 146 326 -144 34 63 -32 47 400 -129 146 190 -130 76 299 -205 -129 -81 101 -234 -98
3476 -98 163 -6 117 32 -330 26 -201 -32 328 92 -59 87 176 -129 308 153 -64 -56 -62 -61 46 65 -43
3499 -43 -247 178 84 -201 90 28 -348 223 95 -163 441 259 -46 367 -39 34 160 94 -11 -45 -34 -342
3521 -342 336 74 -190 74 247 -122 104 148 -256 -162 77 -29 129 355 -93 -83 239 -16 51 306 8
3542 8 -95 205 -12 -467 -7 -98 -58 -229 -120 -221 169 38 115 17 253 -44 -82 317 -98 142 164 151 -83
3565 -83 183 151 -274 259 -52 -181 241 -70 -36 15 -3 -268 216 91 -99 -86 219 -275 140 256 -110 12
3587 12 -186 -108 185 -6 -75 -95 226 -184 -300 -58 -52 -3 102 0 -235 66 25 19 207 339 -89 126 67 57
3611 57 108 -91 211 122 263 -291 90 247 -111 110 143 -15 52 128 -52 -285 22 35 -132 522 -110 -178 11
3634 11 -342 -250 -88 -56 -508 167 232 -353 -12 208 -199 61 124 -91 -43 102 57 -60 -49 -118 85 136 -205
3657 -205 -347 133 -86 -65 -30 158 9 288 -3 11 231 173 -31 -30 147 -176 -123 245 -216 -339 -111 -271
3679 -271 159 175 -169 -138 -40 225 281 124 169 118 -348 4 -177 72 3 -126 3 61 153 91 116 -264 227 -152
3703 -152 174 20 -103 -114 253 27 83 -37 126 122 -138 55 163 39 -34 -83 -46 129 -46 -18 -1 74 -290
3726 -290 12 -119 39 54 -22 -448 -105 78 52 4 83 181 18 165 124 -60 70 -234 135 -9 -14 -74 150
3749 150 -58 98 -40 -95 -175 107 36 34 -119 84 55 2 -184 -25 61 80 -45 51 -72 150 -37 12 -297 -129
3773 -129 93 -80 -52 -127 60 -111 -179 7 -54 78 81 -48 -25 -95 145 116 148 46 -29 -175 0 -61 -72 -18 23
3798 23 -87 124 180 -150 -85 -108 84 -160 -161 -19 -475 -17 229 -196 -78 54 69 73 223 -126 -53 181 -94
3821 -94 -152 109 53 -132 -30 -78 -49 -22 124 -259 -116 -37 -316 119 192 -108 39 138 43 -23 32 15 -8 59 -210
3846 -210 -82 116 50 -76 47 9 -55 71 -104 -79 -270 192 -163 -81 -96 -49 1 204 -76 41 16 -101 -26
3869 -26 -163 3 -463 -133 246 -210 -98 114 -98 351 26 -116 19 31 267 -121 45 178 -199 89 31
3890 31 -61 13 -67 -114 -102 119 59 9 118 38 -102 -154 32 -28 28 -45 142 94 97 47 282 -329 -200 -122 154 47
3916 47 -103 115 172 235 109 91 77 61 80 88 -58 163 -75 231 136 85 -23 141 -76 -314 -121 128 -112 -171
3940 -171 45 37 -224 55 -161 11 -61 69 65 278 -6 227 -179 -61 -144 9 -52 42 9 -51 3 271 101 40
3964 40 -75 45 81 -85 157 97 43 210 -127 -83 4 -27 -187 73 62 -327 113 105 10 -7 178 65 -209 100
3988 100 -57 -176 -104 -76 -139 27 -281 128 -2 -246 -85 -184 -164 -13 -6 22 -154 -100 -197 -22 144 24 19 -89
4012 -89 228 -117 -38 63 39 -79 -132 -41 -119 -61 -134 -199 -34 -19 179 -36 115 177 -82 -72 -32 -253 4 -151
4036 -151 179 43 55 39 -177 176 215 213 92 -184 -63 -282 -177 -76 -60 -31 66 -4 -243 -120 246 -1 33
4059 33 -28 -17 -6 49 108 -196 -177 -131 249 302 64 -54 -113 -27 -175 69 -123 -69 -81 -46 144 -65 -80 -125 178
4084 178 -292 -21 -88 -76 -172 -233 241 249 13 108 -161 74 -161 116 80 214 127 82 43 24 12 198 -45 -99 -73
4109 -73 -9 -66 146 6 115 -231 -239 -7 128 -225 6 146 0 31 330 21 13 38 -264 112 44 117 -25 45
4133 45 246 171 36 97 1 -59 47 -153 -149 18 73 45 -124 -93 -131 2 -2 183 -156 -171 131 73 -3 -82 135 -71
4159 -71 31 -68 -151 20 78 181 -106 -51 -51 -276 113 111 162 52 111 155 -4 181 177 -269 -183 -377 -222 -66 -154
4184 -154 -152 -62 59 69 118 -6 176 -36 162 1 44 -139 76 -32 329 -3 64 317 -53 102 -258 -3
4206 -3 -54 -160 13 34 -390 -14 -250 -257 133 177 -1 -8 53 179 -133 21 -365 28 -15 71 19 65 112 -73 68
4231 68 -426 -246 -56 -191 -5 -110 176 73 -84 104 191 -25 111 114 95 -74 3 -162 -11 133 5 -20
4253 -20 -105 177 23 93 103 -103 109 -121 -324 23 107 182 42 -46 90 18 -169 71 28 -63 151 10 -186
4276 -186 -313 -52 -58 -227 -28 -59 -133 137 -21 170 16 -337 192 107 -240 39 33 -55 154 -66 -9 61 161
4299 161 246 114 79 -50 -29 7 176 14 131 -72 123 -32 -96 147 185 -6 109 75 -104 181 85 269 -259
4322 -259 254 -301 -217 55 -399 -118 25 183 69 -247 -262 16 68 -115 79 -82 53 -123 -212 -23 -19 -128
4344 -128 -62 -23 286 -154 140 -44 -150 141 -12 -179 -123 -10 -126 -205 -295 27 -151 75 -100 285 -8 44
4366 44 -162 -168 -220 -169 -171 91 -78 42 65 -303 36 51 -123 -178 -129 -186 -61 -71 -89 -97 6 -60 64 228 -28 -158
4392 -158 -58 -198 32 115 -96 -144 32 -124 90 33 9 119 174 216 -150 22 175 -101 54 -92 122 33
4414 33 27 113 33 -71 -94 -20 -276 -160 -38 177 -21 4 -59 -11 -5 119 287 56 26 242 -131 0 -48 -185 8
4439 8 236 105 -60 -5 -72 -70 19 52 -139 -170 -42 -171 10 -286 -172 -118 -250 256 182 112 -13 82 -129 -77 -162
4464 -162 109 -85 19 131 18 -20 338 143 -84 20 194 -49 -1 339 -8 83 134 -309 39 84 -138 147
4486 147 34 -90 -45 -53 225 -199 254 256 126 131 12 250 95 91 70 -9 -174 -184 -111 31 -100 228 -164 126
4510 126 233 186 85 232 -7 -254 -105 36 0 273 55 157 120 -203 36 58 24 -110 -22 170 -161 -21
4532 -21 98 199 -55 86 -162 -204 141 -25 80 170 65 22 260 10 19 -8 -69 -283 -223 117 140 52 -45 242
4556 242 -346 -76 -67 -157 -106 137 -304 -386 44 -59 -153 -95 -8 318 -104 19 -133 211 -540 -20 432 26 2
4579 2 77 83 -28 -32 -101 35 53 -16 -194 94 -84 216 51 -44 113 65 -104 77 260 -115 -84 -233 151 -154
4603 -154 167 -81 -83 55 44 -111 -54 222 -286 -27 -65 -204 -153 -268 129 198 179 18 -79 152 68 162 -16 -102
4627 -102 -106 218 53 -64 -56 -91 -14 40 -36 329 208 4 21 -122 179 -119 217 -138 -22 -87 -22 -98 20 -39
4651 -39 -136 -64 -151 234 26 66 44 169 148 184 90 -26 -295 -15 150 -166 -31 63 83 -134 66 291 49 -181
4675 -181 23 -162 -85 68 62 173 131 -32 108 55 -137 -19 -33 56 233 109 -48 -11 326 209 57 102 -19
4698 -19 129 92 209 -104 -63 -279 -151 195 -9 57 -154 147 -201 179 40 113 69 223 109 57 -21 -181 -147
4721 -147 4 -129 181 75 25 -39 49 202 111 71 31 -313 40 189 -148 20 333 224 271 47 -226 -141 68
4744 68 -206 -166 78 2 12 186 -78 -135 13 42 30 0 -5 -49 -96 22 71 -150 29 100 125 244 -142 204 -157
4769 -157 19 -76 65 -137 -323 134 58 -433 95 -57 -62 112 -249 -67 67 -128 -62 101 -340 -144 106 112
4791 112 84 -28 228 -78 -213 232 -177 -54 -52 222 143 78 -159 4 149 59 63 -331 62 -21 218 226 2 54
4815 54 -305 -203 6 30 -238 56 51 118 134 125 -247 207 183 86 -143 4 57 -171 -170 -97 123 79 290 -154 -120
4840 -120 6 22 269 104 41 -25 -41 -63 -53 -203 -57 91 286 -61 -49 -126 93 -170 -204 -38 -89 9 70 -56
4864 -56 -61 -140 -87 -91 136 -124 62 118 52 109 91 144 324 114 80 -2 24 21 65 29 -303 119 72 -135 -249 240 -107
4891 -107 125 -1 -42 -16 -28 16 -137 66 332 7 217 120 -247 43 -196 -189 111 -115 -123 154 46 -207 -112
4914 -112 -86 -188 -118 151 -152 -226 -366 10 136 119 -55 93 -73 -44 330 -91 -487 39 -99 103 -122 -248
4936 -248 14 176 -216 71 -83 -21 -106 37 -66 -17 238 297 53 -162 -28 299 -182 217 60 -25 79 -57
4958 -57 96 72 44 -174 249 -8 118 97 192 -198 -203 164 -135 -7 33 65 108 -129 68 -263 -106 116 -179
4981 -179 222 -253 -74 149 19 -186 58 -13 -43 -66 248 59 65 179 127 39 117 11 -114 -138 2 60 -25 27
5005 27 -141 177 183 -5 73 59 83 -397 274 -97 -348 144 46 -32 187 -3 65 -252 177 140 -51 -111 -188 184
5029 184 -103 83 -84 -127 -216 16 125 129 -88 42 -147 314 43 -123 20 -153 16 -32 -74 150 166 -164
5051 -164 -57 280 -135 -25 227 72 23 70 109 99 14 296 -82 -136 -75 -14 -119 -52 136 216 -166 155 -58
5074 -58 19 -222 201 183 110 28 5 -4 97 55 -35 170 -161 -137 -124 125 86 -18 -84 -15 -82 -58 -281 11 -60 124
5100 124 11 8 -4 77 75 48 -55 -38 -68 -102 -143 14 162 189 134 421 0 -107 31 60 -140 65 -23 -306 -78
5125 -78 -43 -179 -113 82 24 46 -155 -74 15 67 -49 41 133 213 246 -20 -111 -110 12 140 -12 5 -170 -81 13 236
5151 236 21 127 5 -91 -35 18 -152 -214 202 -196 12 9 177 153 207 57 -106 43 30 76 149 260 114 10
5175 10 -303 -57 223 44 -25 158 66 -126 -140 -4 6 369 17 -255 -95 -203 25 -205 201 -394 -36 29
5197 29 -204 67 -105 87 -198 -135 24 -43 -6 34 112 82 -95 -336 66 204 -198 -91 29 102 -6 86 -66
5220 -66 149 26 14 -226 101 -141 232 278 -92 208 -126 -80 -132 157 137 -231 12 -83 -69 161 4 66 150
5243 150 88 -196 268 -201 68 177 82 363 351 -112 21 178 -6 -110 72 -85 -5 31 81 74 -59 181 -139
5266 -139 249 83 -88 78 123 -117 75 97 -258 -90 -41 -16 56 -146 72 -72 25 281 126 -200 133 384
5288 384 153 75 61 19 -49 27 -221 56 -273 154 166 -43 -68 -120 -60 -76 -20 10 23 -66 112 -117 320 52 -142
5313 -142 4 -125 47 209 188 72 -127 -2 61 155 38 -294 -74 51 -55 -86 82 -176 -51 213 11
5334 11 13 -186 -178 120 -28 -69 -280 106 87 -23 -16 -54 -169 36 86 115 67 -313 -12 49 -98 58 56 103 -85 -67
5360 -67 -218 101 52 221 -20 -90 138 13 -2 59 229 -302 173 59 -12 18 -23 -95 -286 84 -138 -7 -115
5383 -115 -148 -101 122 28 -268 -60 -259 -116 85 -72 227 224 -121 -57 -142 94 203 85 -152 31 -143 91
5405 91 -69 -82 -50 -42 83 -169 -9 16 33 -31 11 260 -164 -51 291 -107 -123 -83 152 -210 -26 158 159 -90
5429 -90 13 -33 144 19 201 98 -20 67 92 323 -126 -75 1 -145 -3 73 -202 -7 196 -135 -19 112
5451 112 -30 -318 104 347 -163 23 31 -6 -140 -20 -20 -7 -2 128 134 -94 1 -190 -141 76 -15 182 -205 132
5475 132 -42 -71 87 9 -53 -24 -39 -214 69 57 96 -109 -43 174 -171 265 59 -15 -99 96 -201 117 -5
5498 -5 83 432 60 -288 77 -216 -117 56 177 120 129 -38 -228 109 -196 -379 -97 96 -248 -68 90 92 84 -122
5522 -122 -112 144 -9 131 -101 -122 -75 -93 -102 -123 26 -157 -90 -121 -252 -161 -284 112 98 124 -287 -39 72 -44
5546 -44 -146 -146 -36 74 -95 -39 -105 26 -44 -84 -21 -105 111 79 -102 262 75 -312 86 91 -228 78 17 -78 127
5571 127 154 -26 33 -105 -166 -124 25 21 91 -74 -102 -282 228 59 -356 -127 87 74 54 284 -85 -111 -53 -48 -281
5596 -281 1 133 -199 -20 -138 -239 -224 130 -16 173 -58 -144 -327 -158 160 -195 -102 -138 67 182 -16
5617 -16 -47 268 28 -138 -177 -103 -50 66 -138 -148 12 -52 -292 52 74 -177 73 -28 11 252 47 26 124 -38
5641 -38 71 -241 229 0 57 116 -204 68 -322 -116 -229 59 90 196 260 -17 -59 -256 -9 -405 96 -59
5663 -59 -103 -5 -9 -27 0 195 70 79 181 31 239 -86 62 64 -48 -16 -112 205 -172 52 -13 -272 -71 -59 101
5688 101 -49 198 -104 112 -35 164 -234 24 85 30 208 -138 320 25 -11 -132 1 344 -366 23 72
5709 72 -137 -29 45 -119 135 -91 -75 197 62 -76 -180 41 5 86 -130 -251 -196 119 6 -145 -122 126
5731 126 -199 -152 -294 -25 -57 -16 0 -87 72 -229 42 170 -67 56 -245 -166 -49 83 -225 -84 7 -97
5753 -97 99 -168 -16 -32 30 96 -193 -101 45 -59 192 181 -82 138 278 -37 154 -6 58 302 56 11 -79
5776 -79 -66 -6 -118 -91 338 110 -190 -190 87 34 140 280 148 -89 203 363 93 30 292 155 -99 -49 -160
5799 -160 -213 119 113 74 -96 372 100 -33 159 276 -176 -342 -23 -148 292 14 -86 76 -140 227 -99
5820 -99 112 -38 113 -27 -38 -101 171 93 -168 -158 -44 44 89 -62 -2 94 -145 -241 -183 -42 6 -90 -153 -10 353
5845 353 -27 -185 -110 347 12 -80 118 -134 -34 -20 -86 188 -82 -10 -95 305 -145 90 190 -20 -70 -81 87
5868 87 -277 65 -180 -41 116 28 12 -5 -81 35 -104 21 -171 130 2 -114 -120 -50 -140 -137 -14 221 -159 -28
5892 -28 77 -344 99 -111 2 115 89 -86 -13 -355 -119 -87 -7 -274 240 70 56 167 20 79 -51 45 54
5915 54 21 89 -73 0 -46 -78 -53 51 90 -170 -142 -309 87 73 218 169 -94 -76 -100 136 -45 -18 110 -31 70
5940 70 74 163 -52 123 -146 -124 -8 55 -193 133 33 -139 21 351 36 6 120 -150 -215 62 34 165 115
5963 115 17 326 159 -38 32 -55 2 -2 49 96 -201 259 -6 143 62 -16 265 -129 158 94 257 -11 39 70
5987 70 -73 -123 -24 -126 121 -93 74 269 41 160 60 -159 150 -165 -77 -6 130 84 10 219 -70 11 -54
6010 -54 -338 147 64 98 -73 68 -50 12 64 -82 63 -90 22 -79 -53 15 -265 203 73 -299 128 57 19
6033 19 -110 -55 -178 171 438 30 77 -77 -11 112 60 10 220 91 -198 -135 149 -133 -88 91 -92 33 -115
6056 -115 8 78 306 77 -97 54 29 20 79 10 -46 225 24 -22 4 -172 -101 54 116 -110 2 276 71 -200
6080 -200 139 112 -71 262 78 47 129 -76 -36 179 92 -244 82 -1 52 -94 -30 -48 48 103 94 -100 -184 -79 1
6105 1 53 -202 -127 42 193 -238 213 -10 -1 46 185 -203 39 -177 35 178 55 -22 79 235 -164 -154 21
6128 21 -115 -83 -56 53 -116 -156 313 -131 52 -103 61 0 174 79 130 -109 79 -63 161 -47 20 -135 -213
6151 -213 116 -148 -181 103 -59 -57 -33 -93 2 -85 -59 244 -15 308 78 355 180 175 223 82 11 82 264 30
6175 30 150 255 -60 -125 -39 235 130 -75 -38 -202 117 22 9 -137 -76 22 -195 161 172 62 225 -211 -150
6198 -150 367 9 7 224 -84 91 -5 37 -113 211 357 0 -201 -66 8 111 18 -112 50 -130 -52 31 143
6221 143 -156 -211 115 -177 136 -15 59 -139 102 -293 -139 -85 -264 -47 150 -128 18 -4 -113 188 -128
6242 -128 57 -188 211 -7 -100 -206 167 -96 145 -141 -159 191 -133 -49 -77 -15 185 103 -23 -360 -33 -67
6264 -67 -10 6 -130 13 -37 -26 -52 -56 -91 -15 -123 73 -54 50 229 67 -14 -133 113 1 225 45 -89 193
6288 193 19 292 -34 6 -18 -37 10 2 122 40 47 -102 23 -16 53 173 73 58 -88 -47 -79 -102 -213 -26 -86
6313 -86 -188 -37 49 134 128 70 341 131 -15 142 83 57 -1 12 11 10 235 102 -134 47 -183 -115 12 23 -17 -37
6339 -37 31 -66 216 -50 57 -58 136 -63 3 66 -158 197 80 54 -45 80 133 -10 50 -73 -18 132 75 13
6363 13 34 -104 63 22 214 19 -133 -46 103 140 13 43 -182 -105 -169 -22 -165 130 -82 -103 -224 101 5
6386 5 -44 -116 56 59 292 238 -7 21 85 -36 152 -247 64 138 -147 -29 355 -21 58 115 -56 -62 -197 146 -25
6411 -25 282 353 -206 87 -87 -332 -265 297 145 62 -94 -139 67 -154 -135 -14 -143 99 -30 150 148 -191 -119
6434 -119 -4 -6 -76 100 30 74 -17 31 -138 75 177 200 456 -101 93 -25 8 -215 -42 12 -154 -1 -173
6457 -173 -140 34 25 79 -5 73 41 -162 80 -360 194 -90 -37 129 -15 -61 228 -52 238 115 82 -106 -163 52
6481 52 75 -27 -11 -20 -266 74 -178 35 30 138 279 130 358 173 -76 -86 21 -67 -91 105 258 -228 44
6504 44 64 -22 13 -185 46 -12 108 52 -101 -266 230 190 61 223 -101 -188 247 -236 -245 5 -179 46 -339
6527 -339 -44 -27 -196 342 -55 26 -77 4 -241 146 1 -124 -73 96 129 -40 -32 107 23 68 146 -103 8
6550 8 -111 67 137 40 -317 174 149 116 -25 -100 -221 203 -2 -94 -74 43 18 209 50 14 66 40 -162 -109 177
6575 177 -165 232 95 -8 -67 -101 140 119 80 -127 -140 -23 61 197 124 -69 -101 176 -523 -122 127 177 110
6598 110 192 154 -15 -80 -190 -59 93 -4 -192 135 151 -77 -130 -191 72 70 240 -52 -126 -42 -25 108 -39 -68
6622 -68 106 -65 -7 254 171 -82 195 114 -45 -124 -35 -122 -30 -58 -198 -127 -103 -113 -226 -180 17 90 -72 46 -60
6647 -60 234 189 233 -156 80 -63 -39 -147 -115 -81 -23 15 231 5 88 -304 225 100 188 144 -15 -153 -212 70
6671 70 189 27 -11 99 43 253 88 201 -383 61 202 -2 -91 120 48 -108 -244 165 -2 -23 -192 -29
6693 -29 14 -228 99 -132 -75 169 -399 -23 -133 -65 125 -220 -163 201 92 72 184 100 -113 -261 144 -27
6715 -27 -255 44 -8 82 306 -15 -202 223 2 -340 -89 -101 163 239 187 -348 152 -307 63 11 -117 26
6737 26 114 80 118 -109 75 66 90 84 40 -116 -112 -114 -138 58 -213 -115 -118 306 82 79 -182 24 -152 -39 -342 19 104
6764 104 -39 -97 70 23 37 94 84 278 34 -42 -134 84 -72 130 170 -98 93 -269 -129 -322 -191 -110 -240
6787 -240 -27 223 -193 42 138 235 -43 123 27 45 195 33 276 328 -32 -124 164 123 -101 -128 90 -154 -81
6810 -81 191 -41 -1 -60 -78 10 -107 12 129 106 38 -140 100 -188 266 74 -152 -13 -223 39 1 -89 110
6833 110 163 273 68 27 158 -203 -19 193 -53 -183 -165 236 -334 157 62 71 164 148 -14 160 -55 -204 21
6856 21 -68 92 32 -276 124 122 -100 163 -180 79 269 -126 -145 49 -12 74 10 -104 9 -110 -89 97 116 7
6880 7 297 194 143 139 -71 128 97 8 -127 -118 15 -98 75 -87 105 -171 -81 -54 130 111 157 32 146 -191
6904 -191 -218 -69 90 -38 125 166 -191 10 50 233 2 4 127 216 -5 -24 87 155 -237 -24 -153 -65 -112
6927 -112 29 -406 -84 -47 -67 -35 227 -141 39 -6 -8 88 19 147 148 235 -10 -11 -112 -81 -242 -41 17 155 -17
6952 -17 -39 105 20 74 -213 107 113 -35 22 35 144 93 55 -87 8 -12 -25 -64 -250 -50 91 -46 99 201 85
6977 85 57 -129 230 -115 54 -195 140 -11 30 204 95 -225 -176 144 -226 -152 -99 -191 -73 143 223 6 44
7000 44 -66 151 79 -13 26 -33 -80 34 -166 -245 60 80 -85 0 153 -25 -15 -148 -225 -130 77 -57 -173 115
7024 115 191 -5 270 94 31 179 -31 -116 -18 -76 -96 73 121 1 -104 -112 96 68 -88 14 -179 263 -310
7047 -310 127 228 -35 55 -39 -3 46 12 104 10 6 106 146 -27 157 127 94 -16 -136 42 66 149 15 79 136
7072 136 -20 -32 -98 186 178 -110 -19 -152 54 -176 -86 44 11 -68 25 -128 -1 137 64 -87 -288 -105 106
7095 106 137 -305 20 -79 7 -203 46 -167 65 -26 -323 69 211 129 -2 96 82 -289 310 68 -10 118 148
7118 148 128 -11 -66 12 232 -278 -222 16 145 -25 76 214 128 254 124 188 242 -145 96 334 -49 28 156
7141 156 39 -104 90 108 -280 81 145 46 32 125 -64 24 -40 122 -109 -41 -32 202 276 -167 144 -50 133 -40
7165 -40 211 -93 -6 16 110 -37 -85 51 -42 -80 122 79 -119 1 -93 -197 149 66 -25 27 39 81 -104 -109 28
7190 28 -42 -179 97 -88 -108 -83 -271 -84 -376 -65 22 -200 -25 -104 -126 170 -31 33 293 -133 -43 -25 -72 202
7214 202 99 33 -13 -106 186 158 -110 -49 -107 -10 10 -181 -142 481 -196 285 -172 212 -70 -136 173 131 -51 101
7238 101 174 103 64 -24 -6 169 160 -4 134 -149 5 -58 95 160 -113 150 72 -116 57 171 -126 2 47 215
7262 215 72 -79 -25 -109 -248 244 -128 3 -22 66 -77 -84 -18 -17 170 -77 206 185 -3 -284 159 -88 -35 -66
7286 -66 61 -16 -145 -76 24 -244 11 -54 9 149 71 19 127 190 -300 -224 -43 -139 -195 -159 42 -137 111 26
7310 26 -170 -97 -126 -61 47 118 -176 89 242 -76 -21 174 -12 134 -23 -151 -30 14 12 174 93 -279 -14
7333 -14 18 -87 -179 -150 -146 92 -126 5 -97 182 240 -7 7 206 118 136 37 -41 -150 4 141 -192 -29 -112
7357 -112 -202 64 -33 69 149 120 -34 17 -121 120 150 -155 -73 27 -5 143 -172 35 -168 -85 -96 20 173
7380 173 -350 -88 -10 -11 -102 38 19 -230 -32 -6 -211 -216 -40 -171 60 97 162 -26 -252 -368 154 35 94 -162
7404 -162 -102 -105 -121 136 131 -174 -83 64 37 -10 26 107 35 -109 0 -111 -374 -249 -33 -108 -38 262 157 -139 -26
7429 -26 -143 168 101 -213 58 0 -98 -15 -59 -108 -5 166 37 0 -10 -8 37 -320 -71 72 7 -75 -93 -84 -182 -205
7455 -205 -321 104 72 114 153 -65 -110 91 221 57 83 -84 200 30 29 -255 71 94 -189 -239 -71 13 125
7478 125 -119 81 -314 61 -48 -264 189 57 -237 -215 -13 -170 104 -311 -321 -6 157 -84 -222 -110 -79
7499 -79 -7 -161 -81 -237 -251 -116 -9 63 -302 -264 -134 135 126 13 111 37 -109 -315 158 76 -193 -58 -203 9
7523 9 -42 -1 42 98 50 154 110 -41 -111 -200 -62 241 46 -131 24 41 -11 31 66 -138 168 331 -26 -358 118
7548 118 119 -46 93 173 -39 -280 205 -5 102 -68 -95 62 190 -192 246 -62 -225 -9 -58 -128 -39 -168
7570 -168 -23 -176 154 -81 -281 -102 7 -72 -88 41 117 90 -29 -89 64 -111 106 -18 8 110 -12 68
7592 68 -141 18 -119 -61 260 159 -13 143 -219 -163 103 -191 114 66 -392 65 -92 -95 31 -66 296 133
7614 133 -127 375 -247 -192 -41 110 148 -135 6 322 258 -152 -135 -91 262 -136 -283 -11 27 232 -225 113
7636 113 -45 207 101 -203 -31 -42 126 106 10 44 -93 -81 -63 60 137 31 162 425 184 -111 134 108 145
7659 145 131 -8 -10 20 241 -153 94 129 27 -90 -139 -110 3 -138 -87 140 40 147 20 -292 -19 -50 -101
7682 -101 77 -58 173 53 -36 -95 25 -118 -21 11 -42 39 19 -29 19 -85 157 -192 105 -146 322 219 -156
7705 -156 143 -97 -141 168 142 -164 62 -168 101 142 257 68 134 -111 190 -7 44 -100 -70 -47 32 -174 -44
7728 -44 -102 -329 344 -137 173 4 -96 -223 70 -376 190 -75 54 82 23 79 -96 89 -15 -46 -54 -32 32
7751 32 -187 -181 -145 191 -71 36 -147 69 -83 34 -176 -121 -3 -83 48 352 97 -175 -81 -91 22 142 154
7774 154 42 -120 100 -191 -23 157 -50 86 34 181 126 54 -54 -107 178 -142 -87 64 -157 68 -129 245
7796 245 264 139 86 155 -237 269 67 13 59 -42 264 -178 -289 -75 140 -22 -108 -25 88 41 -48 -58 141
7819 141 125 -28 59 59 199 18 -13 102 76 -198 57 -81 212 -117 -21 356 3 98 -153 71 191 129 -24
7842 -24 119 183 34 -8 54 -208 146 53 -42 213 203 -5 175 48 107 -5 154 48 198 156 -143 -262 92
7865 92 54 -161 -181 -71 58 -2 -174 -80 23 -55 -83 -44 189 13 28 55 -332 54 32 -147 206 -124 -98 -66
7889 -66 -192 289 31 -35 137 2 -79 107 9 -84 126 68 -16 3 30 -104 10 130 -147 184 216 85 -123
7912 -123 -254 -149 54 97 -167 9 -19 -185 -202 22 16 19 4 196 24 16 129 -129 -207 40 -214 22 0 -62
7936 -62 -196 4 156 -149 244 -121 64 179 131 178 44 15 -22 35 83 -303 -233 -3 79 23 -197 -268 -232 72
7960 72 -248 -63 -116 -175 146 49 -63 -145 -69 -251 258 -120 -260 102 -46 -108 227 36 -3 23 204 -121 -113 -59
7984 -59 -79 96 -289 19 86 28 -57 107 -256 72 -88 122 147 89 83 131 -95 -8 -7 230 -98 67 12 114 31
8009 31 -321 240 67 176 197 -75 197 -145 270 -299 2 111 21 27 -21 -63 -258 22 -35 -83 207 194 -85
8032 -85 -206 162 -63 26 24 -179 -21 -12 62 62 13 27 -16 -50 -224 232 95 -141 -160 -306 -115 -90 34 -44 -237
8057 -237 -89 25 111 31 192 -7 122 -77 -99 282 -66 60 -181 -382 243 118 120 -94 -186 155 17 -25
8079 -25 -70 -162 -21 0 -174 66 126 85 -181 -41 14 228 9 -430 103 -177 -89 223 42 -139 216 -255 -286
8102 -286 -37 52 52 239 224 -19 115 113 -135 3 -17 121 128 -271 -37 14 48 -70 117 -77 15 268 -61 -43
8126 -43 96 -164 -60 -31 136 72 294 132 -291 24 246 -77 16 9 -44 -45 -83 215 -29 86 -52 -160 108
8149 108 -94 36 -28 -14 142 -189 -55 -58 -5 -192 -22 113 -127 38 -50 49 332 109 -227 -266 36 40 -47 9
8173 9 -10 127 -13 30 -82 99 90 -178 -69 -38 -162 -177 -46 -139 -118 -95 15 132
8191A32
$$ Imaginary data points
##PAGE= N=2
##DATA TABLE= (X++(I..I)), XYDATA
0 0 0 0 0 0 0 0 0 0 0 0 0 0 0 -8 8 -8 8 -8 15 -16 16 -20 24 -28 32 -39 44 -51 59 -68 76 -87 98 -113 124 -140
36 -140 157 -176 197 -221 244 -270 300 -330 367 -403 445 -492 541 -597 656 -722 796 -879 974
55 974 -1081 1203 -1345 1509 -1705 1948 -2246 2633 -3147 3869 -4953 6758 -10266 19469 -92062
70 -92062 -158895 170971 55465 -70064 135534 68279 -67161 127655 48514 -148228 24426
81 24426 44624 -140663 -9770 45892 -94340 9491 50373 -84127 55410 104764 -103850
92 -103850 535 133454 -63571 -25579 110382 -72642 -47950 121699 -83586 -115207 135958
103 135958 -2791 -142299 74889 34164 -95595 81816 49505 -104759 66895 81085
113 81085 -98430 33175 91482 -87023 -12695 54741 -85380 -2977 57258 -114605 -21574
124 -21574 114766 -65134 -44328 115707 -21672 -30937 111196 -40706 -67847 129423 -8492
135 -8492 -125344 77480 28030 -110257 45326 22012 -112184 44047 47203 -108723 42511
146 42511 96674 -85060 11001 106535 -51384 -4346 72562 -82002 -22729 95904 -78045
157 -78045 -69663 102435 -19196 -67188 74895 -17795 -60502 86913 -15768 -98459 83426
168 83426 40395 -86699 56535 51955 -74904 40129 37348 -99886 24921 55409 -114374
179 -114374 -4033 102294 -57085 -14033 95190 -40956 -15414 93222 -64408 -69628 94325
190 94325 -26975 -94531 66877 12515 -59246 67335 8345 -73379 66309 23712 -97009
201 -97009 36727 47924 -76715 26136 54977 -58484 37801 62955 -83977 11137 87313
212 87313 -84086 -45805 76556 -51039 -43615 72294 -46043 -48048 98714 -15013 -76092
223 -76092 85670 29878 -68394 50030 24179 -62101 45947 19778 -84191 29827 39680
234 39680 -82228 7770 53513 -53516 12285 51671 -58062 16897 77420 -67430 -24946
245 -24946 85346 -42653 -51476 63719 -31752 -48534 72769 -21624 -66375 82610 21001
256 21001 -74872 53662 40577 -61138 30672 24958 -70673 25784 35872 -80363 8313 61434
268 61434 -55151 -6830 54523 -43318 -276 57903 -58064 -19658 81497 -34723 -44213
279 -44213 75441 -6245 -43453 59606 -14219 -61150 57512 -2678 -84967 43507 35117
290 35117 -66434 27730 45535 -48106 25431 41688 -63719 8024 54362 -61688 -18587
301 -18587 59609 -30477 -14322 53762 -31387 -16593 63087 -35395 -47741 61898 -8385 -55391
313 -55391 46286 5232 -42657 50336 5975 -62430 44263 26374 -73971 17100 43820
324 43820 -50739 11509 44343 -45016 13811 56628 -52350 -14713 61476 -36855 -34590 47305
336 47305 -21911 -25396 51133 -23243 -37513 58367 -7894 -56095 43875 11534 -48415 33933
348 33933 13040 -44711 42868 27494 -59147 25033 44210 -56089 -1833 40910 -43073 -2812
360 -2812 41289 -45598 -8928 60525 -31822 -30254 55442 -11730 -34503 38653 -13529 -33940
372 -33940 45522 -7776 -48811 44506 18033 -46965 28610 23995 -38266 25238 19900 -50675
384 -50675 20402 36994 -53865 -2339 45160 -37503 -12433 38585 -33253 -11581 47229 -31487
396 -31487 -26521 57431 -7294 -34802 45045 3748 -32182 34644 -4837 -45346 34482 7972
408 7972 -55361 22484 28717 -38824 16297 29045 -35149 16067 31350 -48652 -2121 43173
420 43173 -37509 -18345 41311 -19368 -12620 41285 -21227 -20693 47639 -14129 -40286 39061 4830
433 4830 -36101 28885 7496 -32492 31649 9697 -47182 20446 23294 -47312 3255 29479
445 29479 -30934 6535 31490 -31181 4967 42932 -31983 -16092 42731 -17652 -23805 32289
457 32289 -12949 -19355 37961 -13344 -34141 37052 873 -43039 22965 11075 -32903 22928
469 22928 13876 -33889 26868 28464 -40490 8200 33934 -33700 -6919 27015 -28577 -3988
481 -3988 33239 -28754 -12832 43336 -14609 -24964 33675 -5208 -24185 26565 -8744 -27687
493 -27687 32702 1088 -37963 25372 15597 -32964 15770 17513 -27945 17247 20482 -35823 9747
506 9747 33891 -32198 -8493 30953 -22418 -12728 24984 -22608 -12570 35549 -15294 -23111 36598
519 36598 1565 -24446 24584 817 -24431 22788 -1926 -34760 23866 14706 -33739 15006
531 15006 24776 -23615 11657 21994 -29029 5855 24895 -36134 -11488 30149 -22424 -16289
543 -16289 28243 -11502 -9967 32108 -10478 -17598 35499 -1339 -28153 23835 5871 -25271
555 -25271 16957 2549 -28255 18842 8582 -36632 10990 22379 -27530 3470 24219 -19337
567 -19337 5435 25682 -24679 -4366 31078 -20842 -19731 25973 -8643 -16760 23089 -6555
579 -6555 -15158 28865 -2295 -26391 23140 6849 -27620 13029 8817 -22648 15145 11028 -28218
592 -28218 12583 21291 -29683 -1690 23759 -20950 -4932 22262 -16976 -2600 29990 -14821
604 -14821 -13504 30454 -6037 -21310 19098 -4477 -19444 18436 -4418 -23591 22594 6950
616 6950 -27712 14285 13892 -22113 9671 13254 -21927 11073 20314 -25585 1435 26539 -18777
629 -18777 -9508 20847 -14466 -9903 20165 -14732 -13085 26782 -5997 -19748 21631 2280 -18303
642 -18303 15756 202 -19729 17123 3980 -25413 14960 16151 -22115 6928 17520 -17724
654 -17724 4011 15805 -22533 -995 22097 -20428 -11092 23172 -8792 -11138 19188 -7584
666 -7584 -10354 21965 -6733 -18490 21728 2187 -21207 14373 5314 -17960 13666 5554 -22728
679 -22728 12960 14029 -24455 4493 20257 -16755 -471 17742 -15543 -2041 18354 -18184
691 -18184 -11563 20653 -10043 -15321 17730 -1408 -9086 19030 -1053 -12202 20832 1643 -21518
704 -21518 12514 6023 -20972 6896 6168 -18830 9303 12189 -21573 4440 20318 -16797 -4317
717 -4317 18817 -10622 -4723 17247 -10726 -7350 20678 -7797 -15281 16391 -1430 -14565 12345
730 12345 -429 -12554 15849 1827 -17103 14730 8661 -19964 5985 9377 -17787 4053
742 4053 10746 -18260 4487 18657 -16493 -3726 21262 -9098 -8446 16229 -7597 -8589 16953
755 16953 -6475 -12655 18040 186 -16612 11217 2074 -14596 9461 1174 -15587 11819 8163
768 8163 -17394 8193 14903 -13508 2671 12227 -14241 416 13109 -16144 -4923 18004 -10107
781 -10107 -10158 16349 -3521 -8816 13847 -4449 -11861 14712 -1411 -16096 11823 5139 -14424
794 -14424 7652 5559 -13084 8584 6947 -16235 5886 13138 -14819 353 14466 -10039 -1125
807 -1125 12564 -11860 -4214 15010 -11283 -10874 15068 -4028 -11423 12812 -394 -8934 13847
820 13847 367 -13203 12544 5519 -15782 6778 7916 -12827 4412 7224 -13389 4041 10470
833 10470 -15152 -1770 13306 -10293 -4614 12824 -6352 -3169 14049 -6805 -7417 14934 -3697
846 -3697 -12538 10221 -60 -11323 9225 1283 -10568 11548 5131 -13810 7368 9041 -13493
859 -13493 1619 7747 -11995 1520 9361 -12315 -258 14186 -8896 -5354 13062 -5105 -5948
872 -5948 11052 -4633 -6585 13198 -2292 -10237 12052 2034 -11808 7096 1849 -11643 6647
885 6647 3093 -13307 6309 8575 -12887 2294 10820 -9211 388 9873 -9305 -961 11949
898 11949 -8700 -4956 13338 -4226 -7788 10001 -2579 -7935 9124 -2757 -9802 10108 1586
911 1586 -11470 7781 5385 -9309 5341 4381 -10641 4678 6608 -12202 1444 10397 -8902
924 -8902 -1480 10384 -6239 -1846 10158 -7174 -5218 11480 -4933 -8738 9929 -872 -8329
937 -8329 7921 -365 -8814 8163 1182 -11299 6582 5235 -9866 4500 7265 -7551 4045
950 4045 6897 -9599 1435 8953 -10271 -3752 8980 -6783 -4441 8711 -5082 -3651 10929
963 10929 -3539 -7231 10144 -463 -9304 6954 1386 -8093 6709 2032 -9044 6507 5227
976 5227 -10223 2813 6627 -8573 482 5953 -7766 702 8058 -7768 -1946 9938 -5158
989 -5158 -4536 8396 -3812 -4862 8212 -3196 -6317 9216 -412 -8507 7386 2895 -8496 5003
1003 5003 3121 -7898 4921 4919 -9302 2714 7255 -8509 -1069 6629 -6825 -1207 6286 -6551
1017 -6551 -1813 9120 -4014 -3562 9753 -1425 -4997 7004 -1830 -6181 7016 -1437 -8835 6428
1031 6428 2282 -8969 4284 4378 -7097 3119 4812 -7527 2620 7238 -7632 -368 8211 -5095
1045 -5095 -2269 6744 -4152 -2864 6577 -4486 -4504 7598 -1747 -5835 6643 568 -5442 6275
1059 6275 346 -6656 5934 2423 -8744 3196 4701 -7610 1650 5325 -6005 1512 6036 -6574
1073 -6574 -424 7696 -4824 -3010 6998 -3072 -3218 6467 -2940 -3901 6741 -2404 -6658 5822
1087 5822 -60 -6426 4521 1287 -5418 5146 2652 -6616 4553 5220 -6950 926 5373 -6034
1101 -6034 -185 5055 -5705 -826 6416 -5038 -3054 6875 -2404 -4318 5820 -1429 -3745 5954
1115 5954 -932 -5102 5674 1000 -6312 3781 2343 -5565 3272 2515 -6003 3040 4184 -6216
1129 -6216 1082 5410 -5367 -1069 4980 -4467 -1567 5538 -3988 -2433 6696 -2230 -3965 5915 -221
1144 -221 -3863 4776 -283 -4953 4813 930 -5945 3930 3070 -5790 2229 3223 -4753 1764 3753 -5500
1160 -5500 456 5155 -4641 -1533 5223 -3222 -1741 4804 -2733 -2081 5591 -2175 -3956 5682 195
1175 195 -4032 4466 602 -4354 3791 674 -5777 3084 2117 -6084 1096 3464 -4819 734 3720
1190 3720 -3687 640 5036 -4007 -1087 5308 -2587 -2368 4453 -2097 -2694 4095 -1790 -3548 4903
1205 4903 -360 -4811 3480 1214 -4124 3351 1613 -4196 2924 2303 -4937 1469 3756 -4619 -250
1220 -250 3641 -3511 -535 3970 -3667 -1097 4997 -2410 -2603 4638 -958 -2794 3708 -961 -3321
1235 -3321 3939 -216 -4551 3502 1346 -4588 2172 2038 -3667 2244 2670 -3711 1630 3768 -4017
1250 -4017 -241 3998 -2882 -1477 3306 -2700 -1655 3789 -2191 -2345 4065 -660 -3159 3266 190
1265 190 -2946 3069 543 -3613 3166 1371 -4047 1727 2186 -3588 774 2314 -3565 656 3105
1280 3105 -3864 -300 3930 -2448 -1187 3820 -1303 -1782 3177 -1581 -2264 3559 -760 -3305 2942
1295 2942 542 -2861 2266 875 -2848 2398 1329 -3753 1661 2437 -3416 326 2468 -2937 -77
1310 -77 2356 -2651 -219 3238 -2288 -1551 3396 -964 -1711 2903 -884 -1851 2939 -47 -2560 2653
1326 2653 751 -3055 1544 818 -2827 1398 904 -3020 1052 1803 -2913 859 2674 -1849 -191 2737
1342 2737 -1758 -219 2962 -2084 -1397 2791 -1317 -2241 2344 -504 -2362 2177 -101 -2115 2394
1357 2394 769 -2573 1340 1483 -2302 955 1180 -2362 579 1786 -2247 395 2248 -2089 -564
1372 -564 2236 -1399 -818 2254 -1157 -1218 2491 -909 -1974 2244 31 -2275 1665 319 -2034 1696
1388 1696 790 -2322 1387 1568 -2044 780 1848 -1686 366 1675 -1823 -48 1938 -1936 -619
1403 -619 1945 -1156 -1187 1982 -783 -1178 2081 -699 -1633 2172 -164 -1926 1717 282 -1705 1318
1419 1318 499 -2272 1274 1128 -2090 589 1413 -1682 -34 1339 -1518 -223 1767 -1278 -333 1684
1435 1684 -1030 -1009 1538 -294 -1013 1624 -363 -1350 2027 -178 -1759 1264 774 -1274 973 916 -1838
1452 -1838 806 875 -1807 275 1201 -1584 -133 1311 -1237 -384 1602 -840 -393 1568 -715 -859
1468 -859 1523 -96 -916 1125 -161 -1017 1384 58 -1314 1024 504 -1561 752 612 -1557 395
1484 395 727 -1218 252 991 -1230 231 1168 -982 -586 1332 -759 -357 1190 -640 -881 1002 -336
1501 -336 -1039 1116 -32 -1233 976 107 -1021 945 413 -1195 574 854 -1138 259 882 -1152
1517 -1152 275 916 -961 175 1271 -1032 -390 1082 -523 -588 1004 -398 -529 940 55 -1006
1533 -1006 983 168 -899 579 246 -970 566 324 -1032 386 657 -780 270 693 -717 4
1549 4 688 -638 11 691 -731 -509 749 -281 -589 730 -343 -819 612 -160 -656 510 16 -593
1567 -593 484 293 -535 367 364 -594 496 243 -902 88 821 -646 -304 402 -493 32 461 -222 64
1586 64 696 -232 -408 641 -310 -507 419 -145 -504 520 70 -646 658 263 -691 288 134 -409 215
1605 215 330 -441 261 247 -583 -223 624 -439 -354 380 -413 -77 547 -159 -520 670 -20 -144 308 -231
1625 -231 -287 363 -192 -340 429 84 -335 -50 346 -236 181 164 -268 57 296 -542 -124 549 -401 -121 315
1646 315 -236 -190 340 -63 -417 416 -141 -225 50 113 -354 179 349 -244 222 475 -268 194 130 -278 -58
1667 -58 271 -78 6 429 -312 -26 496 -90 -172 386 162 -162 317 -79 -422 113 -5 -360 81 6 -176
1688 -176 40 228 -333 373 365 -103 263 148 -172 -37 381 -191 -131 134 -268 -302 272 107 -302 175 116 -39
1710 -39 27 86 -264 147 144 -181 65 193 -286 125 300 -70 -30 48 -344 128 107 -2 18 -46 -60 147 -31 -105
1734 -105 -266 -102 6 -185 226 -54 -409 59 -125 -282 216 150 -74 152 108 -314 -94 97 -171 -151 46
1755 46 12 76 11 18 -121 115 203 -143 128 182 -280 139 -107 52 104 24 -322 -27 231 -45 83 -86 -157 281
1779 281 370 -28 -268 3 -65 -117 -123 83 19 -154 -43 -135 217 15 -145 -316 -97 -373 -68 194 165 -72 -186
1802 -186 -211 -164 204 -42 -111 149 92 -97 20 241 -71 -131 38 -182 -97 229 -53 13 364 -42 -75 189 -124
1825 -124 -130 61 -516 96 351 -331 -64 171 -93 -245 -32 -109 -121 -189 -11 -138 -93 193 -386 -175 60 -161
1847 -161 39 91 25 -61 164 9 -91 108 -112 -460 267 59 -238 -34 76 -293 96 -157 -125 71 305
1868 305 -307 29 71 -475 303 236 -289 -305 160 283 -216 185 -345 -190 168 -188 -359 340 217 -164 -9
1889 -9 -164 -256 292 51 -298 6 293 -331 -22 63 -146 -126 22 -126 -104 276 -203 36 420 65 -267 256
1911 256 -110 -392 405 108 -264 398 277 -279 97 -28 -275 128 -88 -585 97 357 -382 10 634 -263
1931 -263 -153 395 -172 132 465 -267 -70 255 175 -255 310 -254 -531 3 -159 -245 311 -43 -430 -92 104
1952 104 -467 177 194 -325 225 174 -486 32 394 -356 -96 220 -382 -227 264 -105 -420 295 -182 -276 219
1973 219 -127 -108 171 173 -394 353 -96 -349 196 108 -459 400 407 -583 73 124 -330 -53 474 -400 -123 496
1995 496 -53 -31 496 -337 -592 425 -52 -413 429 125 -428 234 305 -349 169 277 -315 -103 229 -549
2015 -549 17 422 -351 -44 513 -463 27 667 -556 -211 523 8 -133 635 -65 -630 256 -103 -441 391
2035 391 -142 -598 471 63 -798 166 300 -651 26 499 -567 159 346 -578 93 531 -318 76 608
2054 608 -262 -401 472 -142 -543 731 -178 -375 245 156 -236 262 271 -626 499 181 -481 116 516 -235
2074 -235 150 337 -588 146 613 -231 -84 571 -448 -312 358 -292 -378 611 -249 -259 504 -113 -441 560
2094 560 -98 -718 121 393 -508 87 297 -571 150 194 -607 -22 480 -538 27 531 -283 -64 701 -138
2114 -138 -409 495 -179 -496 472 116 -433 306 -54 -373 594 34 -649 229 305 -364 530 60 -554 259
2134 259 405 -603 32 642 -477 -211 581 -581 -94 692 -118 -409 534 -149 -81 763 204 -438 472
2153 472 42 -737 424 128 -570 34 328 -564 351 450 -655 294 525 -687 -188 523 -362 -412 333 -359
2173 -359 -287 812 -164 -412 599 12 -338 432 -33 -514 129 38 -604 401 358 -569 532 264 -561 284
2193 284 378 -529 -306 599 -307 -78 354 -460 -181 829 -84 -601 428 256 -321 589 4 -561 455
2212 455 237 -637 364 426 -599 144 331 -737 118 318 -740 114 684 -159 -179 328 -668 -204 474
2231 474 -274 -245 394 -43 -349 501 -201 -311 468 -58 -602 603 73 -666 501 219 -688 254 570 -641
2251 -641 168 425 -542 366 369 -452 -108 525 -329 11 614 -244 -445 712 -359 -581 531 -163 -218 515
2271 515 -25 -567 415 245 -284 339 266 -696 145 395 -207 47 382 -596 -56 495 -425 -134 461 -350
2291 -350 260 361 -373 -247 311 -149 -482 710 154 -404 342 78 -449 466 260 -257 215 406 -497 48
2311 48 532 -595 151 417 -563 304 441 -470 -114 531 -266 -434 223 -64 -131 531 -340 -178 521 -37
2331 -37 -257 416 -44 -425 399 202 -124 298 224 -444 20 366 -624 113 398 -445 283 476 -595 -195
2351 -195 397 -423 -596 571 -290 -333 494 -232 -166 461 -278 -604 455 148 -381 181 8 -216 575 155
2371 155 -502 115 249 -541 -163 494 -615 93 208 -200 2 451 -326 -373 429 -141 -76 189 25 -472
2391 -472 345 116 -606 460 138 -376 479 426 -286 239 151 -470 202 332 -250 15 382 -235 -155 431 -356
2412 -356 -118 432 -397 -387 549 -205 -57 434 -132 -318 302 -86 -319 474 92 -672 229 60 -396 192
2432 192 400 -455 291 276 -521 197 370 -452 81 237 -230 -61 426 -212 -403 472 -371 -269 579 -66
2452 -66 -286 331 -159 -305 438 7 -299 168 97 -398 293 -97 -673 441 267 -505 -132 421 -237 68
2472 68 425 -154 -190 340 -350 -319 310 -70 -24 496 -196 -302 120 94 -427 332 252 -521 405 36 -151 314
2494 314 350 -482 48 329 -282 105 468 -249 -82 157 -71 -155 373 -113 -160 394 -96 -116 354 110 -457
2515 -457 46 -110 -524 117 134 -360 -8 297 -40 444 176 -355 172 232 -311 45 254 -219 -124 648 -98
2536 -98 -178 229 -183 -462 448 -14 -294 353 241 -241 325 -189 -116 419 22 -329 -25 95 -477 -6 393
2557 393 -300 -79 520 -198 -105 81 -151 -232 423 -117 -112 442 -236 -165 186 -185 -335 330 -15 -156 297 -164
2579 -164 -236 181 -68 -498 170 467 -241 68 560 -283 34 247 -626 127 394 -276 24 444 -406 -199
2599 -199 189 -257 -375 239 85 -318 322 16 -137 223 77 -439 135 -30 -328 101 278 -118 -37 587
2619 587 -145 -20 136 -96 49 180 -163 7 257 -40 -325 322 -78 -351 380 149 -342 202 61 -506
2639 -506 489 324 -470 217 84 -417 215 403 -387 194 199 -188 209 305 -112 91 231 -87 -169 109 -153
2660 -153 -272 399 -101 -342 363 -13 -215 335 -97 -89 284 339 -225 211 425 -190 -52 262 -262 222 242
2681 242 -365 264 306 -483 -130 372 -237 -287 591 -166 39 377 -309 -245 285 380 -213 353 193 -288 396
2702 396 240 -191 91 215 -460 -132 60 55 237 125 -146 -241 416 -105 -42 306 11 -335 275 98 -265
2723 -265 428 -76 -259 391 -54 -295 229 181 -145 45 433 -294 145 69 16 82 165 -81 191 -5 -268 -267
2745 -267 195 -121 -76 351 -123 -144 378 -240 -39 377 45 -287 142 197 -256 224 314 -540 353 48 -506
2766 -506 199 154 -159 171 313 -345 -175 270 105 -51 492 -94 -47 273 -352 -75 147 15 -534 260 -19
2787 -19 -387 159 182 -161 509 15 -284 -142 179 -412 104 185 -246 93 161 -382 -1 157 -282 -99 412
2808 412 -87 -21 531 -164 -73 166 27 -310 343 79 -231 300 187 -215 326 -43 -216 -86 300 -338 -119
2829 -119 -8 -367 -183 71 -122 -199 281 -317 -114 190 13 -241 434 47 -224 143 -87 -345 39 43 -166
2850 -166 -139 84 -288 -119 139 -396 -56 333 -244 -12 283 -101 40 110 -161 -143 209 -134 -275 160 -84
2871 -84 -335 315 3 -110 -65 169 -162 141 220 -177 157 115 -298 -195 52 -487 82 397 -283 -132 523
2892 523 -17 96 116 -277 -264 167 -239 -183 330 -57 -323 241 -154 -479 181 100 100 122 5 -270 238 95
2914 95 -87 256 19 -211 103 309 -503 35 160 -122 197 121 -325 127 296 -212 -372 -22 -295 -233 48
2935 48 43 -493 279 130 -381 243 151 -268 -22 -20 -306 121 -52 -14 50 99 -278 -126 211 105 -58 173 -169
2958 -169 -48 396 -257 -166 212 -2 -285 46 83 -273 365 -13 -209 226 197 -66 4 182 -139 66 239
2979 239 -80 -151 131 -251 48 105 103 -219 334 152 -94 292 36 -397 192 235 -245 81 7 -158 -103 154
3001 154 -193 96 171 -87 -70 35 -534 154 -177 -174 -12 89 -129 121 253 -132 -44 20 113 106 286 57 -375
3024 -375 -16 215 -190 88 -123 -196 -103 335 -183 177 144 -328 -109 30 -126 11 5 -390 -261 76 40 -22
3046 -22 139 260 -150 169 -219 -160 477 47 -62 177 -61 -483 -10 0 -254 125 99 -55 1 202 -154 138
3068 138 -54 -56 -117 515 -90 -50 417 -60 125 126 -71 -72 -35 -16 -76 32 -229 -115 108 -115 -504 192 -93 -269
3092 -269 322 -83 -208 -40 347 -119 318 256 -229 -148 262 42 -27 135 -128 -7 155 84 -30 229 25
3113 25 -132 91 -126 -178 40 61 -97 99 260 -295 41 49 -30 81 313 -120 129 255 -172 -45 171 -192
3135 -192 -372 407 -136 -406 439 182 -152 179 97 -59 -136 105 -233 123 183 -37 -41 -68 60 16 155 -281
3157 -281 82 305 179 -35 -143 -183 -132 313 -141 -143 68 83 -241 -107 37 -109 246 55 -10 5 64 -50 114
3180 114 -203 -178 -36 145 -94 -309 406 125 -121 347 120 -222 219 207 92 -19 175 -213 249 -157 -316
3201 -316 5 -53 185 -47 -158 -241 196 -263 -183 92 240 -236 117 311 -212 -164 408 -222 -3 180 -215
3222 -215 -3 29 100 18 188 89 -189 -127 -151 9 82 56 -201 39 17 -257 -43 204 -120 61 383 -255 -12
3245 -12 -49 -137 -220 164 -100 -251 61 -36 -22 11 -95 125 -81 -15 -114 47 -57 -159 104 -24 -318 -22 314
3268 314 -274 395 255 -135 95 161 -122 82 253 -98 133 347 -58 63 272 6 112 114 116 -345 285 44
3290 44 -125 216 -113 -218 225 352 -213 140 198 -176 28 67 99 183 54 8 -73 7 -31 -259 252 -189 -245
3313 -245 246 -55 -27 109 -135 -359 118 63 21 -32 102 -228 138 176 141 38 188 -138 -9 181 18 -75
3335 -75 -150 49 -26 87 -85 -160 273 226 42 92 22 86 250 52 -194 23 8 -89 25 -336 -228 239 -13
3358 -13 -229 -65 -309 -203 222 26 -9 -71 211 -124 33 118 -238 -126 139 -213 -159 225 -149 -271 -189 22
3380 22 -273 72 -30 -77 180 30 -301 255 66 -384 -2 -148 -196 -29 -46 -231 54 295 -306 -14 -14 -108
3402 -108 -137 220 -107 -80 74 9 95 223 -88 -347 303 -206 -79 154 -57 -105 42 212 -49 -48 120 -340
3424 -340 52 26 29 -19 207 -27 -107 -43 -7 -159 37 -54 -134 103 -90 167 280 27 -248 52 69 -282 249
3447 249 140 -21 247 0 -148 -14 147 -1 -211 152 48 -19 307 -47 -49 19 -55 -94 -77 -21 -125 317 -175
3470 -175 -212 -1 -136 -269 132 41 -99 98 66 12 230 14 -411 -343 -78 -156 -87 227 -172 -72 148 8
3492 8 -289 15 -223 -388 429 368 -42 227 -30 -191 -14 -310 -248 115 -194 -44 124 -19 -62 169 -25 -295
3514 -295 -146 147 -293 -28 134 -135 25 273 -34 -23 213 -291 145 -56 -36 -152 233 3 -168 115 63
3535 63 -196 -249 -63 -177 148 256 -232 -1 -28 -397 -21 284 -115 -127 376 -86 -111 88 104 -161 68 104
3557 104 -226 148 -125 162 236 54 149 328 -96 -93 437 133 -49 154 88 -213 87 168 140 -37 98 -238
3579 -238 -103 -4 -209 112 360 -506 174 67 -111 59 12 -84 -135 336 168 -146 96 120 -134 -8 -27 -53
3601 -53 22 76 -49 109 29 -199 -95 28 -120 -13 6 36 -81 40 -222 -65 0 107 -239 -46 -132 -62 0
3624 0 -75 -213 316 97 192 -259 98 -144 -181 13 -152 99 177 13 -51 124 -421 -234 -74 -177 -163 155 -215
3647 -215 14 64 -211 -135 175 -203 -145 -201 133 -182 -128 -158 71 206 152 -66 120 -133 -88 159 78 -131 -93
3670 -93 -179 -215 -69 74 11 -40 -18 -39 10 120 52 -228 155 -161 -30 -57 -52 -169 322 352 -205 274 8 77 212
3695 212 -63 -17 -54 283 -203 295 -284 -134 -332 238 -123 -78 261 99 -96 -5 212 -218 159 202 -71 157
3717 157 207 -28 69 237 -83 125 437 -114 262 170 55 204 141 -61 -39 168 -226 -57 362 -78 -291 127
3739 127 113 -92 90 62 -262 154 114 -222 12 76 44 -36 -80 -186 -33 -46 -307 33 144 -27 21 127 -178
3762 -178 251 -113 -122 79 88 174 75 -1 -185 -183 57 -2 -244 52 -105 -368 -51 59 246 74 -66 -91 -43 290
3786 290 -73 129 87 -141 6 127 41 -141 313 133 233 165 106 47 176 -345 -6 -180 23 -53 12 -154
3808 -154 37 115 -64 10 130 -56 -243 -298 -96 -209 -305 -74 39 -75 154 128 -119 14 -77 -77 416 263 -202
3831 -202 194 150 -136 104 58 34 49 53 -20 -49 212 -168 -55 -51 -15 -37 -89 -288 59 -22 -170 99 -136 -167 16
3856 16 153 -98 -32 125 146 -53 53 97 -160 -207 -147 -149 232 28 -111 71 245 -361 40 -99 -37 281 98
3879 98 -165 85 76 -204 69 -117 242 145 -83 -22 -62 1 -95 -80 188 -41 -111 166 -70 -454 196 90 -293
3902 -293 49 -303 -36 63 -179 -172 -11 -67 36 -20 56 132 -172 135 -191 -41 -2 -381 160 -182 -285 -78 67
3925 67 -221 -98 24 -136 424 -27 17 -2 117 -51 -71 85 284 -14 -53 -112 -22 184 208 -47 80 183 -13
3948 -13 -107 -106 -109 137 163 -98 72 -183 -50 40 -113 -37 143 -85 -43 -127 270 -224 75 -196 37 -264 23 184
3972 184 27 184 52 -36 -70 -66 92 55 -102 132 -151 5 -209 45 172 58 -29 -46 -179 -72 -71 -225 -85
3995 -85 214 27 -13 87 166 20 12 -141 36 -76 2 137 173 76 37 53 -31 96 117 -150 -105 -151 131 -203 -132
4020 -132 86 81 331 -11 -113 39 -204 -14 -47 8 96 -137 -63 174 95 42 64 73 -56 -219 0 -60 116 71
4044 71 -193 -23 -166 6 22 -406 119 128 -193 -9 -21 169 -128 119 -169 -165 6 208 157 -16 -241 -323 -60
4067 -60 -136 -83 289 73 -165 -49 65 19 144 209 67 -221 -83 -1 57 122 -16 -46 27 307 57 127 -25 -80
4091 -80 -212 -39 -328 30 237 -279 -21 44 89 -17 17 -19 26 -241 -175 -90 1 -22 23 -26 -142 346 132 -68
4115 -68 164 176 -220 244 112 -126 -11 142 246 -85 -2 -87 -87 97 244 -1 35 26 99 -116 107 77 -155 -115
4139 -115 -214 53 48 -213 46 -71 43 23 -82 -275 141 238 -108 -45 -47 46 -56 287 -247 -141 -26 -54 126
4162 126 -9 162 191 -229 -84 -72 -123 -227 -98 205 18 -76 169 131 -244 53 128 -7 -288 105 116 -287
4184 -287 -34 38 104 -94 120 75 -107 -133 -14 90 133 188 -77 -224 -26 92 162 4 -223 111 46 83 263
4207 263 85 70 225 52 77 -160 -87 -105 -56 -300 -181 46 -425 113 43 5 -79 123 101 -90 206 -26 -25 81
4231 81 -100 26 65 -46 56 -173 157 -71 -259 1 231 -21 294 -85 192 81 287 53 207 131 3
4252 3 129 -77 -151 53 177 49 -36 -88 -68 -42 -94 -59 -44 -91 -81 -160 16 -121 25 106 -95 -210 155 -290 70
4277 70 -170 -225 -177 -40 -54 23 285 106 -147 197 -40 206 -178 70 -40 -18 24 -26 451 86 -7 222 128
4300 128 103 -75 25 -8 -5 75 -43 -29 220 85 -42 -89 54 63 11 296 -97 -187 210 106 -127 102 -17 -152
4324 -152 86 4 -107 -56 -47 176 116 -201 -15 -79 -33 -63 -118 -5 188 279 -25 -82 144 -231 -4 94 58 23 -85
4349 -85 60 104 154 -26 -98 -120 112 -170 123 -2 192 -54 108 -20 84 31 -221 157 159 -163 -173 -100 -289
4372 -289 213 -200 -152 -30 48 -19 14 58 -84 -28 77 84 -263 70 -13 -36 -229 -4 -97 -55 184 -35 241 -97
4396 -97 -24 92 60 31 11 70 64 -37 192 29 181 -112 3 -182 -51 18 -73 -153 250 -122 43 -7 108 19
4420 19 -13 106 86 218 -498 -32 143 -19 66 15 112 -137 66 -83 171 209 -19 30 -62 257 62 15 -266
4443 -266 27 -6 128 -133 131 105 -22 -79 139 -140 20 148 -286 208 59 15 -71 75 -7 28 282 -109
4465 -109 -164 157 -278 176 -10 -53 -78 92 -32 -78 -70 68 -174 64 -13 -142 1 -107 118 -119 -103 -26 -350
4488 -350 -256 -410 26 -122 -78 -119 -33 -22 -285 -115 -375 -165 -96 -6 -263 216 41 75 255 56 -169 17 374
4511 374 185 -211 187 46 -128 403 -133 34 -24 -34 -41 154 -92 59 91 -122 22 -24 75 -162 63 -108
4533 -108 -207 89 307 49 277 399 3 -88 210 263 49 -74 -363 277 223 60 -309 -29 -107 -74 50 39
4555 39 122 146 -101 -320 -43 43 94 86 60 52 394 25 -326 -233 -23 -219 -42 230 -188 47 154 27 53 335
4579 335 101 151 -167 -58 -85 97 156 66 -98 10 41 -82 153 50 -40 -44 -311 -133 131 16 -109 -108 -62 -182
4603 -182 13 -142 -88 -16 -225 -94 148 -168 -140 -222 124 -1 -39 -159 -193 -83 -98 82 73 173 76 84 -46 32
4627 32 -276 8 -229 -14 -8 107 -7 119 -13 -123 -70 80 111 30 -93 -45 42 -163 -82 43 5 18 -154 65
4651 65 29 61 314 -135 46 -99 -37 28 -27 -1 -85 64 210 -93 181 36 -388 -31 -148 167 -106 122 -105
4674 -105 334 311 68 -18 -56 -78 -136 -65 18 -100 106 -73 -85 336 -223 -5 93 -195 136 92 11 -22 156 -153
4698 -153 282 257 -20 -100 -93 5 60 89 -149 26 48 -190 -346 30 83 -44 169 136 -439 -101 169 78 29 148
4722 148 -16 -63 -85 -59 13 -103 114 146 149 -164 -159 -87 -103 -34 -141 66 69 381 -163 -193 234 89 -39 -35 -25 -83
4748 -83 -48 185 319 -33 -42 97 10 -102 120 110 142 -177 -215 -147 -276 123 -155 -116 49 -140 279 -21 118
4771 118 70 155 -22 178 81 -102 227 241 -34 -155 -76 215 141 75 -111 -21 -260 27 49 -140 -41 -31 265 97
4795 97 -219 -99 -45 -30 -210 -53 -10 49 -233 -233 151 66 -104 43 146 311 33 -309 10 -20 78 30 217 -223
4819 -223 -18 -46 -14 336 32 150 182 -288 138 104 24 279 146 23 -18 65 333 187 -122 -41 36 -88 -84 -105
4843 -105 -285 -137 -19 31 185 70 52 -119 73 114 -49 -7 -15 241 110 -111 21 -14 32 -12 70 211 307 395
4867 395 35 -39 -162 -97 52 167 31 87 -29 -80 -20 -40 85 -32 -48 6 -392 100 44 -140 -1 108 -234
4890 -234 -208 113 40 -144 -138 13 106 -3 86 45 79 -112 -18 -23 80 -264 126 9 -248 248 88 -114 37 213
4914 213 -7 8 -67 24 -132 106 -105 80 27 228 46 108 -284 90 12 -36 -234 -8 -138 18 201 116 -167
4937 -167 -42 -13 112 143 29 17 -139 138 120 -166 151 -300 72 -20 -145 -96 -10 117 -435 324 74 80 -68
4960 -68 79 -50 116 13 -57 136 -119 -74 92 22 -35 -16 130 75 182 -57 -108 286 101 -40 117 -37 2
4983 2 182 82 74 111 -66 66 75 -226 -20 50 87 -65 -45 -204 -205 67 48 3 108 103 -131 52 188 169 3 80
5009 80 98 -131 -160 -95 -13 65 91 255 109 -322 -27 174 162 5 -158 252 96 102 23 -194 30 -199 -70 3
5033 3 101 -88 -69 148 -101 -168 -153 -93 -132 -45 125 -95 -389 202 44 5 136 -22 -340 19 -129 -91 124 111
5057 111 -244 110 169 -47 -60 65 -58 101 143 105 -84 89 -290 -69 171 106 167 -5 141 16 190 -20
5079 -20 -79 -66 124 112 49 86 -25 -90 -132 -197 -41 -136 -114 -155 112 118 187 26 -189 71 -32 196 104 -107 228
5104 228 -183 -32 43 164 -39 -97 -240 10 -235 3 37 132 -9 -142 63 -284 188 -22 -123 46 171
5125 171 -118 90 135 -70 107 -210 -88 135 45 0 60 169 34 -128 121 11 -138 -10 -111 -62 -13 194
5147 194 77 -38 -200 -323 -36 69 36 -7 65 -331 65 17 -141 -17 -47 152 25 65 -29 32 187 -39 1
5170 1 81 -10 144 -152 77 25 20 132 86 209 -67 -131 241 42 -109 361 86 123 98 -96 -12 -100 26 -4 2
5195 2 -294 -202 47 10 88 61 -9 -115 -25 58 10 124 252 -52 -226 -145 105 -23 -148 71 -246 187 71 93
5219 93 -80 212 98 -61 14 0 214 257 114 52 39 -109 13 42 1 -34 347 193 -58 13 -185 -289 -83
5242 -83 26 85 -56 -6 -52 -216 -194 -37 165 -75 -30 -56 -12 -34 157 -153 14 -2 -120 -82 -225 161 164 -70
5266 -70 -215 22 -13 174 168 41 66 -110 -64 -40 232 92 -19 -50 -30 -72 -203 -51 43 34 70 23 -218 4 99
5291 99 126 -65 -67 156 -90 -114 185 103 -92 -5 -11 -2 -108 -77 106 206 -52 -66 123 149 68 -267 186 169 -138
5316 -138 49 79 -13 -179 98 -113 100 102 -18 57 -63 200 -103 2 -91 -205 -29 -169 81 4 21 77 -87
5339 -87 -57 66 -57 -47 243 284 -80 -146 130 28 61 -91 208 -174 -82 -228 -98 -24 -155 -33 -42 239 -277
5362 -277 103 -31 -92 32 108 -10 174 -154 -10 271 -310 49 88 87 -101 226 -156 -260 -52 253 -252 -193
5384 -193 68 -238 -47 -34 98 -58 100 -206 -193 184 9 9 -34 -127 103 -33 32 9 -181 -93 158 196 146 -50
5408 -50 73 -27 -76 -27 -97 -86 -61 266 28 149 75 -155 -30 95 -306 -128 -185 -133 147 -210 -48 -135 313
5431 313 92 118 137 126 224 44 57 -125 48 -70 222 27 -158 -75 54 -85 -407 -219 94 -40 -121 271
5453 271 -201 -127 -109 221 67 44 -4 -169 139 79 -141 34 -74 -170 226 78 -142 -260 -116 15 10 332 -19
5476 -19 -36 112 5 153 -12 -36 -11 197 40 -178 262 -41 -121 -238 77 -33 281 -54 -159 43 181 -24
5498 -24 -21 141 -162 -78 3 -159 233 292 -112 -96 170 -170 -160 270 -57 -116 30 63 -264 0 -104 134 301
5521 301 74 -130 -191 -36 -153 191 -127 -27 -47 47 111 207 -27 287 -36 -42 -39 71 8 -239 153 -199 -10
5544 -10 -290 15 23 94 35 -45 114 40 164 134 -38 241 -46 75 18 128 107 200 59 68 -130 179 117 -118 -74
5569 -74 -307 134 100 81 210 -79 -22 108 -56 117 -257 182 -71 -64 -237 -167 -22 102 -10 11 81 -17 -72 -66
5593 -66 -29 29 175 -57 -67 228 179 146 50 -151 -17 -18 114 -141 -83 117 -111 -44 -129 166 68 -95 35 66 184
5618 184 -253 54 -214 -31 203 44 188 203 200 -199 220 303 -4 -66 21 -45 -180 209 4 -286 -81 -146 139
5641 139 144 17 32 -91 100 -270 -63 11 197 9 -71 262 -6 209 -96 -80 -174 -62 308 96 -162 -112 138
5664 138 63 5 138 -59 -33 19 158 -324 -71 243 -341 -269 70 -303 120 115 -68 -45 -151 -6 -116 84 47
5687 47 207 188 -127 113 -42 -266 -175 118 71 -34 -209 -175 -19 249 47 197 7 -62 -209 -56 -44 -320
5709 -320 10 134 -137 121 172 -112 -180 -240 -90 -35 62 -67 -24 18 -124 -322 102 297 -58 -4 -335 -229 -197
5732 -197 56 -247 -272 91 223 -152 201 -43 206 73 -39 -142 183 60 -143 233 -79 -170 25 -98 -280
5753 -280 -48 -71 11 140 205 -95 108 -12 120 49 -130 1 -87 216 -15 38 69 -144 -312 216 49 -171
5775 -171 -164 164 -41 229 127 26 -34 123 21 -51 180 173 123 86 168 114 -94 84 110 -89 11 -15 -183 -372
5799 -372 230 -133 -122 -120 119 215 -117 94 84 250 90 -149 1 94 -139 56 160 1 31 138 -90 -195
5821 -195 -111 5 245 -11 126 -153 -39 191 -7 108 225 -54 18 99 -124 -17 3 64 -193 33 37 26 59
5844 59 3 -18 72 130 -17 -16 -118 -107 -122 4 -78 -18 26 138 38 239 117 -85 110 -190 -225 198 -84 -26 78
5869 78 62 -177 -42 65 -88 -243 -38 92 19 -13 -197 180 209 4 247 119 -243 -18 -6 -177 15 346
5891 346 41 -107 174 -60 -57 2 94 -145 32 -63 54 40 24 -106 210 -33 -123 91 -57 -258 12 -80 -170
5914 -170 -113 199 -249 -402 38 -92 66 -22 104 72 -201 117 39 -6 184 -73 -95 -103 60 250 9 -52 66
5937 66 -205 -103 63 -1 139 -40 33 -11 52 6 89 -49 -107 43 -22 81 124 258 164 -86 88 -13 -231 27
5961 27 -143 229 -66 6 -116 -192 -58 -206 -170 62 -88 116 97 331 -56 53 -66 97 -42 -40 27 -188 86
5984 86 -22 -28 98 101 -150 -74 171 139 104 -106 -277 38 -141 -151 -9 -25 -259 259 40 -186 -9 103 270
6007 270 53 -14 -34 -17 103 22 -112 -40 0 144 41 -76 -140 -29 124 -237 94 29 -224 -87 -321 25 73
6030 73 72 105 -178 31 16 -81 64 -160 16 90 264 170 240 86 399 -206 -276 107 21 2 -71 -25 183 -140 51
6055 51 77 -109 129 -99 -353 -68 74 163 145 196 -66 37 -141 -227 287 -210 30 16 -113 -33 -240 54 118
6078 118 114 60 212 84 -192 -84 -14 -125 -18 195 70 21 -37 -358 -264 -106 -68 -36 -41 -82 306 -117 114 258
6102 258 239 151 146 -210 -127 -29 -84 157 -134 -74 17 -105 -168 -86 64 -48 -234 170 202 -35 52 8 -79 54 -156
6127 -156 36 -41 -17 -100 -73 213 -100 95 -73 -75 60 -169 -23 -153 47 151 54 -35 37 93 -238 96 -119
6150 -119 48 -250 66 -150 -156 -68 -75 -53 -214 -16 266 -116 -155 -55 443 12 72 83 -258 -32 115 45 -57
6173 -57 -105 -256 58 -78 89 114 75 -87 -41 150 -268 107 326 94 86 -19 -312 -31 -31 46 -23 -258 41 15
6197 15 65 115 85 171 -62 90 -76 -201 -197 43 270 2 41 -58 -188 74 291 -6 -7 179 -101 -52 -10 37 -172
6222 -172 -10 54 136 194 -233 -234 -22 -42 -231 -14 74 -267 20 -136 238 33 179 -40 -117 28 -194 -160 286
6245 286 -40 -69 -18 -25 162 -121 -51 -30 45 -281 4 213 57 -235 -99 199 22 -28 -122 -310 102 3 63 95
6269 95 -3 -79 218 274 -61 19 109 72 154 -117 -214 -168 100 129 -187 2 -156 -102 -90 -57 -43 47 -3 -4 69 -29 141
6296 141 132 -63 -89 -107 16 -77 -243 -15 162 26 113 51 86 1 -7 -41 104 149 -92 -3 98 -123 -75 -96 52
6321 52 -110 15 -89 149 138 204 80 76 26 196 -187 -289 284 78 131 64 36 -3 -63 -312 -68 -245 74 -264
6345 -264 238 12 -77 -102 90 117 -324 63 1 -205 119 -168 38 -66 -203 9 196 -102 -328 126 -148
6366 -148 -90 29 70 161 50 151 77 -150 8 -65 129 149 -97 6 -21 129 133 -115 6 139 -79 105 37
6389 37 16 -270 30 59 -133 206 187 -109 69 144 255 -40 -156 240 -14 -1 96 -108 -102 -182 -78 -72 24 138
6413 138 -100 8 13 78 1 158 34 -130 58 -68 244 -32 99 162 192 -279 43 -169 26 232 288 21
6435 21 65 -25 -224 61 43 17 -33 -107 242 142 -11 120 -136 -28 166 61 -83 -24 -16 311 106 -198 83
6458 83 -93 5 -120 51 1 -150 109 43 47 -117 55 32 146 -169 90 103 -105 -63 198 -4 97 -213 49
6481 49 -59 116 123 -175 -18 111 78 23 97 109 -172 67 104 -230 80 134 86 142 -9 -8 139 166 -51 -33 232
6506 232 -290 164 -131 11 135 85 18 113 129 152 182 62 -17 16 -47 116 16 -27 21 13 289 97 152 143 203 -23
6532 -23 143 207 -1 -3 -137 34 61 97 38 -41 -18 -113 -297 66 -45 26 -115 68 -32 -108 -329 -60 -149 30
6556 30 -3 127 -208 -85 -159 207 -2 -248 99 -56 126 53 11 71 -57 -205 -82 -165 -210 -26 -63 48 -199
6579 -199 68 40 -14 95 -57 -13 14 -3 -51 -41 -144 -105 29 153 -14 134 17 63 -35 -275 72 118 66 150
6603 150 -193 -82 53 109 316 135 63 233 130 234 -288 99 49 -61 129 238 34 -98 28 105 21 90
6625 90 37 1 -133 121 125 -149 -23 154 -257 -29 -47 34 -111 53 -30 -45 174 -247 10 44 -37 -235 33 -165
6649 -165 4 132 78 -259 142 -286 -224 -130 350 67 134 96 115 190 166 -93 71 181 -121 157 92 -270 -20
6672 -20 -48 -202 -89 138 191 -104 245 145 -97 -165 -118 132 59 -71 97 27 42 54 98 -54 91 66 -15 -159
6696 -159 199 35 -53 -1 54 16 -84 -196 30 -24 -114 -28 -63 18 81 344 158 -10 -19 -73 102 -296 -96 -67 17
6721 17 -89 240 -78 116 227 106 52 -16 -2 63 87 -64 -104 -169 18 3 132 -190 -156 -300 -216 -48 147 234
6745 234 -170 -90 13 -26 28 -53 -232 -135 -36 -163 -58 3 6 -118 276 -64 -77 181 2 71 -8 14 -219 106
6769 106 -103 6 -12 -104 61 255 -91 96 119 45 -92 103 -46 13 194 158 110 132 -89 -106 -236 -63 90
6792 90 -192 111 -66 1 36 -57 -7 167 -38 -49 -69 36 -95 -80 34 29 564 233 -192 -147 240 -13 248 303
6816 303 32 30 -56 210 229 -56 -250 138 -94 83 71 -7 -114 -18 161 293 64 33 111 -89 144 -258 74
6839 74 -62 -33 84 -78 160 -58 169 30 -115 -233 101 150 107 12 -48 -79 8 -159 48 229 128 265 -118
6862 -118 -224 -18 209 87 135 47 -108 155 -174 -17 -25 -106 96 -239 163 46 43 -129 -60 37 -89 -118 -178 -45
6886 -45 225 -135 103 41 -143 -27 103 373 -25 301 -105 7 162 64 19 -3 -68 -122 101 -245 1 -30 126
6909 126 208 70 166 11 18 39 280 -29 151 196 171 96 -113 -4 -30 -235 -18 47 -67 87 53 -166 -150 97
6933 97 -322 -104 74 18 -67 123 129 -133 116 -30 -189 -89 239 85 126 269 35 -31 -83 236 -108 254 -119
6956 -119 -50 27 30 74 -36 -16 -186 108 -33 -56 77 333 157 -91 -181 42 129 55 20 232 80 -88 -160 40
6980 40 -189 11 129 -127 -125 -133 -268 -11 147 -93 164 220 -148 56 123 31 -124 -17 60 -67 -90 -81 -152 -156 111
7005 111 -79 -117 123 -223 74 -31 -47 -31 -13 -358 -55 -39 71 77 80 206 85 22 -1 21 -23 -166 153 -62
7029 -62 88 90 12 258 -56 58 332 91 -48 -46 -99 5 -2 -157 -210 -108 132 -33 85 7 58 88 -61 37 0
7054 0 213 -23 -110 6 -293 -67 -47 74 -189 -206 -74 85 183 121 100 503 -55 155 -189 -56 -173 -148 -61
7077 -61 -56 84 184 63 39 -86 -229 -30 -199 -111 0 -138 -184 297 38 109 123 9 -133 82 -77 160 126
7100 126 238 123 25 60 105 -75 19 106 13 -43 16 -218 -67 -189 -152 -105 118 140 230 310 28 257 105 -156
7124 -156 103 -17 -248 -183 42 -85 12 74 91 -84 -234 68 130 5 -143 131 -18 67 150 49 14 -138 142
7147 142 -34 28 -107 248 -26 106 -49 -144 108 -17 -166 17 -90 -117 131 295 -201 -46 -102 -220 -133 27
7169 27 -101 -106 150 -142 58 -260 31 288 -237 -160 -19 187 6 224 126 -175 32 -34 88 243 -47 172
7191 172 100 -64 116 114 -210 -121 -172 -9 78 -204 241 71 -59 -5 46 -286 39 -127 -200 -86 130 -109 -147
7214 -147 277 -8 86 117 44 -104 -28 -69 -83 -23 -29 37 -144 -30 -87 61 35 -95 -131 -235 -138 -39 -96 -58 -5 204
7240 204 87 -39 43 65 -227 119 345 -205 -230 -91 -55 196 69 -66 -7 78 48 -73 172 37 81 -147 -243
7263 -243 33 -179 -11 -127 -33 186 -13 -87 61 141 155 16 -83 -10 -60 70 95 19 1 172 -128 -108 86 104
7287 104 -66 -138 54 -54 104 287 98 88 72 -113 70 30 76 3 87 -145 -32 -169 -257 121 88 135 42 -164
7311 -164 -34 -66 -7 -18 69 105 -44 9 -5 245 63 -234 63 -185 -132 99 130 -4 -75 -134 54 207 -96 126
7335 126 -54 -23 -100 -75 -143 124 -53 -168 -14 -36 -3 98 131 136 158 183 17 -171 -165 137 198 -25 30 132 -42
7360 -42 100 114 -111 -122 -63 -140 -31 250 75 -91 25 -276 -345 -104 -165 -253 110 -87 60 -119 -151 -129 -116 -145
7384 -145 -112 -54 102 82 96 139 37 185 184 50 -117 82 -154 -178 20 -146 -64 -175 103 23 -83 -218 40
7407 40 -18 136 -94 174 -74 -55 -177 84 -58 31 -254 13 -21 -28 -27 -267 45 -178 -84 -7 34 -48 -140 272 16
7432 16 17 157 85 179 48 204 -190 -29 -97 42 114 39 -53 -69 -216 -193 217 203 117 160 -123 -142 -49 181 118 -86
7458 -86 -125 -46 -52 164 63 198 -10 -20 230 129 -64 193 -80 32 28 24 8 246 48 106 -82 82 -147 46
7482 46 109 46 44 -237 -23 2 -60 160 49 221 -60 1 -14 28 407 0 -206 53 -258 91 -78 42 -86
7505 -86 -127 -8 -258 131 14 -110 39 56 -107 24 -106 30 -118 117 -178 -411 -92 312 11 -51 56
7526 56 -290 -40 10 -71 79 24 -56 209 -119 207 150 -104 -124 79 -225 -26 -233 -65 36 -63 -105 -14 -3 9
7550 9 290 67 -195 -199 -56 -17 -93 -187 22 76 268 159 32 3 -185 -22 119 -84 35 -116 -153 123 175 334
7574 334 -284 40 -21 296 76 156 -85 127 -137 78 27 -188 139 10 23 218 -182 48 -62 93 -126
7595 -126 -152 241 -90 -178 -43 -16 -146 -194 -7 -100 81 -40 -117 -193 131 -192 85 -30 125 194 209 -48 63
7618 63 -42 -200 207 53 52 -49 85 -223 83 5 84 -130 171 -117 -308 45 74 -224 170 -20 -227 137
7640 137 -95 83 44 56 -197 135 -7 -107 5 57 77 89 -110 -202 -42 -284 -138 -184 88 82 75 -88 -207 -48
7664 -48 -51 -64 -142 240 -72 -30 121 -89 59 359 -85 41 -1 -94 69 83 -43 77 -56 -163 -20 -278 4
7687 4 237 133 94 178 -131 69 35 -11 37 -68 -251 146 -86 7 -98 1 165 118 35 -16 79 98 161 34 142
7712 142 57 52 248 -10 -18 211 -180 161 120 -12 -126 15 23 -10 -100 53 113 -157 -214 -93 155 70 -70 125
7736 125 -64 -162 237 -14 -58 277 116 -108 315 84 66 -115 77 -158 187 -71 128 -134 143 -67 146
7757 146 197 -150 262 55 -51 -76 -225 -2 6 -23 182 127 13 -210 -277 145 -63 21 -30 107 220 -191 -124
7780 -124 50 45 -29 -143 37 -231 10 17 -68 153 -57 -157 207 159 21 -70 -153 144 319 -191 101 11 -80 302
7804 302 28 49 -109 113 177 17 74 -285 158 172 13 25 33 203 -48 -168 34 -22 -86 269 38 365 64
7827 64 -109 -28 -173 50 34 79 34 243 -23 138 -15 -9 290 -139 147 -82 -3 -141 145 53 -36 -74 14 -32
7851 -32 -271 -160 -20 -33 165 -34 -19 16 223 37 -145 -96 100 -224 -29 116 -198 -164 -258 -7 75 -80 -103
7874 -103 -93 221 33 -18 79 2 16 64 -107 -88 -83 89 154 109 28 -67 124 -132 66 -102 78 -88 56 44 -59
7899 -59 -167 -166 -89 -293 -177 147 165 13 -47 82 2 21 -169 98 -13 -258 11 161 96 -259 89 -160 -170
7922 -170 67 131 -50 88 -219 19 -109 -260 -3 -7 -60 120 49 -128 -109 -63 222 -44 -437 -203 -187 22 107
7945 107 -42 -16 179 -155 96 194 144 30 -23 -23 251 -80 -76 81 159 85 45 -80 226 47 107 -212 75 66 -323
7970 -323 -286 345 -210 39 11 -48 -55 37 -99 -52 139 -44 66 17 -161 123 212 -45 -93 -259 -155 56 -86
7993 -86 -5 -2 -17 162 71 217 94 28 -26 -74 99 -49 -23 9 32 -189 -138 -149 -101 167 119 123 -145 11 115 -20
8019 -20 132 -13 -153 63 -92 39 348 88 30 -26 -30 -41 99 -27 -148 -62 48 114 -116 -238 -100 7 -31
8042 -31 8 -4 82 -141 400 169 79 96 10 -344 -245 -204 -120 48 213 -341 66 -42 -102 -75 -207 7 130 -61
8066 -61 -359 -113 -5 205 -69 117 120 -70 -96 249 65 43 -294 -10 110 115 24 -56 64 162 -49 170 4
8089 4 -85 93 145 -65 -385 12 -10 304 -54 -241 -212 -59 -172 69 -138 250 115 -62 122 -50 274 75
8111 75 -105 144 -158 -48 30 -55 66 187 -49 60 57 71 242 156 -87 -114 -325 -88 59 35 -186 66 46
8134 46 -106 58 245 110 -118 -91 117 7 294 -4 -58 77 -38 -233 -16 -123 -244 114 59 150 84 1
8156 1 253 -120 -147 -192 0 -23 -153 -74 184 -37 -224 -158 -223 120 -128 107 -87 150 -131 -143 15 -84 157
8179 157 25 -16 171 166 -218 -149 -85 235 -110 -30 159 88
8191H8
##END NTUPLES=NMR FID
##END=
