##TITLE=1H_Pr 4898
 CDCl3, 8 sc, 
 8.2.2019
##JCAMPDX= 6.0         $$ Bruker NMR JCAMP-DX V2.0
##DATA TYPE= NMR FID
##DATA CLASS= NTUPLES
##ORIGIN= UXNMR, Bruker Analytische Messtechnik GmbH
##OWNER= root
$$ XWIN-NMR		Version 3.5
$$ Fri Feb  8 16:41:58 2019 Russian Standard Time (UT+4h)  she@DPX200
##.OBSERVE FREQUENCY= 200.1313
##.OBSERVE NUCLEUS= ^1H
##.DELAY= (6, 6)
##.ACQUISITION MODE= SIMULTANEOUS
##.ACQUISITION SCHEME= undefined
##.AVERAGES= 8
##.DIGITISER RES= 18
##SPECTROMETER/DATA SYSTEM= spect
##.PULSE SEQUENCE= zg30
##.SOLVENT NAME= CDCl3
##.SHIFT REFERENCE= (INTERNAL, CDCl3, 0, 15.7039)
##AUDIT TRAIL= $$ (NUMBER, WHEN, WHO, WHERE, WHAT)
$$ ##TITLE= Audit trail, XWIN-NMR		Version 3.5
$$ ##JCAMPDX= 5.01
$$ ##ORIGIN= Bruker BioSpin GmbH
$$ ##OWNER= she
$$ F:/spectra/data/she/nmr/H-F/1/audita.txt
$$ ##AUDIT TRAIL=  $$ (NUMBER, WHEN, WHO, WHERE, WHAT)
(   1,<2019-02-08 16:40:51.78 +0400>,<she>,<DPX200>,
      <created by zg, POWCHK disabled, PULCHK disabled
       configuration hash MD5:
       00 E9 B6 7A A2 85 ED C7 34 08 36 98 17 FE 4E 26
       data hash MD5: 16K
       DD 16 70 FE 29 68 B4 6A 5A 24 9D E9 5B B7 50 41>)
$$ ##END=
$$ 
$$ hash MD5
$$ 49 20 9B AF 9E 3F C1 E5 DB 0C E1 E3 F4 78 9C 86
##$RELAX= 
##$RELAX= 
##$RELAX= 
##$RELAX= 
##$RELAX= 
##$RELAX= 
$$ Bruker specific parameters
$$ --------------------------
##$DU= <F:/spectra>
##$EXPNO= 1
##$NAME= <H-F>
##$PROCNO= 1
##$TYPE= <nmr>
##$USER= <she>
##$AMP= (0..31)
100 100 100 100 100 100 100 100 100 100 100 100 100 100 100 100 100 100 
100 100 100 100 100 100 100 100 100 100 100 100 100 100 
##$AQSEQ= 0
##$AQ_mod= 1
##$AUNM= <au_zg>
##$AUTOPOS= <>
##$BF1= 200.13
##$BF2= 200.13
##$BF3= 200.13
##$BF4= 200.13
##$BF5= 200.13
##$BF6= 200.13
##$BF7= 200.13
##$BF8= 200.13
##$BYTORDA= 1
##$CFDGTYP= 0
##$CFRGTYP= 5
##$CHEMSTR= <none>
##$CNST= (0..31)
1 1 145 1 1 1 1 1 1 1 1 1 1 1 1 1 1 1 1 1 1 1 1 1 1 1 1 1 1 1 1 1 
##$CPDPRG= <>
##$CPDPRG1= <>
##$CPDPRG2= <>
##$CPDPRG3= <>
##$CPDPRG4= <mlev>
##$CPDPRG5= <mlev>
##$CPDPRG6= <mlev>
##$CPDPRG7= <mlev>
##$CPDPRG8= <mlev>
##$CPDPRGB= <>
##$CPDPRGT= <>
##$D= (0..31)
0 1.2 0 0 0 0 0 0 0 0 0 0.03 0 0 0 0 0 0 0 0 0 0 0 0 0 0 0 0 0 0 0 0 
##$DATE= 1549629651
##$DBL= (0..7)
120 120 120 120 120 120 120 120 
##$DBP= (0..7)
150 150 150 150 150 150 150 150 
##$DBP07= 0
##$DBPNAM0= <>
##$DBPNAM1= <>
##$DBPNAM2= <>
##$DBPNAM3= <>
##$DBPNAM4= <>
##$DBPNAM5= <>
##$DBPNAM6= <>
##$DBPNAM7= <>
##$DBPOAL= (0..7)
0.5 0.5 0.5 0.5 0.5 0.5 0.5 0.5 
##$DBPOFFS= (0..7)
0 0 0 0 0 0 0 0 
##$DE= 6
##$DECBNUC= <off>
##$DECIM= 32
##$DECNUC= <off>
##$DECSTAT= 4
##$DIGMOD= 1
##$DIGTYP= 9
##$DL= (0..7)
0 120 120 120 120 120 120 120 
##$DP= (0..7)
150 150 150 150 150 150 150 150 
##$DP07= 0
##$DPNAME0= <>
##$DPNAME1= <>
##$DPNAME2= <>
##$DPNAME3= <>
##$DPNAME4= <>
##$DPNAME5= <>
##$DPNAME6= <>
##$DPNAME7= <>
##$DPOAL= (0..7)
0.5 0.5 0.5 0.5 0.5 0.5 0.5 0.5 
##$DPOFFS= (0..7)
0 0 0 0 0 0 0 0 
##$DQDMODE= 0
##$DR= 18
##$DS= 0
##$DSLIST= <SSSSSSSSSSSSSSS>
##$DSPFIRM= 0
$$ [...]
##$SUBNAM2= <"">
##$SUBNAM3= <"">
##$SUBNAM4= <"">
##$SUBNAM5= <"">
##$SUBNAM6= <"">
##$SUBNAM7= <"">
##$SUBNAM8= <"">
##$SUBNAM9= <"">
##$SW= 20.0189088683792
##$SWIBOX= (0..15)
0 0 2 0 0 0 0 0 0 0 0 0 0 0 0 0 
##$SW_h= 4006.41025641026
##$TD= 16384
##$TD0= 1
##$TE= 0
##$TE2= 300
##$TE3= 300
##$TEG= 300
##$TL= (0..7)
0 120 120 120 120 120 120 120 
##$TP= (0..7)
150 150 150 150 150 150 150 150 
##$TP07= 0
##$TPNAME0= <>
##$TPNAME1= <>
##$TPNAME2= <>
##$TPNAME3= <>
##$TPNAME4= <>
##$TPNAME5= <>
##$TPNAME6= <>
##$TPNAME7= <>
##$TPOAL= (0..7)
0.5 0.5 0.5 0.5 0.5 0.5 0.5 0.5 
##$TPOFFS= (0..7)
0 0 0 0 0 0 0 0 
##$TUNHIN= 0
##$TUNHOUT= 0
##$TUNXOUT= 0
##$USERA1= <user>
##$USERA2= <user>
##$USERA3= <user>
##$USERA4= <user>
##$USERA5= <user>
##$V9= 5
##$VALIST= <valist>
##$VCLIST= <CCCCCCCCCCCCCCC>
##$VD= 0
##$VDLIST= <DDDDDDDDDDDDDDD>
##$VPLIST= <PPPPPPPPPPPPPPP>
##$VTLIST= <TTTTTTTTTTTTTTT>
##$WBST= 1024
##$WBSW= 4
##$XGAIN= (0..3)
0 0 0 0 
##$XL= 0
##$YL= 0
##$YMAX_a= 153648
##$YMIN_a= -171641
##$ZGOPTNS= <>
##$ZL1= 120
##$ZL2= 120
##$ZL3= 120
##$ZL4= 120
##$ABSF1= 10
##$ABSF2= 0
##$ABSG= 5
##$ABSL= 3
##$ALPHA= 0
##$AQORDER= 0
##$ASSFAC= 0
##$ASSFACI= 0
##$ASSFACX= 0
##$ASSWID= 0
##$AUNMP= <proc_1d>
##$AZFE= 0.1
##$AZFW= 0.1
##$BCFW= 1
##$BC_mod= 2
##$BYTORDP= 1
##$COROFFS= 0
##$CY= 11.3945322036743
##$DATMOD= 1
##$DC= 2
##$DFILT= <>
##$DTYPP= 0
##$F1P= 18.9103706918063
##$F2P= -1.10871071338519
##$FCOR= 0.5
##$FTSIZE= 0
##$FT_mod= 4
##$GAMMA= 1
##$GB= 0.15
##$INTBC= 1
##$INTSCL= 1
##$ISEN= 128
##$LB= 0.24
##$LEV0= 0
##$LPBIN= 0
##$MAXI= 10000
##$MC2= 0
##$MEAN= 0
##$ME_mod= 0
##$MI= 1.114404
##$NCOEF= 0
##$NC_proc= 0
##$NLEV= 6
##$NOISF1= 3.799351
##$NOISF2= 2.8
##$NSP= 1
##$NTH_PI= 0
##$NZP= 0
##$OFFSET= 15.70392
##$PC= 1
##$PHC0= -8681.122
##$PHC1= 14.40019
##$PH_mod= 1
##$PKNL= yes
##$PPARMOD= 0
##$PSCAL= 0
##$PSIGN= 0
##$REVERSE= no
##$SF= 200.130013532006
##$SI= 16384
##$SIGF1= 3
##$SIGF2= 2
##$SINO= 400
##$SIOLD= 16384
##$SREGLST= <1H.CDCl3>
##$SSB= 0
##$STSI= 0
##$STSR= 0
##$SW_p= 3612.71676300578
##$SYMM= 0
##$S_DEV= 0
##$TDeff= 0
##$TDoff= 0
##$TI= <>
##$TILT= no
##$TM1= 0
##$TM2= 0
##$TOPLEV= 0
##$USERP1= <user>
##$USERP2= <user>
##$USERP3= <user>
##$USERP4= <user>
##$USERP5= <user>
##$WDW= 1
##$XDIM= 8192
##$YMAX_p= 0
##$YMIN_p= 0
$$ End of Bruker specific parameters
$$ ---------------------------------
##NTUPLES= NMR FID
##VAR_NAME=  TIME,          FID/REAL,        FID/IMAG
##SYMBOL=    X,             R,               I
##VAR_TYPE=  INDEPENDENT,   DEPENDENT,       DEPENDENT
##VAR_FORM=  AFFN,          ASDF,            ASDF
##VAR_DIM=   8192,          8192,            8192
##UNITS=     SECONDS,       ARBITRARY UNITS, ARBITRARY UNITS
##FACTOR=    0.0002496,     1,               1
##FIRST=     0,             0,               0
##LAST=      2.0444736,     0,               0
##MIN=       0,             -171641,         0
##MAX=       2.0444736,     153648,          0
$$ Real data points
##PAGE= N=1
##DATA TABLE= (X++(R..R)), XYDATA
$$ [...]
$$ plain form
2700 938 844 -1875 717 1138 -1724 300 1337 -1707 -122 1409 -1476 -324 1633 -1280 -792 1624
2716 1624 -545 -1016 1461 -275 -1153 1829 -113 -1558 1690 254 -1389 1366 650 -1692 979 1349
2732 1349 -1850 558 1062 -1670 350 1350 -1385 105 1400 -1509 -312 1567 -1004 -772 1685
2747 1685 -905 -1177 1766 -511 -1161 1618 -120 -1536 1541 223 -1832 1091 545 -1793 821 935
2763 935 -1689 496 1110 -1686 421 1441 -1481 331 1797 -1242 -674 1980 -993 -1100 1973 -553
2779 -553 -1056 1516 -591 -1135 1593 -161 -1514 1472 468 -2109 1183 780 -1740 856 811 -1548
2795 -1548 456 1350 -1586 296 1616 -1345 -194 1851 -990 -359 1554 -841 -1116 1522 -633 -1075
2811 -1075 1519 -457 -1632 1678 109 -1785 1386 687 -1520 1115 647 -1660 789 1019 -1766 627
$$ packed form
2700I38r4k719K592M21k862K024J037l044J585J531k885J152J957k913M88K416
2716A624k169m71K477j736q78K982j942j445L248j436j643K755p16k342K671L70
2732A349l199K408N04k732K020J000k735J490J295k909J197J879k571K32K457
2747A685k590k72K943k277o50K779j738j416L077j318k055K923n46k338K614J14
2763I35k624K185O14k796K107J020k922J812J466l039N68K654k973j07L073k526
2779e53n03K572k107n44K728j754j353K986j004k577L292m03k520K596m5k359
2795a548K004Q94k936J882J320k961J151K045k841O31J913k395k75K638k155m42
2811a075K594j976j175L310j569j894L171o99k207K635m68k307K449K30k785K393
$$ plain form
2827 627 1112 -1619 387 1838 -1821 -283 1859 -1138 -820 1704 -762 -734 1683 -828 -1083 1887
2843 1887 -226 -1440 1742 568 -1756 700 552 -1582 1225 299 -1795 993 914 -1789 814 1450
2859 1450 -1614 -25 1857 -1464 -519 1797 -1100 -504 1734 -978 -705 1659 -824 -1375 1592 -283
2875 -283 -1532 1395 -42 -1453 1159 212 -1848 1078 663 -1760 938 1412 -1929 149 1537 -1698
2891 -1698 30 1563 -1133 -184 1481 -1147 -501 1791 -729 -942 1823 -302 -1639 1574 2 -1523
2907 -1523 1438 -19 -1542 1545 158 -1899 1054 975 -1981 729 1502 -1482 422 1454 -1725 184
2923 184 1455 -1399 -179 1866 -1157 -844 1864 -564 -1126 1674 -476 -1215 1623 -239 -1503 1447
2939 1447 295 -1589 1327 669 -1798 1161 979 -1778 892 956 -1676 484 1367 -1705 349 1386
$$ packed form
2827F27M85k731K006J451l659J538K142k997L18K524k466K8K417k511k55K970
2843A887k113j214L182j174k324K456j48k134K807r26k094K788p9k703K603O36
2859A450l064J589J882l321R45K316k897N96K238k712K73K364k483n51K967j875
2875b83j249K927j437j411K612r47k060K926m15k423K698M74l341K078J388l235
2891a698J728J533k696R49J665k628O46K292k520k13K765k125j337L213j572j525
2907a523K961j457j523L087j387k057K953p9k956K710P73k984J904J032l179J909
2923A84J271k854J220K045l023L13K708k428n62K800k150p39K838j862j264K950
2939A447j152j884K916o58k467K959j82k757K670O4k632K160Q83l072K054J037
$$ plain form
2955 1386 -1708 -558 1860 -1150 -921 1677 -786 -1298 1348 -440 -1190 1845 -94 -1217 1593 402
2971 402 -1918 1347 737 -1734 1114 1004 -1883 544 1019 -1534 235 1481 -1720 -49 1784 -1488
2987 -1488 -622 1581 -825 -744 1598 -888 -805 1610 -602 -1622 1774 -145 -1564 1411 435 -1743
3003 -1743 1144 571 -1648 879 569 -1511 735 1096 -1912 328 1526 -1418 -9 1677 -1009 -387
3019 -387 1615 -913 -398 1550 -709 -1115 2012 -370 -1584 1407 51 -1440 1443 282 -1393 1186
3035 1186 490 -1937 913 956 -1821 451 1252 -1748 439 1428 -1456 -209 1377 -1392 -640 1632
3051 1632 -889 -832 1912 -665 -1340 1627 -350 -1240 1337 -27 -1350 1492 428 -1746 1361 678
3067 678 -1706 1103 836 -1884 640 1346 -1484 374 1477 -1572 -167 1386 -1248 -653 1786 -952
$$ packed form
2955A386l094J150K418l010K29K598k463n12K646j788p50L035j939j123K810j191
2971D02k320L265o10k471K848j10k887K427M75k553J769J246l201J671J833l272
2987a488Q66K203k406Q1K342k486Q3K415k212j020L396j919j419K975r76k178
3003a743K887n73k219K527l10k080K246L61l008K240J198k944J409J686k686O22
3019c87K002k528N15J948k259m06L127k382j214K991j356j491K883j161j675K579
3035A186o96k427K850M3k777K272Q01l000K187R89k884J247J586k769P52K272
3051A632k521N7K744k577o75K967j977q90K577j364j323K842j064k174L107o83
3067F78k384K809k67k720K524P06k830J858J103l049J405J553k634N95K439k738
$$ plain form
3083 -952 -854 1874 -586 -1239 1579 -342 -1397 1673 -55 -1269 1439 407 -1770 936 642 -1770
3099 -1770 938 927 -1673 428 1305 -1772 288 1374 -1817 105 1921 -1599 -530 1900 -1055 -747
3115 -747 1885 -643 -1090 1576 -187 -1261 1736 121 -1786 1535 499 -1808 1007 560 -2064 427
3131 427 839 -1723 450 1195 -1824 283 1364 -1623 5 1841 -1264 -408 1942 -879 -746 2066
3147 2066 -618 -1083 1753 -340 -1705 1713 222 -1731 1139 371 -1963 907 607 -1609 913 1011
3163 1011 -1683 572 1309 -1608 586 1699 -1513 -141 1983 -1152 -475 1651 -1082 -868 1625 -844
3179 -844 -1452 1685 -362 -1597 1328 -76 -1874 1150 760 -1993 1068 782 -1869 721 990 -1615
3195 -1615 799 1143 -1519 335 1694 -1460 -292 1798 -1224 -411 1744 -1231 -1001 1749 -721 -1482
$$ packed form
3083i52R8K728k460o53K818j921j055L070j728j214K708j032k177K706k94k412
3099a770K708j1k600K101Q77l077K060J086l191J922J816l520J069K430k955L08
3115g47K632k528m47K666j763j074K997j615j907L321j036k307K815m47k624K491
3131D27M12k562K173P45l019K107J081k987J628J836l105Q56K350k821J33K812
3147B066k684m65K836k093j365L418j491j953K870p68k334K870l00k216K522R8
3163A011k694K255P37k917K194J113l212J372K124l135O77K126k733K14K493k469
3179h44o08L137k047j235K925j404j798L024l90k753L061k86k651K590K69k605
3195a615K414L44k662J854J359l154J168K090l022Q13K155k975K30K750k470p61
$$ plain form
3211 -1482 1526 -455 -1657 1323 8 -1831 1458 514 -1678 915 753 -1889 1034 1082 -1724 596
3227 596 1217 -1584 243 1601 -1301 -328 1749 -1229 -663 1740 -1047 -1052 1863 -736 -1109 1774 -227
3244 -227 -1584 1669 219 -1481 1496 725 -1598 1281 618 -1819 811 970 -1723 184 1240 -1768
3260 -1768 -57 1574 -1475 -314 1726 -1295 -702 2086 -781 -1128 1746 -363 -1081 1627 -255 -1426
3276 -1426 1966 91 -1603 1370 442 -1853 1170 768 -1934 967 1205 -1895 237 1367 -1590 108
3292 108 1282 -1547 -219 1726 -1038 -631 1729 -919 -1043 1834 -573 -1378 1800 -383 -1604 1590
3308 1590 152 -1696 1399 809 -1860 1083 629 -1856 862 993 -1785 339 1258 -1825 118 1826
3324 1826 -1368 -507 1814 -1088 -627 1583 -830 -753 1900 -764 -1250 1637 74 -1502 1486 417
$$ packed form
3211a482L008j981j202K980j315j839L289r44k192K593j62k642K923M8k806K320
3227E96O21k801J827J358k902R73K077k978N66K403k787nK915k599l73K883k001
3244b27j357L253j450j700K977p71k323K879o63k437K630J59k693J907J056l008
3260a768J711J631l049J161K040l021N93K788k867l47K874k109p18K708j882j171
3276a426L392j875j694K973r28k295L023m02k702K901K38l100K132J130k957J698
3292A08J174k829J328J945k764M07K360k648j24K877k407q05L178k183j221L194
3308A590j438j848L095n90k669K943m54k485K718J31k778K124R19l083J943J708
3324A826l194Q61K321k902M61K210k413P7K653k664m86K887j563j576K988j069
$$ plain form
3340 417 -1822 1423 447 -1884 1193 959 -1784 545 1147 -1744 437 1844 -1738 -267 1504 -1439
3356 -1439 -439 1609 -1180 -506 1924 -927 -1184 1805 -395 -1385 1877 7 -1271 1316 267 -1687
3372 -1687 1352 361 -1783 926 821 -1788 840 1412 -2038 144 1593 -1854 -19 1549 -1221 -323
3388 -323 1919 -1348 -722 1973 -475 -1358 1668 -243 -1300 1493 -36 -1495 1322 203 -1952 1371
3404 1371 383 -1958 1022 1024 -1865 452 1465 -1857 151 1284 -1589 34 1388 -1532 -265 1815
3420 1815 -1223 -783 2075 -762 -1125 1515 -257 -1328 1465 -305 -1744 1596 180 -1759 1496
3435 1496 674 -1821 764 869 -1832 487 1132 -1691 424 1371 -1510 6 1936 -1623 -467 1984
3451 1984 -907 -949 1603 -960 -986 1752 -533 -1263 1552 -368 -1744 1423 305 -1877 1201 768
$$ packed form
3340D17k239L245r76k331L077k34k743K329O02k891K181J407l582J471J771k943
3356a439J000K048k789O74K430k851k57K989k200r90L262j870j278K587j049j954
3372a687L039r91k144K709j05k609K628N72l450K182J449l447J835J568k770Q98
3388c23K242l267O26K695k448q83L026j911j057K793j529j459K817j119k155L323
3404A371r88k341K980Kk889K317J013l322K008J133k873J623J354k920J267K080
3420A815l038M40K858k837l63K640j772j071K793j770j439L340j416j939L255
3435A496q22k495K585J05k701K319O45k823K115R47k881J516J930l559J156K451
3451A984k891m2K552k563k6K738k285p30K815j920j376L167j118k182L078m33
$$ plain form
3467 768 -1764 775 1156 -1953 599 1117 -1692 489 1683 -1514 -141 1771 -1340 -719 1674 -871
3483 -871 -716 1830 -657 -855 1941 -626 -1498 1863 195 -1474 1556 507 -2092 941 674 -1675
3499 -1675 945 936 -1807 693 1193 -2072 274 1756 -1470 7 1671 -1170 -641 1564 -854 -700
3515 -700 1768 -757 -1274 2055 -346 -1476 1602 114 -1740 1476 302 -1561 1013 447 -1829 875
3531 875 1247 -1609 588 1587 -1687 -25 1467 -1410 -389 1555 -1086 -365 1841 -1233 -949 1754
3547 1754 -865 -1334 1650 -53 -1629 1171 -138 -1791 1157 428 -1590 1339 666 -1990 582 1074
3563 1074 -1926 498 1472 -1428 -35 1649 -1424 -100 1572 -1360 -357 2158 -1155 -1183 1531 -601
3579 -601 -1230 1386 -211 -1284 1476 -97 -1685 1415 370 -1678 1100 784 -1716 681 1446 -1500
$$ packed form
3467G68k532K539L81l109K552N18k809K181J194l197J373J912l111O21K393k545
3483h71J55K546k487j98K796k567q72L361j668j669L030j049k599L033k67k349
3499a675K620rk743K500N00l265K346J482l226J477J664k841N29K205k418J54
3515g00K468k525n17L329k401j130L078j488j854L216j174j863K574n66k276K704
3531H75L72k856K197R99l274J662J492k877J021J944k641P21K206l074K84K703
3547A754k619m69K984j703j576K800j309j653K948p29k018K929o73k656K572M92
3563A074l000K424R74k900J393J684l073J324J672k932J003K515l313k8K714k132
3579f01o29K616j597j073K760j573j588L100j045k048K778l16k500K397P65k946
$$ plain form
3595 -1500 302 1149 -1650 107 1419 -1552 -325 1577 -1504 -777 1465 -931 -1070 1756 -600 -1371
3611 -1371 1676 -287 -1229 2155 328 -1153 1506 508 -1367 961 877 -1637 873 1009 -1884 420
3627 420 1032 -1884 120 1393 -1639 -385 1919 -1395 -860 1380 -737 -878 1946 -719 -1154 1710
3643 1710 -220 -1396 1667 340 -1495 1238 450 -1719 974 670 -1723 557 1205 -1677 203 1269
3659 1269 -1751 -108 1567 -1063 -309 1792 -1275 -500 1671 -909 -688 1926 -540 -1145 1447 -48
3675 -48 -1759 1525 -160 -1873 1062 495 -1602 926 816 -1753 286 921 -1654 299 1234 -1536
3691 -1536 -214 1575 -1102 -335 1626 -838 -435 1746 -856 -975 1654 -479 -1297 1312 41 -1497
3707 -1497 1221 106 -1410 1205 738 -1595 823 736 -1627 815 1031 -1558 209 1287 -1426 -153
$$ packed form
3595a500J802Q47k799J757J312k971J227J902l081P27K242k396j39K826k356p71
3611a371L047j963r42L384j827j481K659r98j875K328q4k514K510J36k893K304
3627D20O12k916K004J273l032J254K304l314N35K240k117j41K824k665m35K864
3643A710j930j176L063j327j835K733p88k169K693l04k393K280O48k882J880J066
3659A269l020J643J675k630P54K101l067P75K171k580K21K614k466o05K592j495
3675d8j711L284j685j713K935n67k097K528j10k569K039O35k575J953R35k770
3691a536J322J789k677P67J961k464M03K181k602j19K629k133q18K609j271j538
3707a497K718j115j516K615m67k333K418q7k363K442K16k589J767J078k713J273
$$ plain form
3723 -153 1584 -1264 -328 1396 -1154 -500 1687 -901 -868 1341 -389 -1348 1454 -132 -1471 1195
3739 1195 218 -1422 1146 564 -1625 869 639 -1444 814 1404 -1547 201 1511 -1342 -126 1501
3755 1501 -1237 -389 1546 -877 -600 1632 -587 -924 1367 -627 -1321 1252 -389 -1494 1083 522
3771 522 -1438 952 564 -1503 917 747 -1655 345 1016 -1074 75 1306 -1083 -61 1598 -1189
3787 -1189 -132 1423 -771 -777 1423 -436 -1042 1525 -340 -992 1313 65 -1170 1140 224 -1295
3803 -1295 1171 863 -1589 764 833 -1355 340 942 -1359 342 1259 -1317 -9 1523 -880 -410
3819 -410 1422 -976 -463 1282 -569 -1056 1395 -179 -1119 1284 281 -1062 1101 57 -1313 940
3835 940 796 -1241 636 979 -1344 429 1227 -1368 177 1226 -1336 -195 1156 -1085 -308 1421
$$ packed form
3723a53J737k848R36J724k550O54K187k588L3K209j730r59K802j586j339K666
3739A195r77j640K568n82k189K494k30k083K258N90k951J748J310k853J216J627
3755A501k738Q48J935k423K77K232k219l37K291j994o94K573j641j105K577n61
3771E22j960K390l88k067K420j70k402K000O71k090J149J231k389J022J659k787
3787a189J057J555k194oK200j859o06K567j865o52K305j248j235K310r16j519
3803a295K466l08k452K353O9k188J695O02k301J701R17k576J308J532k403M70
3819d10J832k398N13J745j851m87K451j574r40K403j003j343K163j044j370K253
3835I40j44k037J877L43k323J773P98k595J545J049k562J141J351k241P77J729
$$ plain form
3851 1421 -816 -674 1348 -620 -1179 1360 -204 -1131 1169 -25 -1230 922 51 -1031 981 615
3867 615 -1094 681 969 -1193 141 1150 -1098 54 1345 -1111 -330 1027 -878 -440 1334 -996
3883 -996 -782 1245 -498 -924 942 -66 -884 1233 60 -966 1033 214 -1360 856 682 -1286
3899 -1286 734 921 -1484 67 1175 -1417 40 1180 -938 -231 1307 -1042 -172 1466 -839 -839
3915 -839 1103 -467 -731 1372 -205 -1106 1069 46 -1234 917 166 -1336 718 428 -1067 334
3931 334 738 -1350 247 995 -1260 -77 1075 -985 -110 1362 -857 -488 1332 -676 -637 1380 -322
3948 -322 -997 1246 -293 -1140 1096 -32 -978 999 579 -1005 803 621 -993 320 776 -1124 272
3965 272 1036 -1107 74 965 -1081 -444 1220 -729 -576 1075 -492 -517 1044 -331 -743 841 -108
$$ packed form
3851A421k237J42K022j968n59K539j564r27K300j194j205K152q71j082K012l66
3867F15j709J775K88k162J334J009k248J152J291k456P81J357j905M38J774k330
3883i96K14K027j743m26J866j008q18K117j173j026J999q19j574K216j74j968
3899a286K020J87k405J551J108k592J457J140k118P07J538k349Q70J638k305%
3915h39J942j570k64K103j577r01K175j023j280K151p51j502K054k90j495J401
3931C34M04k088J597P48k255J183J152k060Q75J472k219L69J820k008L9K017j702
3948c22o75K243j539q47K236j128r46J977m20j584J808j82j614J313M56j900J396
3965B72P64k143J181Q91k046O37J664j949J53J651j567k5J561j375m12J584r49
$$ plain form
3982 -108 -801 1014 299 -1215 831 324 -1199 513 882 -1045 264 881 -1276 208 761 -929 -105
3999 -105 1260 -696 -390 1097 -773 -419 1017 -717 -848 1234 -214 -942 1024 -71 -869 963
4015 963 29 -1032 559 484 -1050 499 563 -1107 369 623 -786 336 778 -1145 -372 1102 -885
4032 -885 -311 1254 -527 -299 1113 -444 -686 1213 -243 -610 995 35 -1122 873 224 -1052 632
4049 632 297 -1131 520 534 -1260 180 729 -780 285 1166 -755 -73 801 -654 -74 728 -590
4066 -590 -250 892 -380 -929 839 -25 -706 823 -34 -702 526 67 -1068 567 429 -778 679
4083 679 548 -1171 592 809 -1041 -164 543 -575 124 1002 -658 -315 1098 -627 -492 889 -287
4100 -287 -806 730 -137 -1013 700 -79 -790 704 312 -870 435 578 -859 400 553 -835 493
$$ packed form
3982a08o93J815p15j514K046n07j523J712L69j927J309O17k157J484N53j690Q24
3999a05J365j956L06J487j870L54J436j734j31K082j448p28J966j095p98J832
4015I63r34j061J591p5j534J549O4j670J476K54j409J122M42j923P73J474j987
4032h85N74J565j781K28J412j557k42J899j456l67J605r60j157J995o49j276J684
4049F32l35j428J651J4j794J440N49j509J065Q81j921O82Q74j455N80Q02j318
4066e90L40J142j272n49J768q64o81J529q57o68J228m59j135J635j38j207J457
4083F79j31j719J763K17j850Q77P07j118O99Q78j660L43J413j725J35J381j176
4100b87n19J536q67q76J713p79p11J494l92j182J305J43j437J259J53j388J328
$$ plain form
4117 493 917 -757 -177 824 -604 -186 928 -916 -463 1103 -571 -650 916 -214 -913 712 -37
4134 -37 -750 597 -116 -857 533 64 -978 586 661 -906 351 540 -904 93 590 -958 255 714
4152 714 -846 -265 939 -311 -387 761 -94 -680 893 -332 -522 816 -247 -657 842 372 -1175
4169 -1175 566 190 -838 533 365 -682 501 510 -832 65 710 -708 36 816 -513 -348 773
4186 773 -418 -298 595 -218 -579 944 -420 -768 559 -26 -702 496 214 -780 642 197 -853 407
4204 407 549 -865 380 712 -846 170 806 -728 94 660 -270 -420 815 -396 -312 803 -263
4221 -263 -375 638 -140 -738 559 -64 -827 424 105 -869 490 -15 -773 347 407 -831 353 344 -699
4240 -699 -48 759 -865 -160 670 -470 -337 705 -353 -366 706 -234 -434 789 -102 -765 888 -230
$$ packed form
4117D93M24j674N80J001j428M18J114j844M53J566j674p9J566j130o99J625p49
4134c7p13J347p13p41J390m69j042J564P5j567J257J89j444R97M97j548J213M59
4152G14j560N81J204j250p6J148q55n86J573j225j90J338j063m10J499m70j547
4169a175J741l76j028J371j68j047J183Rj342Q97O45j418P44P80j329J65J121
4186G73j191J20Q93q13l61J523j364l48J327n85o76J198k82r94J422m45j050J260
4204D07J42j414J245L32j558J016O36j534Q22N66r30j50J235j211Q4J115j066
4221b63j12J013p78n98J297o23p63J251l19r74J359n05p58J120O0j238J184rj043
4240f99O51Q07j624P05Q30j140J33J042j058j3J072r40k00J223q91o63J653j118
$$ plain form
4258 -230 -532 684 -46 -800 425 362 -513 140 317 -780 198 546 -706 -114 647 -605 -83 689 -530
4277 -530 -239 739 -559 -411 642 -168 -415 491 -85 -548 746 -119 -584 741 222 -743 445 408 -799
4296 -799 554 434 -536 148 612 -478 -217 510 -801 14 472 -546 -505 691 -332 -269 394 -210 -429
4315 -429 798 -121 -589 667 99 -533 674 360 -753 439 410 -340 336 263 -531 148 535 -453 -182
4334 -182 512 -476 -99 623 -178 -340 534 -31 -217 689 -392 -432 753 56 -665 402 125 -413 634
4353 634 82 -580 383 187 -395 413 499 -711 467 606 -470 -35 697 -603 -253 589 -159 34 553
4372 553 -193 -352 554 -202 -303 466 149 -667 289 207 -663 545 308 -562 299 383 -590 400 714 -488
4392 -488 228 209 -536 -4 376 -497 -89 690 -272 -390 455 -311 -520 448 120 -338 574 157 -429 199
$$ packed form
4258b30l02J216p30p54J225o3q75O53J77j097R78L48j252N92P61j252N22P72j219
4277e30K91R78j298J48J053q10k47R06n76m63J294q65m65J325n19r65J188l7j207
4296g99J353j20r70O84M64j090K61P27j311Q15M58j018M1J196j023O3O63o04k19
4315d29J227r19m68J256n68o32J207l14j113J192k9p50O76p3p94O79L87r88K71
4334a82O94r88L77P22q01j62Q74n65j86R06j081m0J185o97p21J067k77n38J047
4353F34n52o62R63j96n82Q08Q6j210J178J39j076M35P32j300L50Q42p48J93N19
4372E53p46j59R06p56j01P69l17q16R56q2q70J208k37q70Q61Q4r73R90L14j202
4392d88P16j9p45N32L80q73M08P79r62j18Q45p66k09R68l28m58R12m17n86O28
$$ plain form
4412 199 20 -405 509 161 -614 28 353 -544 -46 419 -647 185 266 -233 -131 528 -543 -91 454 -177
4432 -177 -329 470 -18 -361 410 -60 -425 416 137 -607 332 153 -457 278 411 -557 250 397 -426 145
4452 145 542 -324 -246 288 -370 -58 460 -37 -37 585 -279 -400 514 -110 -338 384 -171 -244 385 125 -339
4473 -339 432 140 -621 129 15 -388 294 448 -546 -1 360 -209 -170 401 -298 -95 530 2 40 398 31
4494 31 -476 273 -155 -345 146 -18 -149 382 166 -358 203 422 -582 159 544 -474 41 272 -305 -76
4514 -76 353 -497 -3 401 -272 -76 436 -249 -260 516 -64 -193 466 -196 -282 590 142 -450 511 274 -346
4535 -346 123 153 -590 247 372 -352 35 132 -496 62 540 -266 -144 625 128 -241 320 -97 -225 308 -213
4556 -213 -57 359 -48 -275 387 -27 -284 297 109 -312 353 237 -357 -118 415 -394 214 445 -256 -150
$$ packed form
4412A99j79m25R14l48p75O42L25q97M98M65j066Q32Q1m99J02O59j071M52N45o31
4432a77j52P99m88l43P71m70l65Q41k79p44R39j79o10P35J33r68Q07J47q23N71
4452A45L97q66P8N34o58L12N18m97%O22q64j21R14o24k28P22n55p3O29k60m64
4473c39P71k92p61P50j14m03O82J54r94N45L61n69L9N71o99K03O25n28L8L58l67
4494C1n07P49m28j90M91j64j31N31k16n24N61K19j004P41L85j018N15K31n77K29
4514g6M29q50M94M04o73J96N12o85j1P76n80j29O59o62q6Q72m48n92R61k37o20
4535c46M69L0p43Q37J25p24L87R7o28N58M78q06J22P69m97l69N61m17j28N33n21
4556b13J56M16m07k27O62m14k57N81j88m21O65j16n94K39N33q09O08K31p01J06
$$ plain form
4576 -150 209 -319 14 427 -112 -201 480 80 -249 379 -116 -265 360 272 -586 266 -63 -401 234 64 -41
4597 -41 66 26 -445 65 137 -473 190 379 -107 -99 370 -347 72 241 -321 -251 531 -237 -475 550 158 -367
4619 -367 142 88 -353 194 -51 -274 145 101 -174 -68 194 -199 4 381 -571 69 353 -358 -106 418 -93
4640 -93 -90 245 -363 -95 197 -356 -310 326 -154 -325 321 -43 -99 130 105 -146 157 191 -250 -164 225 -209 218
4663 218 291 -220 -149 355 -24 -363 419 -116 -433 172 -141 -141 442 84 -316 116 172 -213 273 -36 -529 176
4685 176 275 -276 -33 174 -362 209 26 -299 -70 261 -285 -236 305 -174 -259 614 -174 -145 252 -60 -501
4706 -501 538 -38 -275 357 -112 -193 -27 259 -370 239 273 -524 27 142 -374 96 210 -251 -126 189
4726 189 -323 -54 204 -408 -320 337 -83 -313 453 49 -394 452 108 -436 243 98 -242 89 441 -385
$$ packed form
4576a50L59n28L33M13n39q9O81m00l29O28m95j49O25q8q58Q52l29l38O35j70j05
4597d1J07m0m71N10P2o10O63J89m86QM69p17M19J69n62P0P82p68k38J025l92n25
4619c67N09n4m41N47k45k23M19m4k75J06K62l93K03L77r52O40K84p11K52N24n11
4640i3LL35o08K68K92n53M6O36m80j71O46l64n6K29k5k51L03L4m41Q6L89m34M27
4663B18P3n11P1N04l79l39P82n35l17O05l13%N83l58m00M32N6l85M86l09m93P05
4685A76R9n51K43K07n36N71j83l25K29L31n46M9N41m79q5Q73p88K9L97l12m41
4706e01J039n76k37O32m69q1J66K86o29O09L4p97N51J15n16M70J14m61J25L15
4726A89n12K69K58o12Q8O57m20k30P66m04m43Q46l44n44O79j45l40L31L52q26
$$ plain form
4746 -385 21 324 -316 -67 381 -257 -185 394 -392 -202 268 -104 -143 613 -153 -212 429 26 -241 96 -63
4767 -63 -206 258 -113 -235 152 216 -151 207 178 -187 -15 61 -356 -5 405 -191 262 194 -83 -16 306 -88
4789 -88 -247 275 58 -28 75 34 -246 328 32 -360 244 304 -138 107 339 -336 174 260 -449 34 116 -430
4811 -430 -107 321 -50 -196 376 -149 -120 350 -54 -142 578 -87 -369 89 186 -194 92 191 -309 565 320
4832 320 -65 370 -96 -245 83 251 -473 -150 88 -328 -47 404 -544 -293 166 -83 -143 387 -123 -184 454
4853 454 136 -248 190 148 -194 272 378 -268 97 390 -448 -66 384 -429 81 382 -118 162 193 -276 -135
4874 -135 318 7 -387 375 -109 -6 334 -205 -157 314 78 -428 388 143 -260 370 5 -315 95 371
4894 371 -329 378 167 -581 57 305 -253 1 280 -374 -172 525 -154 -271 404 -237 -143 495 -36 -392
$$ packed form
4746c85M06L03o40K49M48o38P2N79p86J90M70l72l9P56p66n9O41m03k67L37j59
4767f3j43M64l71j22L87O4l67L58k9l65J72P6m17L51M10n96M53o8k77O7L22l94
4789h8j59N22k17q6J03m1k80N74k96l92O04O0m42K45K32o75N10Q6p09M83Q2n46
4811d30L23M28l71j46N72n25K9M70m04q8P20o65k82M58R7l80K86R9n00Q74k45
4832C20l85M35m66j49L28J68p24L23K38m16K81M51r48K51M59k49o0N30n10o1O38
4853D54l18l84M38m2l42M66J06o46L65K93q38L82M50q13N10L01n00K80L1m69J41
4874a35M53l11l94P62m84J03L40n39M8M71k36n06Q16k45m03O30l65l20M10K76
4894C71p00P07k11p48O38K48n58K54K79o54K02O97o79j17O75o41R4O38n31l56
$$ plain form
4914 -392 368 -142 -293 288 149 -383 54 403 -224 116 302 -181 63 406 -210 12 278 -162 -186 150
4934 150 46 -240 473 -36 -284 54 -92 -273 109 -20 -363 291 -376 -348 59 167 -323 -177 169 -397
4954 -397 5 290 -386 73 178 -192 -181 317 -249 -378 262 -1 -284 444 -261 -261 219 -136 -400 400 248
4975 248 -370 -102 214 -420 261 139 -265 231 72 -399 -150 44 -391 107 399 -392 -323 198 -34 -55 357
4996 357 -59 -110 596 -143 -402 300 -52 -376 253 8 -454 187 247 -414 -44 54 -442 56 328 -176 -104
5017 -104 312 -389 -113 281 -245 -84 473 -372 -63 174 -77 -310 391 -260 -568 363 32 -293 212 77
5037 77 -374 327 160 -475 303 344 -199 77 287 -82 -44 255 -150 -143 308 16 -139 238 -73 -263 185 83
5059 83 -440 268 -44 -385 187 -208 -349 80 125 -472 332 226 -447 137 339 -282 240 282 -41 -190 401
$$ packed form
4914c92P60n10j51N81j39n32M37L49o27L40J86m83K44L43o16K22K66m40k4L36
4934A50j04k86P13n09k48L38j46j81L82j29l43O54o67K8M07J08m90J46L46n66
4954c97M02K85o76M59J05l70J1M98n66j29O40k63k83P28p05%M80l55k64Q00j52
4975B48o18K68L16o34O81j22m04M96j59m71K49J94m35M98K92p91O9N21k32k1M12
4996C57m16n1P06p39k59P02l52l24O29k45m62O41O0o61L70R8m96M98K72n04P2
5017a04M16p01K76L94n26J61N57q45L09K37k51k33P01o51l08R31l31l25N05j35
5037G7m51P01j67o35P78M1n43K76K10l69L8K99m05PM51k92j55L77l11j90M48j02
5059H3n23P08l12l41N72l95j41M29M5n97Q04j06o73N84K02o21N22M2l23j49N91
$$ plain form
5080 401 -102 -116 545 32 -157 355 64 -133 125 -80 -197 481 -168 -382 14 70 -339 140 94 -560 391
5101 391 407 -368 143 167 -352 -78 188 -476 120 352 -181 -76 447 -8 -413 524 141 -217 528 -26 -207
5122 -207 353 -115 -99 302 241 -561 245 23 -380 119 278 -363 293 411 -218 -10 257 -426 -223 548 -79
5143 -79 -10 151 -171 -240 233 113 -182 289 32 -239 305 101 -330 119 312 -361 82 64 -488 372 310 57
5165 57 -144 452 -69 54 348 -390 -168 510 -117 -234 284 -168 -156 401 -83 -443 382 -146 -81 449 66
5186 66 -416 385 -95 -258 203 136 -385 70 279 -351 52 322 -327 -3 316 -145 -234 337 -206 -323 277
5207 277 -141 -330 597 -115 -124 421 -239 -393 315 -73 -476 287 102 -410 150 477 -435 71 124 -176 -139
5228 -139 436 5 5 269 -386 29 432 -374 -151 421 -194 -253 365 -6 -480 210 -275 -311 119 30 -401 444
$$ packed form
5080D01n03j4O61n13j89N12k91j97K58k05j17O78o49k14L96N6m09M79m6o54R51
5101C91J6p75N11K4n19K74K66o64N96K32n33J05N23m55m05R37l83l58P45n54j81
5122b07N60m68J6M01o1q02Q06k22m03M99J59o41O56J18o29K08K67o83K03P71o27
5143g9O9J61l22o9M73j20k95M71k57k71N44k04m31M49J93o73M43j8n52Q60o2k53
5165E7k01N96n21J23K94p38K22O78o27j17N18m52J2N57m84l60Q25n28O5N30l83
5186F6m82Q01m80j63M61o7n21M55K09o30M03K70o49L24L19m61q9N71n43j17O00
5207B77m18j89R27p12rN45o60j54P08l88m03P63j85n12N60L27r12N06N3l00L7
5228a39N75m31%K64o55M15M03q06K23N72o15n9O18l71m74O90m85l6M30q9m31Q45
$$ plain form
5250 444 149 -240 290 103 -222 206 324 -514 15 364 -122 -48 334 -207 -316 145 -143 -102 520 -162 -217
5271 -217 324 68 -340 473 -3 -372 229 -17 -319 274 186 -408 -106 376 -275 -32 524 -269 -70 184
5291 184 -260 191 460 -226 -257 259 -116 -169 252 159 -336 484 -86 -495 384 181 -449 132 52 -256 -40
5312 -40 216 -361 -27 188 -458 -109 381 -345 106 539 -167 -215 233 -216 -242 287 77 -355 178 -247 -264
5333 -264 431 4 -345 317 230 -381 207 203 -147 240 204 -293 170 321 -295 88 241 -354 -107 234 -249
5354 -249 -231 299 -79 -509 346 -63 -332 400 82 -374 309 270 -452 335 98 -253 168 183 -332 307 137
5375 137 -449 -44 208 -510 -126 411 -351 -19 377 -257 -250 459 -1 -283 473 -344 -311 272 -153 -539 223
5396 223 111 -407 206 175 -498 -32 190 -323 220 193 -305 56 514 -221 -137 525 -488 19 162 -283 -169
$$ packed form
5250D44k95l89N30j87l25M28J18q38N29L49m86P4L82n41j09M61k88M1O22o82n5
5271b17N41k56m08Q13m76l69O01k46l02N93q8n94L02M82o51K43N56p93J99K54
5291A84m44M51K69o86l1N16l75n3M21r3m95Q20n70m09Q79k03o30N81q0l08K16
5312d0K56n77L34K15o46L49M90p26M51M33p06m8M48m49k6N29k10m32N33m25j7
5333b64O95m27l49O62q7o11N88ml50L87l6m97M63J51o16L83J53n95K47L41m83
5354b49J8N30l78m30Q55m09k69P32l18m56O83l9p22P87k37l51M21J5n15O39j70
5375A37n86M05K52p18L84N37p62L32L96o34PP09m60k82P56q17L3N83m25l86P62
5396B23j12n18O13l1o73M66K22n13N43k7m98L61M58p35Q4O62j013N07J43m45J14
$$ plain form
5417 -169 595 -113 -396 286 -128 -218 441 -88 -301 380 -72 -606 313 322 -178 338 193 -359 343 387 -304
5438 -304 -169 303 -257 -131 302 -297 -160 412 -341 -49 258 -377 -100 338 -147 -312 233 139 -520 225
5458 225 343 -412 116 50 -632 45 195 -390 -181 121 -511 -73 372 -361 -99 293 -228 -320 505 -418 -228
5479 -228 415 -76 -256 280 103 -239 472 -53 -339 -79 221 -430 410 242 -544 -48 241 -334 195 440
5499 440 -400 93 362 -359 -39 587 -177 -64 462 -220 -270 480 -174 -486 242 -153 -378 215 93 -534
5519 -534 267 296 -440 147 364 -688 176 304 -315 176 184 -530 -209 366 -393 -5 221 17 -74 459 -375
5540 -375 -246 660 -482 -369 586 -72 -199 205 -1 -464 321 248 -561 50 93 -293 118 258 -456 -143
5560 -143 545 -379 -185 128 -279 -92 435 -209 -139 420 -265 -335 619 -95 -447 544 100 -320 288 228 -467
$$ packed form
5417a69P64p08k83O82m14r0O59n29k13O81m52n34R19Rn00N16j45n52P02M4o91
5438c04J35M72n60J26M33n99J37N72p53K92L07o35K77M38m85j65N45r4o59P45
5458B25J18p55N28o6o82O77J50n85K09L02o32M38M45p33K62L92n21r2Q25r23J90
5479b28O43m91j80N36j77l42P11n25k86K60L00o51Q40j68p86M96K89n75N29K45
5499D40q40M93K69p21L20O26p64J13N26o82n0P50o54l12P28l95k25N93j22o27
5519e34Q01K9p36N87K17j052Q64J28o19M91Qp14L21N75p59L88K26k04r1N33q34
5540c75J29R06j142J13R55o58j27M04k06m63P85p3q09O11M3l86M11J40p14L13
5560a43O88r24J94L13m07J87N27o44P0N59o85p0R54p14l52R91m44m20O08o0o95
$$ plain form
5581 -467 340 -8 -423 171 379 -335 -6 228 -463 225 593 -631 -201 393 -127 -216 437 -110 -177 557
5601 557 -203 -184 434 -46 -564 435 118 -649 236 48 -751 207 311 -622 120 357 -452 119 260 -438
5621 -438 -58 242 -404 63 542 -196 -337 149 -205 -312 458 -283 -392 429 -13 -352 427 -53 -353 450
5641 450 103 -471 215 203 -576 171 142 -263 -9 395 -512 -64 346 -442 -49 450 -512 -466 589 -184 -475
5662 -475 609 -142 -373 534 -65 -440 639 54 -457 304 351 -478 328 700 -429 185 294 -643 57
5681 57 511 -488 24 456 -525 -226 463 -479 -447 518 -183 -279 431 -38 -422 227 -24 -555 319 -49 -389
5702 -389 422 335 -435 369 273 -387 189 324 -447 51 328 -531 -229 289 -289 -182 505 -393 -282 514 -338
5723 -338 -64 526 -160 -365 494 89 -522 534 273 -420 321 202 -425 334 407 -359 102 516 -441 249
$$ packed form
5581d67Q07l48m15N94K08p14L29K34o91O88L68j224M30N94n20q9O53n47o7P34
5601E57p60J9O18m80n18R99l17p67Q85j88p99R58J04r33P42K37q09N71J41o98
5621d38L80L00o46M67M79p38j41M86l54j07P70p41j09Q21m42l39P79m80l00Q03
5641D50l47n74O86j2p79P47k9m05K54M04r07M48M10p88L93M99r62M6J055p73k91
5662d75J084p51k31R07n99l75J079n85n11P61M7q29Q06L72j129O14J09r37P00
5681E7M54r99N12M32r81K99O89r42L2R65p01r6P10m69l84O49k51n31Q74l68l40
5702c89Q11q7p70Q04r6o60N76J35p71M98K77q59L02N18n78J07O87q98J11P96q52
5723c38K74N90o86k05Q59m05o11J056k61o93P41j19o27P59P3p66M61M14r57O90
$$ plain form
5743 249 361 -511 -35 1 -440 -63 582 124 -343 458 -209 -449 294 148 -301 693 64 -453 328 317 -363
5764 -363 29 207 -345 285 341 -303 242 463 -404 -155 424 -494 -105 578 -406 -376 448 -205 -565 617
5784 617 -167 -284 326 -49 -585 350 200 -509 461 42 -453 187 147 -430 -19 314 -511 -10 370 -263
5804 -263 55 629 -293 -5 356 -286 -156 339 -349 -318 549 -109 -477 479 -6 -446 403 -43 -357 321
5824 321 164 -587 439 77 -815 120 313 -480 -45 300 -329 187 325 -330 -213 523 -130 -157 571 -275
5844 -275 -282 294 -224 -330 535 37 -493 569 -137 -538 71 274 -576 309 235 -580 245 82 -615 48 395
5865 395 -432 28 416 -323 -328 512 -168 -193 559 -280 -273 613 -7 -360 414 -269 -376 641 33 -385 159
5886 159 137 -673 217 269 -385 31 401 -401 -140 474 -459 -137 558 -464 -100 436 -493 -420 476 -308 -397
$$ packed form
5743B49J12q72M76L6m41L77O45m58m67Q01o67k40P43j46m49R94o29n17P81j1o80
5764c63L92J78n52O30N6o44N45K21q67K49N79r18L89O83r84L0Q24o53l60J182
5784F17p84j17O10l75n36R35j50p09R70m19m95O40m0n77M11L33q25N01L80o33
5804b63L18N74r22K88L61o42J30M95o88L1Q67o58l68R56m85m40Q49m46l14O78
5824C21j57p51J026l62q92R35J93p93M35L45o29N16J38o55J17P36o53k7P28q46
5844b75pN76n18j06Q65m98n30J062p06m01O09K03q50Q85p4q15Q25j63o97O63L47
5865C95q27M60L88p39nQ40o80k5P52q39PQ86o20l53P74o83j07J017o08m18N44
5886A59k2q10Q90N2o54M16L70q02K61O14r33L22O95j022L64N36r29P3Q96p84q9
$$ plain form
5907 -397 583 -262 -42 407 67 -365 569 -10 -487 700 -40 -432 31 341 -550 42 197 -427 270 90
5927 90 -427 -81 558 -313 -200 386 -280 -318 398 -173 -116 524 -32 -409 426 209 -548 263 219 -639 188
5948 188 256 -408 45 458 -505 82 219 -536 72 109 -344 -354 749 -149 -248 297 51 -182 419 -445 -272
5969 -272 323 -16 -113 267 205 -207 369 179 -264 500 444 -437 84 22 -296 14 132 -380 -31 339 -462
5990 -462 -66 252 -306 -29 506 -250 -212 320 -251 -552 328 -310 -628 381 12 -207 383 160 -429 187
6010 187 214 -723 357 406 -511 303 365 -532 55 420 -217 114 286 -201 -125 478 -256 -217 438 -162 -493
6031 -493 417 94 -446 358 130 -324 535 256 -456 273 384 -478 141 265 -532 270 270 -373 -68 496 -655
6052 -655 58 436 -371 -176 373 -318 -422 280 106 -151 632 -155 -165 386 26 -543 388 46 -406 363
$$ packed form
5907c97R80q45K20M49l40m32R34n79m77J187p40l92M63L10q91N92J55o24O97j80
5927I0n17L46O39q71J13N86o66l8P16n71N7O40n56l77Q35k17p57Q11m4q58Q27
5948A88O8o64M53M13r63N87J37p55O08L7m53j0J103q98r9N45k46k33O01q64J73
5969b72N95l39r7L80o2m12N76j90m43P64n6q81N21o2l18L10J18n12L49L70q01
5990d62L96L18n58K77N35p56L8N32n71l01Q80o38l18J009l69k19N90k23n89O16
6010A87K7r37J080M9r17Q14O2q97N87L65o37L31J72m87P6O03p34L9O55o00l31
6031d93R10l23n40Q04k28m54Q59k79p12P29J11q62O19J24p97Q02%o43L05N64j151
6052f55P13L78q07J95N49o91j04P02j74k57P83p87j0N51l60n69R31l42m52P69
$$ plain form
6072 363 280 -461 212 191 -468 106 268 -312 203 245 -443 -336 413 -290 70 477 -204 -173 525 64 -150
6093 -150 404 -177 -378 345 60 -587 291 410 -562 468 142 -525 72 247 -254 -17 468 -243 65 391
6113 391 -392 -130 258 -314 26 496 -236 -329 440 8 -239 414 -278 -184 477 -164 -454 304 158 -350 156
6134 156 171 -432 198 258 -312 -88 267 -269 -136 216 -287 -143 253 -362 -97 378 -27 -303 328 -116 -338
6155 -338 235 -411 -227 150 300 -473 259 227 -397 346 -55 -269 21 -207 -407 168 375 -473 103 371
6175 371 -446 -232 242 -294 -117 352 -38 -203 365 95 215 353 63 -230 207 10 -288 330 230 -348
6195 -348 246 246 -225 192 172 -409 145 276 -634 -62 304 -44 -157 453 -83 -330 205 116 -328 421 100
6216 100 -132 269 35 -472 321 -81 -143 103 1 -462 123 312 -420 56 458 -466 350 184 17 28 205
$$ packed form
6072C63q3p41O73k1o59N74J62n80N15M2o88J07P49p03L60M07o81L1O98m61k14
6093a50N54n81k01P23k85o47Q78J19r72J030l26o67N97J75n01K37M85p11L08L26
6113C91p83K62L88n72L40M70p32r3P69m32k47O53o92R4O61o41k90P58j46n08N06
6134A56J5o03O30O0n70K24L55n36J33L52n03J44L96o15K65M75m05k76O31m44k22
6155c38N73o46J84L77J50p73P32l2o24P43m01k14K90k28k00N75K07q48N76K68
6175C71q17K14M74n36J77M69l90j65N68k70J20J38k90k93M37j97k98O18j00n78
6195c48N94%m71M17k0n81N54J31r10N72L66l48j13O10n36k47N35q9m44P49l21
6216A00k32M01k34n07P93m02o2K46j02m63N85J89p32M76M02r24Q16j66j67J1J77
$$ plain form
6237 205 -102 -183 222 -263 -142 310 21 -43 306 -373 -228 330 -33 -223 246 130 -463 120 79 -556 158
6258 158 96 -187 342 469 -367 -272 387 -400 33 333 -333 -437 59 -59 8 264 67 -202 308 -89 -398
6279 -398 125 13 -189 282 6 -158 225 29 -525 -19 204 -500 183 264 -422 -336 253 -193 -44 300 -237
6300 -237 25 163 -78 -172 280 -21 -101 414 -275 -228 312 192 -442 208 252 -284 204 32 -403 59 185
6321 185 -487 42 450 -412 -86 540 -214 -141 543 -253 -142 225 -226 130 159 -8 -209 156 31 -449 195
6342 195 91 -354 319 101 -70 239 88 -868 279 -3 -303 -19 131 -200 182 321 -113 -287 206 -309
6362 -309 -215 336 -185 -224 419 81 -366 -70 -136 -66 332 -159 -333 341 111 -74 47 59 -582 -35 184 -13
6384 -13 152 251 0 -53 -137 -217 -11 437 -131 -192 92 102 188 225 -106 -169 139 78 -22 166 94 -355 31 107
$$ packed form
6237B05l07q1M05m85J21M52k89o4L49o79J45N58l63j90M69j16n93N83m1o35P14
6258A58o2k83N29J27q36R5O59p87M33L00o66j04M96j18O7K56j97k69N10l97l09
6279c98N23j12k02M71k76j64L83j96n54N06K23p04O83Q1o86Q6N89m46J49L44n37
6300b37K62J38k41r4M52l01q0N15o89M7N40j20o34O50M4n36M88j72m35M62J26
6321A85o72N29M08q62L26O26p54P3O84p96J11L67m51L56K9j67k01L65j25m80O44
6342A95j04m45O73k18j71L09j51r56J147k82l00K84J50l31L82J39m34j74M93n15
6362c09R4N51n21l9O43l38m47K96o6P0L98m91j74O74k30j85J21J2o41N47K19j97
6384a3J65R9k51n3q4q0K06M48n68o1K84J0Q6L7l31o3L08o1j00J88p2m49L86P6
$$ plain form
6408 107 -150 75 155 -235 87 19 -477 105 100 -227 76 94 -134 -15 106 -283 -144 190 131 -108 100 -216
6430 -216 -193 -22 158 -266 31 -211 -90 225 162 -162 -64 130 -319 -72 277 -84 136 442 -225 63 232
6451 232 -90 -32 170 136 -80 162 -137 -141 400 32 -283 170 -26 -197 60 9 -38 33 137 -374 159 210 -394
6474 -394 -131 183 -155 76 274 -117 -71 158 -37 -71 188 -180 -186 -97 132 -100 63 85 -171 9 118 -310
6496 -310 -14 136 -213 251 376 -182 -118 265 -328 -218 310 -21 30 -30 -111 -199 296 -22 -489 246 -56 -116
6518 -116 455 163 -109 84 -103 -191 -1 373 -316 202 55 -82 20 0 -198 164 113 -341 -16 136 -25
6539 -25 207 -139 -46 -175 334 23 69 137 15 43 148 153 -63 248 -78 -304 93 48 4 -8 258 -146 125
6562 125 346 -110 -63 154 -105 -81 97 -118 -45 159 -44 15 235 -179 -149 74 34 -200 -26 38 -135 233
$$ packed form
6408A07k57K25Q0l90L22o8m96N82nl27L03J8k28J19J21l89J39L34n9k39K08l16
6430b16K3J71J80m24K97k42J21L15o3l24R8J94m49K47L49l61K20L06o67K88J69
6451B32l22N8K02l4k16K42k99mN41l68l15M53j96j71K57n1m7P1J04n11N33N1o04
6474c94K63L14l38K31J98l91M6K29j95l4K59l68oQ9K29k32J63K2k56J80J09m28
6496c10K96J50l49M64J25n58O4L83n93J10N28l31N1o0q1q8M95l18m67P35l02o0
6518a16N71k92k72J93j87q8J90L74o89N18j47j37J02k0j98L62n1m54L25J52j61
6539b5K32l46R3j29N09l11M6O8j22K8J05Nk16L11l26k26L97m5m4j2K66m04K71
6562A25K21m56M7K17k59K4J78k15P3K04k03N9K20m14L0K23m0k34J74O4j73L68
$$ plain form
6584 233 46 -12 -49 -16 17 -129 105 -27 -14 203 -43 140 207 -314 -150 52 -125 -96 124 -26 -110 -83 -66
6607 -66 6 -160 -61 -229 142 141 -293 -39 -8 -389 12 124 -139 356 51 -211 -75 -86 -181 -175 103 165 169 185 -148
6632 -148 -271 228 194 -173 444 -39 -53 -11 102 37 84 -80 -316 72 100 -185 52 100 39 82 110 -94 54
6655 54 37 -328 -218 203 70 -166 144 -138 -97 -57 -158 40 -26 -20 15 -3 127 -55 149 62 158 86 229 -130
6679 -130 -242 350 203 -152 26 -160 141 62 -120 -62 201 -127 -64 417 -16 -147 218 194 -89 72 53 -253
6701 -253 73 -35 -38 -192 272 -22 116 -125 -22 -126 86 -208 -101 31 -50 -239 107 67 27 306 -77 78
6723 78 247 -24 -120 233 -158 60 -1 -60 -61 -45 173 63 -65 180 -139 106 -14 49 -12 263 -214 43 -22
6746 -22 -164 -230 -146 -37 -297 110 -221 -76 82 -13 -94 203 -56 -113 -146 -58 -267 14 -28 -184 82 179 -228
$$ packed form
6584B33j87n8l7L3L3j46K34j32J3K17k46J83O7n21J64K02j77K9K20j50q4K7J7
6607f6P2j66R9j68L71jm34K54L1l81M01J12k63M95l05k62J36j1r5OK78O2MJ6l33
6632a48j23M99l4l67O17m83j4M2J13o5M7j64k36L88K8k85K37M8o1M3K8k04J48
6655E4j7l65J10M21j33k36L10k82M1M0j01J98o6OL5j8J30j82K04q7R6p2J43l59
6679a30j12N92j47l55J78j86L01p9j82N8K63l28O3M81m33j31L65k4k83J61j9l06
6701b53L26j08lj54M64k94J38k41J03j04K12k94J07J32q1j89L46m0m0K79l83J55
6723G8J69k71r6L53l91K18o1n9jJ6K18j10j28K45l19K45j20O3o1K75m77K57o5
6746b2j42o6Q4J09k60M07l31J45J58r5q1K97k59n7l3Q8k09K81m2j56K66R7m07
$$ plain form
6769 -228 -272 -22 -136 -79 -114 211 -249 -254 229 -134 74 5 22 92 -230 -317 -155 54 -78 -57 24 -216 20 46
6793 46 -133 90 40 -55 -65 92 186 -52 259 -84 123 156 -234 22 16 -200 -14 -100 50 -181 13 -34 -55 -57
6817 -57 130 -30 3 86 -251 52 190 -98 138 -75 -90 55 112 171 -111 258 -83 -126 -24 -149 92 1 210
6840 210 -141 145 14 -28 72 133 -351 153 152 -21 -177 62 -96 359 243 26 148 32 -182 -88 149 89
6862 89 64 -6 61 -110 4 18 -132 77 -76 -41 105 -96 54 170 206 -101 36 13 -429 -109 107 -217 30
6885 30 281 -194 -165 132 3 183 104 -77 -103 208 -94 -268 -4 52 -42 334 28 -317 113 165 -191 314
6907 314 -72 -302 115 -170 -143 31 63 -30 49 190 -161 -40 82 -201 -213 248 145 -109 56 -84 -62 65
6929 65 233 -265 41 19 -211 195 -112 -327 100 74 -462 -168 -19 12 -45 34 -33 -188 -60 116 -50 44 -67
$$ packed form
6769b28m4K50j14N7l5L25m60nM83l63K08o9J7P0l22q7J62K09j32K1Q1k40K36K6
6793D6j79K23n0r5j0J57R4k38L11l43K07L3l90K56ok16J86q6J50k31J94m7k1k
6817e7J87j60L3Q3l37L03J38k88K36k13j5J45N7N9k82L69l41m3J02j25K41r1K09
6840B10l51K86j31m2J00O1m84N04jj73j56K39j58M55j16k17J22j16k14R4K37o0
6862H9k5p0O7j71J14J4j50K09j53L5J46k01J50J16L6l07J37k3m42L20K16l24K47
6885C0K51m75K9K97j29J80p9j81k6L11l02j74K64N6r4L76l06l45M30N2l56N05
6907C14l86k30M17k85K7J74L2r3P9J41l51J21J22k83j2M61j03k54J65j40K2J27
6929F5J68m98L06k2k30M06l07k15M27k6n36K94J49L1n7P9o7j55J28J76j66R4j11
$$ plain form
6952 -67 40 206 158 -195 -83 83 -126 -22 199 -71 188 137 -1 103 61 -290 135 -18 -166 190 64
6973 64 -66 143 169 -140 238 121 -148 -102 1 -291 -212 -31 39 -260 200 -82 -160 81 198 -374 151 67
6995 67 -61 -75 111 -221 112 131 -35 -152 141 58 -38 326 -71 44 63 74 -279 20 7 45 114 -123 154
7018 154 -18 -157 -123 122 277 -156 155 136 -275 92 31 -503 197 159 -119 -288 247 128 -438 111 84 32
7040 32 39 14 71 177 -153 -147 235 295 -202 -112 62 -356 98 230 -239 33 376 -45 137 229 -372 -169 216
7063 216 -33 -92 41 -144 80 112 -57 -240 224 63 -256 -34 144 -172 181 -10 -507 -68 137 -116 232
7084 232 275 38 234 -33 -194 -99 -137 -93 -249 260 -35 -45 177 30 58 229 98 20 504 -44 -141 -123 -194
7107 -194 -122 -44 280 -385 98 282 -100 3 130 -68 -97 131 -467 141 -72 -187 -38 330 -250 -92 206
$$ packed form
6952f7J07J66m8l53J12J66k09J04K21k70K59n1j38J04m2l51M25j53j48L56j26
6973F4j30K09K6l09L78j17k69M6J03k92P9J81P0k99M60k82p8K41J17n72N25q4
6995F7j28j4J86l32L33J9j66j17K93q3r6L64l97J15J9J1l53K99j3L8O9k37K77
7018A54j72j39L4K45J55m33L11j9m11L67o1n34P00l8k78j69N35j19n66N49k7n2
7040C2Pk5N7J06l30OL82O0m97R0J74m18M54J32m69K72L43m21J82R2o01K03L85
7063B16k49n9J33j85K24L2j69j83M64j61l19K22J78l16L53j91m97M39K05k53L48
7084B32M3k37J96k67j61R5l8M4j56N09k95j0K22j47K8J71j31p8M84n48r7J8p1
7107a94P2P8L24o65M83J84l82J03J27j98k9K28n98O08k13j15J49L68n80J58K98
$$ plain form
7128 206 -44 -27 142 -38 -56 303 132 -147 203 17 -170 -107 63 85 77 364 91 -152 245 -434 -87 105
7150 105 50 -259 172 -149 -214 276 -90 -42 196 88 -338 174 -8 -314 240 271 -455 298 -117 -62 73 100
7172 100 -118 94 91 -274 -187 140 49 45 205 -239 172 -84 -163 -108 224 -204 -131 -141 -54 -206 81 -15 1 137
7196 137 64 -214 335 30 -273 206 36 -274 110 304 -31 39 385 76 143 -50 -426 -10 227 -389 -84
7217 -84 207 -200 105 210 -218 -23 224 -102 -161 262 -97 -313 208 121 -261 -16 297 -188 229 423 -164
7238 -164 13 82 -50 48 196 -21 -121 89 -13 -380 151 -63 -309 230 73 -243 -86 89 -454 105 220
7259 220 -241 245 308 -175 18 56 -401 124 -6 -295 -147 171 -133 164 224 -150 -418 118 -296 -35 240
7280 240 7 -179 351 -27 -217 198 -18 108 51 84 -113 138 160 -171 -24 178 -208 -121 -74 -144 -220 173
$$ packed form
7128B06k50J7J69j80j8L59j71k79L50j86j87O3J70K2qK87k73k43L97o79L47J92
7150A05n5l09M31l21o5M90l66M8K38j08m26N12j82l06N54L1p26P53m15N5J35K7
7172A00k18K12ll65Q7L27r1mJ60m44M11k56p9N5L32m28P3j0Q7j52K87r6J6J36
7196A37p3k78N49l05l03M79j70l10L84J94l35P0L46l09O7j93l76M16K37o16L05
7217h4K91m07L05J05m28J95K47l26n9M23l59k16N21q7l82K45L13m85M17J94n87
7238a64J77O9j32R8J48k17j00K10j02l67N31k14k46N39j57l16J57J75n43N59J15
7259B20m61M86O3m83J93L8m57N25j30k89J48L18l04K97O0l74k68N36m14K61K75
7280B40k33j86N30l78j90M15k16J26n7L3j97K51K2l31J47K02l86Q7M7p0p6L93
$$ plain form
7302 173 -36 31 299 -215 -163 227 -255 -156 165 -177 -122 103 -105 -315 5 246 -405 280 249 -33 -37 178
7324 178 -190 -78 305 -206 28 54 -123 -171 239 -6 39 291 -191 -194 213 -220 -81 310 25 -428 330 43
7346 43 -371 -114 116 -288 109 -46 -347 -68 245 -26 -80 114 -265 81 1 -252 -101 301 -116 -336 18
7367 18 -121 -350 64 5 -472 252 -13 -305 73 120 -265 232 134 -211 -29 311 -334 -70 166 -474 -37
7388 -37 466 -446 183 283 -182 44 369 -93 -185 303 92 -376 308 -13 -76 35 62 -196 -264 181 -263 159
7410 159 94 -86 -49 71 -6 16 289 -132 44 177 -358 147 244 17 -43 143 18 -46 208 -247 12 470
7432 470 -199 -164 157 -133 -315 356 -108 -220 -19 106 -134 -32 216 -31 14 337 -284 163 274 -251 34
7453 34 251 48 -135 253 -75 182 172 -7 -388 294 41 -85 340 44 -97 204 84 -247 88 46 -250
$$ packed form
7302A73k09O7K68n14N2L90m82R9L21l42N5K25k08k10L20K41o51O85l1k82mK15
7324A78l68J12L83n11K34K6j77m8M10k45M5K52m82lM07m33J39L91k85m53P58k87
7346D3m14K57K30m04L97j55l01K79L13k71n4J94l79L46q0k53J51M02m17k20L54
7367A8j39k29M14n9m77P24k65k92L78M7l85M97r8l45J82L40o45K64K36o40M37
7388c7N03r12O29J00m65K26L25m62r2M88k11m68O84l21o3J11K7k58o8M45m44M22
7410A59o5j80L7J20p7K2K73m21J76J33n35N05R7k27o0J86j25o4K54m55K59M58
7432D70o69L5L21k90j82O71m64j12K01J25k40J02K48k47M5L23o21M47J11n25K85
7453C4K17k03j83L88l28K57j0j79l81O82k53j26M25k96j41L01j20l31L35m2k96
$$ plain form
7474 -250 196 172 -313 -13 350 -296 2 111 -435 45 257 -95 -73 312 -101 -214 134 36 154 308 31
7495 31 -219 74 -17 -324 1 276 -392 157 173 -297 214 63 -334 94 284 -306 -25 313 -44 71 329
7516 329 -312 -64 165 82 -174 -12 -177 -52 11 -80 -406 471 178 -328 353 16 -347 -143 392 -449 118
7537 118 265 -470 -160 181 -71 23 316 -350 -45 389 -48 -47 358 -55 -105 210 -150 -95 241 -49 -506 102
7559 102 59 -447 111 -41 -111 116 296 -421 -114 318 -342 51 246 -133 107 111 -130 -89 321 -88 25 400
7581 400 -270 -100 122 26 -118 191 -29 -339 206 159 -408 -28 -52 -243 133 55 -215 207 65 -18 -87 439
7603 439 -268 -94 426 -136 -167 507 -55 -169 109 -297 -179 409 199 -489 215 43 -309 84 490 -440
7623 -440 110 99 -330 256 11 -15 -53 420 -33 -139 157 -206 177 315 -60 -33 383 -13 -336 259 74
$$ packed form
7474b50M46k4m85L00L63o46K98J09n46M80K12l52K2L85m13j13L48r8J18J54k77
7495C1k50K93r1l07L25K75o68N49J6m70N11j51l97M28J90n90K81L38l57J15K58
7516C29o41K48K29q3k56J62j65J25O3r1l26Q77k93n06O81l37l63K04N35q41N67
7537A18J47p35L10L41k52R4K93o66L05M34m37JM05m13n0L15l60N5L36k90m57O08
7559A02m3n06N58j52p0K27J80p17L07M32o60L93J95l79K40Mk41M1M10m09J13L75
7581D00o70J70K22r6j44L09k20l10N45m7n67L80k4j91L76p8k70M22j42q3o9N26
7603D39p07J74N20n62l1O74n62j14K78m06J18N88k10o88P04j72l52L93M06r30
7623d40N50j1m29N86k45k6l8M73m53j06K96l63L83J38l75K7M16l96l23N95j85
$$ plain form
7644 74 -110 401 -93 -429 188 93 -305 119 184 -244 -57 300 -354 245 78 -105 -13 65 -324 -30 324 -38
7666 -38 -87 325 48 -210 506 -82 -226 153 -277 -225 367 32 -274 248 18 -366 288 -47 -357 270 178
7687 178 -310 152 517 -445 61 343 -140 -170 239 13 -272 138 -1 -194 107 -355 -307 85 64 -355 237
7708 237 -78 -139 384 -18 -383 282 235 -418 112 96 -335 199 406 -168 -68 62 -69 -148 399 -127 -195 142
7730 142 108 -330 207 -183 -199 211 -30 -306 6 -60 -522 293 273 -298 173 192 -439 136 264 -287 -69 279
7752 279 -416 -112 316 -337 -265 95 -297 -217 52 -55 -234 270 267 -280 273 -45 -481 127 168 -403 107 305
7774 305 -224 359 92 -229 17 404 -92 -126 494 -266 -89 71 -303 -202 93 -298 -236 262 -262 -33 369
7795 369 -109 -136 255 132 -341 -17 -98 -316 346 120 -363 -83 235 -403 131 336 -522 -360 160 -223 -201
$$ packed form
7644G4j84N11m94l36O17r5l98M24O5m28J87L57o54N99j67j83R2P8l89K94L54l62
7666c8m9M12k77k58P16n88j44L79m30N2N92l35l06N22k30l84O54l35l10O27r2
7687A78m88M62L65r62N06K82m83l0M09k26k85M10j39j93L01m62M8L92k1m19N92
7708B37l15o1N23m02l65O65m7o53N30j6m31N34K07n74J00J30j31p9N47n26o8L37
7730A42l4m38N37l90j6M10k41k76L12o6m62Q15k0n71M71J9o31N75J28n51K18L48
7752B79o95L04M28o53P2L60l92Q0K69j07j79N04ln47N53l18m36O08M1n71N10J98
7774C05n29N83k67l21K46L87m96l4O20p60J77J60l74J01K95l91O2M98n24K29M02
7795C69m78k7L91j23m73L24q1k18O62k26m83K80L18o38N34K05q58J62N20l83K2
$$ plain form
7816 -201 421 -342 -6 423 -57 -149 240 -97 -393 221 -48 -289 151 190 -329 175 -229 -187 76 98 -295
7837 -295 190 252 -674 79 222 -332 220 227 -397 -42 405 -5 -238 215 -76 -323 514 -130 -231 165 163 -128
7859 -128 241 186 -364 211 136 -649 90 388 -322 195 98 -211 -178 362 -488 78 168 -180 -79 403 -102 -340
7881 -340 348 -108 -295 321 100 -164 324 -11 -238 355 86 -412 377 147 -305 123 367 -367 -135 487
7901 487 -398 73 369 39 44 177 -186 -133 468 -412 -45 638 -113 -175 126 -181 -170 234 -100 -318 293 103
7923 103 -181 216 116 -285 184 423 -265 51 324 -214 -73 415 -370 -235 392 -385 -59 556 -69 -252
7943 -252 59 -282 -125 502 -70 -294 149 124 -583 244 -102 -413 211 230 -617 185 -26 -224 59 193 -267
7964 -267 -138 198 -238 -229 316 -103 -180 457 58 -65 247 8 -398 437 -18 -301 40 -164 -396 172 46
$$ packed form
7816b01O22p63L36M29m80r2L89l37k96O14k69k41M40L9n19N04m04M2K63K2l93
7837b95M85O2r26P53J43n54N52Po24L55M47m10k33M53k91k47Q37o44j01L96kk91
7859a28L69n5n50N75p5p85P39K98p10N17r7l09L3N40q50N66R0l48J01M82n05k38
7881c40O88m56j87O16k21k64M88l35k27N93k69m98P89k30m52M28K44p34K32O22
7901D87q85M71K96l30NJ33l63N3O01q80L67O83p51o2L01l07J1M04l34k18O11j90
7923A03k84L97j00m01M69K39o88L16K73n38J41M88p85J35O27p77L26O15o25j83
7943b52L11l41J57O27n72k24M43k5p07Q27l46l11O24J9q47Q02k11j98K83J34m60
7964b67J29L36m36RN45m19p7O37l99j23L12k39m06Q35m55k83L41k04k32N68j26
$$ plain form
7985 46 -290 203 217 -352 116 234 -340 134 328 -235 194 100 -363 -305 252 -222 -66 499 -320 -244 469 -219
8007 -219 -347 520 -66 -395 235 62 -93 254 53 -87 -18 234 -257 141 439 -363 237 20 -235 -89
8027 -89 187 -316 -299 181 -436 -71 165 -315 -350 270 4 -24 403 -172 -192 363 248 -354 362 -35 -308 140
8049 140 318 -339 30 169 -106 -22 244 -257 -100 258 -121 -188 257 -260 -128 217 -68 -178 298 -96 -190
8070 -190 287 261 -468 312 21 -383 293 125 -495 119 29 -407 55 256 -307 162 222 -305 227 288 -97
8091 -97 -408 266 -152 44 261 128 -227 342 226 -309 291 35 -207 320 99 -327 240 156 -483 55 164
8112 164 -360 -6 387 -274 -172 502 -330 120 371 -216 15 106 -430 -247 230 -279 -331 378 -80 -23 353
8133 353 218 -545 310 104 -381 168 175 -470 262 269 -370 42 488 -421 61 436 -257 50 395 -187 -121 385
$$ packed form
7985D6l36M93J4n69M68J18n74M74J94n63M29r4m63N8N57m74J56N65q19P6P13o88
8007b19j28Q67n86l29O30j73j55L47k01j40O9K52m91L98K98q02O00k17k55J46
8027h9K76n03J7M80o17L65K36m80l5O20k66k8M27n75k0N55j15o02P16l97k73M48
8049A40J78o57L69J39k75Q4K66n01J57L58l79o7M45n17J32L45k85j10M76l94r4
8070a90M77k6p29P80k91m04O76j68o20O14r0m36M62K01n63M69O0n27N32O1l85
8091i7l11O74m18J96K17j33l55N69j16n35O00k56k42N27k21m26N67q4o39N38J09
8112A64n24L54L93o61J02O74q32M50K51n87K31R1n36J83M77n09n2P09m58N7L76
8133C53j35p63Q55k06m85N49Po45P32Po39M12M46r09M82L75o93L07L45n82O6N06
$$ plain form
8155 385 23 -345 426 -64 -61 343 33 -516 426 52 -521 406 -49 -366 291 304 -376 112 228 -214 -192
8176 -192 280 -480 -25 540 -536 158 250 -128 -198 157 -155 -134 249 -178 -199
$$ packed form
8155C85l62l68P71m90LM04l10n49R42l74n73R27m55l17O57J3o80M88J16m42K2
8176a92M72p60M55N65j076O94R2l78p0L55l12K1L83m27k1
8191a99
$$ Imaginary data points
##PAGE= N=2
##DATA TABLE= (X++(I..I)), XYDATA
$$ plain form
0 0 0 0 0 0 0 0 0 0 0 0 0 0 0 -7 8 -8 8 -8 10 -16 16 -18 24 -27 32 -36 42 -50 58 -66 75 -86 94 -108 123 -138
36 -138 153 -171 191 -214 237 -264 291 -322 357 -392 433 -477 526 -578 637 -702 776 -854 946
55 946 -1050 1167 -1305 1466 -1656 1889 -2179 2552 -3049 3746 -4794 6535 -9926 18847 -89550
70 -89550 -171641 124505 29655 -85909 83310 38692 -62316 97266 34452 -86842 82158
81 82158 85083 -59331 65628 68897 -81688 24651 56157 -95505 2261 59598 -74811
92 -74811 21104 76186 -104282 -5327 110704 -116107 -85401 137766 -20755 -103347 76777
103 76777 -529 -69484 83461 -2863 -86165 102019 48847 -114162 17111 23543 -101387
114 -101387 25368 47931 -89005 17814 58677 -84250 -4211 41208 -87345 35785 119983
$$ packed form
0@%%%%%%%%%%%%%pJ5j6J6j6J8k6L2l4M2n1N9o8P8r2J08j24J41j61J80k02K31k61
36a38K91l24L62m05M51n01N55o13O79p49Q25r10J003j104J215j339J478j630J800
55I46j996K217k472K771l122L545m068M731n601O795q540J1329j6461K8773j08397
70h9550q2091K96146r4850j15564J69219m4618j01008J59582o2814j21294J69000
81H2158K925j44414J24959L269j50585J06339L1506j51662R7766N7337j34409
92g4811R5915N5082j80468R8955J16031k26811L0706K23167j58521q2592J80124
103G6777p7306o8955J52945q6324q3302J88184n3172j63009J31273O432j24930
114a01387J26755K2563j36936J06819M0863j42927Q0039M5419j28553J23130Q4198
$$ plain form
125 119983 -78882 -16288 138815 -47654 -74760 101683 3703 -32451 107803 -2273 -53001
136 -53001 109691 103 -111314 76018 49517 -96526 21860 13626 -113324 12154 35185
147 35185 -95253 17441 62377 -76870 7364 47376 -114257 -13716 109730 -61325 -46959
158 -46959 96416 -18522 -36066 70358 -40800 -35950 113158 -14519 -75841 99571 22716
169 22716 -93073 49528 23541 -80796 50348 34965 -85840 43762 60747 -80335 24570
180 24570 72695 -69071 18859 84932 -85886 -38240 85599 -40837 -40232 64071 -31619
191 -31619 -14518 84386 -58155 -73773 87278 -16411 -94425 52929 2151 -73684 58613
202 58613 4595 -95381 54309 41435 -89137 40728 68302 -72247 26845 73882 -80669
$$ packed form
125A19983j98865O2594J55103j86469k7106J76443r7980l6154J40254j10076n0728
136e3001J62692j09588j11417J87332k6501j46043J18386q234j26950J25478K3031
147C5185j30438J12694M4936j39247Q4234M0012j61633J00541J23446j71055J4366
158d6959J43375j14938j7544J06424j11158M850J49108j27677o1322J75412p6855
169B2716j15789J42601k5987j04337J31144j5383j20805J29602J6985j41082J04905
180B4570M8125j41766Q7930O6073j70818M7646J23839j26436O05J04303r5690
191c1619J7101R8904j42541j5618J61051j03689p8014J47354n0778p5835J32297
202E8613n4018r9976J49690j2874j30572J29865K7574j40549R9092M7037j54551
$$ plain form
213 -80669 -2718 94529 -47925 -26726 74345 -29054 -15274 70014 -42860 -23355 102303
224 102303 -22713 -74865 58194 -9805 -66771 47170 -15650 -68150 76213 20307 -93347
235 -93347 42808 42103 -81946 25982 45566 -85472 16654 75085 -74331 -21788 71722
246 71722 -39358 -14097 63332 -44051 -15551 83324 -39673 -52783 75610 -6112 -50186
257 -50186 49639 -21708 -52996 70953 -5183 -75954 71642 39954 -71925 39757 33616
268 33616 -76466 35018 50747 -88379 3617 74569 -53624 -9678 63363 -45012 -6936
279 -6936 69881 -55274 -41421 72855 -24717 -51478 49281 -21397 -40451 62136 -20275
290 -20275 -61990 69576 13505 -69742 47739 27268 -59179 45517 30164 -79522 28686
$$ packed form
213h0669P7951R7247j42454K1199J01071j03399J3780Q5288j12874J9505J25658
224A02303j25016n2152J33059o7999n6966J13941o2820n2500J44363n5906j13654
235i3347J36155p05j24049J07928J9584j31038J02126N8431j49416N2543R3510
246G1722j11080K5261P7429j07383K8500R8875j22997j3110J28393q1722m4074
257e0186R9825p1347l1288J23949p6136p0771J47596l1688j11879J11682o141
268C3616j10082J11484J5729j39126R1996P0952j28193M3946P3041j08375L8076
279f936P6817j25155J3853J14276r7572k6761J00759p0678j9054J02587q2411
290b0275m1715J31566n6071q3247J17481k0471q6447J04696j5353j09686J08208
$$ plain form
301 28686 58293 -69069 1785 62414 -45020 2634 61610 -53049 -15144 73130 -43471
312 -43471 -50379 51204 -24372 -37977 53700 -23578 -42568 70500 -3220 -64596 51833 17406
324 17406 -55269 41622 12555 -66097 45971 40208 -72827 20935 57434 -54233 6750 50669
336 50669 -53643 5890 68147 -54980 -29660 64737 -32347 -38303 48861 -29032 -32941 65469
348 65469 -17963 -52291 62096 8666 -55008 36725 1148 -56380 44662 13430 -71835 35158
360 35158 44651 -57118 16350 43184 -49845 16193 48521 -63688 -7820 66747 -39967 -26574
372 -26574 53592 -27915 -21357 58408 -27759 -36249 68443 -2877 -50762 44009 3917 -42230
384 -42230 43788 -731 -60564 43477 25731 -61882 25343 37985 -46000 22680 33687 -64244
$$ packed form
301B8686K9607j27362P0854O0629j07434M7654N8976j14659L7905Q8274j16601
312d3471o908J01583p5576j3605R1677p7278j8990J13068p3720o1376J16429l4427
324A7406p2675R6891k9067p8652J12068n763j13035R3762L6499j11667O0983M3919
336E0669j04312N9533O2257j23127K5320R4397r7084n956Q7164p7893l909R8410
348F5469q3432l4328J14387n3430o3674R1733l5577n7528J01042l1232q5265J06993
360C5158R493j01769P3468K6834r3029O6038L2328j12209N5868P4567j06714J3393
372b6574Q0166q1507O558P9765q6167q490J04692p1320m7885R4771m0092m6147
384d2230Q6018m4519n9833J04041j7746q7613Q7225J2642q3985O8680J1007r7931
$$ plain form
396 -64244 7752 52774 -59431 -22197 49693 -37166 -17789 50152 -37926 -24772 65550 -22906
408 -22906 -49542 50572 -542 -39837 42360 -4778 -44060 53922 16168 -53902 40570 35397
420 35397 -43351 28725 30017 -49481 27431 45405 -59932 -5917 46680 -43383 -13871 40047
432 40047 -41832 -11423 57901 -37668 -39610 54424 -11963 -43365 34132 -14272 -37460 48500
444 48500 -2218 -49655 46692 22456 -47586 29079 22300 -45418 28872 28545 -59983 8107 41832
457 41832 -45906 -2632 39355 -39263 938 50604 -42545 -17986 64781 -16410 -30616 46729
469 46729 -9305 -24988 47243 -13900 -38393 56419 9912 -47405 39064 18122 -48091 23677
481 23677 11440 -60865 14353 26462 -56421 -1525 27720 -47460 972 37004 -45262 -3530
$$ packed form
396f4244P1996M5022j12205L7234P1890q6859J9377O7941q8078J3154R0322q8456
408b2906k6636J00114n1114l9295Q2197m7138l9282R7982l7754p0070R4472n173
420C5397p8748P2076J292p9498P6912J7974j05337N4015N2597r0063K9512N3918
432D0047q1879L0409O9324r5569j942R4034o6387l1402P7497m8404k3188Q5960
444D8500n0718m7437R6347k4236p0042P6665o779o7718P4290l27q8528O8090L3725
457D1832q7738M3274M1987p8618M0201M9666r3149K4559Q2767q1191j4206P7345
469D6729n6034j5683P2231o1143k4493R4812m6507n7317Q6469k0942o6213P1768
481B3677j2237p2305P5218J2109q2883N4896K9245p5180M8432L6032q2266M1732
$$ plain form
493 -3530 57228 -32020 -27919 45861 -13304 -17392 45061 -14112 -18698 58813 -7028 -44153 48793
506 48793 16302 -41189 32268 14628 -44410 24958 15705 -55692 10919 28780 -41604 11235
518 11235 34760 -41385 6347 46327 -41447 -16848 49187 -17198 -17892 32782 -27049 -17832 46310
531 46310 -26001 -36891 55269 1494 -50529 26080 1320 -46116 25006 6613 -47894 26307
543 26307 24214 -46128 14881 30183 -37855 19228 46437 -34378 4205 53219 -23442 -14320
555 -14320 33428 -21561 -2480 45881 -29098 -22133 55458 -15313 -49261 33372 3921 -35965
567 -35965 25730 -4561 -46559 23410 4534 -50158 22725 27764 -36530 18347 28680 -44880
579 -44880 3202 38381 -32215 -5936 36242 -21854 -2342 30281 -39358 -13236 54020 -20421
$$ packed form
493c530O0758q9248M101P3780n9165m088O2453n9173m586P7511o5841l7125R2946
506D8793l2491n7491P3457j7640n9038O9368r253p1397O6611J7861p0384N2839
518A1235K3525p6145M7732L9980q7774K4599O6035o6385o94N0674n9831R217O4142
531D6310p2311j0890R2160n3775n2023P6609k4760m7436P1122j8393n4507P4201
543B6307k093p0342O1009J5302o8038N7083K7209q0815L8583M9014p6661R122
555a4320M7748n4989J9081M8361p4979O965P7591p0771l3948Q2633k9451l9886
567c5965O1695l0291m1998O9969j8876n4692P2883N039o4294N4877J0333p3560
579d4880M8082L5179p0596K6279M2178n8096J9512L2623o9639K6122O7256p4441
$$ plain form
591 -20421 -32458 49595 3652 -34883 23636 -6971 -30499 38090 6117 -37178 35528 19650
603 19650 -42787 20053 25963 -35100 20679 36719 -37180 -3561 25027 -35114 -4605 26641
615 26641 -35386 -70 46794 -36601 -32839 42592 -12911 -36154 27915 -3998 -21929 32326
627 32326 -11807 -39916 34925 9549 -38219 31485 27166 -31067 19996 22493 -38399 9272
639 9272 30206 -26149 8967 27505 -34198 2605 35669 -38081 -12794 52676 -12186 -27183
651 -27183 29858 -11283 -25547 23843 -17264 -26393 42092 73 -39776 29235 11172 -39540
663 -39540 18130 16283 -32125 19027 21408 -37335 5599 18597 -37312 8545 34338 -33376
675 -33376 299 45261 -28958 -25579 34070 -9231 -13813 30469 -14759 -17079 37248 -15084 -35467
$$ packed form
591b0421j2037Q2053m5943l8535N8519l0607k3528O8589l1973m3295P2706j5878
603A9650o2437O2840N910o1063N5779J6040p3899L3619K8588o0141L0509L1246
615B6641o2027L5316M6864q3395L762P5431n5503k3243O4069l1913j7931N4255
627C2326m4133k8109P4841k5376m7768O9704m319n8233N1063K497o0892M7671
639I272K0934n6355L5116J8538o1703L6803L3064p3750K5287O5470o4862j4997
651b7183N7041m1141j4264M9390m1107r129O8485m2019l9849O9011j8063n0712
663c9540N7670j847m8408N1152K381n8743M2934J2998n5909M5857K5793o7714
675c3376L3675M4962p4219L379N9649m3301m582M4282m5228k320N4327n2332k0383
$$ plain form
688 -35467 39953 13380 -29150 27708 13246 -30794 19029 9393 -37762 17260 22350 -33670
700 -33670 10987 23366 -39872 686 33921 -33283 -12600 38603 -15064 -19291 18933 -21840
712 -21840 -13389 32947 -17784 -22018 43415 1306 -33048 24769 7025 -23118 28215 8051
724 8051 -31095 24401 14005 -38930 12621 21488 -33417 12301 31872 -33903 -3816 34396
736 34396 -24713 -16453 24452 -16601 -6151 29484 -23218 -17545 38640 -10311 -28597 32094
748 32094 5673 -20181 24901 -4096 -30658 26787 5625 -37200 21212 18670 -34416 11947
760 11947 20701 -36399 5616 33149 -27110 -6811 28246 -18835 -7336 23619 -23378 -8334
772 -8334 37631 -13708 -20187 33851 -1066 -21583 21762 -6076 -21407 29652 -1654 -34442
$$ packed form
688c5467P5420k6573m2530N6858j4462m4040M9823r636m7155N5022N090n6020
700c3670M4657J2379o3238M0558L3235o7204K0683N1203n3667m227L8224m0773
712b1840Q451M6336n0731m234O5433m2109l4354N7817j7744l0143N1333k0164
724H051l9146N5496j0396n2935N1551Q867n4905M5718J9571o5775L0087L8212
736C4396n9109Q260M0905m1053J0450L5635n2702N673N6185m8951j8286O0691
748C2094k6421k5854M5082k8997k6562N7445k1162m2825N8412k542n3086M6363
760A1947Q754n7100M2015K7533o0259K0299L5057m7081J1499L0955m6997J5044
772h334M5965n1339o479N4038l4917k0517M3345k7838j5331N1059l1306l2788
$$ plain form
784 -34442 23199 9523 -35819 15412 17440 -30108 14663 24528 -33708 -263 27439 -23352
796 -23352 -3388 25424 -21446 -3410 31581 -21444 -15528 35036 -6731 -18592 25572 -6486
808 -6486 -17432 26857 -9348 -29224 28266 4284 -32175 20828 12125 -29443 17080 15445 -33336
821 -33336 10368 24358 -29238 -852 22286 -25407 -2031 26006 -24350 -7173 33932 -14934
833 -14934 -17068 27142 -7535 -14468 25824 -10190 -20677 30110 -594 -27649 24702 9417
845 9417 -24933 19676 10327 -27599 17847 17585 -31903 4935 20076 -27420 722 21055 -25674
858 -25674 -1638 28269 -22688 -12254 29644 -11645 -13828 24128 -12802 -16597 28120 -8282
870 -8282 -25058 26976 3840 -24783 19459 4988 -24210 20882 9229 -32195 12974 18395
$$ packed form
784c4442N7641j3676m5342N1231K028m7548M4771R865n8236L3445K7702n0791
796b3352J9964K8812m6870J8036L4991n3025N916N0564m1767j1861M4164l2058
808f486j0946M4289l6205j9876N7490k3982l6459N3003q703m1568M6523j635m8781
821c3336M3704J3990n3596K8386K3138m7693K3376K8037n0356J7177M1105m8866
833a4934k134M4210l4677o933M0292l6014j0487N0787l0704k7055N2351j5285
845I417l4350M4609r349l7926M5446k62m9488L6838J5141m7496K8142K0333m6729
858b5674K4036K9907n0957J0434M1898m1289k183L7956l6930l795M4717l6402
870h282j6776N2034k3136k8623M4242j4471k9198M5092j1653m1424M5169N421
$$ plain form
882 18395 -28020 4921 19029 -24277 5812 25470 -24360 -1480 33060 -14641 -9582 25990
894 25990 -12547 -10242 27730 -12702 -20236 27686 -3138 -25483 19250 1042 -22756 18647
906 18647 306 -31873 14640 10422 -30634 6654 14105 -24645 7735 18509 -25070 5649
918 5649 29365 -18819 -4771 26869 -13252 -5867 26161 -14512 -12737 29762 -7802 -21292 23853
931 23853 -462 -19159 20598 -1382 -24656 21108 6549 -29014 12650 12733 -23506 11001 14591
944 14591 -23760 10522 22714 -24614 -620 24773 -18494 -5925 20555 -20666 -10631 24925
956 24925 -17036 -19485 24625 -6181 -20447 19167 -4506 -19871 22717 1968 -25343 18680
968 18680 11189 -21625 14986 14407 -18533 16167 18988 -22689 7959 24425 -18676 -990 19586
$$ packed form
882A8395m6415L2941J4108m3306L0089J9658m9830K2880L4540m7701N059L5572
894B5990l8537K305L7972m0432p534M7922l0824k2345M4733j8208k3798M1403
906A8647j8341l2179M6513m218m1056L7288P451l8750L2380J0774m3579L0719
918E649K3716m8184J4048L1640m0121P385L2028m0673J775M2499l7564j3490M5145
931B3853k4315j8697L9757k1980k3274M5764j4559l5563M1664Q3l6239L4507L590
944A4591l8351L4282J2192m7328K3994K5393m3267J2569K6480m1221J0035L5556
956B4925m1961k449M4110l0806j4266L9614k3673j5365M2588k0749k7311M4023
968A8680p491l2814L6611n79l2940L4700K821m1677L0648J6466m3101J7686K0576
$$ plain form
981 19586 -20023 -4959 21937 -20520 -13402 25000 -11552 -19389 19373 -6838 -17383 20809
993 20809 -4832 -23142 20223 4113 -24183 15106 9623 -20075 14168 11384 -23094 11127
1005 11127 18019 -23077 2186 17778 -20714 -187 19415 -21690 -5628 26132 -15261 -12659
1017 -12659 25340 -5697 -11897 22452 -6729 -15966 25046 396 -21231 20428 7405 -20869
1029 -20869 13758 7635 -21151 13675 12074 -24706 4750 13530 -23437 305 14011 -22930
1041 -22930 -1320 20991 -20102 -9494 23492 -10440 -10936 20143 -8930 -10531 24329 -6664
1053 -6664 -19410 23197 3181 -20283 17026 7880 -17007 15680 8244 -22652 11058 13515 -21176
1066 -21176 5778 14209 -20454 3190 17452 -21734 -3296 23432 -13264 -7944 18722 -11914
$$ packed form
981A9586l9609J5064K6896m2457P118L8402l6552p837L8762k6211j0545L8192
993B0809k5641j8310M3365j6110k8296L9289n483k9698L4243k784l4478L4221
1005A1127O892m1096K5263J5592l8492K0527J9602m1105J6062L1760m1393K602
1017a2659L7999l1037o200L4349k9181r237M1012k4650k1627M1659j3023k8274
1029b0869L4627o123k8786L4826j601l6780K9456Q780l6967K3742J3706l6941
1041b2930K1610K2311m1093J0608L2986l3932m96L1079k9073j601L4860l0993
1053f664j2746M2607k0016k3464L7309r146k4887L2687p436l0896L3710K457l4691
1066b1176K6954Q431l4663K3644J4262l9186J8438K6728l6696N320K6666l0636
$$ plain form
1078 -11914 -8130 20666 -13791 -15742 24646 -3234 -21442 17760 2732 -18896 14836 3169
1090 3169 -20341 15544 10321 -22125 7683 11306 -21336 5720 15875 -19217 2730 21290
1102 21290 -15425 -5453 17224 -12088 -2526 19874 -14029 -8735 24449 -9373 -18581 20427 1022
1115 1022 -15358 17036 1506 -17270 15729 3335 -22892 11674 10165 -20713 7663 12320
1127 12320 -21605 2169 15488 -18179 -1136 17699 -11792 -1351 14885 -17416 -5260 22065
1139 22065 -12364 -11842 24263 -2030 -14794 16324 -2180 -13390 18951 899 -17965 17243
1151 17243 5522 -23021 9625 9367 -20816 6817 14626 -17972 2062 14558 -16318 -1341
1163 -1341 13464 -15050 501 20093 -15353 -8621 21322 -8224 -13526 17697 -1203 -8676 17603
$$ packed form
1078a1914L784K8796l4457j951M0388k7880j8208L9202j5028k1628L3732j1667
1090C169k3510L5885n223l2446K9808L623l2642K7056J0155l5092K1947J8560
1102B1290l6715R972K2677k9312R562K2400l3903N294L3184l3822r208L9008j9405
1115A022j6380L2394j5530j8776L2999j2394k6227L4566j509l0878K8376M657
1127A2320l3925K3774J3319l3667J7043J8835k9491J0441J6236l2301J2156K7325
1139B2065l4429N22L6105k6293j2764L1118j8504j1210L2341j8052j8864L5208
1151A7243j1721k8543L2646k58l0183K7633P809l2598K0034J2496l0876J4977
1163a341J4805k8514J5551J9592l5446O732K9943k9546n302L1223j8900p473K6279
$$ plain form
1176 17603 -4794 -16475 17111 361 -20873 14340 8666 -19014 8158 9233 -19365 4367
1188 4367 12629 -15099 3406 14025 -14905 600 14724 -17464 -4802 21135 -9673 -9171 18358
1201 18358 -4921 -10102 13115 -8066 -10677 20304 -2881 -18184 16187 2875 -21340 9115
1213 9115 7636 -15453 10886 10980 -16579 5055 10776 -16376 4325 15062 -15084 1239 18888
1226 18888 -14220 -7897 16959 -6992 -6581 15223 -6808 -6747 16875 -9719 -16693 16972 -31
1239 -31 -18038 12647 5186 -15950 8446 3690 -17609 8833 10355 -15112 5618 11438 -17092
1252 -17092 1056 13751 -15018 -1842 19166 -7490 -5282 13216 -8293 -4125 16232 -9272
1264 -9272 -9108 20419 -2527 -16106 13316 1569 -14736 11125 3567 -13847 11670 5991 -17678
$$ packed form
1176A7603k2397j1681L3586j6750k1234L5213n674k7680K7172J075k8598K3732
1188D367Q262k7728J8505J0619k8930J5505J4124l2188J2662K5937l0808N02K7529
1201A8358k3279n181K3217k1181k611L0981k3185j5303L4371j3312k4215L0455
1213I115j479k3089K6339R4k7559K1634N721k7152K0701J0737l0146J6323J7649
1226A8888l3108O323K4856k3951M11K1804k2031O1K3622k6594o974L3665j7003
1239c1j8007L0685p461k1136K4396m756k1299K6442J522k5467K0730N820k8530
1252a7092J8148J2695k8769J3176K1008k6656K208J8498k1509M168K0357k5504
1264i272J64K9527k2946j3579K9422j1747j6305K5861p558j7414K5517n679k3669
$$ plain form
1277 -17678 6111 8054 -16922 4819 12569 -15099 730 13948 -13254 -4941 13185 -8257
1289 -8257 -1725 14407 -11203 -6998 16709 -8284 -14194 15508 372 -11945 12007 71 -13117
1302 -13117 11982 2741 -14917 11251 8569 -14232 7447 10197 -14894 3585 13544 -11137 1524
1315 1524 14641 -9322 -1493 11619 -11699 -4014 15137 -9813 -10027 14353 -5461 -13984 9558
1328 9558 -2606 -11118 11720 -1065 -14256 11183 3414 -15696 8105 7869 -13253 6687 10544
1341 10544 -12832 3519 12181 -10567 1336 12522 -9918 -281 14028 -11121 -6188 14572
1353 14572 -7021 -9284 13011 -2587 -8475 11970 -3081 -11203 13015 1772 -13291 10568
1365 10568 5513 -13116 6898 5926 -13256 5777 9315 -12957 1386 9457 -12107 -859 9623
$$ packed form
1277a7678K3789J943k4976K1741P750k7668J5829J3218k7202Q313J8126k1442
1289h257O532J6132k5610M205K3707k4993n910K9702j5136j2317K3952j1936j3188
1302a3117K5099r241j7658K6168k682k2801K1679K750k5091J8479R959k4681J2661
1315A524J3117k3963P829J3112k3318P685J9151k4950k14K4380j9814q523K3542
1328I558j2164q512K2838j2785j3191K5439p769j9110K3801k36k1122J9940L857
1341A0544k3376J6351Q662k2748J1903J1186k2440R637J4309k5149M933K0760
1353A4572k1593k263K2295j5598n888K0445j5051q122K4218j1243j5063K3859
1365A0568n055j8629K0014r72j9182J9033L538k2272J4343Q071k1564J1248J0482
$$ plain form
1378 9623 -13228 -4156 12489 -9888 -8160 12061 -4839 -7856 11432 -3241 -6977 14521 393
1391 393 -10598 12198 4699 -10590 9438 5906 -9713 8488 6906 -12421 4685 8756 -11805
1404 -11805 1508 8685 -12563 -1263 10502 -11995 -5188 12182 -7253 -6926 10769 -5293 -6503
1417 -6503 12407 -3826 -9787 12282 869 -10933 8593 2297 -10556 7768 2918 -12049 6703
1430 6703 6886 -11911 2685 7171 -11373 2367 9337 -11364 -482 12570 -7871 -3440 11998
1443 11998 -4968 -3446 12470 -4486 -7040 12863 -921 -9630 9276 783 -9550 7397 755
1456 755 -11062 7134 3723 -12559 3372 4967 -11259 2393 5982 -11207 1397 9395 -10240
1469 -10240 -1557 11183 -6373 -2608 11055 -5707 -4487 12597 -3484 -7501 10688 -290 -8069
$$ packed form
1378I623k2851R072J6645k2377J728K0221j6900l017J9288j4673l736K1498j4128
1391C93j0991K2796p499j5289K0028l532j5619J8201j582j9327J7106M071k0561
1404a1805J3313P177k1248J1300J1765k2497O807J7370j9435L27J7695j6062j210
1417f503J8910j6233n961K2069j1413j1802J9526o296j2853J8324m850j4967J8752
1430F703J83j8797J4596M486j8544J3740O970k0701J0882J3052k0441M431J5438
1443A1998j6966J522J5916j6956k554J9903j3784q709J8906q493j0333J6947o642
1456G55j1817J8196l411j6282J5931J595j6226J3652L589j7189J2604P998j9635
1469a0240Q683J2740j7556L765J3663j6762J220J7084j6081m017J8189j0978p779
$$ plain form
1482 -8069 8836 355 -8764 8738 2503 -10377 6283 5109 -9786 4256 5363 -10227 3107
1495 3107 7204 -10131 706 9377 -8371 -1843 9058 -7087 -2864 10318 -6004 -6077 9944
1508 9944 -3787 -8058 8433 -1132 -7693 8307 173 -9527 7379 3144 -9467 5383 4506 -8699
1522 -8699 4198 5688 -9020 3200 8287 -8009 402 8648 -6641 -627 9333 -6644 -3131
1535 -3131 10041 -5002 -6202 9005 -2555 -6585 8115 -1655 -7613 8323 787 -9629 5763
1548 5763 2674 -9046 4310 3461 -8981 3749 5579 -9117 1605 7342 -7198 568 7237
1561 7237 -7258 -929 9047 -5869 -3542 9172 -3164 -4871 7921 -2811 -5517 8713 -1004
1574 -1004 -7782 7136 1309 -8324 4919 2326 -8032 4449 3925 -8725 2989 5929 -7312
$$ packed form
1482h069J6905q481r119J7502o235j2880J6660j174j4895J4042J107j5590J3334
1495C107M097j7335J0837Q671j7748O528J0901j6145M223J3182j6322p3J6021
1508I944j3731m271J6491r565o561J6000q134r700J6906m235j2611J4850q77j3205
1522h699J2897J490j4708J2220N087j6296Q411Q246j5289O014R960j5977L513
1535c131J3172j5043j200J5207j1560m030J4700r770n958J5936p536j0416J5392
1548E763l089j1720J3356q49j2442J2730J830j4696J0722N737j4540P766O669
1561G237j4495O329R976j4916K327J2714j2336j707J2792j0732k706J4230r717
1574a004o778J4918n827r633J3243k593j0358J2481n24j2650J1714K940j3241
$$ plain form
1587 -7312 1233 6156 -7022 351 7707 -6640 -2174 8346 -4574 -4154 7186 -3348 -3788 8102
1601 8102 -2650 -6551 7585 -67 -7634 5561 1681 -6957 4986 2470 -7701 4202 4468 -7232
1615 -7232 2751 5541 -6844 1699 6463 -6832 -830 7624 -5442 -2676 6931 -4002 -2913 6819
1629 6819 -4423 -4614 8138 -1604 -6762 6523 180 -6686 5118 1215 -6268 5681 3267 -7139
1643 -7139 3815 3883 -6689 2705 5425 -6623 1177 6497 -6012 -1210 5879 -4588 -1886 6329
1657 6329 -4789 -2788 7506 -3580 -5782 6470 -1047 -5741 5256 241 -5304 4765 360
1670 360 -6721 4736 2970 -6462 3683 4264 -6655 1467 4940 -5842 440 5978 -4411 -615
1684 -615 5535 -4609 -1460 6421 -4016 -3577 7200 -1696 -5169 5410 -930 -4843 4999 -400
$$ packed form
1587g312Q545M923j3178P373P356j4347M466J0520j2920M20J1340j0534m40J1890
1601H102j0752l901J4136p652p567J3195l880q638J1943k516j0171J1903K66j1700
1615g232R983K790j2385Q543M764j3295O002Q454j3066K766R607j0933J089R732
1629F819j1242j91J2752r742n158J3285o343o866J1804l903p483J1949k414j0406
1643g139J0954O8j0572R394K720j2048P800N320j2509M802P089j0467K702Q215
1657F329j1118K001J0294j1086k202J2252p517m694J0997n015n545J0069m405
1670C60p081J1457j766r432J0145N81j0919Q122L473j0782O282N538j0389L796
1684f15O150j0144L149P881j0437M39J0777q896l473J0579o340l913R842n399
$$ plain form
1698 -400 -4984 5697 1391 -6644 3742 2702 -6738 2046 4097 -5456 1244 4404 -6002 -263
1712 -263 4425 -4801 -33 6236 -4626 -2663 6559 -3198 -4552 5318 -469 -3228 4831 -1067 -3944
1727 -3944 5602 96 -5539 5259 2972 -5012 3718 3173 -5399 1962 3203 -4913 1934 4656 -4490
1742 -4490 276 4170 -6182 -1841 5601 -4078 -3121 5267 -2066 -3904 3508 -2398 -2930 5542 -941
1757 -941 -4363 5520 950 -5278 3456 2135 -4386 3402 3461 -4371 2391 3053 -5213 1086 3970 -4994
1773 -4994 451 5511 -4654 -2303 4935 -2879 -2511 4308 -1565 -1489 5026 -2260 -3726 5249 -52
1788 -52 -4283 4535 1791 -4529 2309 820 -4884 1996 1856 -5073 2083 2696 -5765 189 3636 -5128
1804 -5128 -998 4837 -2452 -1448 4335 -2066 -1415 4578 -1787 -1684 6554 -47 -3510 4447 699
$$ packed form
1698d00m584J0681m306q035J0386j040r440Q784K051r553O700L160j0406N739
1712b63M688r226M768O269j0862J963R222r757j354R870n787k759Q059n898k877
1727c944R546n506n635J0798k287p984Q730n45q572P361J241q116O847K722r146
1742d490M766L894j0352M341P442r679R57Q388p333j838P412n906n32Q472o483
1757i41l422R883m570o228Q734j321o521P788N9p832O762O62q266O299K884q964
1773d994N445N060j0165K351P238p814L68O819n873P6O515p286j466Q975n301
1788e2m231Q818k744o320O838j489n704O880j40o929P156O13q461N954L447q764
1804e128M130N835p289J004N783o401O51N993o365J03Q238o601l463P957l748
$$ plain form
1819 699 -4244 3290 838 -3321 3353 962 -4903 1879 1551 -5341 1154 3368 -4469 -129 3790
1834 3790 -3944 -1292 3635 -2671 -806 4276 -2550 -1485 4662 -2333 -3347 4496 -97 -3405 3082
1849 3082 359 -3431 2309 -66 -4365 2986 1669 -4358 2307 2518 -4493 773 3257 -2999 773
1864 773 3984 -2357 -125 3499 -2666 -802 4495 -1874 -2214 4378 -1363 -3601 2772 -630 -3389
1879 -3389 2369 -771 -3478 2654 260 -4726 1819 1695 -3766 1506 2924 -3221 680 3050 -3048
1894 -3048 182 3447 -2391 140 4187 -2554 -1207 4213 -1560 -2460 3184 -533 -2105 2785 -671
1909 -671 -2936 3030 43 -3622 2961 1713 -3380 1632 2054 -3114 1249 2279 -3198 646 2869
1924 2869 -3030 -325 2450 -3229 -772 3534 -2369 -2033 3185 -1431 -2423 2173 -1194 -2151 3532 -254
$$ packed form
1819F99m943P534k452m159O674k391n865O782l28o892O495K214p837M340L919
1834C790p734K652M927o306J865N082o826J065O147o995j014P843m593l308O487
1849C082k723l790N740k375m299P351j317o027O665K11p011N266K484o256L772
1864G73L211o341K232L624o165J864N297o369l40O592n741k238O373l402k759
1879c389N758l140k707O132k394m986O545j24n461N272J418o145L901K370o098
1894c048L230L265n838K531M047o741J347N420n773r00N644l717j572M890l456
1909f71k265N966k987l665O583j248n093N012M22n168M363J030n477L844K223
1924B869n899K705K775n679K457M306n903L36N218m616r92M596l367r57N683l786
$$ plain form
1940 -254 -2922 3006 890 -2725 2359 1550 -2543 1904 1993 -2863 1502 2339 -2607 597 2762 -2668
1956 -2668 -216 2894 -2402 -1192 2983 -1830 -1750 2483 -1541 -1961 2685 -1183 -2501 2889 78 -3056
1972 -3056 2199 807 -2777 1582 1053 -2752 1534 1901 -2824 1080 2142 -2574 359 2622 -2536
1987 -2536 -411 2834 -1749 -973 2887 -1576 -1207 2705 -909 -1871 2987 -143 -2397 2352 344 -2595
2003 -2595 1993 739 -2522 1869 1417 -2859 850 1663 -2666 653 2094 -2616 29 2088 -2300
2018 -2300 -707 2339 -1733 -1024 2656 -1195 -1380 2693 -468 -1868 2489 -30 -2086 2268 209
2033 209 -2167 2069 665 -2477 1630 1610 -2519 946 1837 -2243 262 1798 -2336 -360 2255 -1831
2049 -1831 -857 2376 -1486 -912 2207 -1210 -1569 2209 -636 -1696 2213 71 -2144 1960 303 -2266
$$ packed form
1940b54k668N928k116l615N084q09m093M447Q9m856M365Q37m946L204K165n430
1956b668K452L110n296J210M175m813Q0M233m024m20M646l868j318N390k811l134
1972c056N255j392l584M359n29l805M286L67m725L904J062m716K933K263n158
1987b536K125L245m583P76L860m463L69L912l614r62M858l130k254M749k008k939
2003b595M588j254l261M391m52m276L709Q13m329L319J441m710K645K059m388
2018b300J593L046m072P09L680l851j85M073l161j400M357k519k056M354k059
2033B09k376M236j404l142M107k0m129L465Q91m080K505J536m134J976K615m086
2049a831R74L233l862N74L119l417l59L778k845j060L909k142k215M104j657k569
$$ plain form
2065 -2266 1750 992 -2825 933 1225 -2452 471 1800 -2229 74 1973 -1996 -598 2200 -1443
2080 -1443 -709 2231 -1248 -954 2250 -688 -1274 2166 -29 -1789 2050 128 -2076 1508 665 -2382
2096 -2382 1117 1055 -2093 752 1391 -2043 380 1966 -2148 -288 2135 -1578 -613 2187 -1209 -676
2112 -676 2326 -787 -1423 2119 -272 -1503 1772 -363 -1738 1596 285 -2086 1277 825 -2039 1036
2128 1036 1193 -1932 705 1315 -2069 450 1651 -1659 -346 1683 -1306 -441 2157 -1005 -1218 1981
2144 1981 -484 -1407 1896 -358 -1766 1312 -93 -1770 1570 521 -2115 1351 698 -1758 943
2159 943 1120 -1872 523 1689 -1762 156 1718 -1430 -288 1849 -1333 -1033 1740 -656 -1363 1668
2175 1668 -570 -1242 1673 -198 -1213 1492 350 -1900 1173 813 -1601 831 949 -1541 535 1263
$$ packed form
2065b266M016p58l817L758K92l677K923J329m029K303J899l969J398K798l643
2080a443P34K940l479K94L204k938n86L440k195j760L839j922k204L584q43l047
2096b382L499o2l148K845O39l434K423J586m114J860K423l713R65K800l396N33
2112f76L002l113o36L542k391j231L275k135j375L334j311k371L363m52k864L075
2128A036J57l125K637O10l384K519J201l310J313K029k989Q65K598l162k13L199
2144A981k465r23L303k254j408L078j405j677L340j049k636L466o53k456K701
2159I43J77k992K395J166l451J918J562l148J142K137l182L00K773k396p07L031
2175A668k238o72K915j871j015K705j142k250L073l60k414K432J18k490K076P28
$$ plain form
2191 1263 -1750 244 1706 -1718 -25 1746 -1304 -527 1837 -866 -923 1765 -457 -1055 1539 -130
2207 -130 -1411 1687 -65 -1724 1306 497 -1617 737 634 -1592 535 719 -1800 218 1335 -1670
2223 -1670 108 1727 -1015 -761 1534 -1124 -909 1643 -424 -677 1813 -104 -1200 1707 -427 -1447
2239 -1447 1447 566 -1589 823 623 -1588 549 697 -1416 437 1323 -1680 -23 1355 -1376 -190
2255 -190 1360 -966 -650 1620 -700 -980 1394 -560 -1066 1653 -279 -1318 1515 225 -1546 722
2271 722 466 -1383 661 764 -1453 968 888 -1825 318 1535 -1181 111 1542 -1110 -431 1518
2287 1518 -741 -614 1653 -401 -991 1623 -541 -1637 1338 -266 -1396 967 164 -1540 810 -118
2303 -118 -1555 895 864 -1792 647 1589 -1375 86 1483 -1384 -433 1651 -662 -356 1534 -979
$$ packed form
2191A263l013J994J462l424J693J771l050P77K364k703n7K688k222n98K594j669
2207a30j281L098j752j659L030q09k114K354j03k226K127J84k519K018J117l005
2223a670J778J619k742K54K295k658K15K552k067k53K490j917j096K907k134j020
2239a447K894q81k155K412k00k211K137J48k113J853Q86l003J657J378k731J186
2255a90J550k326L16K270k320k80K374j954n06K719j932j039K833j290j771K268
2271G22k56j849K044J03k217K421q0k713K143J217k716J292J431k652O79J949
2287A518k259J27K267k054n90K614k164j096K975j604j130K363q03j704K350r28
2303a18j437K450l1k656K439R42k964J461J397k867R51K084k313L06J890k513
$$ plain form
2319 -979 -879 1504 -754 -863 1690 49 -1451 1268 270 -1415 1169 443 -1254 944 773 -1323
2335 -1323 714 1123 -1564 191 1457 -1075 -53 1287 -1041 -418 1166 -1280 -366 1533 -752 -1093
2351 -1093 1221 -419 -1354 1250 431 -1089 1260 173 -1029 962 349 -1570 939 1102 -1446 434
2367 434 1517 -1322 -176 1179 -1063 101 1219 -1088 -365 1483 -1160 -1129 1448 -346 -1255 1309
2383 1309 -206 -1145 986 -52 -1328 1036 356 -1550 1194 690 -1749 436 902 -1647 164 1348
2399 1348 -976 22 1183 -1215 -195 1510 -864 -725 1767 -497 -940 1495 -223 -1140 1181 245
2415 245 -883 1382 106 -1392 1209 499 -1758 573 1048 -1453 312 933 -1514 135 1135 -1541
2431 -1541 3 1423 -1286 -894 1403 -913 -1191 1598 -492 -1197 1268 -62 -1190 1492 -14 -1265
$$ packed form
2319i79J00K383k258j09K553j641j500K719r98j685K584p26j697K198j71k096
2335a323K037M09k687J755J266k532J022J340k328O23J584k446R14J899k285l41
2351a093K314j640r35K604q19j520K349j087j202J991o13j919K509J63k548J880
2367D34J083k839J146J355k242J164J118k307P23J848k643L1K577j794r09K564
2383A309j515r39K131j038j276K364o80j906K744n04k439K185M66k549J811J184
2399A348k324R98J161k398J020J705k374J39K492k264m43K435j718r17K321r36
2415B45j128K265j276j498K601p10k257K331M75k501J765O21k447J649J000k676
2431a541J544J420k709L92K297k316k78K789k090p05K465j330j128K682j506j251
$$ plain form
2447 -1265 1611 334 -1222 830 910 -1236 282 1130 -1201 299 1231 -1476 83 1251 -1335 -322
2463 -322 1456 -844 -846 1267 -671 -956 1317 -461 -1074 1374 -46 -1168 1299 -22 -1659 1135
2479 1135 672 -1716 866 1160 -1134 590 1014 -1445 147 1242 -1528 -14 1494 -1092 -405 1609
2495 1609 -878 -781 1630 -445 -713 1235 -331 -1113 1465 33 -1431 1165 528 -1588 1012 559
2511 559 -1470 742 1019 -1518 490 1041 -1626 67 1276 -1351 -363 1758 -897 -675 1691 -409
2527 -409 -672 1506 -232 -1156 1548 -261 -1527 1311 494 -1338 1053 338 -1191 939 811 -1784
2543 -1784 604 797 -1579 388 1279 -1585 -329 1644 -1343 -369 1477 -844 -566 1767 -672 -779
2559 -779 1730 -572 -1121 1525 -42 -1514 1336 265 -1668 1060 506 -1457 876 846 -1551 451
$$ packed form
2447a265K876j277j556K052Q0k146J518Q48k331J500R32k707J559J168k586J013
2463c22J778k300kK113j938k85K273j778o13K448j420j122K467j321j637K794
2479A135m63k388K582K94k294J724M24k459J592J095k770J514J508k586O87K014
2495A609k487R7K411k075k68J948j566p82K578j432j464K596o37k116K600m53
2511E59k029K212K77k537K008N51k667J693J209k627R88K121k655K22K366k100
2527d09k63K178j738r24K704j809j266K838q17j832K391p15j529K130j28k595
2543a784K388J93k376J967Q91k864J256J973k987R74J846k321K78K333k439j07
2559g79K509k302n49K646j567j472K850j071j933K728n54j963K333l0k397K002
$$ plain form
2575 451 1042 -1825 379 1495 -1294 -176 1657 -1311 -529 1680 -1046 -741 1519 -672 -1100 1519
2591 1519 -631 -1522 1535 78 -1492 1149 395 -1505 1171 609 -1462 855 1070 -1576 546 1173
2607 1173 -1464 149 1349 -1307 -579 1439 -1181 -402 1732 -872 -731 1606 -574 -1192 1615 -317
2623 -317 -1372 1654 -144 -1693 1146 321 -1531 871 559 -1779 761 959 -1608 472 1407 -1507
2639 -1507 222 1382 -1166 -27 1601 -1309 -574 1780 -809 -766 1706 -406 -1272 1765 -169 -1403
2655 -1403 1373 200 -1379 1229 472 -1887 1118 637 -1804 578 864 -1670 400 1279 -1440 -15
2671 -15 1504 -1476 -203 1650 -1201 -682 1678 -718 -825 1725 -579 -1361 1671 -241 -1406 1403
2687 1403 242 -1754 1353 619 -1819 791 903 -1699 690 1017 -1541 403 1574 -1181 20 1788
$$ packed form
2575D51N91k867K204J116k789J118J833k968P82K209k726L05K260k191m28K619
2591A519k150q91L057j457j570K641p54j900K676n62k071K317K15k646K122O27
2607A173k637J613J200k656P28K018k620P79K134k604J41K337k180o18K807j932
2623c17j055L026j798j549K839q25j852K402l12k338K540J98k567K080R35k914
2639a507J729J160k548J139J628k910P35K354k589M3K472k112q66L037j934j234
2655a403K776j173j579K608p57k359L005m81k441K382K86k534K070Q79k719J425
2671a5J519k980J273J853k851N19K360k396j07K550k304p82L032j912j165K809
2687A403j161j996L107p34k438K610J12k602K389L27k558J944J171k755J201J768
$$ plain form
2703 1788 -1288 -416 1786 -935 -623 1641 -730 -1103 1610 -756 -1359 1368 -161 -1541 1229 19
2719 19 -1890 972 608 -1599 902 1003 -1658 863 1647 -1661 488 1499 -1549 159 1641 -1304
2735 -1304 -272 1785 -1144 -854 1569 -1001 -1082 1695 -505 -1547 1544 -252 -1477 1413 269 -1779
2751 -1779 1234 711 -1747 948 864 -1667 434 1351 -1775 317 1540 -1699 -335 1412 -1136 -610
2767 -610 1485 -1014 -752 1700 -627 -1134 1735 -196 -1426 1695 215 -1678 1517 310 -1623 1308
2783 1308 722 -1730 964 1196 -1899 271 1314 -1428 144 1392 -1477 -485 1324 -1365 -463 1615
2799 1615 -1171 -925 1852 -536 -1092 1665 -168 -1604 1643 285 -1322 1350 162 -1817 1055
2814 1055 834 -1871 810 1236 -1545 436 1149 -1090 -49 1468 -1588 -175 1824 -1418 -627 2014
$$ packed form
2703A788l076Q72K202k721L12K264k371l73K713k366o03K727j529j380K770j210
2719A9j909K862l64k207K501J01k661K521P84l308K149J011l048J708J482k945
2735a304J032K057k929K90K423k570q1K777k200j042L091j796j225K890j144k048
2751a779L013n23k458K695q4k531K101R17l126K092J223l239J364J747k548N26
2767f10K095k499K62K452k327n07K869j931j230L121j480j893L195j207j933K931
2783A308n86k452K694K32l095K170J043k742J572J248k869R92J809k689R02K078
2799A615k786K46K777k388n56K757j833j436L247j358j607K672j188j979K872
2814A055k21k705K681M26k781J981P13k239J041J517l056J413J999l242P91K641
$$ plain form
2830 2014 -1178 -1013 1931 -414 -1118 1498 -412 -1450 1513 -64 -1566 1309 592 -1737 905 984
2846 984 -1530 549 1238 -1526 597 1459 -1635 72 1638 -1707 -217 2012 -1077 -944 1811 -889
2862 -889 -1203 1617 -315 -1134 1507 -280 -1347 1576 -49 -1628 1060 717 -1894 998 684 -2066
2878 -2066 619 955 -1702 432 1291 -1691 -47 1429 -1477 -778 1872 -934 -675 1571 -592 -931
2894 -931 1317 -631 -1138 1611 -122 -1597 1726 390 -1657 1160 768 -1597 1054 717 -1401 824
2910 824 1033 -1900 458 1565 -1895 -8 1972 -1178 -457 1678 -1049 -707 1681 -690 -1002 1779
2926 1779 -511 -1266 1666 191 -1581 1265 358 -1864 1135 401 -1571 941 647 -1755 724 1247
2942 1247 -1841 167 1550 -1535 -128 1763 -1142 -323 1921 -1097 -458 1632 -770 -1292 1972 -67
$$ packed form
2830B014l192J65K944k345p04K616j910j038K963j577j502K875p17k329K642P9
2846I84k514K079O89k764K123Q62l094J707J566l345J490K229l089J33K755k700
2862h89l14K820j932q19K641j787j067K923j625j579K688l43k611K892l14k750
2878b066K685L36k657K134Q59k982J644J476k906O99K650k806K59K246k163l39
2894i31K248j948n07K749j733j475L323j336k047K817l92k365K651l37k118K225
2910H24K09k933K358J107l460J887J980l150P21K135k727L42K388k371l12K781
2926A779k290p55K932j475j772K846r07k222K999p34j972K512k94k402K479N23
2942A247l088K008J383l085J407J891k905Q19K244l018O39K090k402n22L264k039
$$ plain form
2958 -67 -1353 1542 -96 -1411 1247 323 -1488 1308 357 -1966 877 836 -1804 425 1329 -1857 79
2975 79 1292 -1307 -138 1657 -1345 -212 1930 -1269 -883 1869 -938 -1299 1759 -203 -1389 1560
2991 1560 -215 -1359 1403 125 -1566 1320 576 -1913 902 1098 -1646 441 1195 -1526 314 1539
3007 1539 -1391 -223 1404 -1584 -503 2045 -886 -561 2018 -444 -1398 1485 -507 -1314 1647 10
3023 10 -1447 1623 493 -2068 1219 878 -1647 541 1075 -1466 525 1152 -1675 260 1597 -1683
3039 -1683 -31 1764 -1241 -588 1862 -812 -852 1941 -760 -954 1977 -747 -1189 1384 -72 -1779
3055 -1779 1357 526 -1844 1127 684 -1610 702 1212 -1605 572 1429 -1522 229 1338 -1435 17
3071 17 1671 -944 -653 1741 -872 -811 1867 -811 -964 1839 -548 -1537 1442 7 -1797 1387 351
$$ packed form
2958f7j286K895j638j315K658r24j811K796r51k323K843m1k640K229R04l186J936
2975G9J213k599J169J795l002J133K142l199L86K752k807l61L058j962j186K949
2991A560j775j144K762j278j691K886p44k489K815J96k744K087P54k721J840J225
3007A539k930J168J627k988J081K548k931L25K579k462r54K883j992q07K961j637
3023A0j457L070j130k561L287l41k525K188N34k541J991O27k827J935J337l280
3039a683J652J795l005O53K450k674m0K793k701j94K931k724m42K573j456j707
3055a779L136q31k370K971m43k294K312N10k817K177Q57k951J751J109k773J452
3071A7J654k615K91K394k613O1K678k678j53K803k387r89K979j435j804L184j036
$$ plain form
3088 351 -1731 932 739 -1669 1060 885 -1539 500 1400 -1671 496 1373 -1605 -151 1982 -1096
3104 -1096 -675 1734 -1124 -935 1731 -693 -1449 1731 -524 -1536 1585 279 -1591 1506 624 -1652
3120 -1652 1522 1031 -1727 540 1130 -2035 532 1421 -1576 227 1392 -1393 -213 1471 -1343 -807
3136 -807 1795 -884 -1143 1648 -767 -1174 1508 -231 -1515 1617 226 -1432 1661 383 -1759 1251
3152 1251 797 -1757 686 1076 -1620 252 1310 -1697 64 1576 -1554 -340 1594 -1317 -666 1744
3168 1744 -1034 -741 1771 -528 -1207 1774 -56 -1348 1680 -22 -1822 1208 723 -1644 744 1029
3184 1029 -2029 611 1014 -1808 222 1347 -1926 -435 1527 -1530 -304 1630 -1206 -621 1880
3199 1880 -1009 -832 2016 -252 -1021 1891 39 -1371 1600 128 -1746 1345 946 -1892 857 884
$$ packed form
3088C51k082K663j93k408K729j75k424K039R00l071K167Q77k978J454K133l078
3104a096M21K409k858J89K666k424p56L180k255j012L121j306j870L097q82k276
3120a652L174m91k758K267N90l165K567Q89k997J803J165k785J180J684k814N36
3136h07K602k679k59K791k415m07K682j739j284L132j391j658L093j278k142L010
3152A251m54k554K443L90k696J872J058l007J761J512l130J214J934k911O51K410
3168A744k778K93K512k299o79K981j830j292L028j702j800L030m85k367K388K85
3184A029l058K640M03k822K030J125l273J491J962l057J226J934k836N85K501
3199A880k889J77K848k268p69K912j852j410K971j472j874L091l99k838K749K7
$$ plain form
3215 884 -1917 439 1138 -1979 51 1225 -1775 -131 1626 -1498 -348 1884 -1029 -738 1734 -850
3231 -850 -899 1613 -684 -883 1810 -210 -1695 1281 102 -1942 1261 318 -1732 943 993 -1745 613
3248 613 1168 -1572 281 1205 -1509 29 1735 -1413 -166 1847 -1106 -475 1670 -1025 -898 1946
3264 1946 -671 -1379 1760 -181 -1569 1305 345 -1890 1281 458 -1920 1133 837 -1706 499 1298
3280 1298 -1778 346 1351 -1537 72 1763 -1384 -229 1813 -983 -404 1732 -706 -973 1697
3295 1697 -349 -1459 1717 24 -1579 1281 71 -1602 1351 483 -1787 1055 1103 -1564 687 1146
3311 1146 -1796 232 1308 -1667 145 1796 -1285 -306 1804 -1028 -874 2080 -743 -1232 1672 -474
3327 -474 -1418 1554 -190 -1462 1398 338 -1684 1409 544 -1806 1011 888 -1778 1003 1407 -1543
$$ packed form
3215H84k801K356O99l117K030J174l000J644J757l124J150K232k913K91K472k584
3231h50m9K512k297j99K693k020j485K976j179k044L203r43k050K675N0k738K358
3248F13N55k740J853R24k714J538J706l148J247K013k953O31K145k695J27K844
3264A946k617p08L139j941j388K874r60k235L171q23k378L053k96k543K205P99
3280A298l076K124J005k888J609J691l147J155K042k796N79K136k438k67K670
3295A697k046j110L176j693j603K860j210j673K953q68k270K842M8k667K251M59
3311A146k942K028J076k975J812J651l081R79K110k832J54K954k823m89K904k146
3327d74r44K972j744j272K860j060k022L093q65k350K817j23k666K781M04k950
$$ plain form
3343 -1543 225 1514 -1508 -21 1726 -1228 -207 1920 -933 -1079 1762 -669 -1350 1793 -674
3358 -674 -1175 1342 -28 -1614 1580 249 -1890 1214 717 -1747 915 1239 -1649 862 1245 -1506
3374 -1506 106 1788 -1506 25 1756 -1317 -576 1833 -980 -922 1805 -833 -1461 1413 -602 -1281
3390 -1281 1809 -308 -1616 1265 388 -1844 1189 761 -1774 978 1007 -1765 723 1207 -1607 250
3406 250 1621 -1538 -304 1738 -1413 -812 1624 -940 -881 1608 -755 -1122 2026 -688 -1514 1737
3422 1737 42 -1537 1264 616 -1659 1209 651 -1616 1098 1038 -1856 604 1277 -1747 31 1599
3438 1599 -1602 -404 1662 -1131 -649 1561 -828 -820 1644 -839 -1383 1921 -335 -1645 1484 -138
3454 -138 -1566 1555 385 -1382 1428 522 -2051 941 1047 -1910 234 1390 -1577 -129 1340 -1373
$$ packed form
3343a543J768J289l022J487J747k954J021K127k853j46K841k431o81L143k467
3358f74n01K517j370j586L194j331k139L104m97k464K662L24k888K511L83k751
3374a506J612J682l294J531J731l073P41K409k813N8K727k638o28K874k015o79
3390a281L090k117j308K881q77k232L033m28k535K752K9k772K488M84k814J857
3406B50J371l159J234K042l151O01K436k564N9K489k363l67L148k714q26L251
3422A737j695j579K801o48k275K868n58k267K714o0k894K460O73l024J778J568
3438A599l201J198K066k793M82K210k389QK464k483n44L304k256j310L129j622
3454a38j428L121j170j767K810r06k573K992J06k957K144J156k967J448J469k713
$$ plain form
3470 -1373 -213 1641 -1248 -640 1865 -1140 -965 1759 -802 -1461 1659 109 -1472 1390 -99 -1631
3486 -1631 1582 123 -1846 1361 1102 -1804 661 808 -1657 554 1555 -1495 167 1454 -1560
3501 -1560 -381 1594 -1404 -472 2111 -1074 -1100 1832 -575 -1632 1398 -313 -1493 1460 14 -1596
3517 -1596 1657 574 -1930 887 961 -1843 606 982 -1807 383 1226 -1763 200 1630 -1608 -258
3533 -258 1545 -1364 -868 1821 -844 -889 1831 -389 -1075 1734 -408 -1522 1805 351 -1731 1419
3549 1419 691 -1752 910 649 -2088 563 991 -2011 112 1223 -1812 22 1427 -1523 -404 1974
3565 1974 -1099 -963 1253 -920 -869 1614 -571 -1093 2100 -407 -1667 1457 417 -1437 1329 771
3581 771 -1530 804 530 -1848 699 1118 -1785 508 1623 -1631 88 1681 -1335 -541 1751 -671
$$ packed form
3470a373J160J854k889O08K505l005J75K724k561o59L120j550j581K862j489j532
3486a631L213j459j969L207k59k906K465J47k465K211J001l050J662J287l014
3501a560J179J975k998R32K583l185k6K932k407j057L030j711j180K953j446j610
3517a596L253j083k504K817P4k804K449L76k789K190Q43k989J963J430l238J350
3533b58J803k909M96K689k665m5K720k220o86K809k142j114L327j454k082L150
3549A419p28k443K662k61k737K651M28l002K123J111l035J834J405k950J119K378
3565A974l073J36K216k173N1K483k185n22L193k507j260L124j040j854K766n58
3581G71k301K334k74k378K547M19k903K293J115l254J719J593l016P94K292k422
$$ plain form
3597 -671 -449 1798 -759 -918 1672 -549 -1352 1693 -351 -1678 1185 265 -1877 864 352 -1828
3613 -1828 1124 482 -1823 633 1393 -1829 198 1594 -1288 39 1771 -1002 -266 1795 -970 -399
3629 -399 1691 -642 -930 1871 -460 -1358 1384 92 -1393 1134 179 -1733 1300 389 -2104 857
3645 857 940 -1497 630 1468 -1781 187 1466 -1394 101 1236 -1317 -260 1638 -1072 -764 1754
3661 1754 -1042 -1305 1675 -593 -1443 1338 -169 -1367 1414 287 -1819 1391 717 -1758 797 824
3677 824 -1335 548 1194 -1610 465 1536 -1501 97 1644 -1101 -364 1795 -953 -961 1504 -921
3693 -921 -1312 1562 -362 -1533 1564 -241 -1508 1527 413 -1666 1050 594 -1662 692 875 -1509
3709 -1509 276 1067 -1352 404 1528 -1354 -229 1596 -1187 -396 1938 -1030 -873 1390 -635 -1204
$$ packed form
3597f71K22K247k557j59K590k221q03L045k044j327K863r20k142K741n12k180
3613a828K952o42k305K456P60l222K027J396k882J327J732k773P36K061k765N71
3629c99K090k333k88K801k331q98K742j292j485K527r55j912L033r11k493K961
3645H57Q3k437K127Q38l249J968J279k860J495J135k553J057J898k710L08K518
3661A754k796k63K980k268q50K781j507j198K781j127k106L210o74k475K555K7
3677H24k159J883O46k804K075J071l037J598J547k745P37K159k748qK465k425
3693i21l91K874j924j171L097j805j267L035j114k079K716m56k256K354J83k384
3709a509J785P91k419J756J124k882J125J825k783P91K334k968J57K263k025n69
$$ plain form
3725 -1204 1640 -413 -1380 1496 22 -1776 1326 355 -1491 825 459 -1659 560 757 -1548 329
3741 329 1218 -1774 234 1278 -1123 -200 1569 -1157 -658 1568 -810 -631 1546 -567 -1094 1663
3757 1663 -265 -1374 1477 136 -1541 1192 552 -1458 1137 706 -1522 984 879 -1447 506 933
3773 933 -1410 -25 1331 -1437 -463 1120 -1071 -585 1363 -807 -933 1724 -773 -988 1408 -98
3789 -98 -1318 1343 255 -1215 1390 174 -1565 831 513 -1437 657 939 -1398 509 927 -1425
3805 -1425 113 1251 -990 -297 1267 -1131 -650 1384 -996 -675 1505 -653 -1043 1457 -122 -1197
3821 -1197 1153 145 -1496 1196 360 -1336 1137 664 -1228 615 908 -1294 309 912 -1371 -401
3837 -401 1431 -1068 -334 1452 -1099 -514 1400 -880 -664 1449 -363 -987 1363 -26 -1285 1444
$$ packed form
3725a204K844k053r67K876j474j798L102r71j846K316l66k118K219J97k305J877
3741C29Q89k992K008J044k401R23J769k726M99K226k378J79K177k113n27K757
3757A663j928j109K851j341j677K733o40k010K595m31k228K506j05k326J953M27
3773I33k343J385J356k768R74J583k191M86J948k170j26K657k497k15K396j506
3789i8j220K661j088j470K605j216j739K396l18j950K094K82k337J907M18k352
3805a425J538J138k241O93J564k398M81K034k380L21K180k158l90K500j579j075
3821a197K350j008j641K692q36j696K473m73j892J843K93k202J603O03k283R70
3837d01J832k499P34J786k551N85J914k280K16K113j812o24K350j389j259K729
$$ plain form
3853 1444 184 -1140 1061 326 -1406 894 631 -1554 673 723 -1439 201 1130 -1160 237 915
3869 915 -1065 -227 1225 -901 -542 1337 -628 -920 1559 -244 -927 1289 62 -1086 948 33
3885 33 -1333 785 606 -1316 890 644 -1597 427 803 -1346 210 1221 -1219 -211 1087 -1048
3901 -1048 -572 1220 -806 -790 1179 -637 -656 1350 -358 -952 1088 -344 -1181 1238 376 -1116 1062
3918 1062 200 -1381 579 647 -1030 430 911 -1129 171 951 -1319 165 1538 -1195 -554 1314
3934 1314 -685 -576 1397 -873 -828 1175 -137 -1047 1219 -116 -1246 977 119 -852 685 391 -1309
3951 -1309 748 738 -1205 509 926 -1142 334 924 -1114 58 1169 -740 -96 1040 -437 -543
3967 -543 1364 -706 -931 1071 -239 -994 880 47 -1146 1064 216 -1094 764 220 -1154 662
$$ packed form
3853A444j260j324K201p35j732K300k63k185K227N0k162J640R29k290J397O78
3869I15j980Q38J452k126L59J879j965k92K479j803o83K216j227j148K034r15
3885C3j366K118j79j922K206k46k241K024L76k149J556J011k440J008J298k135
3901a048M76J792k026J6J969j816j9K006j708n94K040j432q37K419q62j492K178
3918A062q62j581J960O8j677J460M81k040J300P80k270J484J373k733O41J868
3934A314j999J09J973k270M5K003j312r10K266j335j130K223q58r71J537k94j700
3951a309K057j0j943J714M17k068J476N90k038J172J111j909O44J136j477j06
3967e43J907k070k25K002j310p55J874q33j193K210q48j310J858n44j374J816
$$ plain form
3983 662 735 -923 246 896 -989 54 925 -787 -146 952 -787 99 1274 -839 -710 1044 -515
4000 -515 -883 1126 -24 -979 820 -131 -917 777 265 -1201 591 275 -1178 627 610 -936 303
4017 303 794 -1035 240 921 -976 200 1079 -771 -191 1259 -542 -608 1237 -148 -713 826 -465
4034 -465 -1152 712 213 -989 1156 234 -1189 720 377 -940 534 487 -824 424 778 -1017 41
4051 41 778 -868 110 1011 -661 -266 980 -577 -542 768 -241 -772 957 -179 -769 900 -191
4068 -191 -1067 717 460 -985 715 483 -907 301 366 -755 32 1007 -756 31 847 -818 -254 782
4086 782 -674 -407 939 -379 -439 914 -173 -647 999 -102 -857 819 154 -874 739 339 -851
4103 -851 680 455 -941 288 683 -1150 189 543 -917 21 886 -462 -316 816 -461 -172 527
$$ packed form
3983F62P3j658J169O50j885J043Q71j712O41J098j739Q86J175k113J29J754j559
4000e15l68K009j150r55J799r51p86J694n12j466J792l16j453J805j7j546J239
4017C03M91j829J275O81j897J176Q79j850N80J450j801o6J845j385n65J539j291
4034d65o87J864m99j202K145r22j423J909l43j317J474m7j311J248L54j795J058
4051D1P37j646R78R01j672L95J246j557L5J310j009n31J729j136n90J669j091
4068a91q76J784k57j445J700k32j390J208O5j121P87R75j763P87Q16j665N64J036
4086G82j456K67J346j318o0J353j087m74J646j101p55J676o65j028J613m00j190
4103h51J531k25j396J229L95j833J339L54j460R38Q65j348J46J132j277K89O99
$$ plain form
4120 527 -635 -460 858 -435 -554 924 -204 -849 657 -46 -751 403 195 -967 543 479 -943
4137 -943 384 540 -907 101 909 -876 -2 908 -325 -152 813 -569 -450 807 -610 -395 978
4154 978 -287 -804 730 -83 -929 530 94 -915 667 215 -982 494 464 -609 257 404 -888
4171 -888 268 726 -713 -269 650 -573 -142 737 -507 -344 927 -367 -790 595 13 -635 738
4188 738 171 -779 708 293 -771 736 293 -890 627 657 -667 145 440 -770 246 581 -553
4205 -553 23 607 -553 -28 759 -388 -410 976 -151 -554 549 -101 -696 785 47 -644 605 213
4223 213 -677 494 377 -854 382 326 -792 97 609 -797 223 659 -769 -108 697 -507 -274 799
4241 799 -620 -391 825 -64 -372 886 -120 -789 544 -395 -923 770 190 -476 193 194 -834 226
$$ packed form
4120E27j162J75J318j293j19J478j128o45J506p03p05J154k08j162J510o4j422
4137i43J327J56j447J008Q08j785Q74R10j233J73R65j382J19J257j417K15J373
4154I78j265n17J534q13q46J459m36j009J582m52j197J476l0j073Q66J47j292
4171h88J156M58j439M44R19j223M31Q79j244J63J271j294m23J385n82o48J373
4188G38n67r50J487m15j064J507m43j183J517L0j324Q12K95j210J016L35j134
4205e53N76N84j160N25P87j147k2J386j127m03J103o50n95J481p38o91J249l92
4223B13q90J171j17j231J236n6j118Q89N12j406J020M36j428O61Q05j204K33J073
4241G99j419K29J216q89l08J258j006o69J333r39n28J693n80o66O69Jj028J060
$$ plain form
4259 226 425 -718 359 481 -676 44 508 -578 -14 685 -550 -219 778 -283 -396 747 -206 -403
4277 -403 582 -109 -658 753 103 -534 401 76 -607 537 338 -661 421 691 -561 -28 582 -697
4295 -697 188 547 -439 -88 713 -423 -265 560 -401 -427 707 -219 -474 617 -39 -656 595 286 -610
4314 -610 454 121 -478 391 246 -577 54 538 -501 -36 442 -302 -80 413 -499 -217 472 -592 -275
4333 -275 604 -249 -313 463 -241 -529 650 27 -369 389 141 -592 403 105 -550 7 596 -428 283 315
4353 315 -466 -99 411 -530 -153 446 -261 -535 609 -322 -138 673 -527 -469 518 -203 -316 359 -24 -368
4373 -368 460 29 -666 295 42 -698 -30 127 -466 231 266 -479 46 394 -388 -96 559 -198 -543 513
4393 513 -265 -185 508 -81 -473 558 -240 -434 366 150 -564 413 -23 -627 516 259 -486 350 49 -640
$$ packed form
4259B26J99j143J077J22j157P20M64j086N64O99j235L31R97j061j13J143r53j97
4277d03R85o91n49J411o50o37R35l25o83J144j99r99J082K70j252N33O10j279
4295f97Q85L59r86L51Q01j136J58Q25r61k6J134r26k55J091o56o17J251l09q96
4314f10J064l33n99Q69j45q23O31M84j039M65M78p44K22M93r12K82O89j064L17
4333b75Q79q53o4P76p04k88J179o23l96P58k48p33R95k98o55N57N89j024P11L2
4353C15p81L67N10r41L77N99p07k74J144r31J84Q11j200N8R87p21j13O75l83l44
4373c68Q28m31o95R61k53p40O68J57n93O97L5p45N25L48p82K92O55p57l45J056
4393E13p78Q0O93n89l92J031p98j94Q00k16p14R77m36o04J143k57p45Q36l01o89
$$ [...]
8191B99
##END NTUPLES=NMR FID
##END=
