##TITLE=1H_Pr 4898-H
 CDCl3, 8 sc, 
 8.2.2019
##JCAMPDX= 6.0         $$ Bruker NMR JCAMP-DX V2.0
##DATA TYPE= NMR FID
##DATA CLASS= NTUPLES
##ORIGIN= UXNMR, Bruker Analytische Messtechnik GmbH
##OWNER= root
$$ XWIN-NMR		Version 3.5
$$ Fri Feb  8 16:35:44 2019 Russian Standard Time (UT+4h)  she@DPX200
##.OBSERVE FREQUENCY= 200.1313
##.OBSERVE NUCLEUS= ^1H
##.DELAY= (6, 6)
##.ACQUISITION MODE= SIMULTANEOUS
##.ACQUISITION SCHEME= undefined
##.AVERAGES= 8
##.DIGITISER RES= 18
##SPECTROMETER/DATA SYSTEM= spect
##.PULSE SEQUENCE= zg30
##.SOLVENT NAME= CDCl3
##.SHIFT REFERENCE= (INTERNAL, CDCl3, 0, 15.7039)
##AUDIT TRAIL= $$ (NUMBER, WHEN, WHO, WHERE, WHAT)
$$ ##TITLE= Audit trail, XWIN-NMR		Version 3.5
$$ ##JCAMPDX= 5.01
$$ ##ORIGIN= Bruker BioSpin GmbH
$$ ##OWNER= she
$$ F:/spectra/data/she/nmr/H-F/1/audita.txt
$$ ##AUDIT TRAIL=  $$ (NUMBER, WHEN, WHO, WHERE, WHAT)
(   1,<2019-02-08 16:34:33.76 +0400>,<she>,<DPX200>,
      <created by zg, POWCHK disabled, PULCHK disabled
       configuration hash MD5:
       00 E9 B6 7A A2 85 ED C7 34 08 36 98 17 FE 4E 26
       data hash MD5: 16K
       7E F9 EF E1 E9 02 1C B3 F0 F9 D6 9B 6A 02 F2 0E>)
$$ ##END=
$$ 
$$ hash MD5
$$ BD 46 BE 0A 93 DE 7C 4B 7A 2B 7B DE 7A 48 D3 1D
##$RELAX= 
##$RELAX= 
##$RELAX= 
##$RELAX= 
##$RELAX= 
##$RELAX= 
$$ Bruker specific parameters
$$ --------------------------
##$DU= <F:/spectra>
##$EXPNO= 1
##$NAME= <H-F>
##$PROCNO= 1
##$TYPE= <nmr>
##$USER= <she>
##$AMP= (0..31)
100 100 100 100 100 100 100 100 100 100 100 100 100 100 100 100 100 100 
100 100 100 100 100 100 100 100 100 100 100 100 100 100 
##$AQSEQ= 0
##$AQ_mod= 1
##$AUNM= <au_zg>
##$AUTOPOS= <>
##$BF1= 200.13
##$BF2= 200.13
##$BF3= 200.13
##$BF4= 200.13
##$BF5= 200.13
##$BF6= 200.13
##$BF7= 200.13
##$BF8= 200.13
##$BYTORDA= 1
##$CFDGTYP= 0
##$CFRGTYP= 5
##$CHEMSTR= <none>
##$CNST= (0..31)
1 1 145 1 1 1 1 1 1 1 1 1 1 1 1 1 1 1 1 1 1 1 1 1 1 1 1 1 1 1 1 1 
##$CPDPRG= <>
##$CPDPRG1= <>
##$CPDPRG2= <>
##$CPDPRG3= <>
##$CPDPRG4= <mlev>
##$CPDPRG5= <mlev>
##$CPDPRG6= <mlev>
##$CPDPRG7= <mlev>
##$CPDPRG8= <mlev>
##$CPDPRGB= <>
##$CPDPRGT= <>
##$D= (0..31)
0 1.2 0 0 0 0 0 0 0 0 0 0.03 0 0 0 0 0 0 0 0 0 0 0 0 0 0 0 0 0 0 0 0 
##$DATE= 1549629273
##$DBL= (0..7)
120 120 120 120 120 120 120 120 
##$DBP= (0..7)
150 150 150 150 150 150 150 150 
##$DBP07= 0
##$DBPNAM0= <>
##$DBPNAM1= <>
##$DBPNAM2= <>
##$DBPNAM3= <>
##$DBPNAM4= <>
##$DBPNAM5= <>
##$DBPNAM6= <>
##$DBPNAM7= <>
##$DBPOAL= (0..7)
0.5 0.5 0.5 0.5 0.5 0.5 0.5 0.5 
##$DBPOFFS= (0..7)
0 0 0 0 0 0 0 0 
##$DE= 6
##$DECBNUC= <off>
##$DECIM= 32
##$DECNUC= <off>
##$DECSTAT= 4
##$DIGMOD= 1
##$DIGTYP= 9
##$DL= (0..7)
0 120 120 120 120 120 120 120 
##$DP= (0..7)
150 150 150 150 150 150 150 150 
##$DP07= 0
##$DPNAME0= <>
##$DPNAME1= <>
##$DPNAME2= <>
##$DPNAME3= <>
##$DPNAME4= <>
##$DPNAME5= <>
##$DPNAME6= <>
##$DPNAME7= <>
##$DPOAL= (0..7)
0.5 0.5 0.5 0.5 0.5 0.5 0.5 0.5 
##$DPOFFS= (0..7)
0 0 0 0 0 0 0 0 
##$DQDMODE= 0
##$DR= 18
##$DS= 0
##$DSLIST= <SSSSSSSSSSSSSSS>
##$DSPFIRM= 0
$$ [...]
##$SUBNAM2= <"">
##$SUBNAM3= <"">
##$SUBNAM4= <"">
##$SUBNAM5= <"">
##$SUBNAM6= <"">
##$SUBNAM7= <"">
##$SUBNAM8= <"">
##$SUBNAM9= <"">
##$SW= 20.0189088683792
##$SWIBOX= (0..15)
0 0 2 0 0 0 0 0 0 0 0 0 0 0 0 0 
##$SW_h= 4006.41025641026
##$TD= 16384
##$TD0= 1
##$TE= 0
##$TE2= 300
##$TE3= 300
##$TEG= 300
##$TL= (0..7)
0 120 120 120 120 120 120 120 
##$TP= (0..7)
150 150 150 150 150 150 150 150 
##$TP07= 0
##$TPNAME0= <>
##$TPNAME1= <>
##$TPNAME2= <>
##$TPNAME3= <>
##$TPNAME4= <>
##$TPNAME5= <>
##$TPNAME6= <>
##$TPNAME7= <>
##$TPOAL= (0..7)
0.5 0.5 0.5 0.5 0.5 0.5 0.5 0.5 
##$TPOFFS= (0..7)
0 0 0 0 0 0 0 0 
##$TUNHIN= 0
##$TUNHOUT= 0
##$TUNXOUT= 0
##$USERA1= <user>
##$USERA2= <user>
##$USERA3= <user>
##$USERA4= <user>
##$USERA5= <user>
##$V9= 5
##$VALIST= <valist>
##$VCLIST= <CCCCCCCCCCCCCCC>
##$VD= 0
##$VDLIST= <DDDDDDDDDDDDDDD>
##$VPLIST= <PPPPPPPPPPPPPPP>
##$VTLIST= <TTTTTTTTTTTTTTT>
##$WBST= 1024
##$WBSW= 4
##$XGAIN= (0..3)
0 0 0 0 
##$XL= 0
##$YL= 0
##$YMAX_a= 241964
##$YMIN_a= -421430
##$ZGOPTNS= <>
##$ZL1= 120
##$ZL2= 120
##$ZL3= 120
##$ZL4= 120
##$ABSF1= 10
##$ABSF2= 0
##$ABSG= 5
##$ABSL= 3
##$ALPHA= 0
##$AQORDER= 0
##$ASSFAC= 0
##$ASSFACI= 0
##$ASSFACX= 0
##$ASSWID= 0
##$AUNMP= <proc_1d>
##$AZFE= 0.1
##$AZFW= 0.1
##$BCFW= 1
##$BC_mod= 2
##$BYTORDP= 1
##$COROFFS= 0
##$CY= 11.3945322036743
##$DATMOD= 1
##$DC= 2
##$DFILT= <>
##$DTYPP= 0
##$F1P= 18.9103706918063
##$F2P= -1.10871071338519
##$FCOR= 0.5
##$FTSIZE= 0
##$FT_mod= 4
##$GAMMA= 1
##$GB= 0.15
##$INTBC= 1
##$INTSCL= 1
##$ISEN= 128
##$LB= 0.24
##$LEV0= 0
##$LPBIN= 0
##$MAXI= 10000
##$MC2= 0
##$MEAN= 0
##$ME_mod= 0
##$MI= 1.114404
##$NCOEF= 0
##$NC_proc= 0
##$NLEV= 6
##$NOISF1= 3.799351
##$NOISF2= 2.8
##$NSP= 1
##$NTH_PI= 0
##$NZP= 0
##$OFFSET= 15.70392
##$PC= 1
##$PHC0= -8681.093
##$PHC1= 14.40019
##$PH_mod= 1
##$PKNL= yes
##$PPARMOD= 0
##$PSCAL= 0
##$PSIGN= 0
##$REVERSE= no
##$SF= 200.130013532006
##$SI= 16384
##$SIGF1= 3
##$SIGF2= 2
##$SINO= 400
##$SIOLD= 16384
##$SREGLST= <1H.CDCl3>
##$SSB= 0
##$STSI= 0
##$STSR= 0
##$SW_p= 3612.71676300578
##$SYMM= 0
##$S_DEV= 0
##$TDeff= 0
##$TDoff= 0
##$TI= <>
##$TILT= no
##$TM1= 0
##$TM2= 0
##$TOPLEV= 0
##$USERP1= <user>
##$USERP2= <user>
##$USERP3= <user>
##$USERP4= <user>
##$USERP5= <user>
##$WDW= 1
##$XDIM= 8192
##$YMAX_p= 0
##$YMIN_p= 0
$$ End of Bruker specific parameters
$$ ---------------------------------
##NTUPLES= NMR FID
##VAR_NAME=  TIME,          FID/REAL,        FID/IMAG
##SYMBOL=    X,             R,               I
##VAR_TYPE=  INDEPENDENT,   DEPENDENT,       DEPENDENT
##VAR_FORM=  AFFN,          ASDF,            ASDF
##VAR_DIM=   8192,          8192,            8192
##UNITS=     SECONDS,       ARBITRARY UNITS, ARBITRARY UNITS
##FACTOR=    0.0002496,     1,               1
##FIRST=     0,             0,               0
##LAST=      2.0444736,     0,               0
##MIN=       0,             -421430,         0
##MAX=       2.0444736,     241964,          0
$$ Real data points
##PAGE= N=1
##DATA TABLE= (X++(R..R)), XYDATA
$$ [...]
2254A90k00n8K03k26P8Kq0J08L3K3j53o1lm1J96J78k50L31k71k10K29l3O4k33
2278a84K94j67J41J27j81P7p2J05l88N19k34l7q9L04l35J26l2m2M9O8j40L5Q9
2301C3j7J04R5k97m6K43l73K12K0j62KM26k86j30K20J1m5J4K03m90O22j53l36
2324a30K13k20j81L67j19j63L47J5k23J10J05k09J42K43l72J25N62p61QJ49O6
2345G4m76K99K80k03N0j96nM31m3p10O23L44q64M29K72n84J24J96l79J62N11m73
2367a38L3K39j80k13R18o27k02L87k61j63J76o5J03L64m02q6M30l84j74L34J3
2388A02l34K61K29m83L58J7l80J75M26o10j22P95o96k02O18l64OL88k45o5N77
2409D51l45l63O42k77m71O12k63k42L82J00m32L05J2k56L24K06q94M70M89q51
$$ y = [190, -10, -68, 135, -91, -13, -11, -91, 17, 50, 73, -80, -141, -144, -185, 11, 189, -61, 270, -1, -211, 18, -15, 49, -184, 110, -57, 84, 211, 30, 107, 35, 140, -248, 271, 37, 0, -89, 215, -120, 6, -26, -68, -19, 49, -91, -56, 33, 16, 120, 215, -82, -128, 115, -258, -46, -26, -188, -186, 240, -46, -176, 44, 55, 10, 24, 227, -263, 359, 206, -130, 83, -137, -318, 49, -70, -233, 114, 129, -94, 16, 121, -88, 54, 297, -75, 50, 612, -149, -141, 8, 74, -402, -103, 177, -26, 24, -172, -177, 254, 211, -499, 124, 468, -396, 33, 305, -279, -155, 41, -338, -176, 335, -138, -105, 134, -46, -259, 659, 32, -170, 217, -44, -207, -31, -96, 7, 371, -31, -117, 313, -71, -245, 89, 102, -232, 29, 258, -225, 133, 150, -230, -55, 371, -239, -361, 434, -262, -464, 154, -210, -204, 184, -61, -126, 451, 106, -257, 385, 108, -363, 249, -14, -256, 126, 226, -206, 99, 111, -145, 179, 385, -509, -39, 450, -401]
2429d01L13M82m44K4L07n08o9O99o49J66O24n00k93O28r1n81N84k91m1L23k58
2450B4l30L84L80q58M22P34j323P55j48o19N22M44n12J18N37o54lN69l33k75O36
2471D70m29l26N33l6n83N29j12o06J150n51n63O45J15r31O31K69k73K91L43o89
2491a23J04L38o01M10L84p49p1R42r09j81R73o02l60O38j05l10O23o14k51Q89
2511D25l90o37J042j80q09O06K57p50M96L60q16M68M61j042L52O15p09MO37m92
2531a02n9Q47r47j56Q84o56m4P32o17l53P21N3o87R22k99p11Q23k12r23Q66L37
2552D19j259P44N60q60J88Q13r82J72N28m46l4O38o72j79R87p81m80J138k41r67
2572g14J214k82o10O34j56l79N36k18p34J103J4j125J045K56j104N75O41j274
$$ y = [-401, -88, 394, -50, -26, 281, -227, -296, 403, -246, -80, 544, 44, -249, 379, 288, -293, 291, 0, -41, 282, 24, -306, 78, 458, -400, 22, 756, -567, 188, 40, -579, -57, 387, -125, -7, 530, -124, -127, 442, 109, -166, 470, 41, -285, 248, 212, -371, 158, 46, -560, 590, 39, -524, 121, 236, -695, -64, 205, -68, 223, 566, -123, -19, 319, -282, 128, 512, -237, -308, 634, -275, -456, 517, -85, -445, 193, 88, -222, 401, -213, -464, 425, 35, -602, 440, 260, -549, 57, 314, -436, 60, 420, -396, 72, 533, -509, -157, 458, -251, -247, 390, -102, -161, 686, -261, -417, 467, -189, -233, 499, -118, -471, 250, 303, -384, 538, 239, -472, 351, 139, -784, 82, 419, -840, -96, 464, -396, -208, 605, -377, -205, 323, -123, -157, 481, -191, -370, 617, -164, -644, 494, 253, -714, 500, 218, -392, 242, 86, -293, 243, 25, -709, 394, 408, -717, 328, 584, -520, 55, 696, -578]
2590e78O17N67j005M9J030r04k28J005j037J56R22n29o51J225o88l58P97m8j032
2609f90R14K03r18N86K57n20J54L16q34P70M50j071N03M14r97L38P13j088J11
2628c89P82m17n58R34m05n76R39k63p08J282n22n91R48k2j395J463o6j098R74
2647C12J68j067O20N23j163K91O43q28M38P06j230N78R58j185L8R05q82k73J118
2666F70n33o80Q94j20o63N64J53j066R93n3q85J204j97j401J236L57j045J07J090
2685F25j042J68Q49q79n7J082j040K27Q65j103k63J225q28o25J389p72n97J160
2703C84k77p58R87j57p67O51O71j464R06K04q90P98O2n73L69O53j301J28Q48q35
2723c61j60J038p25k32Q13q79k29J247m99o19J356o47r62J336L79j405P30L35
$$ y = [-578, 39, 606, -399, -350, 680, -224, -452, 553, -484, -328, 594, 65, -586, 639, -49, -407, 390, 342, -690, 224, 427, -491, 95, 352, -168, -14, 302, -532, 238, 688, -383, 120, 534, -463, -125, 588, -500, -389, 393, -24, -582, 352, -53, -629, 310, 47, -661, 621, 99, -492, 456, 434, -961, 502, 436, -662, 312, 480, -587, 33, 556, -607, -316, 327, -501, -63, 643, -587, -9, 949, -236, -198, 707, -175, -448, 670, 137, -543, 351, 231, -432, 132, 285, -781, 212, 159, -726, 478, 281, -1120, 116, 473, -572, -465, 625, -417, -249, 600, -279, -336, 746, -294, -67, 798, -305, -568, 657, -171, -796, 593, -179, -776, 384, 107, -651, 336, 179, -588, 63, 734, -730, 176, 380, -510, 288, 350, -223, 146, 799, -502, -374, 474, -361, -521, 517, -208, -440, 373, -506, -735, 512, 13, -606, 750, 103, -859, 477, 856, -549, 181, 516]
2741E16q78P91J14q94N56N12j177L26P84j150J84Q80j144L20P62r01n2J250r29
2760a30k89J004o78o14J493m32j215J373l28p85P67J73j008P26K20j002P98M61
2778E34j259M82R19j081J32P79j171N74O48p81j02J258j029n40J558q54o35J210
2796F42m07p10P12j91p89J011j27j071J381L0j352Q77M80j103M33P43r74M83N74
2815F42j105M68N05j234J91J376q32l86J304q69n44P69l91m43J339n84r22J321
2833F05l99q68R25J7p99J028L61j239Q40r7j160J119L16j253P17Q10j143k51Q62
2852C91o22k61R03n44j12P52p90l77J515j088p27J425K31j265Q00L47j078P29
2870B29K99p58O80J64j281N29Q31j451N44J026r43RO86p93K01M42q26L29R74q55
$$ y = [516, -362, 429, 543, -351, 205, 717, -460, -134, 650, -500, -316, 564, -580, -260, 502, -399, -451, 799, -130, -419, 585, -93, -707, 786, 354, -861, 512, 184, -601, 166, 339, -669, 57, 277, -725, 73, 534, -725, -243, 676, -405, -273, 506, -665, -91, 557, -224, -326, 932, -97, -637, 921, 67, -568, 642, 235, -475, 237, 46, -743, 268, 141, -930, 451, 481, -871, 6, 486, -617, -184, 559, -415, 68, 642, -463, 5, 510, -724, -533, 843, 11, -375, 929, 60, -484, 285, -106, -549, 790, 206, -716, 605, 206, -662, 263, 280, -519, 509, 870, -369, 471, 374, -786, 333, 649, -604, 113, 923, -220, -471, 391, -231, -492, 411, -133, -245, 507, -283, -660, 855, -233, -960, 465, 696, -569, 231, 578, -500, 229, 528, -230, 450, 614, -667, -138, 693, -758, -214, 812, -131, -122, 564, -229, -28, 414, -412, -83, 891, 36]
2890C6p36J352n29q24J128m62l54N87r6p64J110n26r13J014O09j190M45N14j165
2909g64L73O02m61J15P66j179M17P98j091m7J538q67p54J079n75m11P86n59m15
2928f49J235o05p85J346k88j221J023K50p11M40O77r11j08O01r52Q24M99j052
2946c87J75Q32j037j23R75n13k31P38n89n4Q51p81q03J559n27p02J241o1j113
2965e50P25K27q43N77o1m95O34K22j095K02Q33j057L98R66j018J59N45p74K84
2984a21O23q80J77J291j031o68Q52J15r27Q26J85o68N88k18q19R26O3j125R57
3003A46L25j038J98O42n94L8N34n14K94O85j163K17P97q44l13J128o47k07R80
3022F64p11m98Q06k07n56R26j55q76J077l2j135O93L55o89N46L49j076Q23K44
$$ y = [36, -700, 652, 123, -701, 427, -35, -389, 198, 102, -662, 448, -78, -991, 23, 632, -558, -113, 401, -764, -391, 211, -250, -135, 631, -548, -131, 667, -424, -471, 1067, 200, -554, 525, -50, -461, 325, -234, -649, 586, -19, -804, 542, 254, -967, 56, 306, -405, 35, 712, -199, -307, 294, -658, 166, 665, -387, -212, 620, -417, -540, 435, -78, -309, 429, -160, -214, 637, -144, -947, 612, 85, -617, 624, 563, -550, 175, 402, -441, 136, 75, -420, 214, 436, -659, -457, 376, -681, -283, 683, -335, -176, 369, -405, -121, 502, -378, -201, 1090, 59, -609, 243, 358, -569, 257, 442, -226, 362, 144, -675, 251, 314, -811, 146, 471, -567, -369, 273, -321, -283, 251, -263, 31, 716, -447, -230, 567, -277, -590, 538, -109, -316, 664, -47, -545, 261, 54, -502, 424, 269, -607, 470, 438, -697, -4, 351, -338, 208, 557, -519, 304, 548]
3041E48r12L77Q96j256j9R32r58k78J075q30j2Q90m05n11P54m21p42J201N7j068
3061f82J060J52q99M17K41n27N76O1q87P84J65j075N47N00p65J36P39q76MN85
3081B56o01n3R21p22k86J104p08o98J238k73q68J107N3q04Q99m18r64P98M50p50
3101c19J28P11p81j41P58o49rO69n10mJ060r18j30P70n60m15R14m74l25O27m42
3122d0k41Q12l82o18J091n32r04R28L25r82N93M51j359Q60N07j079P33M27j033
3141d43K10R45j140J38J056j190J56O90o51m71J287m88r05J212m35m60Q11m5r26
3160f49P67L11q79R09k5q02N60L79j038N34O63j464P88O89r79mR18q43j54J026
3180G07q93l14R21o47j97P44m76n21J262k06j110R93p5n88M89L01p98L86N64r97
$$ y = [548, -364, 13, 909, -347, -366, 566, -392, -670, 405, -425, -437, 453, 48, -463, 291, -130, -872, 329, 386, -682, 378, 530, -369, 48, 289, -238, 338, 399, -488, 296, 461, -614, -67, 433, -332, -196, 543, -333, -329, 256, -345, -398, 523, -199, -485, 619, -89, -787, 451, 178, -690, 417, 470, -334, 565, 147, -817, -19, 431, -319, -191, 520, -261, -402, 356, -293, -302, 367, -143, -147, 913, -5, -135, 635, 75, -340, 574, 100, -225, 402, -40, -281, 531, 149, -469, 622, 90, -814, 114, 439, -543, 50, 501, -858, 2, 509, -570, 163, 590, -443, -233, 712, -428, -290, 766, -424, -268, 422, -229, -700, 587, 99, -806, 406, -29, -489, 322, 277, -649, 118, 429, -450, 459, 434, -368, 192, 571, -467, 67, 730, -734, 54, 743, -236, -240, 678, -165, -319, 707, -186, -500, 421, -226, -423, 321, -155, -676, 586, 380, -730, 263, 188, -400, 89, 390, -408, -22, 542, -455]
3200d55O15L59r19M51L71o40R0Q85j091J33Q60o57j19M92n21l12J024o83j29Q14
3220E68n36m33P71p5o63M77K63q08M64L30p29M63J61o18O35k1n89L03Q74j111
3240b74K5R05p53m40R71n69l11P95j20n96Q51m68l67Q32k74n08O12j6p71Q24j5
3261C33r19Q16j02n51L89L84p19m4Q27p24L5P16p25j83R21o91l9Q30o35n75R36
3282B80k66m72Q60l06o63P83j34o09O72N8o00O88Pn65L78J48r04O04L45k79r7
3303g2N69n42k1N12q15R5P06m86K5O47n76l09N21m83j82Q67l07o89O81q9p20P95
3325A27J68p94O71J19m75K97M04j055N15L81p23K81O84q16j1Q24o08m08R79o00
3345d0k34N58j66p18J028k46p19Q45k04n84O52K65p71K87O74r63L94J85n22K51
$$ y = [-455, 160, 519, -400, 51, 422, -218, -128, 757, -334, -201, 659, 2, -117, 375, -146, -458, 566, -117, -246, 568, 32, -401, 370, 295, -368, 109, 372, -436, 28, 358, -371, 92, 253, -365, 270, 249, -340, -37, 837, -274, -249, 656, -97, -537, 434, -135, -446, 349, 229, -367, 484, 16, -351, 481, 207, -301, 311, 295, -476, 348, 333, -586, 230, 128, -423, -34, 350, -369, -413, 414, -310, -275, 441, -284, -467, 454, -237, -276, 554, -81, -656, 280, 14, -458, 402, 96, -567, 216, 82, -527, 145, 203, -397, 291, 298, -267, 111, 259, -645, -41, 304, 25, -72, 497, -45, -66, 446, -369, -274, 432, -54, -29, 618, 42, -267, 254, -229, -411, 456, 149, -540, 141, 52, -668, 127, 295, -499, 172, 291, -184, 113, 517, -538, -23, 358, -365, -84, 600, -216, -227, 597, -11, -419, 560, -40, -274, 284, 118, -600, 428, 182, -537, 308, 104, -480, 172, 437, -334, -47, 627, -336, 58, 243, -279, -28]
3365b8J55o02L03Q18q87j1O17n09l22O68n44J86L94m19k3N22l00m21Q78j78q44
3386e47R63l5o48O55m21n84O55M04r54L25O01r54M96M86m59k93P48p79M5P57o13
3407a52k97J136n92o50R93n31k21O64j67m80M11jn79Q69j52n89M29K85n98N7L89
3428B24o78K62L22n58L14L30n89M65M57p52l02P93k60l34O02J13p61P45n54j68
3448c29N28k31l17O70J37r94M88K00o38O32J24m36J82M83q50J98N91o57o9P60
3468D72m05j60N91p03n8N65k66n13P83l64k23P86m79o13R38j33m54N35O5n93L07
3489G8N3n37P31N1q61N38M26r36J2Q37m39K4L73m96o0L81k72k25P36l63o10R38
3511C79j45o25L11K25l60O86k44l93M41j68l30K51J38n30M31K75k96j6K26n89
$$ y = [-28, 127, -475, -172, 646, -241, -252, 365, -144, -466, 202, -342, -156, 238, -181, -204, 318, 18, -403, 475, 297, -547, 416, 381, -267, 388, -33, -617, 38, 442, -512, -187, 414, -540, -44, 442, -17, -310, 438, -341, -296, 461, -152, -449, 687, 95, -555, 438, -93, -314, 350, 183, -297, 114, 113, -466, 403, 251, -338, 91, 376, -222, -165, 224, -454, -192, 130, -428, -114, 216, -373, 92, 549, -203, -505, 288, 28, -306, 296, 409, -352, 393, -161, -329, 199, -32, -349, 321, 458, -536, -48, 152, -486, 146, 270, -166, 16, 499, -351, -153, 438, -219, -288, 472, 67, -93, 498, -205, -263, 302, 36, -477, 306, -58, -281, 505, 26, -587, 351, 218, -236, 299, 364, -229, 78, 131, -406, 325, 376, -485, 53, 479, -457, -445, 392, -47, -23, 350, -146, -206, 175, -97, -322, 414, 51, -559, 379, 234, -391, -80, 145, -215, 471, 227, -166, 275, 107, -223, 28, 166, -364, 67, 342, 46, 30, 256, -333]
3531c33N2O46n62L2Q00m84n70Q52l54n35Q76p5o34P62m36l20M41p7o83Q92j36
3552A54n53R8O23o44O5N34m13N90q2q71K73O64l72k04M71m75q3K89J93n28N58
3573B87l56k39N81l58k64P48p8o93O19O8n97M95j38k63L56J58o53M59J64o57K3
3594c38M64j73k25M59l18p0N38n54M1N09j63n07N87j43j67L27l00Q9q5R2k75K97
3616H5L16n98L56J00j144Q35L67n25J12M10k44j71J73l7rK38l59P4L05j11l98
3637b25K25M6l36M41k4k41K13J04n37N81k22l52N09m9n35M35N16q16J2P22q54
3658c87J40O68p55J61N80o27o1P36m89k26N88n86m4O81l89m22O71r1l86J96Q0
3679C8k53O8M28m41J41L66o84M84J82o18K33L68n45J84M30m55j11N93k32k49J06
$$ y = [-333, -281, 365, -197, -165, 635, 151, -419, 433, 79, -456, 420, 345, -289, 473, 37, -283, 158, 81, -602, 290, 154, -399, -301, 322, -322, -257, 277, -136, 454, 372, -499, -226, 438, 66, -138, 333, -142, -225, 64, 257, -271, 287, -69, -308, 273, -85, -349, 399, 321, -372, 247, 315, -282, 213, 75, -188, 168, 326, -327, 132, 296, -361, -338, 126, -47, -272, 187, -131, -201, 337, -217, -176, 333, 170, -337, 250, 107, -60, 267, -33, 56, -29, 63, -212, 85, 401, -197, 159, 259, -885, -50, 317, -208, -96, 314, 70, -101, 72, 35, 26, 264, -95, -21, 284, 173, -225, 0, 46, -290, 151, 127, -114, 99, 203, -334, 247, 25, -327, 182, 133, -402, 33, 549, -267, -255, 467, -387, -247, 421, -334, -173, 407, -220, -281, 455, -34, -260, 328, -258, -302, 379, -10, -432, 239, 148, -238, -42, 38, -215, -147, 281, -160, -19, 347, -337, 147, 329, -289, -56, 312, -233, -49, 381, -74, -185, 408, 176, -73, 33]
3700C3q4m09Q70m86k56N88l31m07P62j43n39K81M87m59J67K2m70M71Q2m85J08
3721a98K82k04n3N06o57M6N64l32j98L33O5m69N62l2l02M76j83l46L45j21m38
3742c54O95l23l68P08J08p41J04M62m72j0K56r7j13O27m20k62L39k89L4K37k66
3763a45k1N17l20m03Q08m65k99M74j18k56L83k2m77L86J33l15J91K03n86L37K15
3784B20k86n6M63o16K11M92n35q3L52l60KK61k0k87L75n3m17L91J71m71K91O5
3806A10n58L75N17p54Q8M52m67L23K56l56p1M00k79k67M94k97l0J77p9j48O51
3827E37n48k93N29j12m10L90Q6l88N98j77l06N9K80m59K69R5l41L95K19p13J14
3848a76N08m98M3J95j0k94N39l99l07J073o09k45L89N0l65L71j83k71K66j63j95
$$ y = [33, -51, -460, 410, -76, -332, 256, -75, -482, 280, 137, -402, -121, 366, -93, 74, 96, -374, 97, 179, -306, -198, 84, -120, -173, 333, -324, -278, 286, -46, -244, 89, 154, -315, 247, 215, -87, 389, 206, -140, 205, 84, -354, 341, 18, -350, 358, 466, -275, -171, 291, -181, -191, 65, -32, -145, 482, 62, -200, 139, -150, -116, 121, -145, -166, 351, 31, -372, 436, -29, -328, 146, 28, -228, 155, 133, -344, 42, 175, -140, 51, 254, -332, 5, 220, -66, -122, 341, -275, -64, 428, -107, -190, 162, -198, -196, 65, 45, -242, 133, 80, -337, 54, 225, -246, 45, 110, -448, -73, 444, -310, -222, 230, -237, 86, 342, -14, -85, 315, 36, -231, 263, -34, -64, 113, 34, -114, 537, -11, -304, 225, 113, -297, 93, 179, -209, 389, 212, -94, -35, 245, -214, 55, 150, -191, 204, 423, -290, -176, 332, -166, -123, 72, 62, -232, 307, -92, -399, 674, 65, -180, 209, 259, -106, 265, 82, -189, 77, -86, -281]
3869b81M50j3m73K96K54p24N58J12m89Q9N19m64J83N12p57L85n3q6l25Q12m85
3890B0k00N21l15l19O96l70l53L88K4l99L29J80l79K12J27n24N12J66m38M29o6
3911B41m83K18M05n09R0J93k56j42N45m79j83M99j95k74N36j61m95P67r9n12M08
3932A14J24k55J88J01o30L59Oj77J75J98l30m5P50p90j92N54p4l76M04l8k23M30
3954B73k92k05O25k41k68J58J26m01K81K0n02O11J87q18N35m7l60K50L44m50j53
3975c27P16m78N9Q9n8j10M16l44k33N19k43m53Q13k02m99N61r7j94K30M6n40M03
3997G4L6l72N33j94l35M24L27p68K02M76l55k40M07l02j08L64m09J0N98k65l12
4018b09L14k29k56L47K64o30N72k02k78M94J2m97M80l1l80L51O1l75Q7N41q36
$$ y = [-281, 169, 156, -317, -21, 233, -491, 67, 179, -310, -221, 298, -166, 17, 529, -228, 157, 104, 18, -307, 505, 20, -180, 341, 26, -293, 403, 33, -320, 68, 92, -307, 22, 202, -177, 35, 162, -362, 150, 316, -122, 307, 241, -242, -24, 381, -128, -38, 155, -101, -243, 302, -177, -360, 139, -56, -330, 206, 45, -450, 317, 218, -294, 114, 238, -17, 171, 272, -358, 1, 7, -170, 5, 203, -127, -172, 578, -212, -404, 150, 76, -300, 104, 66, -157, 273, -19, -224, 401, 160, -108, 50, 176, -225, 56, 76, -426, 185, 372, -446, 89, 42, -318, -68, 276, -174, -327, 389, -89, -30, 59, 1, -109, 307, -37, -270, 249, 6, -447, 366, 164, -335, 226, 129, -65, 165, 211, -329, 74, 110, -262, 271, 77, -258, 166, 493, -275, -73, 403, 48, -192, 215, -87, -195, 169, -240, -230, 368, 103, -209, 105, -124, -380, -33, 231, -399, 173, -29, -307, 187, 199, -298, 182, 151, -229, 122, 183, -192, -105, 436, -400]
4039d00M93K67l42l29K76j58Q8L00l73J48J07j94j24O07r9o54Q48k84m66L03J86
4060B00k26J77L3l43J09K46k30J21J01l95R2N01o85R2O94n73K28k19m7P7K23j73
4082Cj47M21j70l28K43J6n01N93j25j95L13o7o07O21j3j82J41K00o13M22L56n74
4104a93M3M43n00J5M26l44j34N06j64k03L61m92j34M97J7m80M55M1l88K50J58
4125A80m17L93M3q18N72K06j60J31K29o21M21J23l36k56O20o71J61L82l72k6N04
4146B88l65j95M39k83l9L20k04m61P98l2n98M82j64q7n0L94m27N30k58p8J21J50
4168B81n99J25M25j18k41M71k15q4K14j46j37M50l33m04O09j02k67K08J18k67
4188a2L84n5n53M06l35o6N71k55l37K75M07n79M8M87n01J03M57n10j91O10n30
$$ y = [-400, 93, 360, 18, -311, -35, -193, -105, 195, -178, -30, 77, -117, -241, 366, 267, -387, 461, 177, -289, 14, 200, -26, 151, 184, -159, -50, 196, -34, 87, 188, -207, -115, 386, -299, -207, 487, -86, 142, -77, -124, -47, 176, 3, -144, 277, 107, -221, 22, 38, -463, 130, 5, -190, 123, 56, -551, 70, 57, -125, 16, 216, -397, 25, 381, -193, -150, 293, -207, -192, 234, -110, -244, 262, 98, -105, 256, -236, -370, 127, 144, -336, 119, 160, -228, 22, 180, -237, 156, 199, -619, -47, 159, -1, 130, 359, -262, 159, 282, -54, -310, 310, -361, -200, 182, -190, -216, 288, -77, -272, 167, -116, -155, 165, -39, -500, 298, 266, -332, 150, -14, -101, -151, 243, -184, 346, 88, 10, 131, 281, -318, -193, 232, 114, -127, 344, 129, 45, 259, 113, -24, 426, 93, -311, 298, 196, -71, 137, 255, -12, 372, 317, -236, 170, -165, -231, 340, 85, -252, 23, 430, -149, -101, 386, -115, -12, 445, -65, -256, 354, -176]
4209a76L7O11n92K1M40l40k49L11K04m90L79p9m58O47j19l58J49L35n64L92K73
4230C74m69J74N5k92R5L60m65j94Q22n96m21N85J17m65M80m61lM76k89k84O89
4251B88j21l91L46J06o11L89J95m32K48L19n86K20K8j27R1J64k61n1O97p12k3
4272b24L74k23k27P32k89j09N6j26l40N50j4k61j3O1j47L81Q3m07K60O4n46L24
4294d1K72m03K47J67j70j18L58l14k70O60o20MN37l21l79N90m9m88M25q9n02N41
4316C7M4m21L95J57m47K29k0o1L35r0j97J98M5l21M5N03m26k48N05l48j72K70
4338A2k28j00P38l02m89O17j35m42K59J5k70M77j14l46L82p1k14K6M32m40K97
4359A04O9m09K39J34l59j19N65j80j71M70m24l36Q35m13j7K79j08n09N03m1k89
$$ y = [-176, -139, 472, -120, -99, 341, 1, -248, 63, 267, -223, 156, 77, -381, 266, 147, -211, -62, 273, -291, 101, 374, -95, 79, 134, -158, -63, 297, -168, -362, 460, -136, -557, 28, 145, -320, 160, -301, -304, 172, -117, -401, 288, 167, -224, 122, 228, -383, 6, 201, -231, 17, 336, -250, -30, -2, -129, -38, 126, -135, -186, 511, -201, -224, 150, -73, -300, 432, 143, 34, 90, -36, -376, 174, 160, -101, -114, -53, -200, 181, 264, -143, 117, 181, -365, -41, 231, -172, 75, 242, 72, -46, 312, -2, -272, 388, -232, -228, 309, -12, -391, 199, 150, -338, 87, -2, -504, 37, 81, -340, 55, 212, -235, -6, -26, -87, 248, 158, -39, 159, 204, -117, -72, 431, 5, -243, 262, -86, -258, 12, -216, -316, 422, 120, -369, 248, 113, -329, -70, -55, -325, 152, 38, -308, 74, 3, -211, -185, 247, -193, 104, 173, -236, 3, 137, -222, -341, 224, 44, -127, 343, -81, -417, 418, 5, -12, 267, 159, -350, 153, 112, -177]
4380a77M85o8l87N5M14l18J50J71o72K23J95k69Q6K27n09Q1P39n03k66O12l11
4401d2k9J75k36m8J36J2k46O03j80k83O23m27m21M78J84k78K7J80n02K29M31p44
4423c58M18J99l27j63L49j6k51N75k68m17N10k60k08M40j51j87O7j82j34M07J42
4444A85n36N61p1j47K2K88n46N12n4n46L83K41l20MM10n51KM03l50j70N99m78
4466a59l05P07j88m04O21l27m86O99K76o92M03R8o60M55O56o87j82L76m83L23
4486D1K03m61K10J47l00j48P58l72l40M58j19k1N9j16N3K37j57k29L18J68m85
4507i6J96L05p37M57j3m47K91J38j72N3J31m91J10M99n24J29J83j04l00R50n70
4528a2j17M90n59r7O00l50l28M46L6m03K83l54l38Q99l05N9O2J45m28Q0J32l05
$$ y = [-177, 308, 240, -147, -92, 322, 4, 154, 325, -347, -124, 71, -198, -112, 115, -394, -313, 426, -77, -343, 269, -42, -71, 104, -132, -180, -44, -32, -278, 325, 145, -138, 485, 58, -363, 115, 299, 21, 48, 228, -274, -45, 386, -358, 60, 259, -68, -231, 118, 102, -149, 426, 158, -259, 251, -9, -217, 223, 72, -115, -48, -230, -364, 43, 185, -351, 210, 139, -8, 14, 302, -244, 268, 214, -332, 51, 292, -28, -24, 386, -165, -163, 240, -110, -280, 319, -159, -464, 243, 55, -349, 272, -55, -541, 158, 434, -258, 145, 243, -417, 38, 694, 7, -175, 201, -282, 41, 244, -217, -7, 140, -160, -308, 450, 78, -262, 196, 77, 56, 115, -1, 52, 289, 132, -97, 221, 389, -96, 100, 405, -332, 125, 112, -335, -44, 94, -78, -25, 106, -385, -275, 224, -300, -171, 12, -92, -392, 558, -12, -129, 361, -198, -295, 305, -45, -373, 73, 109, -294, -11, -365, -703, 196, -109, -50, 12, 157, -271, -191, -59, -364]
4550c64M84J20l71J3N98n53J1K62j11p8M65p01p4M39r8l39L46mk66K24K79l44
4572f2M6R9k65Q3L38n44M76J65m66K39om2k62O31n99PM95k89j80M60l64l32N16
4595A44n6l85M53p1k82M35r5m24N30q7l11K06L9l13L38K42m44P0J40m99L11J13
4617E4k44K41L21m84n3O03m67j04M91k60k24M45l04l86N91o8m19N34j46j76K62
4638B07j02k61J54K81n32J31M93m59j38M17l30q9N18m27K48J05j56j25J54k18
4658a29o2M17j73k48L03L9l36R1K19l20J75J23l70M39Q8n87O46K86q66L99J8l90
4680b38J85M72m81o9J97j04p7K86k71M1L36j53k94N32k69m02O12r3m85M38K7m26
4702b36L50Jm01K21J61l28Q4M11n87K54M02o28K28L18m53k63O92k32k54L98j59
$$ y = [-364, 120, 240, -131, -118, 480, -73, -62, 200, 89, 11, 476, -225, -299, 140, 42, -297, 49, 45, -221, 3, 282, -62, -16, 83, -182, -99, 239, -305, 171, 336, -130, 109, 103, 61, -201, 430, -169, -162, 333, 44, -136, 324, -40, -372, 144, 88, -297, 156, 85, -197, 238, 143, -281, 249, 162, -149, 57, 96, -217, 121, 363, -81, -11, 129, -370, -59, 54, -190, 51, 372, -112, -165, 438, -29, -133, 358, 98, -126, 319, 15, -371, 220, 152, -267, 267, 121, -55, 207, 105, -156, -2, 279, -253, -122, 371, -88, -226, 191, -139, -228, 290, -137, 111, 216, 60, -65, 89, -129, -191, 226, 53, -195, 108, 147, -189, -98, 121, -199, -24, 99, -271, 168, 256, -331, 315, 601, -265, 134, 152, -238, -53, 419, -62, -131, 66, -38, -115, 171, -100, -59, 277, 124, -170, 362, 93, -309, 303, 210, -275, 163, 190, -236, 114, 115, -286, -65, 96, -232, -148, 263, -324, -70, 332, -296, -68, 250, -203, -466, 226, -6, -260, 138, -21]
4723b1l47Q34l47m91O45m64K1N05j43n13L57on9N2J88l10K43J85k95j53K93m20
4745b46N1M77n90K75O16p07kL62k10j94L67k43j83K41K30m81K94J20k68J81M7
4766A37m69K75L2m09M12J06k69P1L67l74L4K98l4j11K33n81N4L68l25j28O61m56
4788a08j37M00J00n37N16q0l10K44J81n81K99M97o05J24J77n89M96J95m57J43
4808c2J32k84J31J60m84L32L47k27m00P39k56l33J78Q9l71N37j74l66O55l06n74
4829e07P73j8o45M29N11p16J18K42o10K74M12n67O0P20n04j29J57j86J93K38k09
4850C6p9K45m52MN28j15m20M14j15l20N59o3n04K88l9k28J68K18l39L28j4n57
4872d57M21M00m49J53J93j60j50L46j35n73O54k79L2K05n1k10K17j85l67L80M01
$$ y = [-21, -368, 466, 119, -372, 273, -191, -170, 335, 192, -321, 36, 30, -29, 23, 211, -99, 144, 329, 34, -119, 174, -246, -195, 282, -308, -33, 583, -124, -126, 236, 26, -168, 199, -44, -227, 14, 244, -237, 57, 177, -91, 90, 137, -332, -57, -25, -434, -22, 84, -185, -114, 253, -121, -87, 211, 177, 66, 299, -282, -228, 140, -185, -313, 348, -108, -245, 155, 255, -282, 234, 154, -156, 88, 269, -312, -13, 484, -121, 3, 180, -409, 87, 282, -175, -32, 100, -184, -53, 107, -377, -45, 302, 75, -325, 414, 158, -175, 3, 92, -279, 258, 84, -282, 373, 67, -507, 266, 248, -397, 32, 543, -173, -55, 187, -423, -149, 263, -304, -244, 476, -28, -157, 0, -186, 7, 245, 36, -43, 202, -250, -246, 282, 167, -253, 161, 46, -274, 285, 222, -282, 6, -33, -261, -93, 125, -214, 114, 100, -457, -36, 364, -85, 68, 261, 101, -49, 297, 162, -411, 243, -36, -4, 201, 150, -60, 157, -28, -395, -15, 386]
4893C86p25N42Rn16L39J72m13K07K86m66L70L60q13L83K29n10p4N59m54K54l6
4914H9k42K8L80k04k87L66j22m70O95K8m39K18K02m77L66r5l99L36K68l62P4K59
4936B12k85j08K66j77J97n6l64k1M87l23j15N31p0k92M85n94p1L64M6k15J33J56
4958A86n64M89m6m68L84K73p66L19L80o68M55K14k02J44P9l70M8L87l14k74L42
4979B8J78l12M38p4l01L37o5l65L22j8n47M82K19m78R5J59l17L67j10l00K29K65
5001B32m31o0L65k87J94J74k95k20M97k86l5L57p1n14N11j26l87L69P7k31K05
5022C8J2k19K17O2m38L92L9j96r4L98l80PO26q34K12M40m09J77K40k79k66M13
5044A58r1j11L21j94k99O08m19n45P69qn14M84Q9m77K42M3n65M66L47m09K03O
$$ y = [386, -339, 203, 212, -304, 35, 207, -206, 1, 287, -179, 191, 551, -262, 121, 350, -160, -234, 325, -129, 125, 89, -153, -125, 255, 51, -236, 130, 8, -462, 233, 261, -178, 40, 242, -235, 131, 36, -363, -27, 241, -121, -47, 212, -73, -181, 85, -92, 105, 49, -315, -336, 151, -172, -287, 244, 174, -118, 367, -227, -298, 66, 112, -103, 30, 186, -378, 111, 65, -403, -19, 254, -512, -193, 187, -481, -26, 188, -14, 130, 209, -161, -113, 274, -40, -314, 28, 206, -106, 332, 258, -43, 294, 229, -136, 186, 168, -379, 103, 322, -156, -61, 98, -219, 148, 38, -262, -33, 232, -199, -259, 106, -181, 13, 187, -108, -328, 169, -117, -152, 205, 134, -380, 131, 5, -382, -13, 64, -167, 38, 50, -169, 48, 110, -328, 64, 103, -93, -187, 211, -169, -162, 464, -370, -158, 282, -127, 50, 290, 11, -255, 158, 67, -44, 277, 83, -216, 392, -27, -572, 197, 189, -325, 159, 248, -229, 13, 56, -509, -43, 304, -105, 98, 104]
5066A04l22M61m0k69j75M30n08K00J27Km49R00l10l67O75m44q7j9L22l91j31M80
5088A89l03j22N11l17OL54o16o9O41n36J85K24k93O6M85m69j23M86m17p2L44k7
5110A27l13M55m48N1L97m8k58L1R8m36N57L5m88K37m9q0N39o3l56P8J86l99m2
5133a89K97k56p7L25j28j38M62m39K0K15o2j00L54j35l95L84p8k42L61R7m93M20
5155B03Q9m24Q3L35o66M28P2m28P5M93o82O23m5l14J09L55j95j70L97k99k64L75
5177A50j49l44P69k91l25M18k07k72L02J01m22L26jl33J21J11j73L60J09k98J14
5198F6j6k11J47L21l05k27K04j48J00K69r1k86L63k61k46M90n7l02Q7J66n02N98
5220A59j12j04J8K73l44j2L70l70K57k10k4l1J05O7k19M83m93n9N64l43k61L64
$$ y = [104, -218, 243, 203, -66, -241, 189, -319, -119, 8, 10, -439, 461, 151, -216, 459, 15, -72, -91, 231, -160, -291, 189, -114, -236, 275, -42, -36, 318, -298, -367, 274, -262, -77, 147, -146, -80, 405, -64, -187, 299, -118, -190, 154, 127, -186, 269, -179, -128, 269, 221, -37, -6, 92, -344, 213, 248, -240, -3, -52, -132, 407, 344, -12, 66, 252, -147, -189, 108, -148, -225, 100, -28, -166, 296, -143, -123, 92, 30, -70, 284, 149, -246, 138, 60, -182, 179, 276, -217, 203, 292, -132, -49, 286, -380, 48, 120, -308, -233, 260, -422, 201, 156, -158, -49, 306, 111, -59, 338, 39, -225, 150, 1, -343, 426, 135, -190, 228, 21, -251, 51, 152, -270, 56, 55, -278, -157, -46, -219, 141, 250, -48, 66, 50, -161, -14, 307, 2, -225, -21, -169, -69, 200, 109, -177, 186, -75, -321, 169, 112, -190, -103, 63, -439, 159, 47, -57, -39, 234, -110, -122, 248, -122, 135, -75, -99, -130, -25, 42, -177, 306, -187, -246, 318, -25, -286, 78]
5242G8L03n71N69l29m25N59K64m13m3J56k50K43M7l58K60J0k98K28K10l62k08
5263c30P49k76l45J99P4k06J57J42q9R5r5l01M23p5l39L63Q5n14J81K63l27K09
5285D3N4q4j17K06j91N3L51l95o4J48m7J02K7j77K11J63j96l7o0l47K78L09k33
5308cj12O3Q9l52L95J62m08K54m1j88J79J83n38K52J62m16M44L22n20M6J15o3
5330B5o5J28l31P4M99l99L1J15k16J25K90k36j60K86p7m58L29j2k80M33L22m93
5352g0Q3L41n47K34J01l2j91J58j0k18J37l9j23L47l05M9%L3j9L39k84j13K72
5375A43j0k44N5J03j95J78K19n16j73L49q8M14m4l25J42K77m02l2K00k11K26J61
5397B27j88j79M43n32j31P35m23r4K74j94J03j22P3p5M2n6J07K80r2l62P7M74
$$ y = [78, 381, -190, 379, 50, -375, 184, 448, 35, -8, 148, -102, 141, 188, -170, 90, 100, -198, 30, 240, -122, -330, 419, 143, -202, -3, 71, -135, 22, 164, 75, 170, 75, -226, 197, 122, -217, 146, 231, -283, -102, 161, -166, 43, 97, 13, -104, 102, -89, -36, 315, -80, -144, 4, -43, 59, 86, -91, 120, 283, 87, 50, -10, -357, -79, 230, -3, -115, -52, 37, -315, 80, 242, -166, 88, 47, -141, 38, 221, -317, -65, 97, -319, 125, 447, -73, -27, 88, 25, -40, 88, -243, -169, 330, -69, -38, 77, -139, -14, 276, 40, -120, 166, 89, -369, -40, -52, -332, 101, 423, -70, 13, 354, -193, 41, 142, 110, -81, 77, 67, -151, -14, -53, -176, 171, -134, -85, -85, -52, -71, 268, -16, -129, 143, 133, -111, -56, 47, -148, 30, 249, -267, -440, -91, -179, 235, 191, -134, 8, 285, -117, -149, 51, -160, 66, 227, 39, -140, 303, -229, -360, 375, -48, -142, 132, -62, 41, -81, -8, -83, -41, -97, 10, 290, 198, -164, -87, 387]
5419C87m65%K38n56P8N04j31o0J16n09J9O28m01N8R6k81J94J32k76K3L32n5j36
5442f5j2K42m90N58m7l56L29j44j23J99Q2j96J71P9l95N8K51l09k3L51j84r7P4
5465d7J13l06L92j21k99P32l51l31L21N0k40O8M0q2r9K36n06M00K05k51j02M96
5487C18m70k22O68m41P4K37l12k13M56j93J54J53l43J4K21j06j81J59J33j03P1
5508G4L34o03Q6J49j88K81K1l27K17K58n35L90N9l31M7Q4j54n7L55j53k01K73
5530G9j77q2M65m30J24K34J06o26J75J86j96L62k05r5kL28j06j85K33r0q2J35
5552A51l17J69K09m07J58K88l60j01K08J51k53L81m95J6L64J10m49L06k20o0J88
5573C7J48m84J62N1l6J67K38l28N8m5n8K66j33o8L6K19l43Q2J24j71M5K35j89
$$ y = [387, -78, -78, 160, -396, -318, 186, 55, -5, 111, -398, -379, 249, -152, -94, 2, -279, -85, 47, -229, -206, 126, 71, -65, -77, 165, -325, 233, 186, -170, 159, 15, -108, 91, 173, -23, 148, 227, -168, -110, 141, -168, -191, 160, -24, -121, -47, 66, -240, 152, 31, -268, 464, 113, -218, 103, 153, -87, -19, 21, -61, -160, 76, -430, -30, 175, -76, -178, 318, -152, -374, 294, -147, -73, 164, -148, -361, 95, -98, 56, 209, -134, -120, 101, -5, -186, -27, 106, 3, 74, 408, -195, -109, 40, -148, 133, 154, -173, 44, 302, -233, 157, 216, -115, -68, 16, -138, -195, 160, 7, -194, 79, -98, -180, 285, -145, -21, 213, 319, -307, -132, 54, -142, 220, 15, -80, -82, 246, 140, -45, 188, 98, 16, 151, -166, 3, 212, -195, -37, 251, -109, -210, -2, 149, -104, 277, -218, -202, 162, 272, -177, 129, -91, -151, 37, 185, -299, -137, -86, -122, 45, 283, -45, 13, -32, -90, 176, 43, -25, 11, 230, -113, -31, 93, -78, -33, 202, 13]
5596A3j21O1O3Lp6K31k45Q5J91k04N6Qk89R8K36k38J55K10n22L49k8j13J50Lq9
5621a3J65K16j66j94K33k20q9K47j34J53j59m9j43L38r0l31K22J33j78l2M5q7
5643a33K81m2m30M29J82m17l9N22m64RL40j41k76K80j35q5M8N8j87M13k64K59
5665B08l84K32k20K91j03k85N77m93j14L27k53Q0L92L5l89M5K4j05R9J20j55N1
5687b0j5j41l9L24n3Klj09p6L29k17jk9K36j84Q9L0j2Q3k77rK67j21m71K52M9
5713a16N9J98M6l22J29P6L4j25J41l6l0P7j59P5K49k23R0J35m21J28J59j18k60
5736b14L53n34L64J64j37j54K90l5p1o9j52K24K06j38k38J64R0j82j54N25k18
5757H4l75J62K20j06Q5q8r4J41L4q1J08J38m83L33l6j94L42j83p2M9K32m91K70
$$ y = [13, -108, -47, 16, 19, -57, 174, -71, 14, 205, 1, 57, 65, -224, -126, 110, -128, 27, 237, -285, 64, 36, -77, 73, 76, -13, 152, 368, 202, 8, 241, 21, -68, 179, 45, 198, 39, -10, -153, 185, 95, -236, -14, 119, -59, -91, -46, -133, 148, 106, -324, 105, 287, -130, -169, 353, -111, -102, 238, 97, -179, 101, -34, -119, -71, -13, -200, 213, -51, 208, -176, 56, -164, 127, 24, -261, 316, -177, -291, 36, -217, -137, 255, 290, -99, -54, -30, -135, -36, 84, -71, -20, -35, -176, -215, 109, 56, 58, 55, -54, -130, 199, -18, -19, -48, 188, 4, 93, 123, 111, 194, -83, -92, 175, 54, -417, -165, -116, -57, 141, 187, -135, -6, 70, 104, -21, 120, 84, 54, 131, -28, 47, 296, 73, 163, 298, -123, 5, 164, 46, -214, 139, -395, -31, 133, -4, -158, 132, 97, 26, -43, -195, 29, 235, 97, -141, 23, 113, -69, -223, 302, 84, -291, -129, 91, -15, 70, -18, -112, 29, 63, -18, 90, 228, -255, 78, 42, -152, 190, 7, -65, -16, 216, -275, -5]
5780eR2j32J60L5k19J15J44k37O7J8J5k26K21l3j2P9j22j45L95K8j95P3k0k4J99
5805B71j84j49n1J79k1k04L93m92K84P5K5r3K59m40K34J42J4l78K78j82q5L85
5827B60j89k90L71j9r2M3n3j76J27K46m59Q5J88j68R8R8k87K21j7K32k92k3q3
5850a79M04k88P0N4R3l64M8J3q1J79OK81m13L29k12R8j44M21m69P6K28j75pJ20
5874H8M6q3j1j0j0k54J35M5M6o6K4K32j30k60J80q0R4O6P0P4j66J3k18N92p7m58
5900a18O1j73J93m5K47j42K80k40k5j69l7J01o6J47J59j79On8j64J93n0J09L4
5923F4j42J00J8J66m27J64J88k26J49L2K18j83n3mj95L00j00k54L28M4j42j91
5945a46J62L3k1%J80j79p6K79k29Kj18L77l85J93j85J1L20p1%j63j36J64j74Q3
$$ y = [-5, 87, -45, 115, 150, -69, 46, 190, -47, 20, 38, 53, -173, 48, 15, 3, 82, -40, -185, 210, 238, 43, 116, 96, 72, 271, 87, -62, -113, 66, 45, -159, 234, -258, 26, 101, 126, 33, 292, -148, 86, 228, 242, -136, 142, -40, -125, 260, 71, -219, 152, 133, 41, 84, 31, -145, -18, 228, -231, -146, 42, -126, -28, 70, -217, 4, -13, 219, -73, -96, -179, 225, -63, 7, 61, 154, -210, -162, -149, -230, -51, -45, 236, -177, 152, -60, 38, -106, 315, -154, -78, 150, -25, -32, 88, 134, 51, 40, 30, 20, -234, -99, -54, -8, -74, -50, 182, 52, -208, -28, -108, -14, 52, 122, 196, 30, 43, -175, 417, 340, -118, -57, -230, -37, -82, 165, 23, 303, 63, 38, -131, -168, -67, -133, 14, 173, -6, 0, -58, -222, -29, -79, 30, 64, -78, 22, 40, 206, -221, -57, 131, -95, 54, 86, 304, 121, 68, 64, -131, 169, 69, -185, 143, 187, 45, -146, 16, 49, 28, 28, 208, 29, -47, 232, 3, 5, -113, 264, -121, 72, -113, -102, 218, 147, 147, -16, -152, 12, -162, -79]
5969g9K45j64J36j28j38K45kk03K1kL09j23q3j3k19J86k19K35J4j40p4L29j18
5992A5j1j04L39l12P9K5k42J80J61j60N7m6j1J02O9J43k08K4r7q0J97Nr6J55o6
6017A18J60j67m8j05R3J64l94L21M9k69J60k8n2k0j7r7K68j94r1J75J65k82q6
6040a77J78j40K24k5k4j16k1j55L29J6k02K91L9j98j20Q0M2k04L26k02J69j94
6062h4J56p8K82K0k51j5J32j25j08Q2p9N3k9L0P6R3j06p8n6K44k00K80j76k17
6086a54J99O9k03K14k79L92o9m25J26r5L65j50N6l0pl3L9k48N44j48q1m1J00j58
6110a7j22O2K74l29L14j89o9Q5q0k2kJ92j51N5r6RJ09P1p5%p3J13r0K3n1J59j48
6137d8J52q2J10k14R6J96n23L31l63J10L18rJ64j25j80N4rJ63k39K91j96k22K01
$$ y = [-79, 166, 2, 138, 10, -128, 117, 115, -88, -67, -69, 240, 117, 34, 21, -198, -12, -231, 4, 18, -122, -196, 133, 15, 4, -100, 239, -73, 6, 31, -211, -31, 130, -30, 27, -19, -30, 72, 141, 284, 76, 100, 3, -77, 120, 125, 29, 184, 118, 278, 111, 63, -42, 51, 215, -179, 142, 191, -78, 82, 54, 2, -18, -35, -132, 136, -58, -149, 26, 191, -91, -177, 1, -139, 85, 60, 36, -80, -101, -256, 73, 89, -113, 178, 217, 19, -101, -21, 21, -183, 143, -59, 110, -84, 72, -6, 276, 296, 45, 30, 162, 37, -71, 11, -68, -15, -44, -14, 62, 155, 49, -29, -85, 159, -41, 239, 63, -154, 45, 114, -89, 125, -154, 238, 169, -256, -130, -225, 140, -10, 46, 16, 9, -24, 15, -233, 311, 163, 82, 41, 141, -17, -139, -77, 197, -132, 182, -7, -76, 9, -71, -93, -95, 97, -54, 1, -95, -86, 23, 94, 19, 19, -54, 59, -31, -8, -59, 100, -48, 104, 22, 132, -82, 14, 210, -313, 18, -345, -235, 83, 74, 238, 113, -67, -13, -22, 141, -98, 193, -3, -225, -24]
6160b4j21N4m9P1J3r9J60p8J60j3p3o2K11l63p2K65j4k5J0L14o81M06m2j09J05
6185e6j3J42j58K5j17L69Rl15J15Q5k10J60k98K50l2J32j01p8j8l3L51k24J61
6208A46j09R6j49P9l22K79Q2j12J7m61M47j6j56J19o9J96j62J6l0J61J4j32l17
6231c83L80n2r1O7r1R0j45K57O6N6k11n5L48k15k54K65j87J07j63J85k15J90R7
6254D6r3j41L71O0j75l6J00k55K39o2q4O3KK11j66J10n2J29k65N7j87lJ25R5l7
6279E2j70N3J67m1m8k76J82J32l83L17N4Mq5J66r8j53K95j0l52L0L70m65L28p5
6303fj44K96k24M8J75l07M23m65J69K12j27j8J05j81M0k5J31j16J13j35k42L98
6325A20L9k30q9k4P5J39Oj40K41J41m64K76j9j81K14l5j4j02r3K21j91J3K18k56
$$ y = [-24, -145, -91, -140, -69, -56, -155, 5, -73, 87, 74, 1, -61, 150, -213, -285, -20, -34, -59, -49, 265, -416, -10, -52, -161, -56, -69, 73, -85, -60, -177, 192, 201, -114, 1, 86, -124, 36, -262, -12, -44, 88, -13, -91, -109, -142, 209, -15, 146, 37, 133, -16, 63, -259, 20, 102, -10, 7, -454, -7, -23, -179, -60, -129, 67, -95, -79, -109, 52, 66, -66, -383, -3, -55, -146, -79, -170, -80, -225, 32, 98, 154, -57, -112, 236, 21, -233, 32, -155, -48, -211, -26, -241, -51, 46, -47, -188, 183, 243, 68, 32, 132, -123, 116, 54, -30, 33, 35, 246, 80, 190, 138, 267, 2, 59, -128, -131, -6, 89, 52, -118, -65, 102, 61, 13, -263, -81, 51, -332, -15, 39, 43, -42, 124, 26, -127, 168, 158, -194, -164, 206, -259, 69, -6, -150, 146, -78, -30, 145, -162, 261, -204, -35, 177, 50, 32, 137, -44, -4, -29, 102, -14, 99, -36, -278, 120, 159, -71, -160, -184, -109, 30, 36, -104, 137, 278, -186, 90, 71, -110, 104, 69, 55, -47, -140, 81, -110, -97, 121, -135]
6349a35K55j49k07L40Q8k02J08k25j03M10l7k19M47n13j06M64l79j58K98J09k93
6370b07K84L3k91J68K11l76M23j13p9M6J1k07J46ok8j0N9j79j31L49k9K8J00k04
6394bj29J57j43Q5J70Kj85J08l8J0J3l60K47J38P3j37J01P5l75L74L5l03n8J98
6418E6N0j14K9j29N3k07J31R1J0k45k6L19R8j34J12j60J3J26M9j20j01J55j35
6441g9J00j30n1P7J14p3J77j23k50J25J08r0K0L75l82o2J33n1o5L48k65N9J10
6464A25j57M7l8O9k71N17k79m2k27L14k69Q5J11R7q8J36k13O7L09j78k71L12M5
6487B01l95j7M54k63M4j6o8K68m36K60p0R9l78K45O6M2J6j56j30L30r1j54K19
6510G0l1k49Q4K39j75K99j99P4k07K59j23k10K49N3j08L0M4j36j04J55j36L26
$$ y = [-135, 120, -29, -236, 104, 192, -10, 98, -127, -230, 180, 143, -76, 371, -142, -248, 216, -163, -321, -23, 86, -207, 77, 110, -181, -13, 198, -178, 245, 132, 53, 99, 110, -97, 49, 43, 15, 5, 64, -115, -246, 103, 74, 102, 202, -2, -131, 26, -117, -32, 138, 140, -45, 63, 25, 35, 48, -312, -65, 73, 146, 9, 110, 185, -190, 184, 219, -84, -142, 56, 106, -8, 21, -108, -55, -262, -131, -40, -30, -275, -301, 18, 116, -18, 94, -66, -53, 73, 122, 2, -99, 56, -79, 21, -109, -160, -83, 31, -42, 135, 12, -238, -113, -5, -95, -75, 300, -82, -144, -11, -62, -127, 221, -44, 15, 125, -32, 15, -23, 46, -225, 292, 13, -29, -256, 58, -211, -126, -15, 82, -6, 130, -83, -16, 293, 115, -156, 156, 201, -194, -211, 243, -20, 24, 8, -60, 208, -228, 32, -38, 61, -317, -72, -6, 36, 52, -104, -234, 96, 5, -149, 70, 39, -210, -126, 113, -62, 237, 38, 112, -95, 164, 41, -169, 80, 133, 25, 55, 99, -37, -141, 14, -122, 204]
6532B04k19l65L20J67r2K10K5m00J95P5l05J50K49j67M8J89j93k56K12J71m73
6553b55K63j74J67J53k42k41M74r8k14K15j84q7M70p4l11q9J73J44J11r1l8j0
6575F2q3J77j32J2Ml7L8J12j68J16k82K29K84k56pJ10L0k36O2K14m73M22l18N7
6599f3J89q0rR0pl16L08NL4l70L53j31k68M95m39L9L49j42j01J34j13l24J23K32
6623a2L6j5j71J10M0O9l76RK84m8K34J6k83j02K36J34j02J99j97J28Q3l43k5K83
6647A87l42J15n4J19j41K20o3m1J14J02m22L54l78K52Q6j48n4K65j88k49K94J15
6669A43kj82J72k76J88jk75M35j28q2Q6j56k2L5J94j58r6K68m3k19K20jkK44n26
6694a84l3M17l3j42j02R3k6J11Q4m45M32l6k72K84j38j9k20K38R9j38J72Ol74
$$ y = [204, -15, -380, -60, 107, 15, 225, 250, -150, 45, 120, -185, -35, 214, 47, 95, 284, 91, -165, 47, 218, -255, 8, -166, 1, 154, -88, -329, 145, 47, -167, 48, -136, -223, 247, 173, -138, -227, -54, 90, 201, 110, 72, 62, -21, 156, 24, 36, 40, 3, 41, 153, -15, 101, -181, 48, 332, 76, 69, 179, 209, -27, 35, 249, -224, 198, -120, -63, 126, 46, 37, 127, 120, -196, 112, 117, 151, -219, 134, 3, -265, 230, -209, -170, 179, 37, -64, 70, -43, -367, -244, -12, 24, 9, -162, -52, -12, 57, -319, -310, -26, -74, 160, 176, -107, -209, 27, 161, 59, 258, 61, 189, 272, -71, -96, 187, -155, -40, -94, 25, -116, 104, 41, 0, 114, 216, -206, 148, -230, 22, 108, -40, -94, 171, -17, -266, 28, 143, 141, -41, 131, -145, 43, 42, -233, 202, 74, -8, 78, -78, -100, -65, 129, -29, -125, 143, 100, -119, 101, 100, 98, 342, -184, -217, 200, 167, 25, -77, 16, -10, 101, 185, -260, 172, 136, -136, 148, 10, -9, -229, 9, 108, -30, 142, 148, -226]
6717b26L84k25j99M82k68j53K09J44k36L10k21j44K39K10m14J76J84l84L17k36
6737e1k51K55L70o19L82J39m05jJ82k81K37K4j38J94J52l53J63K16l30K61J26
6758B72m48J80K99m43J06K86k33j78K67k5j09m1J12j76O4n1j98K19J20k00L10
6779A33N6m17J98j48J21o2K39p2p6K34M5m90L26l00L0K67J2q0p2J64l43L05l20
6802b50P2K18q8k45M9K91M0p5O6K8k31K68j21j44J16J9j97L34j30k29M70j18l03
6825a60K51j8j76O5J02r1J02m4m91O52J6k24J8j29PL9K53l79J29L32o60M07L78
6848C79l12q6L10m6j79K90m07j3M01m72k14M34j6r4k36J70k94J92R9j38Q1L44
6870A93n73N93Q9j83k16J73j53j42J24J21j64J17J34j47P0rj68K01O0k6J0j07
$$ y = [-226, 158, -67, -266, 216, -52, -205, 4, 148, -88, 222, 1, -143, 96, 306, -108, 68, 252, -132, 185, -51, -302, -47, 323, -296, 86, 225, -180, -181, 1, -280, -43, -19, -157, 37, 189, -164, -1, 215, -115, 146, 272, -176, 4, 303, -140, -34, 252, 19, -159, 108, 83, -26, -67, 45, -131, -67, -118, -316, -97, 23, -177, 133, 189, -228, -30, -178, -57, -119, 120, 48, -28, 206, 251, -239, 87, -213, -183, 84, 96, 16, -56, 108, -235, 70, -250, -178, 40, -48, -293, -244, 47, 87, 12, 78, 106, -125, 143, 22, -122, -6, 13, -184, 150, 20, -209, 261, 143, -160, 91, 73, -103, -38, 64, -27, 75, 31, -460, 192, 208, -16, 2, -127, -120, -81, 172, -207, -78, 254, -406, 1, 379, 67, -19, 291, 245, 66, 356, -51, -64, 337, -135, -349, 85, 69, -25, -261, -91, -385, -193, -94, -232, -151, 193, -380, 213, 302, 119, -97, 76, -77, -219, -95, 26, -138, -21, 113, -34, 36, 27, -141, 60, 120, 94, 104, -3]
6892cN3J63j19k53L94j02m01N14l8l14J30J91l51J08K79n10K37O8j18j1J84k28
6914a27P7K21l37M5J89j25q7K59L2j35J00kl18L38k18l3J32Q0N1k16K51l29L27
6937A75K7k51l3K40j78k99L90l52J27M15k26k35L73r0l70N34l4k53J92l03p6L45
6959A18j85l5J49J25j54P9j46L9K78l7l27P7K00l90R4K73k99K50J36j24m5J8l71
6982b77J31L34j22k98O47m16m31N40p8k87J25J20k04L41m3j58J43R3k36K21J00
7003B45k83k7K51k66R9L87k59k40K57k32l03P10k65n8K87k20l14L29Ok27K87j25
7025C9n2J53k00j1K06j03L0M1M03o62J28J95l56J15J52q8J7K50k04l02M94l49
7047a04k07L57L9l74L63m19J51L00k75o9M46n2l08J55j45j49L20j49r2M06j01
$$ y = [-3, 50, 213, 94, -159, 235, 133, -268, 246, 208, -106, 24, 215, -136, -28, 251, -259, -22, 46, -72, -83, 101, -127, -50, 171, -166, -121, 68, -57, -144, 115, 147, 12, 112, 110, -208, 130, -88, -121, 11, 91, 142, -74, 177, -152, 175, 202, -49, -82, 158, -20, -319, 71, -281, -154, 261, 35, -200, 173, 83, -287, 247, 213, -40, 152, -151, -227, 118, -67, -102, 47, 172, 18, 97, -49, -10, 268, 231, -96, -19, 181, -209, -115, 158, -141, 109, 245, 121, 76, 94, -277, -146, 188, 66, -232, 415, -1, -432, 108, 30, -257, -132, -12, -216, 125, 82, -76, 67, 160, -76, 145, 245, -38, -65, 186, -80, 19, 406, 147, -93, 164, -68, -371, 339, 74, 16, 303, 83, -231, 98, 104, -123, 164, 39, -13, 140, -60, -71, 135, 32, 62, 103, 506, -156, -28, 167, -189, -74, 78, -10, 7, 257, 53, -249, 245, -104, -311, 46, 85, -289, 74, -345, -194, 106, -169, -238, 208, 156, -152, 3, -142, -291, 29, -120, -212, 194, 93]
7068I3l15K56Q3j21M3K33m12l29M93r2n7J16k23K06L25n7o97O49j8l23K38j13
7090b2j24L01N9k35n8R4m43N76J94m81L11q6k03m2K23k4k00J36J40j11J65l02
7112a32Q6J68p6k71L55j72j46K14O4o7j08K5k40K49L72m83M41n0n78N07J43n41
7134b40K00P3k4j42L28m32k3M52k63k66M98o5l88N50m5p4L2k63J06O3p0k42N43
7157C08j91m86N78l66l82N45N2pK9K76o72L90L7r0O3M5l31j2M96r6l03P9R7q5
7181b6K96q6n09L66Q5n88L34J00j83K99j00j51K05p9j84L38l4m07N55j20k82K26
7203E5P3n5j38K95k12l00M03j01j98J44M0k05K08P0l28O05r5k77M5J42k00J46
7225A17L1r2k57M31k74k2L70m07J93J94l13j26L61k23q7L49j99j19L44l10k19
$$ y = [93, -222, 34, 117, -4, 39, 272, -140, -469, 24, -68, -125, -9, -232, -26, 299, 242, -455, 194, 176, -147, 91, -22, -146, 155, 214, -21, -79, 15, -428, 148, 342, -139, 172, 86, -117, -159, 64, 40, -160, -24, 116, 5, 170, -132, -46, 122, 46, -225, 130, -42, -188, 26, 90, 23, -85, -60, -300, -51, 321, -162, 279, 229, -349, 158, 301, -240, -40, 33, 9, -133, 195, -237, -260, 192, -71, -337, 161, 96, -292, 258, 213, 139, 171, -92, 14, 77, 7, -235, 308, 117, -369, 209, -157, -539, 6, 58, 51, 80, 356, -316, 74, 111, 21, 84, 129, -202, -214, 282, 186, -117, -38, 59, -26, 270, 184, -325, 41, 126, -462, -128, -28, -211, 88, -12, -163, 42, -37, -221, 117, 83, -324, 231, 111, -171, 55, 128, 73, -65, 230, 18, -282, 121, 20, -178, -34, 6, -199, 9, 79, -249, 356, 261, -16, 29, 171, -29, 117, 148, 56, -201, 230, -44, -66, 304, -103, 90, 284, -29, -155, 206, -17, -104, 245, 46, -73, 271, -39, -258]
7246b58N59k10k61L58jk51M5J57l06K60O9m27Q6K52k3j09K29m83K77L26o43J54
7268b00J59k83K35M44m04k96L64J93k40K92k28m36N33J0m55K78Mk56J60L33l37
7289a30K52j08k11K60L9j79J45K60k30K8K14m61j57M26j48k30K78k7k57N53m66
7310a49J61K54k96k31M12l31k7J54P4P1P5M0m64J08N6Pj59M49k46K8J15j54N3
7333@L07j89k95M69j74m41N39o7m81L15k60j61M02J19k54K90j87k22M12J25l33
7354h6N2J11l87K94K5k98L8O88n06o5L93k39j48K57j39r6K17J1m6O6j01j49M02
7377B94m31J26M9q8k81L57m9j93J69L31m44J14L13l60qP1k89L29K21l48J09Q1
7399G3J7k32M55k61k30L67j13m29O17l11j11K91k29NJ52K73p02M90m1j45L9J75
$$ y = [-258, 301, 91, -170, 188, 187, -64, -19, 138, -168, 92, 161, -266, -180, 72, 49, -60, 169, -314, -37, 289, -354, -200, -41, -324, -89, 355, -49, -345, 19, 212, -28, 264, 36, -400, 133, 143, -312, -34, -30, -286, -126, 207, -130, 122, 14, -197, 63, 102, -77, 68, 328, 98, 126, 340, -121, -278, 148, 0, -230, 48, 21, -236, 317, -149, 12, 266, -30, -261, 151, -180, -207, -53, 21, 92, 167, 207, -257, -149, -93, -86, -245, 204, -42, -14, 101, -53, 0, 307, 118, -177, 292, 118, -323, 216, 149, -332, -17, -277, -438, -36, 83, -171, 119, -68, -290, 122, 247, -86, -34, 77, -310, -16, 9, -289, -251, 437, -69, -134, 259, 20, -128, 129, -10, -106, 111, 122, 76, 142, 41, -108, 294, -137, -11, 38, -50, -331, 26, -23, -216, -47, 284, -160, -46, 267, -93, -101, -30, -319, 10, 231, -117, -8, 73, 90, -142, 313, 52, -178, 189, 76, -353, 264, -47, -158, 133, -96, -91, 61, 334, -368, 122, 81, -64, -25, 150]
7421A50l47J36Qk19L08O6j60j22J23k00K33J6Jk53M22Qm09L34Q1l66L87j46m38
7444c87O20m3j36o4k9k9K37L5l22o7L40j03p4L27l35k91K83o1L9M29m05n6L71
7467B79l01k82J57M26n51M80j13k08L79k89j12J63P9l69L56l6j44K07R3n56M07
7488F5J90j98j87M67l78j67K86k33K52K06o05j21M84L31n68K78q5j68K71j26J11
7509A05k01J99n80M79J74k01L5m0l07K21Q1j15M0J05N5k26N22m86K15O0J3k76
7531a28K60l4k51K83k34j69K73Nl20J45L78l16K05j11k4K54k25k78J93K78K1j89
7553A6M43o02j32M76l22N5K23l42q4M35l46J49O2J33k57N02j81k12K05j03l75
7574b57K61k13j00L66J1l05J63K51k77j6K48o32N78J73m02K4L99k44J5N8k89J14
$$ y = [150, -197, -61, -53, -272, 36, 102, -58, -180, -57, -257, -24, -8, -7, -260, 162, 170, -239, 95, 176, -190, 197, 51, -387, 233, 190, 54, -10, -39, -68, 169, 204, -118, -185, 155, 52, -22, 305, -30, -321, -38, -99, -60, 369, -36, -92, 279, -22, -304, -147, 279, -272, 208, 95, -113, 266, -23, -135, 28, 107, -262, 94, 58, -86, 121, 214, -342, 65, 255, 57, -130, 337, -41, -208, 78, -155, 97, 303, -302, -423, 61, 392, -176, 102, 17, -151, 120, -6, 105, -96, 103, -477, 2, 176, -25, 10, -30, -337, -116, -35, -150, -110, -5, 50, -176, 346, -140, 75, 135, 148, -128, 132, 98, -153, 130, -104, -273, 0, 5, -315, -170, 208, -108, 97, -14, -38, 216, -9, -287, -94, 184, 205, 16, 459, -143, -275, 201, -121, -66, 157, -185, -269, 166, -180, -31, 31, 164, -93, 409, 228, 16, 221, 118, -257, 4, -209, -309, 57, 68, -237, -74, 177, -100, -116, 132, -500, 78, 251, -151, -127, 272, 28, 43, 101, -188, -74]
7596g4lK40k34K33j05j63J90L9j91L07n7l03K18J37m26K13K03k20k3J55n40L14
7618i0K75k75n3K14j53j07M78k98M9J61l65LM24l7l82L91k52j51L05j71r1J3K87
7641A75l50J1J89q0J24N3k68M4L20m21J37R8k15J41J89k72j49L18j02r5L2K53
7663A32k98L01l30J15L31j36m40N06n6l20M56k34k10K05j7k30K48l3k96L23J1
7684B8m0j7K49l54Q1L57m19l9L55j80L2j2j30j41L50J06l33P1L3k51K36J54n21
7707c85N19J45k72J98l14j90K55O2j49M9M74m20l6J56j88M6K14o0k03K81m36Q3
7729a71L06K21n76K38L1q5O1J74n16K57J45k57J03J25n0p4L41m02o0L35K7l11
7751a38L86l36r7K89O3l36L90j63k23J35J86m99N54j98l17J52M42n14J95L39n55
$$ y = [-74, -77, 163, -71, 162, 57, -106, 84, 123, -68, 239, 182, -121, 97, 234, -192, 21, 224, 4, -19, 136, -404, -90, 185, -90, -143, 71, -82, -189, 289, -9, 40, 201, -164, -161, 263, 226, -156, 235, -17, -168, 137, -34, -125, -112, 175, -175, -164, 25, -55, 69, 122, -146, -102, 218, -203, -66, 32, -183, -42, 147, -125, -274, 44, -58, -153, -121, 132, -166, 135, -195, -80, 251, 115, -325, 181, 125, -195, 261, 27, -183, 22, 5, -225, 23, -10, -306, 17, 28, -12, -29, 220, -134, -53, 304, -115, -154, 201, 21, 53, 41, -89, -230, 120, 226, -107, -36, -3, -254, -18, 136, -385, 134, 279, 7, 205, -109, -299, -44, 18, -131, -82, 392, -28, -64, 92, -96, -50, 164, 104, -99, 182, -254, -171, 135, 356, -220, 18, 49, -36, 25, 199, -317, -60, 85, -172, -69, 56, 6, -68, 273, -129, -189, 146, 173, -138, 248, -88, -185, 104, 167, -169, 221, 58, -165, -30, 156, -343, 211, 13, -304, -152, 290, -224, -29, 310, -245]
7772b45L45m2m51M06L6l08K39L51k32n0R8l93M1K53O5m50M90j24p8M10k20k19
7794g8K97k69k0K19Nm83L85J80l81K39K77l97J13k1j70j69K34j12L1K56j23l68
7816c55O06j49l87N83k52q8P9k11k7J97m2k40M02n1j63j0L27l57R1K13l15L99
7838B50j21k53K48k8k17M83j29l25n5L53r8p6L6j15k12L83r4l28N55m84M0L86
7860A99j66j69O7n6k3J78J52l07K80N1n49M59o1j25L3L64m94Q7P5P1k05L12k89
7883a16k87P12l90q6L39p0k45L20J24o41M15Q7k26p0J0P9K19R7m12J56K7k14P5
7906i7O2j55J22L75l36j76K13j85J95J55j18j25K55p6k27J83K5l36N62j82m22
7927b88K72K19l66J99Q1j65P3J99j95QL10n50Q1L44l7k88K60j43j96L69l08l48
$$ y = [-245, 100, 58, -393, 13, 49, -259, -20, 331, 99, 49, 147, -246, -205, 48, 113, -337, 153, 29, -49, 361, 141, -78, 219, -50, -70, 149, 154, -329, 56, 236, -145, 94, 371, -26, 87, 66, -104, -273, -39, -151, -120, 136, 13, -355, 251, 102, -285, 298, 46, -42, 37, -174, -201, -4, -46, -286, 116, 65, -98, -108, 219, -138, -47, 166, -149, 250, 129, -124, 124, 96, -121, 362, 233, -92, -147, 206, 108, 32, 68, -47, -259, 124, 30, -298, 257, -227, -187, 199, 33, -136, -69, -125, -148, 30, 182, -125, 155, 206, -343, 116, 55, -70, -37, 327, -167, -80, -5, 66, -139, 173, -116, -403, 309, -81, -167, 172, 102, -143, 177, 301, -340, 75, 162, -64, -134, -124, -45, 174, 271, -141, 15, 42, -172, -97, -35, -190, -68, 307, -29, -205, 8, -177, 18, 173, 55, -70, 185, 109, -118, 65, 90, -246, 316, 134, -288, -16, 203, -163, 36, 117, -48, 25, 224, 29, 37, 347, -203, -122, 222, 185, -103, 157, 14, -182, 187, -121, -469]
7949d69O80k23k42K90j29J01KR5k74K86J94o34K81O3J1L08k12k05%L7k01L42K53
7972C54n90K52r2n7J60J25m64L56J24j39k45L58j89r9N4L05l38K29Q6l57J50J64
7994A47l83J69L85m93J50mn9N6j4o8P5J92m49j5N82k07J15M1j59l99K91L86l38
8017AJ30o4l22L88j61m4j8k53R3J03R1k20K87L41m21L16k15j47K0K11l89J00L01
8040A28k89Q1J63o8l9K88l47J1OJ30m05M89J42m03J36P6l71M04j08O6n1J62l12
8063a11J41n6Km6K37m28J97K80k69j89N02j29o5o5m4J92o2mk70K66K1l82J25J29
8087b8k10K29K43j68l02K27O2J10J77n30N7L39m28Q6J11j20K81k39k1K36J78l13
8109b3j36L76j31k93L18R2k37J66j30mJ70j85k5O1O5m89M79j78J1J20K60l86j7
$$ y = [-469, 211, -12, -254, 36, -93, 8, 10, 105, -169, 117, 311, -323, -42, 21, 32, 340, 128, -77, -77, -40, -241, 101, 354, -236, 16, -76, -133, 27, 152, -312, 44, 168, 29, -216, 142, -47, -146, -92, 213, -125, 104, 190, -167, -17, 147, -236, -67, 318, -175, -25, -29, -88, -32, -46, -114, -39, 153, -296, -311, 271, 64, 179, 220, 61, -338, -47, 339, 1, 131, 67, -255, 133, -28, -72, -90, -343, -250, -147, -56, -276, 11, 352, -69, 247, 32, -115, -95, 116, -273, -173, 128, -161, -80, 83, 15, -24, 264, -83, -72, -66, 64, -341, 148, 290, -113, 23, 99, -272, 132, 24, 90, 39, 201, -111, 30, -26, -24, -70, 167, -261, -64, 216, -53, -242, 260, 131, 66, 1, -43, 149, 87, 83, -187, 79, 100, -282, -157, -28, -238, -9, 234, 66, -236, -9, 53, 163, 340, -190, -133, 206, -222, -136, -25, -145, 136, -103, -124, 112, 290, -23, -159, 217, 86, -207, 111, 203, -34, 132, 2, -2, 168, -17, -42, 19, 84, -405, 74, -104, -93, 27, 287, -99, -116]
8132a16K56k47L5J59r5r0J45J1r0O9R0j79K84n2k19K4J11j69J80N4m17K82P2m77
8156c79L40R0m25L86K4r7J6M40o31R5J91j57J43J09n91L81K74m6j08k1J68l47
8178a45L04j98k14L61k62qJ66KQ3J69k35J4M1
$$ y = [-116, 140, -107, -72, 87, -8, -98, 47, 58, -32, 37, 127, -52, 232, 180, -39, -15, 96, -73, 107, 161, -256, 26, 98, -379, -39, 51, -374, 12, 36, -61, -45, 395, -236, -141, 50, -107, 36, 145, -446, -65, 209, 163, 55, 34, 202, -145, 159, -39, -253, 108, -154, -162, 4, 6, 89, 258, 23, 37, 78]
8191G8
$$ Imaginary data points
##PAGE= N=2
##DATA TABLE= (X++(I..I)), XYDATA
0@%%%%%%%%%%%qJ6j6J6k4L2l6M4n6O4p2Q8j04J20j42J66j92K23k54K90l31L75
33A99m24M79n39O06o77P56q45R39j043J157j281J414j561J725j903K096k308K543
51A333k803L090l410L769m174M635n166N785o514P392q474R843j1634J4088j7667
66i907K3380l3907N9362k28299k32059N85053N792k68407J57385J05544j54118
77I819O6471Q778p6911R2186m915j05797J63227K8034k40390P309J14124j37366
89g5431j1983J62360r851r6664k0752N677M4899l8416q5892J19943J33904j01817
101B5977p2818J8201k1922P2134M3664j26583N1600J38120j63014j03741J52885
112A4503l6648j15371R4318L8292o655O6444j09850q0037J62844l8594j03642
$$ y = [0, 0, 0, 0, 0, 0, 0, 0, 0, 0, 0, 0, -8, 8, -8, 8, -16, 16, -20, 24, -32, 32, -40, 48, -56, 64, -78, 88, -104, 119, -135, 155, -176, 199, -225, 254, -285, 321, -356, 400, -445, 494, -549, 608, -673, 741, -820, 905, -998, 1098, -1210, 1333, -1470, 1620, -1790, 1979, -2195, 2440, -2726, 3059, -3455, 3937, -4537, 5306, -6328, 7760, -9907, 13473, -20434, 38928, -189371, -421430, 163623, 169415, -98992, 58393, 163937, 9819, 76290, 85068, 8157, 100343, 95428, -10369, 152858, 180892, -59498, -52189, 61935, -75431, -87414, 74946, 65095, -31569, -52321, -46644, -1745, -40161, -126053, -6110, 127794, 25977, -46841, -28640, -50562, 21572, 65236, -61347, -9747, 128373, -34641, -138382, 14503, -22145, -137516, -43198, -4906, -11561, 54883, -54967, -135004, 27840, -10754, -114396]
123a14396K51333M4427k91632J06988K18333k17018p8018K25384o983r6367K3003
134F5054m2269K5315L8133j84052r646K29834q7723j78013J38243K1381j63855
145a47598N1605P7836m0300N5461J7183p1602L7658n349o5508J03363N4369r6569
157b9451N8199P2692j02538j0149M0648o5342N2932O5486j24614J3111J32428
168A03402j11474j03647J09771L2418k1943L1763m5312J2561P1218j23983m1557
179h6783K01425k9258j64206J20666O3235j55157K0310Q1305p5218p631L7606
190F294j4302M4714n6953j30032J25637Q9746j87860K5749J96946j01554r7141
201i8756J20117j5496m9843P9011l4091k1123J09561o3824q4620J26249q219j02999
$$ y = [-114396, 136937, 181364, -110268, -3280, 215053, -1965, -79983, 145401, 138418, 42051, 65054, 22785, 48100, 86233, -97819, -107465, 122369, 34646, -143367, -5124, 16257, -147598, -95993, -18157, -58457, -2996, 14187, -57415, -19757, -25106, -90614, 12749, 67118, -29451, 28748, 101440, -1098, -11247, 29401, -35941, 16991, 82477, -42137, -29026, 103402, -8072, -111719, -1948, 30470, 8527, 40290, -5022, 7539, 78757, -45226, -86783, 114642, 85384, -78822, 41844, 105079, -50078, -29768, 51537, -23681, -31312, 6294, -8008, 36706, -20247, -150279, -24642, 65104, -122756, -97007, 99939, -1615, -98756, 21361, 5865, -43978, 35033, 942, -20181, 89380, 25556, -59064, 67185, 58966, -44033]
213d4033J08057J8740j31507P5682N9612j36210J1893Q0470o8577J7609O2711
224E4447q7504j1777P1302m8729j3446N0297l5601J9275M2238r4044J0252J12539
236F9249q9548o9358J30488O507q7443M2305N293l3447N0448k5897l8860P7611
248C7348l0808o9067J03726m123j23466R7110Q0437j24498J5196Q3916q0265o568
260b1062N5538o2421K9669O4332j09348Q339J28108r3509o7524J18234m2034p0484
272f2162J16668k5001j14804R3523L7058r8020M7100L6247p7478M1169M0923p2285
284c7062K8002L9561p0017K8056N2921o9718J2399N4705o9128J0578Q3542o0027
296C812l6484O6548j8321j4908L4074n8087n790Q2306n7335m6130R2068k8220
$$ y = [-44033, 64024, 82764, -48743, 26939, 86551, -49659, -37766, 42704, -25873, -8264, 54447, -33057, -44834, 26468, -22261, -35707, 14590, -21011, -1736, 40502, -53542, -43290, 69249, -20299, -89657, 40831, 47338, -40105, 2200, 7493, -25954, 24494, -1403, -40263, 37348, 6540, -62527, 41199, 37076, -86390, 10720, 91157, -33341, -18145, 65771, -14494, -21062, 34476, -27945, 1724, 66056, -43292, -34953, 93155, -354, -67878, 50356, 8322, -62162, 54506, 29505, -85299, 8224, 45282, -52738, -5638, 30609, -46869, -5700, 35223, -37062, -9060, 30501, -39516, -11460, 41461, -28257, -15858, 38847, -30281, -19703, 63839, 3812, -32672, 33876, 15555, 647, 34721, -23366, -29156, 53150, -4185, -50315, 41753, 13533]
308A3533o9433Q4184l703q4316O5998J9296q3469N0201L9084o9612L5636L0115
320B7514o7446N5305M6716j06406K5002R3398q3986j9414Q5966o0866k7830Q6685
332E4638n5222n0219R2093k5215o5590P1278q883n8487O7936j1164p6420P6924
344A1669K5756r2218M2650N2315o6024K2987M0843o2328K2861M8451o9313M9N6667
357C4365m7461k829M5316n3868K921O9156n9449l2432P6077k7529l9885N8514
369B2896k4277l3941P1986j9382n6663P1878O173o7560M9995J3267o1161N1402
381B4613J6556q3708M0844M8707p9657R809M9017o2929J6069N7092p5919l858
393d3364Q3623n8647l6164P8369l0440l6308P0645k6935m1486Q3366j2442p0359
$$ y = [13533, -55900, 28284, 24581, -59735, 6263, 25559, -57910, -7709, 31375, -38237, -2601, 27514, -39932, 15373, 62089, -44317, -19315, 74083, -9903, -29317, 56649, -4217, -32047, 54638, -584, -50803, 41290, 16075, -49515, 21763, 12880, -45607, 22329, 11165, -65255, 11669, 37425, -54793, -12143, 40172, -25852, -2865, 37978, -24350, -1489, 46962, -22351, -22302, 34365, -13096, -15925, 29391, -24477, -21556, 47600, -11849, -44281, 31796, 4267, -35618, 22896, -1381, -35322, 36664, 17282, -39381, 32497, 38670, -28890, 21105, 34372, -26789, 24613, 41169, -42539, -1695, 47012, -32645, -22836, 26181, -36748, -20679, 36413, -39506, -43364, 40259, -18388, -54552, 23817, -6623, -42931, 27714, 779, -40707, 42659, 30217, -40142]
405d0142O6975J5729o7223M6478J4909p2379M3951L8949p2981J6385M5603n1347
417a5093J0522L5583n6438J1337M8552n8820m403O2693l9515j9115M9479l5491
429a0709j1748O1303m2428l7428P2079j3579n2566M6844p948m4294N2007l418
441H115n2741N3858Q023o4112N1028K6786p4650L9290N2387p6601Q159O8577n2707
454d588j6045N3806k6957K567M1952o0506p845P6551n4211n1059Q1492j1319o3526
467c9688N3667M743n6153L7929Q095m4905M1529Q237n3989L9419J5438o4700L9075
480a1303M3953o5701J4192N5356m7856l286M0773m5841N283O1416m7398k6041
492b6453O0002k3787l5390M0914j5454j2914N1201l1018l3836O7983k2067p3093
$$ y = [-40142, 26833, 42562, -24661, 21817, 36726, -35653, 8298, 47247, -25734, -9349, 36254, -15093, -4571, 31012, -25426, -14089, 34463, -24357, -28760, 33933, -5582, -24697, 24782, -10709, -22457, 38846, -3582, -41010, 31069, 17490, -35076, 11768, 3820, -40474, 11533, 8115, -44626, 9232, 17255, -46857, 4171, 30957, -43693, -4403, 47984, -28617, -20458, 48119, -4588, -20633, 33173, 6216, 8783, 50735, -9771, -17616, 58935, 4724, -46335, 35157, 23838, -39688, 13979, 18722, -37431, 498, 8593, -36312, 5217, 13454, -40535, -1116, 14322, -50378, -11303, 32650, -33051, -18859, 36497, -11359, -14645, 26128, -19713, -14430, 46986, -412, -26453, 33549, 9762, -25628, 15286, -168, -13082, 38119, 7101, -26735, 41248, 19181, -53912]
504e3912O2466L0175o5884K8158L4999n1691P181K3448l1713K4099J1374n1070
516c2370M2742L7240r4582j720Q8047m7137m2712O9298k216l8350K0606j7384
528a8538n547M5626l3800k1190P4918j8296o5328N2369J1819n4626M7490L0406
540D5303n3311K2814K0459n4178K1861K8071n8834K0854N7097n1189j9128L8072
552A7891l2200o371L4712l3482J1755N5235o5954m1002Q1249j2750o4726N4368
564a275L4173l7579O554l521j5397L2135k2118l2681P3389P443q3798M1290M8892
577D7507q6565q665Q2766j1267l1260J4726q301J0525K446n3358K9887P0264n7104
590A601k9391P4356k5375o2448M6046J3164k7849L4291q073l9933L6915o471n6293
$$ y = [-53912, 8554, 38729, -27155, 1003, 36002, -15689, -8508, 14940, -16773, 7326, 18700, -32370, 10372, 47612, -46970, -48690, 39357, -7780, -50492, 18806, 16590, -21760, -1154, -18538, -24085, 21541, -12259, -33449, 41469, 23173, -42155, 10214, 22033, -32593, 14897, 45303, -8008, 14806, 35265, -18913, 2948, 31019, -27815, -6961, 50136, -1053, -20181, 17891, -14309, -20680, 14032, -19450, -7695, 47540, -18414, -59416, 21833, 9083, -55643, -1275, 32898, -4681, 1873, -1648, -17045, 15090, -7028, -39709, 33680, 41123, -42675, -1385, 47507, -39058, -47723, 35043, 23776, -7484, 7242, -1059, 9466, 11912, -41446, -11559, 58705, 1601, -27790, 46566, 21191, -41257, 4789, 17953, -9896, 24395, 16322, -23611, 13304, 6833, -49460]
603d9460L6680K3775l8720L6504K4951o1948N3K4724l0142L5667L7718o4361N388
616a9171O7492m9475l8276N8797k306k8411L0963L834m556N098o1678n877R1819
629D8253k4449p1660O6733K7631q1119Q274M4544l1829k871K8061J56J2826k5827
642a277m9790N2371L6537p0911J5326P3085n0017l9058N1829j1245l6437J9657
654i930r70J4181L8279n0600m1961N4732J324l3722M5716Q683l9565K6035K112
667A4314l7455L3052Q001m5712M3256L8447o0343l520L6741l8649j0514L5761
679A3379r947O062Q489m8618J3266M3184o3604j4556R6393j3168p2415L7555K5060
692B1080l8770M646J0688K187K7280k3812k7065N4062j0666p0338M7209M8825
$$ y = [-49460, -12780, 10995, -27725, 8779, 33730, -28218, -28165, -3441, -33583, 2084, 39802, -24559, -19171, 48321, -1154, -39430, 19367, 17061, -11350, 19613, 23447, 18891, 23989, -37689, -43566, 48253, 23804, -47856, 18877, 46508, -34611, -26337, 18207, -13622, -16493, 11568, 11724, 24550, -1277, -51067, 1304, 37841, -33070, -17744, 55341, 5324, -33734, 18095, 6850, -29587, -9930, -10900, 3281, 41560, -9040, -51001, 3731, 5055, -28667, 17049, 25732, -13833, 12202, 14314, -23141, 9911, 17912, -27800, 15456, 53903, -6440, -9960, 26781, -11868, -22382, 13379, 3432, 9494, 17983, -30635, -17369, 25815, -37789, -52345, 44048, 30880, -41535, -3980, 21080, -17690, -13044, -2356, -169, 27111, 3299, -23766, 30296, 19630, -50708, -3499, 45326]
704D5326o0144L356N0732m0870k9277K6484o965J0000K3972l2165L499L6787m1486
717a0751k0187N3427q492k8564L1883o736k0729L1203j9248l8336M3837J4373
729B1680l7453K2764J1366l8892Q673Q730k0487L1145Q446m4625L0489K6503o2217
742c3878J1440O2633m2153k5658N6814n005l6431J1734k372M676J7924l6528J947
755a4857O1356l7281n5677N7017J1276n6761L1012L4020m2000L93J7451k1633
767a5684J4865J2890k8842K2835K1233m5974J0317M1360m2741j8179M6329j0417
779G992j7138K3954j7811j4840L0891j4444j8259L4236m179k3416K1493r967j8335
792a9823L3711q376l0887M3020P478n1730K5358K8303m3126O223L0330k9900J38
$$ y = [45326, -14818, -11462, 39270, -1600, -30877, -4393, -11358, -1358, 22614, -9551, -6052, 30735, -10751, -30938, 22489, 13997, -14567, 17316, 10580, -10149, 21054, 1806, -36530, 7307, 21680, -15773, 6991, 18357, -20535, -11862, -3132, -23619, 7526, 15972, -28653, 1836, 28339, -33878, -22438, 40195, -1958, -27616, 29198, 24193, -12238, -504, -2876, 1800, 19724, -16804, -14857, 46499, 9218, -46459, 10558, 21834, -34927, -3915, 30105, -11895, -11502, 5949, -15684, -819, 12071, -16771, 6064, 27297, -18677, -8360, 33000, -9741, -27920, 18409, 7992, -9146, 14808, -3003, -17843, 13048, -1396, -19655, 14581, 10402, -13014, 8479, -1488, -19823, 13888, 5512, -25375, 17645, 25123, -26607, -1249, 27054, -16072, -9849, 20481, -9419, -9281]
805i281K5245k3810J5J5814l0644J6333M1196m5763j7635N6242k0755l8452M3439
818A1944M960l3486K1182M027j8276K4428p152l0407L3715Q354l7495K3648J4109
831A9551m3372J7964L1968l9706k628L3874k0361m962K2298k2495m500K8083j9093
844c379q391K6774k0432j2315L2049j6054j7179L4950j3854l0135L8926O916l8224
857b0348J5393J1987j9155K0332L793k8800K2889J2751l2724K1237K0053m2306
869a4898J0497L6492l7666r362L7290k3268j7464L1704j1445j4992K2465j7735
881h382j0621L6632j8270k9990L9128J276l3888K8693P910l5236K3973J9711l3633
894a2697R636J9560k5256P264J5460k6761R407K0541l1684L291L2639k7444j0468
$$ y = [-9281, 15964, -7846, -7831, 7983, -22661, -6328, 34868, -10895, -28530, 27712, 6957, -31495, 11944, 16904, -16582, 4600, 8627, -9649, 14779, 7627, -22780, 10935, 19289, -18206, 5442, 19551, -23821, -5857, 26111, -13595, -16223, 17651, -2710, -7672, 14626, -7869, -12369, 15714, -3379, -11770, 15004, -5428, -17743, 14306, -1748, -18927, 16023, 2169, -27966, 10960, 17876, -20348, -4955, 7032, -12123, 8209, 12002, -16798, 6091, 18842, -13882, 7355, 27408, -14898, -4401, 32091, -5575, -14937, 22353, -915, -18379, 13325, 1880, -13112, 9353, -8382, -19003, 17629, -641, -30631, 8497, 9773, -24115, 4578, 12488, -22748, 1225, 20936, -12697, -3061, 16499, -8757, -1493, 13967, -12794, -3387, 17154, -14530, -11239, 21400, -6044, -16512]
907a6512L3068j5700j4398K9799j1930j8322K8457l742j9482K1035m350j5499
919g576K6087q544k7926K9840N204l6573J7245J3664l1865J2053J7294l0147Q045
932a3199K2001k7028M405K4786k5475J830K9397k6205m398L8264k1945k0053L8071
945B0451n903k4605K7288m191k4458K6582j13l0356K0850O443k8359J8591J0250
958A2470l1532J6269J9123l1114P970K4480k6499N5K5567k0745l591K4346k0263
971c464q151K7496j4714j4174K3305j2678j4348K4972j0711k1467K6273r37k4152
984b2750K1370N139k1850J9974P581k2521J9341J0987k6899J5725J7088k8472
996e287J0037K2463k9115j01K7352k4958q550K5931j9576j0610K5602j8576j6637
$$ y = [-16512, 16556, 856, -13542, 16257, 4327, -13995, 14462, 10720, -8762, 12273, 7923, -7576, 18511, 9967, -17959, 11881, 17085, -19488, -2243, 11421, -20444, -8391, 8903, -21244, -13199, 8802, -18226, -13821, 10965, -14510, -12680, 16717, -9488, -13886, 24378, 2433, -17620, 20451, 14548, -10057, 17231, 13040, -11418, 15164, 15051, -15305, 5545, 11988, -16371, 2220, 12470, -19062, -2793, 16330, -14784, -6814, 17666, -8833, -8778, 16789, -3956, -7547, 16799, -3464, -11615, 15881, 1167, -13007, 10298, -2380, -16728, 8244, -2467, -23934, 2339, 1402, -22750, -1380, 3759, -18091, 1883, 9464, -13057, 6284, 17271, -9628, 6097, 23185, -5287, 4750, 27213, -1902, -2003, 25349, 391, -8159, 17772, -1804, -12414, 13188, -5388, -22025]
1009b2025L0980j1342k3855K9845R80k5355K2118M849k3332K0423P035k6333J9010
1022B998J3510k9323J1671J8969k8631L670K4325k2282l750K1337j7930m652K0252
1035A0164j7832n003K6880j5246j3412K9233o267k0165K1435K81j4997J8510k864
1048A0717j8891K0302K60k5468J7279Q141k5435J2385J1411k5230P493J2890k4006
1061a8152Q359J8721k5306L847K6557k5576o787L3706j4513j6149K7741l894j4263
1074e709J8338j0658j3853K9049o919k6943K7673Q008l3399J2953J5594k4105
1086i971N951J4192j7435O547J0823k2363P551J7047k2964M577K6112k2559j0958
1099a3450K6589j0330j4461J7261o829o636K0174j3041j6541K4377l609k1362
$$ y = [-22025, 8955, -2387, -26242, 3603, 4583, -20772, 1346, 6195, -17137, 3286, 10321, -16012, 2998, 16508, -12815, -1144, 17825, -10806, -7136, 17189, -5093, -8843, 12494, -5436, -10088, 10164, -7668, -12671, 14209, -1037, -14449, 14784, 8517, -11648, 9787, 10068, -4929, 13581, 10717, -8174, 12128, 12388, -13080, 4199, 12340, -13095, -710, 10701, -14529, -7036, 5854, -18152, -9793, 8928, -16378, -12531, 14026, -11550, -18337, 15369, 856, -15293, 12448, 8554, -5709, 12629, 1971, -11882, 17167, 10248, -16695, 10978, 18986, -14413, -1460, 14134, -9971, -4020, 10172, -7263, -716, 10107, -12256, -4705, 12342, -10622, -6045, 20067, -2492, -13450, 13139, 2809, -11652, 5609, -1220, -7856, 12318, -723, -17264, 7113, 3504, -17858]
1111a7858J9691O236j7652J2858P34j8591J8437N489k5261J7640J7622k7096M799
1124b952J9644k2781k067K1818j3505k757J5164j7231j341K0579k3267q784L5914
1137A8434j0661k7830K6167P073k5695P068O866p371J3693l722j6968J9785K179
1150I018k7943J7149J7972k6253M416K0503j8921l402J5226j4607L8J7507j3112
1163b409N79J9019k1483j1309K8155o360j6907J7621j637j2062J5976q337j8604
1176a7758K2743M215k3241J6013J2018k3786J610J1018r942Q259N505j8034J3624
1189B244J4616k6676J486K3428j9995n115K9955j0152k0981J2600L53n467J0133
1202F429j0871l738K3359j3803k0582K7553J120l0525J6304J8855j6563J936N045
$$ y = [-17858, 1833, 8069, -9583, 3275, 4009, -14582, 3855, 9344, -15917, 1723, 19345, -7751, -2952, 16692, -6089, -8156, 13662, 157, -2600, 12564, -4667, -6008, 14571, -8696, -17480, 18434, 7773, -20057, 6110, 13183, -12512, -5444, 1422, -5949, 7744, 4022, -12946, 6839, 9018, -18925, -1776, 16196, -10057, -5641, 14862, -4059, -7461, 7765, -6842, -6804, 10703, -2409, -1830, 17189, -4294, -15603, 12552, 6192, -10715, 6906, 5269, -6793, 9183, 846, -17758, 4985, 9200, -14041, 1972, 13990, -9796, -8186, 2832, -7110, 1149, 6654, -11380, 2244, 16860, -9816, -8330, 15098, -4897, -10012, 19943, 9791, -11190, 1410, 1763, -3704, 6429, -4442, -8180, 15179, 1376, -19206, 8347, 9467, -21058, -4754, 14101, -2462, -526, 4519]
1215D519j4777R769J0009j8100Q737J4523k0278K260J6702k0786n442K1815r655
1228g04o799J6827j1669r679J8674q599j2432K2309l4j7455J3564M700j3324P120
1242B499j552p502K2134j60k7200J4258J4469k5658P88K0307j3280n899J1868
1255E072r079j562O974j3801M455J7443j8015l258K6216j4504k0696K4212N681
1268I138j7406J0645N642r327P822m381j1713J8327K588k0988J2115J0317k0730
1281g951M402J2157j7440L127J6012j4095r77J4915j3813m482J6400r236n429
1294f410J7108o446r381J2143p762p689J8024o032j5407J9050N71k3147J1378
1307d000J1253j6177J257Q153o268P229J249j5153J1115R825j8103P030J9600
$$ y = [4519, -10258, -489, 9520, -8580, 157, 14680, -5598, -3338, 13364, -7422, -12864, 8951, -704, -7503, 9324, -2345, -12024, 6650, -1949, -14381, 7928, 7894, -9561, 4003, 8703, -4621, 2499, 947, -6555, 15579, 15419, -11781, 2477, 16946, -8712, -7924, 12383, -897, -6796, 5072, -4007, -5569, 1405, -12396, -7941, 9502, -8513, -11771, 14445, -59, -20755, 3457, 9138, -8268, 2377, 8019, -1308, 6514, 2133, -9580, 8747, 11335, -9653, 2462, 12779, -7951, -3549, 8608, -8832, -5705, 10307, -3788, -4765, 10150, -3663, -8145, 8255, -981, -6410, 10698, 4252, -5129, 7014, -748, -8437, 9587, 3555, -11852, 7198, 7769, -15378, -4000, 7253, -8924, -7667, 486, -5782, 1447, 2696, -12457, -1342, 8483, -9620, -2590, 17010]
1320A7010j8152o755J9958p922r645J3903k242o277R327q304n147J4811j0473
1333I2j2950J9985p15j9267J3116N978j6967P270P759j4136Q495R850j5037K380
1347d147J0180j2337K355J2305j1623o5J1949j2465k133J5480j1123p195J6458
1360G639n984j0928J4892j316j3184Q854K694o053R122l119r770J4596J21j6797
1374i233J2433R244j8178M485J2570j3267j467R836q732J12P930j0852K73J0755
1388E909j2113k189J5463j2203q660J9656k697j3838J1633Q53j0651J1919K840
1401E922j2441Q323M104j0600Q284M781j3378O459P637j3156N271R779j5024j038
1415e077J3566q729m335R997o928l649J0419o310m176R558o449l697J3764p274
$$ y = [17010, -1142, -7897, 12061, 4139, -5506, 8397, 6155, -122, 9205, 901, -4246, 10565, 92, -12858, 7127, 6412, -12855, 261, 6239, -10728, -3458, 4301, -9835, -1340, 8510, -6527, -4147, 6033, -6304, -3949, 8356, -3267, -3332, 8617, -3848, -5981, 9499, -1624, -8819, 7639, 1655, -9273, 5619, 4303, -8881, -27, 2667, -3386, 5736, 2617, -7153, 7443, 7564, -9233, 3200, 12444, -5734, -1249, 11321, -1946, -3413, 6423, -2309, -2197, 5733, -5119, -4846, 5909, -6204, -8393, 7070, -5133, -13793, 5863, 3166, -10672, 961, 1814, -8837, 3082, 5922, -6519, 1804, 5908, -4692, 3592, 8373, -5005, 1454, 9091, -4065, 1206, 10985, -4039, -5077, 8489, -240, -4575, 5422, -1506, -5155, 5264, -1046, -5222, 4336, -2113, -5810, 7954, 680]
1429F80j1752J5714R03j4052R449N115j2587N509N800r070M386L108j0999P135
1443f61P259j2879K903R654j2233J137J4100j0553n966J3683m171n904R827m310
1457A886n507J0653m011p582J0985k368j0011J0742N09j2438Q637M064j2712N264
1471a889P061j1092J697P354q009J997O185r223L080Q867j0245o97J1734q397
1485a577l512J2439o159p031J1844k319q393Q298n33p423Q202j120q848Q580J433
1500C881j0931P881N000j2275M836P657r961J837Q258r181L01Q853o853j552P350
1515E101o949j053R464p681m540J0491m746o852J0251k444q626R114O87q779P342
1530G80K192q664O275L418q108N422L941r569M960P144j0410Q39Q960q256j170
$$ y = [680, -11072, 4642, 5545, -8507, 942, 6057, -6530, -1021, 4779, -4291, 95, 3203, -7796, -661, 6598, -6281, -3378, 6276, -5957, -4820, 9280, -1273, -7239, 6444, 2273, -3631, 6196, 1886, -3621, 7032, 3021, -4561, 6424, 4056, -5955, 4787, 5296, -7142, 1495, 5559, -7153, -1889, 5172, -5920, -4223, 3131, -4878, -2881, 3304, -5919, -2839, 6028, -4217, -4914, 6820, -1577, -5089, 7350, 1191, -5840, 6004, 3685, -4708, 3590, 3057, -4366, 3836, 2716, -6132, 2448, 3881, -7050, 831, 5831, -6444, -1608, 6049, -3912, -2075, 6183, -2998, -2697, 6156, -697, -2249, 5101, -1848, -2901, 6563, -1118, -5658, 4833, 87, -6765, 3486, 1042, -7584, 1530, 2217, -6562, 780, 2972, -5692, 583, 4001, -4107, 1315, 5256, -4313, 647, 7791, -2619, -1780, 7180, -1076, -2246]
1545b246Q423p101l285Q702n092m028P417l730m421Q817l726o190R775j300q902
1560f887Q723K607r095N325L625p789M418L354p819L594M973q019K006N997q185
1575c172O84P589p560j517Q142n147l294Q015m110l857Q210k995n378Q168j194
1590B584o878O955L8o765O203J520q339N747L487q935L086N067p226J719N103
1605C366o672R38O205o672k10P243n781j688Q445m878m538Q613k652n747P115
1620C087p62n484N758q90o381O634R50p968N374L533p899K916M249o380K331M162
1636C230o302K067N679o762k97O943n964j579P387l528m142N960j869m036N702
1651B489k278l369O420j656o052O287J196p006M131K887n645L225K448o217K863
$$ y = [-2246, 6177, -924, -4209, 4493, -599, -4627, 2790, -940, -5361, 3456, -270, -6460, 3315, 2015, -6887, 1836, 4443, -4652, 673, 4298, -3491, 927, 4281, -3538, 56, 5029, -2990, -984, 5013, -3172, -2488, 5101, -2459, -3976, 4166, -981, -4275, 3740, -370, -4227, 3983, 988, -4390, 3778, 2584, -4294, 2661, 2699, -4066, 2137, 3657, -4682, 1065, 4552, -4383, -1297, 3770, -3456, -1737, 3366, -3306, -2368, 3837, -2835, -3045, 4198, -1583, -3271, 5174, 296, -4242, 4371, 1719, -4028, 3087, 2325, -3159, 2599, 1709, -4672, 1962, 2912, -5056, 318, 3851, -4048, -1132, 3117, -3263, -932, 3230, -3072, -1005, 4674, -2088, -2385, 4558, -1406, -2985, 4402, 874, -3268, 2692, 823, -3213, 2489, 211, -3158, 3262, 1606, -4446, 1841, 3037, -3969, 162, 3049, -2596, 629, 3077, -3140, -277]
1666b77L547o825K292N857o928R2O004n271k173O171l581j948O440l464l263O393
1682C066l339m333P433k55n854M703J359n200L193Q90m720M375J999o418L702
1697F01L518p188Q89N753m634q40M989l445r88L544l744l71M815l837j654O746
1713D154l367n256N635K1m343M123K51l682M064q39m890M829J581o088L562M011
1729C766n606J415L148m918J451M698m565n1N021m915j611N489k953l402N284
1744B251j101k936L360j913l023M545j312l749O046K89o491L522L372n367J204
1759a303K721k476J875J438m296J885K346m940J661N214n004j884M960k011k723
1774b537L746j126j757L537j092k211L854k236l499N423R03m765K798J243m033
$$ y = [-277, 3270, -3555, -1263, 4594, -2334, -2242, 3762, -1509, -3682, 2489, -1092, -3040, 3400, -64, -3327, 3066, -273, -4606, 2827, 2572, -3282, 1421, 2780, -2420, 773, 1663, -3057, 1318, 3317, -3101, 601, 4119, -3069, -2180, 3573, -1061, -1901, 3088, -357, -1345, 2199, -1545, -1916, 2899, -938, -2592, 4154, 787, -4469, 1166, 1187, -3156, 967, 1218, -2464, 1600, 761, -4129, 700, 2281, -3807, -245, 3766, -1840, -425, 2723, -2195, -744, 3954, -611, -662, 4359, -556, -2167, 3322, 369, -3033, 2251, 1150, -1786, 1574, -339, -3362, 1183, -129, -3878, 2168, 2457, -4034, -512, 2860, -2507, -1303, 1418, -1058, 817, 2255, -2041, -156, 2190, -2750, -1089, 4125, -879, -2763, 2197, 186, -2537, 1209, 83, -1674, 1863, 771, -1440, 2414, 178, -3321, 2102, 3005, -1760, 1038, 2281, -1752]
1789a752K590R17m411K749K463m483J064L110m654n95L528j946k79L250k873p00
1805b022L921l130j650N395j724l142M888J50m485K110J192k350K236j06k524
1820a241L143k22m979L191K915n180J423L718l205j284L092k391rK814k354M1
1836e28K975k912j332L984k264k387L800l91l072K859n10k868K451J18k731K878
1852G0J215l428J560J339k333J528J668k677J984K300m202N41L787l328j361M219
1868B882j736k119K504j613j460K425j547j149L255j590k840L657R3m098K841
1883d95K239l224O87K089k221O24J345k249J257K040l374O06K936l130j174L269
1899A225j878r71K998j037j886K203p96j023K390n39j523K302l12k038K358k79
$$ y = [-1752, 838, 1755, -2656, 93, 2556, -1927, -863, 2247, -2407, -3002, 526, -1420, -1699, 1551, -1322, -2022, 1899, -1231, -2881, 2514, 790, -2352, 2536, 2686, -1799, 311, 1503, -847, 1389, 1283, -1241, 1902, 1680, -3299, -108, 2807, -2373, -950, 2768, -437, -1721, 1371, -1020, -1029, 1785, -569, -528, 2447, -465, -1797, 2187, -77, -2464, 1336, 945, -2127, 732, 222, -2646, -195, -77, -2808, 70, 1285, -2143, -583, 756, -1577, -49, 1619, -1058, 926, 3226, -976, -435, 3352, 24, -1337, 2882, 1146, -973, 1531, -82, -1542, 883, -664, -1813, 1442, -148, -2988, 669, 762, -3336, -495, 1744, -1480, -793, 1296, -925, -301, 1044, -1205, 52, 2092, -1282, -676, 2260, -870, -2044, 1225, -653, -1624, 1374, 337, -1549, 654, -142, -1165, 1225, 686, -837, 1465, 1153, -885, 1473, 1194]
1915A194k321K177Q14k883J538J421l625O73K281k440r4J930j741Q7J371k244
1931a862N32K780k516o03L103j517j749L186r2k546J971O04j966J426M23k073
1947h99J707J94k330K153Q31k968P10J970k162l3K065j722k49J931j172p00J793
1964A119j181o05K188j386q63J587q70j466K140o56j574J928j09j563J314J74
1980A77j714J122J021j299P90L35j705J194J727k415O13J843j668p74K582j299
1996E30j406J671o54p25J503r94j056J913n80j511K000k12k233J816P48j962Q29
2013c23J374j935N48J012j138J51J188j292R1J433j808K3J579j217n21J507o57
2030A5j123J704l63j088J030J75p53R50J74j190R65J31j066Q97K32j293J031N41
$$ y = [1194, -1127, 1050, 1864, -1019, 519, 1940, -1685, -1012, 1269, -1171, -1265, 665, -1076, -989, 382, -1862, -1330, 1450, -1066, -1669, 1434, -83, -1832, 1354, 1262, -1284, 687, 1291, -675, 751, 1174, -899, 808, 1002, -1328, 825, 1656, -1312, -602, 1368, -794, -827, 1238, -484, -733, 1198, 26, -674, 1119, -62, -667, 1521, 135, -728, 859, -11, -1477, 663, 7, -1567, 361, 252, -1311, 3, 177, -1537, -415, 606, -693, 97, 432, -1273, -79, 1648, -767, -154, 1689, 21, -753, 1829, 530, -876, 795, 141, -584, 919, -75, -1131, 782, 202, -1309, 691, 479, -1754, 62, 810, -1152, -323, 1051, -884, -336, 676, -462, -311, 877, -415, -324, 1109, -699, -676, 903, -314, -835, 672, 15, -1108, 596, 233, -855, 175, 350, -403, 547, 721, -469, 496, 627, -439, 458, 690, -603, 428, 969]
2048I69j883O60J084j059l55J174j114J10R82r05l42J420j312K9J142p55o95J595
2066G45m34j150J212R9j188R24K85q42N57k4q29Q04M70j217M25O97j109L50R83
2085G58o90m20J165p89l91Q57l56n47P89k52m47Q47o10o01J078J2j318J100j15
2104G0o49N75M72j025M80K88o72O86J01p23K59O67q27MP67j091M73N75m11n72
2124e53O93k12k79P28l57k98P43m29n29Q53p2p19R20n9p75L53N57j104M19O23
2144E03m83k01O74m97l60N42l58J68L17l79l50R57n98m45P65M2q00Q18r0m21M17
2165B21L8m04J10J62n64K36L18j91j08M46q04L91L89k72j55M62k69j98M28l00
2185f4M6L82l87l49O59j10m61L28K39l96L45M6m57P8J65l61K61J98l34O1pp9J31
$$ y = [969, -914, -254, 830, -229, -584, 590, -524, -414, 568, -337, -679, 741, -571, -542, 600, -155, -850, 745, 311, -839, 373, 472, -716, 208, 493, -349, 208, 184, -645, 159, 629, -588, -163, 534, -575, -225, 758, 68, -352, 813, 24, -367, 490, 134, -413, 376, 124, -323, 524, -86, -687, 391, 403, -915, 185, 70, -579, -4, 468, -557, -77, 211, -461, 225, 326, -397, -138, 529, -298, -294, 473, -618, -145, 430, 19, -553, 140, -72, -351, 377, 20, -278, 465, 36, -493, 360, 288, -431, 489, 430, -345, 8, 565, -539, -120, 503, 20, -181, 493, -4, -364, 178, -180, -12, 305, -74, -424, 533, -65, -510, 255, 297, -503, 315, 225, -196, 221, 259, -145, -35, 127, -437, -201, 117, -74, -182, 264, -540, -149, 240, -32, -187, 275, 6, -192, 236, -64, -18, 364, -23, -372, 287, 177, -284, 44, 283, -113, 232, 278, -179, -101, 64, -297, -36, 162, -172, -111, -118, -197, -66]
2208f6R4k65J46M27k92lk62J57k49L43O3l14J98K47j35n7r6k37L57q8l16M01O6
2231A19l88K9K35j39JJ86m5K51j49K5l29N28m34J56K15l19J76o7R0l53L06k34
2253a40N9J7L54j75j91J45J9n8K0P9k37J01j46K07j98N8K11P8j11k56K41k68K69
2276G8j2N1q4P0j10p0r1L58j64l10M39l20J96J91l02r3K80J47m92J14K29l41J34
2299a02L05j87l82N87l87J22P0j17K50N8k38j72J44M0j96J31J7N0k63L99l54J93
2321c2J55l22J22j3m86M57N17o48R6L00j71j55M23k36r2K34j42j70M02k45k57
2342b63N00L4m84J72J32l38N05j05n98N24M4m61K73K89m84Q3N85n02j83M10m99
2363c66J24M08k57j21K20l67J48O08k97m10N01p7j78R0o7j25M42j74m57K42J77
$$ y = [-66, 28, -237, -91, 336, 44, 41, -221, -64, -313, 30, 93, -221, -23, 224, 89, 32, -64, -301, 56, -32, -348, 53, 119, -269, -240, -5, -144, -143, 43, -2, 249, 100, 125, -204, 324, -110, 46, 261, -58, 118, 51, 141, -212, 94, -140, -81, -64, 290, 115, -76, 69, 88, 30, 50, 129, -108, -7, -153, 54, -144, -86, 125, 203, 92, -164, 77, -191, 78, 66, 117, 33, 103, -7, -77, -168, 190, 26, -284, 155, -165, 31, 222, -80, -173, 107, 254, -238, -124, 105, -236, -102, 203, 16, -366, 221, -166, -44, 26, -91, 159, 217, -21, -193, -49, -9, -205, -74, -57, -7, -270, 129, -225, -32, 123, -199, -77, -90, -576, -119, 398, -250, -154, 146, -25, -180, 243, 7, -85, 149, 7, -163, 239, -6, -263, 237, 271, -213, -41, 91, -247, 258, 153, -445, 79, 123, -338, -65, 224, -260, -177, 408, -94, -277, 133, -366, -242, 166, -91, -212, 8, -359, -211, 397, 100, -310, 191, 114, -64, 26, -41, -166, 276, 102, -355, -113, 64]
2384F4o16M68L43n78L40L33n29J00M53n45K46J66j85o5L67k66n80O47J05o04M90
2405A54J90o58L80j50l31N20p3l68J72O70o33P7J98m06L09L18m03K37J07m66q3
2426b39P42o92q1M57j00k00L3k06J18J73o1j16M80m16n92P62l5m72O91K84p10
2447a80J87J42m68L42K54n90M04J91m78r4O16q29J7Q11m04l14N92k58o26R12j13
2468A14n62Q94k46m53K93K17o21M90lo67N27M38r28M56M90p43OR82p49k91P79
2489D23p64J69M02m64j02J018p50l44O39p8p18R98k04o29N50J87p77O44j53o44
2509e97Q46N1r95O85N91j134L94O15n93r9N38l80j4P81q45k86R02l47l99O67n94
2530b13k75R63o39m33J053k24n93P55mj051M67L45o89P52N5q55O71M14p07J70
$$ y = [64, -552, -84, 259, -319, 21, 354, -175, -75, 378, -167, 79, 245, 60, -5, 362, 96, -484, 163, 268, -336, 154, 344, -314, 66, -84, -415, 105, 32, -336, -164, 506, -127, -50, 148, -258, 51, 369, -34, 203, 310, -156, -239, 503, -189, -270, 187, 87, -113, -80, -286, -168, 5, -56, -172, 308, -108, -700, 62, 27, -445, 246, 530, -180, 7, 149, -319, 23, 277, -313, 91, 282, -196, -290, 326, -503, -486, 325, -79, -393, 199, -59, -685, 227, 114, -448, 446, 200, -253, 40, 257, -364, 126, 123, -544, -17, 421, -507, -51, 439, -304, -298, 684, -65, -356, 423, -341, -172, 230, -234, -336, 682, -68, -412, 227, 149, -569, 429, 225, -404, 146, 333, -444, 200, 47, -597, 249, 300, -695, -10, 581, -553, -159, 456, -137, -236, 302, -78, -92, 689, -156, -442, 460, 113, -286, 381, -213, -488, 475, -164, -597, 456, 232, -361, 394, 390, -661, -194, 151, -538, 214, 269, -586, 85, 499, -208, -38]
2550c8Q90j083N1R89r57q5O88l55o47R06l97m79J060m74m18R15m94o05R94Mj201
2571g36R60J36p15P86n7p01J20P35j037L84M54q24L96N68p66NO60j024L30J069
2591G43j049l42J294l28r22R23L8p19N30j51o35J103l33o90R04J09j132O45P21
2610G09j358N27N96q21J08N30n45J03N88o60n6J117j035p0R30m89q79J155k95
2629A55n35M96N5o53Q02k19o31Q36n4n75M20L03j049P47O33j205J81J130j488
2648f51L74R81r80j56R62q95j20J059p70j68J014o22o77J310m96q74J133O1j393
2667i08J140J31r08Q97j5q89N50Q22j272N08M74j276K65J151j177J55P37n53j87
2686c55R87q62m88J356n91n40J062n92n78J029J56j057P64K93j310J031K65j059
$$ y = [-38, 852, -231, -180, 809, -148, -233, 455, 100, -547, 359, -38, -517, 543, 69, -349, 566, 72, -533, 461, 465, -736, 224, 360, -355, 431, 374, -327, -207, 528, -509, -125, 329, -495, -99, 469, -297, -292, 368, -656, -326, 743, -306, -648, 646, 318, -604, 319, 357, -362, 168, 17, -618, 485, 152, -538, 366, 475, -657, -12, 709, -649, -122, 474, -347, -239, 291, -254, -151, 437, -223, -279, 838, -197, -267, 663, 174, -705, 450, 155, -380, 116, 171, -482, 320, 101, -530, 306, 252, -323, 97, 400, -649, 98, 731, -474, -293, 837, -651, -277, 704, -276, -432, 530, -365, -485, 574, -196, -364, 650, 28, -649, 661, 165, -709, 424, 485, -908, 232, 363, -545, 352, 337, -552, -2, 820, -452, 56, 530, -746, -481, 670, -507, -352, 385, -168, -355, 632, -230, -718, 638, 47, -493, 569, -23, -601, 428, 584, -473, 291, 584, -726, 305, 570, -489]
2704d89O96L49j138M86L71p85K06Q90j247N30Q40j120Q5J072j049k16J325n43
2722B63p83R93l54p77J015l40n31Q67j41j002R70K0j031J164N2j121M98Q15r31
2741c54j35R68r27M91P15p08l78J229j526R2J315q80l73J177o70o15Q82n7p94
2760e48J002k94p40R10J06r34Q67K62j344P49O14r43L55P36j236M27R54j229l0
2779c16R49r45m46J196n75l35J123p64m84R18l42o84J153k23j116J266J48r78
2797d55Q66j39o23M78N43j292Q88L91j282N50R22j277r4J165r77l9Q13p93j38
2816d93J274r04m44J347o42p62J171m03q38Q63J73q92J044j15j065R25O8j218
2834i11P02R40j116L32M83r94M05M86p02L24Q21j104J65J290j306m93J149l46
$$ y = [-489, 207, 556, -582, -96, 275, -510, -304, 586, -661, -131, 709, -411, -326, 746, -303, -519, 806, 263, -520, 473, 119, -658, 357, 17, -514, 353, 212, -790, 180, 200, -831, 333, 385, -736, -238, 577, -354, -489, 479, -448, 43, 758, 50, -328, 901, -625, -533, 782, -98, -471, 706, 36, -579, 303, 246, -548, 454, 160, -580, 330, 436, -498, 369, 631, -713, 36, 650, -293, 62, 798, -438, -11, 943, -286, -316, 633, -312, -758, 438, -137, -472, 651, -113, -597, 321, -21, -705, 448, 225, -891, 375, 523, -455, 411, 272, -351, 127, 670, -622, 266, 657, -625, -75, 847, -430, -524, 641, -336, -375, 438, -355, -493, 781, -123, -567, 780, 138, -624, 547, 144, -694, 169, 342, -550, 494, 379, -686, 239, 307, -911, -209, 731, -385, -53, 430, -564, -159, 327, -375, -51, 770, -334, -169, 1121, -185, -678, 471, 125]
2852A25p50R81j30o74R04m18r58J279k16q08Q62L96r98K03N87q91N84O78r65J83
2872b6O41j532M16J337j175q1J105o55p19J188p41j37R06m80l97R65o45q35J112
2891B47j46p55R28k7o71O11J69r36O69L53j028P39O61j197j37J016p20O1N91n02
2911g4j93Q72q31m00J319p89l90J352o17q11O93J90p26L84R7o83J382n40r53J017
2931B99l9j115Q04P72j125J66O77q26m7J003j013R0J236j062j97J169q00o97R52
2950B47j50o47R44k56o40P84j50q18J083J18j062O69K39j192N55Q83q87M07K23
2969C50o85M86M11j168Q7J051o51l05J002m67p40P81l01k82Q89n49n53J404n46
2988B14r87J224R0j043N64N30q48M83J00q99P10M79j000L08R18j338P8R66n79
$$ y = [125, -625, 356, 226, -448, 456, 38, -920, 359, 143, -665, 197, 593, -405, -202, 385, -506, 78, 756, -209, -26, 615, -917, -501, 836, -339, -420, 685, 30, -689, 499, -242, -379, 527, 47, -350, 615, -30, -865, 247, 101, -654, 274, 247, -424, 187, 356, -580, 89, 442, -586, 153, 814, -383, -520, 496, -224, -163, 428, -74, -267, 605, -226, -626, 693, -96, -486, 866, 249, -562, 131, 321, -405, -21, 76, -607, 775, 235, -718, 299, 260, -855, -51, 721, -404, -238, 439, -387, -434, 569, -444, -354, 882, -180, -377, 792, -8, -705, 247, 97, -550, 394, 138, -502, 282, 132, -686, 397, 515, -547, 122, 361, -831, -276, 607, -280, 127, 350, -335, 151, 562, -606, -519, 532, -119, -424, 578, 111, -629, 152, -149, -431, 458, -91, -644, 760, 214, -773, 451, 541, -502, 62, 592, -256, 227, 327, -572, 138, 617, -383, -75, 843, -495, -417, 549, -30]
3007c0n06J068m04l22M70m40j89O53n48k27J142k20j020R92k35p95J042k28q58
3026f55Q16M52j280N40N27j128L88J131j033R6N88q76L28P93q16R9Q29n93m31
3045b25O03m13m93J009l17m55Q59m02p71Q70j10p20R22q5q82O08N59r52K30M08
3065B43n57K41P40j093N08N26j029P4J043r50k89R91n62k77P11m70l65J074l78
3084A81n13Q48k72q85J005J09j144P30N40q20K97M14j093N95O72j221L83Q15q52
3103b11j84Q14p66j93J138p52k14Q03p71k91J049l63p89R35k1o76O45K03o26N62
3123B92j7n81P23M2j035Q23N26j086K46P08j130K07P15q60K23O07o63N4P96p34
3143a44l62J017l49n88Q21p2q81J125l16q33Q61L6r00N90N09j104L18O77r64K00
$$ y = [-30, -536, 532, 128, -194, 276, -164, -353, 300, -248, -475, 667, 447, -573, 419, 184, -611, 431, 203, -655, 161, 613, -667, -127, 400, -728, -340, 791, -242, -146, 442, -434, -106, 687, -129, -30, 799, 206, -225, 378, -35, -528, 481, 164, -291, 568, 166, -605, 265, 155, -565, 357, 272, -610, -2, 557, -395, -165, 243, -314, -73, 667, -426, 82, 608, -421, -347, 696, -254, -543, 448, -114, -391, 320, -150, -515, 559, 181, -332, 516, 244, -641, 364, 473, -671, 59, 599, -221, 76, 490, -603, -8, 664, -557, -174, 641, -211, -395, 419, -347, -540, 598, -154, -368, 435, -336, -627, 422, 59, -730, 205, 184, -492, 153, 356, -270, 292, 275, -306, 417, 459, -576, 247, 773, -313, -67, 641, -489, -282, 433, -427, -204, 403, -260, -206, 590, -144, -506, 511, 162, -426, 395, 323, -558, 567, 251, -582, 279, 315, -585, 5, 514, -590, -272, 405, -559, -359]
3163c59P07p62K33O65j162L06R09o84m23J104m92k84P67l37n65P94k89m59R95
3182F64m98r73J136j13p56P13O0p84N75M71j144O22M93q28J47O45q22K74N06q42
3202d54j26J008m44n40J169p39o93J168k08o10Q94l62o51R20r1p06P81n2q83N87
3222c2P01j283O02P24j361O74M88m77k16N77o70JO36m23l05R32p00k38Q52n10
3242b8n30J044n72n44J127l09o65O75k32o37Q44J62o88Q56j63p25K88Q92j090
3261b95K64O53q86R7N68o86J85Q00p60m25J144p94l13Q66k15p28Q26k2o35O34
3281B78p0p79Q56M83j360N44N04p37K80N64r01M28M39p76Q5O99o40n19J009n47
3301a60m44P58k20j73M06k22n48R06j19p67Q36j49n85N76L2n89M00M33o96L51
$$ y = [-359, 348, -414, -181, 484, -678, -372, 537, -147, -570, 534, 42, -242, 525, 188, -377, 417, 128, -331, 664, 166, -807, 329, 216, -540, 173, 233, -551, 24, 495, -649, -27, 466, -362, -215, 430, -392, -118, 388, -454, -580, 428, -16, -556, 613, -126, -819, 349, 141, -469, 425, 63, -588, 332, 241, -465, 316, 264, -619, -32, 669, -614, -12, 712, -649, 25, 513, 36, -180, 397, -273, -272, 364, -59, -364, 568, -132, -370, 482, -28, -558, 486, -86, -630, 497, 188, -477, 198, -34, -671, 173, 335, -353, 503, 340, -385, -97, 795, -295, -31, 622, -264, -167, 401, -285, -100, 700, -60, -485, 659, -135, -448, 418, 203, -525, 301, 279, -356, 278, 208, -571, 285, 768, -592, -48, 456, -281, -1, 563, -338, 90, 529, -247, -162, 537, -103, -622, 387, -160, -604, 154, -66, -239, 167, -55, -603, 303, 184, -583, 253, 104, -481, 95, 127, -462, -62, 371, -325, 26]
3321B6R7m38MQ14r47L30P37j138n9Q38o47L35O48p87p9Q17p04l92R32p8o14N69
3343B64n4o26L63N69r45N29K46q04O06K11r77M19N84p75J34N23o30L96K27l64
3363a04l7N24l76k55O75n36k10Q35l26o06N26J33p78N43o4m55Q17k07n89P38n9
3384A89o73N13K80o05J25L31m87M64N66j136K08J095j030j84R39p37j30O99m56
3403b9n25J249q61l20O22K6q44R49q5n68O04j59j75L37L54r92O41J55r22N38N31
3424E26p10J39M96o03j8K80K7n48P20k98l08P61m96m25Q55l92l98O35k30j54L10
3445A69p1n25N66j2o57P25J53o49J68M95m63o3N85o39J52M33o61K81N27p27k53
3466d66Q63k33o53N03J6n36P96k25l29P03m18k77L70J06o99O61K25o64lO58o52
$$ y = [26, 123, -315, -311, 503, -444, -114, 623, -515, -574, 264, -383, -48, 600, -187, -266, 551, -153, -545, 387, 309, -305, 264, 210, -416, -53, 516, -429, 100, 346, -458, 148, 359, -618, -199, 385, -390, -256, 267, -363, 33, 260, -104, -141, 383, 7, -248, 427, -109, -319, 516, 190, -416, 110, 243, -535, 8, -56, -511, 306, 99, -490, 248, 189, -484, 29, 309, -296, -171, 160, -327, 137, 703, -433, -225, 870, -160, -344, 595, -142, -272, 427, -29, -554, 695, -166, -486, 136, 162, -682, 267, 182, -386, 218, 59, -116, 221, 575, -417, 224, 379, -543, -5, 526, -184, -45, 451, -152, -170, 110, 137, -411, 309, 11, -297, 464, -32, -457, 398, 6, -392, 243, 13, -141, 169, 98, -427, 139, 127, -530, 195, 348, -301, -133, 362, -101, -164, 421, -218, -66, 367, -294, -13, 514, -213, -466, 397, 164, -489, 14, 30, -506, 290, 65, -264, 439, 21, -256, 114, 220, -479, 182, 407, -257, -260, 398, -254]
3487b54J58L55n01K96K10m63k03P56n76n6L74J70o81N59Q4l59N27n47m63Q33j10
3508A09l68L72K04p90L03L17l82N24P1n63J19M93r35L87N17q53K21N79l83l05
3528c63M31j49k13O24n62o5P17n79l96P95J5n13P38j18m76J29L15o36L45K27o83
3549d17Q05J66q39L2Q50r05J09M07m03j23P39m30k36N19l48k89Q69p7q05M73K
3570I9m08N12j37m44M89R4p61N21K80o42M50J71m12L10K2k72J10K78l45M8M47
3591D10o13l7O78m67l09M48J56n86P96l73m34L73r2l64O57ko05L06L08n52K26
3612g6N31p01K20K84l82K11M86q22J71N06l89l99N04j95l73M67j83k45O99l50
3632c6m06Q48l08l89N55r2p34Q21l1l79K28K02o85L35K52k29j42L73l87j33N36
$$ y = [-254, -96, 259, -242, 54, 264, -199, -402, 354, -222, -278, 96, 266, -415, 144, 228, -131, 396, -151, -614, 219, 109, -259, 113, 317, -473, -170, 147, -235, 289, 360, -203, -84, 409, -526, -139, 378, -475, -254, 325, -58, -363, 68, -81, -294, 330, -232, -297, 420, -159, -555, 240, 255, -258, 480, 362, -114, 15, 330, -306, 39, 266, -417, 388, 554, -285, -253, 597, -308, -199, 208, -195, -318, 421, -9, -245, 274, -74, -363, 506, 429, -376, 97, 99, -309, 203, 66, -378, 111, 205, -556, -35, 245, -397, 53, 224, -188, 122, 144, -128, -18, 260, -85, -37, 410, -203, -240, 438, -29, -338, 110, 266, -320, 476, 103, -331, 42, -50, -414, 243, 241, -364, -58, 250, -302, -76, 455, -246, -26, 258, -124, 87, 573, -249, -78, 428, 39, -360, 144, -51, -424, 43, -140, -385, 314, -36, -442, 406, 98, -291, 264, 172, -562, 259, 228, -151, 77, 279, -406, -71, 181, -48, -190, 183, -204, -337, 199]
3653A99l68n3M76k36l10O99o80J29O01l93m17L76ok62N51k0o90N89K54q99M82
3674B2K84o45L43M81p57R8L16l04j01K53j19j8K58l11P7K66k24m1N57m69m02O96
3696B60m41j2M51k42n23L18K57m39L36L67p19N04L16p48K72N60n76J76L20o03
3716a66J42L53n61r4P32l32n7N7M5m18M79k27j73N50n27j99M26J02n22N98J05
3737C13q43O27k7k60L62J71o96J75L81k97L3L95n63o2N73m46k8M38m76rN53k75
3759C9n80P27m6n04N94j7n29M56J73n40K07L36m59NL27l52J62K32m67J27M11n38
3781b36K1O42o29O2K73k57j51Q37l36m84M95j3l00L17o3l13L41O9n98M96J91p31
3803c67M09M41p01Q0J79J00l17K77l40M2O48q35K94M12m86q8M64k73k9O7J41m42
$$ y = [199, -169, -222, 254, 18, -292, 407, -273, -144, 457, 64, -353, 23, 17, -245, 306, 286, -404, 185, 439, -460, 22, 306, -339, 4, 485, -272, -174, 142, -162, -263, -10, -129, -147, 111, -200, -123, 143, -81, -122, 435, -34, -436, 260, -181, -193, 258, 16, -507, -189, 68, -371, -35, 332, -387, 117, 433, -315, -43, 517, -59, 117, 437, -166, -24, 329, -232, -326, 406, 74, 17, 74, 119, -299, 180, -47, -220, 330, -197, -396, 30, 132, -390, 208, 313, -530, 97, 70, -190, 172, 343, -353, -178, 203, -94, -61, 334, -229, -291, 282, -164, -192, 246, -230, -239, 314, 39, -541, 186, 140, -364, 230, 213, -316, 140, 313, -227, -20, 316, -143, -138, 189, -163, -1, 231, -236, -109, 302, -236, -215, 427, -202, -140, 133, -124, -275, 562, 226, -258, 237, 224, -76, 241, 178, -135, 206, 275, -323, 173, 364, -367, 42, 483, -218, -138, 41, 141, -176, 101, -239, -197, 451, -384, -90, 322, -164, -252, 212, -61, -90, -23, 118, -324]
3825c24M15m0l45P26k85l49J38L05l90K62M03o08J18J90m48K13M94o38k99P17
3845B55l83o2N19m09k71N83lk38L27m76j65O99j88o09N27R0o01O51j90l30K32
3866d2L43m58J69L67o86K79K94l52j02N32k84m49L83Qj26K83l84Q0M35k73m02
3887c85O14m9m65L23J73m92J06M40n47N48o2n70L75K75m21j22N68m06K2J4q7K5
3909a23L93l63J32K6k3q4J31j05l78O66k9m53J35J72m39M32J71k45N6J03n19J93
3931a51M93o43K50L73n57K02L38o27L03M00k96j51L67n85M1M44j04m32M07n8n9
3952d5K10mj01K00j53n09N04J63n33O0L57l61M13P2k97Q6O8l54j30O53l29r5N37
3975D12m13n6L50j66l36M08l59k8L29N5o84Q98k31o09M34J84l94L03nk39K42L20
$$ y = [-324, 91, 51, -294, 432, 147, -202, -64, 241, -149, 113, 516, -92, 26, 216, -232, -19, 475, -163, -462, 255, -128, -190, 329, -80, -351, 232, 229, -9, 318, -158, -323, 376, 188, -421, 106, 196, -405, 246, 56, -274, -42, 301, -157, 12, 379, -307, -28, 266, -86, -188, 344, 60, -389, -6, 2, -124, 159, -225, -145, 290, 17, -385, 229, 180, -285, 38, 211, -281, -175, 265, -282, 266, 204, -366, 9, 284, -137, -259, 309, -97, -75, -61, -148, -123, 270, -93, 39, 65, 42, -42, 89, -16, -394, 272, 243, -210, -75, 97, -342, 90, 261, 16, 72, 175, -344, -151, 342, -301, -51, 322, -235, -33, 305, -322, -19, 381, 85, -66, 301, -284, -243, 201, 97, -335, 72, 14, -45, 165, 161, 60, 260, 107, -402, 102, 265, -268, -208, 149, -212, 201, 273, -24, 62, 130, -224, -354, 299, -30, -125, 412, -1, -57, 293, 127, -209, 199, -160, -188, 141, 196, -488, 410, 179, -430, 4, 188, -206, 97, 92, -147, 95, 415]
3997D15n34M5P26r21K37J88k51k3L58m01N3L44m63J12M20k62k07M35k22k87M87
4018B49j6n83N37J19n27M13J78p37L44K91n92J73L48l99J61L90l75k85N40l32
4038a03j53P96l46m36P28m48k43N21l05j44L63k57j22M54k99l15L12J71l63J19
4058g0J85l04J46K05m07K09L63n37J56L86o78J46P02n36p7J97Jn37M28l26J39
4079b09M17k66j3O13l02n14N69j57m32K11Q3l14L13J38k47J66K49p88M50M52n12
4100i3k08M26m11O7K79j6k43K67l73p0O56n6m38J97N21p46K60N4k79L44J28l47
4122h1K21O7m93J20N99o54J27N23o77j76N61j10j55K21p1k19N88m75p7N30j21
4143B48m46K60P4m38K70P7m37L77K82q17N90M14o66K75L07n72m5M72n40J55N02
$$ y = [415, -119, -74, 652, -269, -32, 156, -95, -118, 240, -161, -108, 236, -227, -115, 305, 43, -164, 271, 49, -238, 249, 233, -350, 187, 306, -221, 192, 370, -367, -23, 268, -324, -151, 197, -202, -41, 349, -26, -311, 229, -103, -256, 540, 194, -242, 486, 38, -205, 316, 11, -133, 230, -27, -149, 305, 6, -309, 3, 174, -189, -70, 115, -189, -43, 162, -245, -36, 327, -210, -54, 332, -346, -200, 502, -34, -111, 86, 87, -450, -22, -348, -209, 208, -58, -71, 542, 240, -274, 295, 138, -294, -83, 0, -314, -1, 137, -110, 56, 305, -483, -33, 419, -93, -301, 125, -286, -219, 60, 44, -199, 68, -305, -375, 281, 225, -213, -16, 505, -241, 19, 73, -206, 138, 266, -81, 140, 207, -286, -166, 433, -221, -94, 429, -248, -424, 137, 27, -128, 93, 22, -197, 391, -84, -161, 369, 248, -198, 62, 136, -302, -32, 45, -392, -15, 267, -550, 40, 454, -212, 63, 370, -202, -247, 225, -315, -160, 342]
4164C42l38k30N31l99j64O03k82m17M76j45K4J53O2n53L41Q4k24J90K31n39M44
4185A90K23n22Q5L15n02J94J96o82M83K37l37N0L94o47k4M24k09j15M44m67p1
4206c41M23j24J13K31l28k21N51k00n00M30J56l96R0J83k39Q5L85o30o0M78j77
4227i1j49M92l95N1L78q7j33L39l49k71P05k05m67P22m26l58L21J00n97N42J16
4248B38o12L75J61m09K81J40o72L58O66o61PM00n38k1N68j58m41Q38o56j12M82
4269B34k34j89L46n6l95K96N5n00O69j08m43N96mn56M79J58l77j80N63n64l4M28
4291A84l47J87K71m18J59J17l88m1N47m35K8K61n8p26R27j6o09L84M7k8N5l1m44
4314c74M08K91l25L02J22l73p7L51n98L06J71l46k23N36l11J2L48k29k15M30j10
$$ y = [342, 4, -226, 305, -94, -258, 345, 63, -354, 122, -23, 1, 154, 216, -337, 4, 88, -136, 54, 285, -254, 190, 413, -109, -24, 291, -211, -17, 179, -503, -20, 217, -120, -70, 324, -323, -347, 77, -132, -247, 197, -270, -341, 82, -42, 71, 302, -26, -247, 304, 104, -396, 34, 190, -206, -116, 67, -172, -87, 298, -332, -392, 86, -91, -240, 252, -143, -92, 286, 199, 66, 405, 56, -215, 490, 285, -182, 540, 114, -244, 77, 177, -420, 122, 238, -374, 1, 162, -247, 34, 174, -498, -140, 526, -135, -128, 272, -266, -287, 281, 123, -318, 520, -136, -248, 234, 0, -189, 157, 101, -294, 2, 57, -443, 226, 118, -325, 271, 267, -289, 190, 348, -29, -209, 354, -210, -244, 184, -163, 24, 295, -123, 36, 153, -235, -276, 271, -164, -136, 125, 67, -659, 268, 252, -357, 27, 74, 46, 101, 70, -374, 34, 325, 0, 302, 424, 51, -26, 325, -273, 33, 204, -142, -365, 171, -140, -128, 220, -9, -224, 206, 96]
4335I6k72L47j17k90L96k2k82L82J05o50K80L1l78L97M58o31K69q2m19J05N19
4356B42l57j45K71j9k97N46m04r9N82k83l13K65J46j79O8l9k96N42J0p15M24J43
4378I3n50M43N40p68K34K07l55J82K49k61j48K96k74j61M07m84J28M94k66k34
4398b28L25j32m07O28l38j02N61N4o86M39j9k19K47K68n39J75K37n84K26L09m25
4419b10J1M24k73l9M89m73j62N50l63RK41j88l25O25k86k98O10j96m82L45K01
4440B10n41L86J14n07K66L94p63M92pk15R9K43m54O0O79p69Q5O46k95j82K05o2
4462H4k86L15N9n84K55P7k36L34L43o59L36J77o59L21L09m49K16K55m39m5M47
4483A71j10K5lk08K35K89l20k63K64m7l66M72J7n10K09L67l59L70j14j42J09K59
$$ y = [96, -176, 171, 54, -236, 160, 138, -144, 238, 343, -307, -27, 4, -374, 23, 481, -150, 119, 37, -382, -277, 242, -115, -260, 11, -8, -305, 241, -163, -262, 320, 37, -276, -11, 135, -44, 24, -15, -311, 231, 241, -474, -50, 93, -457, -14, 526, -242, -8, 199, -156, 26, 275, 14, -134, 162, -112, -273, 134, -350, -222, 272, 6, -228, 97, -35, -442, 186, -152, -254, 307, 361, -325, 114, 95, -124, 123, 391, -148, 27, 264, -320, -94, 215, -210, -199, 225, -48, -87, 402, -71, -233, 317, -46, -37, 204, 16, -309, 316, 30, -268, 342, 146, -336, 9, 210, -331, 55, 169, -338, -72, 322, -441, 51, 44, -171, -72, 171, -283, -223, 456, -313, -228, 418, 123, -59, 146, 84, -202, 113, 172, -412, -157, -80, -316, 18, 361, -298, 38, 215, -444, -123, 186, -263, -47, 208, -231, -276, 171, 61, 86, 83, -125, 110, 399, 79, -184, 80, 33, -333, 139, 156, -354, -145, 222, -137, 233, 119, -23, 86, 345]
4505C45n66L91K82n93K02J30l44p1N54n36K26K16m98J98K97l76k80N90K5l34M99
4526C57j51l99O95n60j13L49o5l23M46O8m14K59K45n10k09N82l43j21L87o39J73
4547b86N34o66L11J91j49k97N06l61J66M36l51k89N37k08m02O72k36m69P08r7
4567B50l95K60R4n48L61L44n18j38L84l00L7K77j09k55P86p65J13N01o24J30N60
4588D45n80o4N09k59m28M96N6l47L36J16n70L46K33q92N50L45m88K52l4j50L2
4609i6L65l74m1L77j99j79N68o44l5O35l00m96Q08q3n67K11m4j08L05N0l31J99
4631B1K22o75J85L71o27M55J55j57K31K42n01J43L21n93J1M36k94l48O22j91J41
4652A70M3l5l74M04k00l30P01l24m24L30J75n03L95j82oJ01K67m23K06K87m04
$$ y = [345, -221, 170, 452, -141, 61, 191, -153, -224, 330, -206, 20, 236, -262, -64, 233, -143, -423, 167, 192, -142, 357, 206, -193, 502, -58, -171, 178, 113, -210, 236, 304, -110, 149, 394, -116, -325, 257, -86, -207, 180, -459, -286, 248, -418, -107, 84, -65, -362, 144, -217, -51, 385, 34, -255, 282, 74, -328, 344, 108, -361, 347, 250, -145, 115, 209, -339, 22, 366, -152, -290, 94, -206, -169, 108, -1, -256, 530, -235, -122, 379, -245, -115, 445, -135, -199, 310, 51, -377, 119, 175, -172, 164, 280, -290, 56, 289, -603, -53, 292, -196, 56, 22, -128, -96, 269, -105, -146, 231, 32, -147, 421, -223, -258, 377, 77, -419, 389, 306, -261, -50, -94, -202, 103, 153, -178, 21, 243, -432, -247, 124, -503, -48, 107, -50, 181, 423, -78, 65, 386, -207, -196, 240, -54, -402, 220, 29, 170, 213, 178, -196, 208, 8, -322, 379, 55, -369, -39, 136, -367, 28, -154, -160, -59, 208, -215, -9, 278, -126]
4673a26j51L35l55l0N66k13l03N50n95K2O68m34j78M74j97m98O57p7l10K06l7
4694b6l92M35K86l00Q6J59n49M20q2n24L42O39n70j85O46n48J46M11o56o1O25
4715C02j94m71M84K4k34M58m22j66N74k55n33L78M00o41K44L47k21j71L62m29
4735a64R3M08l68j99O89p96J59L24n71J06N29k71l58O12k34j25L98q5k42M39l6
4756C08n28K27K53l81K50K53o81M25R0j7k01J14k39l5M52n38K00L05l30j93K83
4777A7r9o0K7L79l42L63k11l30L54K88p14L45j0k08P2J95k68K79Q2o15K44L53
4799A41m18J44K14j54J65K31l52k41K50K71o18Q04l99k88N02m19j03K99Q8k74
4819a57J57K69o62N78l06j85M54q9m70M12K51m64K66K1j43o2J99j34k93O53l06
$$ y = [-126, -277, 58, -297, -327, 239, 26, -277, 273, -322, -300, 368, -66, -244, 230, 33, -465, 192, 115, -195, 11, -26, -418, 17, 303, 3, 89, 248, -301, 119, 37, -487, -145, 494, -76, -261, 385, -163, -17, 394, -262, -323, 302, 108, -363, 121, 145, -89, 369, -53, -219, 355, 100, -433, -55, 345, -296, -52, 295, 74, -97, 265, -164, -71, 337, -31, -230, 459, -337, -178, 146, -425, -319, 210, -61, -419, 193, -41, -166, 232, 147, -95, 344, 308, -220, 7, 260, -121, 129, 382, -299, 126, 216, 199, -2, 112, -127, -162, 290, -248, -48, 257, -73, -266, 17, -82, -142, -115, 264, -78, 285, 74, -256, 98, 386, -328, 17, 7, -201, -129, 66, -202, 77, 159, -456, -212, 141, -277, -133, 81, -73, 92, 323, -29, -270, -20, 251, -367, 437, 38, -250, 252, -167, -270, 29, 117, -157, 0, 269, -393, 185, -121, -306, 148, 59, -411, 1, 252, -212, 54, 75, -68, -130, 69, -65, -358, 295, -11]
4840a1k19N84k84k67N75m38L4L11k41l86N84q7l59L65R0l41K34o8l18L71J92k26
4862I5n4M75n82k9M49o18K14L88k90l00M57o7k47J93j57k33N96k24j95M82j15
4883B38m17M76M2p34N87j97l55L94J5k09J18L03n71R8K46l44J94M59k20k18K23
4904A28Rm62M05k01j60O75k44l30N11j65m08O42m32l6J92k2m26O3K65k68K25M07
4926C68l53j09J87k82K18K66m90J50L07j43j89K56nm30M58j94l41M38M2n61N41
4947A34q5m28O35l4n57O29j30m15J16L53m68M01j46k30K18K95k53k14L94m18K8
4968a75L79m51J78K26m9m79O11l02j98M63j28j50M16l22j83N63j89l57Q5Q4j18
4989i6K62q0r8j29M12o01K11M64n61p6O47n94K5P01o14J01K78j88l17M92j19k99
$$ y = [-11, -230, 354, 70, -197, 378, -60, -26, 285, 44, -342, 242, 155, -204, 161, 251, -90, 144, 76, -242, 129, 321, 95, 41, 516, -66, -95, 354, -264, -50, 338, 48, -252, 205, 138, -109, 84, -73, -306, 290, 66, -129, 353, 238, -179, 297, 339, -395, 192, -5, -360, 34, 49, -160, -42, 261, -310, -212, 34, -310, -116, 343, 123, -95, 128, 137, -325, 80, -121, -281, 394, 150, -180, 331, 166, -242, 400, -32, -68, 124, 102, -324, -261, 4, -264, -39, 368, 15, -94, 93, -189, 29, 295, -195, -45, 262, 119, -70, 186, 181, -249, 209, 15, -326, 112, 154, -407, 134, 49, -379, 256, 222, -335, 294, 164, -251, -135, 218, -250, 151, 5, -225, -7, 288, 35, -179, 215, -203, -175, 204, -247, -69, 157, 108, -371, 240, -62, -260, 203, 75, -75, 341, 19, -164, 399, 210, -147, -62, 22, -96, 166, 86, -12, -141, 271, -330, -119, 345, -216, -292, 355, -239, -214, 487, -127, -26, 252, 64, -253, 239, 120, -179]
5011a79N11l22m74N64N1m23K85J70j76K15r0k73QK57m35K10L14m74K22L63l89
5032f5k8J90q6l47N53j94l17J81K76n01M94J9k04j82K73j7J33J43n65L54Q9j48
5054E1l3R7k51nJ31J00j72K42k59j03N99o16k2M29m24j6K89K02m66L12Ml27K58
5077B0k2j51M53j23n65N04J86m92O3N70p22J32K83m33K83J77k25k49M13p2k23
5098a93L32l57J6M17l00rN7k88J17K86O0j60M7k6k83J65M8j88P6K77l69K81J95
$$ y = [-179, 332, 10, -464, 100, 151, -272, 13, 183, 7, 222, 132, -141, -133, 124, -311, -101, 213, -261, -39, 324, -65, -93, 97, 11, -336, 217, 23, -294, -113, 163, -338, 156, 175, -29, -211, 62, 45, 178, 321, -244, 110, 199, 51, 18, 115, -136, -141, -10, 90, -82, 160, -99, -202, 397, -219, -241, 188, -236, -252, 37, 239, -227, 85, 89, -238, 20, -2, -153, 300, 177, -388, 116, 302, -190, -127, 443, -279, -147, 136, -297, -14, 163, -62, -311, 102, 30, -193, 139, -218, -202, 215, -85, -94, -37, -325, -208, 78, 138, -22, 25, -1, -284, -119, -71, -259, -183, 94, -275, 6, 201]
$$ [...]
8191b1
##END NTUPLES=NMR FID
##END=
