##TITLE=1H_Pr 4897
 CDCl3, 8 sc, 
 8.2.2019
##JCAMPDX= 6.0         $$ Bruker NMR JCAMP-DX V2.0
##DATA TYPE= NMR FID
##DATA CLASS= NTUPLES
##ORIGIN= UXNMR, Bruker Analytische Messtechnik GmbH
##OWNER= root
$$ XWIN-NMR		Version 3.5
$$ Fri Feb  8 16:25:44 2019 Russian Standard Time (UT+4h)  she@DPX200
##.OBSERVE FREQUENCY= 200.1313
##.OBSERVE NUCLEUS= ^1H
##.DELAY= (6, 6)
##.ACQUISITION MODE= SIMULTANEOUS
##.ACQUISITION SCHEME= undefined
##.AVERAGES= 8
##.DIGITISER RES= 18
##SPECTROMETER/DATA SYSTEM= spect
##.PULSE SEQUENCE= zg30
##.SOLVENT NAME= CDCl3
##.SHIFT REFERENCE= (INTERNAL, CDCl3, 0, 15.7039)
##AUDIT TRAIL= $$ (NUMBER, WHEN, WHO, WHERE, WHAT)
$$ ##TITLE= Audit trail, XWIN-NMR		Version 3.5
$$ ##JCAMPDX= 5.01
$$ ##ORIGIN= Bruker BioSpin GmbH
$$ ##OWNER= she
$$ F:/spectra/data/she/nmr/H-F/1/audita.txt
$$ ##AUDIT TRAIL=  $$ (NUMBER, WHEN, WHO, WHERE, WHAT)
(   1,<2019-02-08 16:24:50.73 +0400>,<she>,<DPX200>,
      <created by zg, POWCHK disabled, PULCHK disabled
       configuration hash MD5:
       00 E9 B6 7A A2 85 ED C7 34 08 36 98 17 FE 4E 26
       data hash MD5: 16K
       BD 3C 4F A7 1A 63 C9 59 50 F1 CC 69 56 C2 7E 5A>)
$$ ##END=
$$ 
$$ hash MD5
$$ DA 30 2F 6A AA 46 0F F0 D3 62 1D 5A 9D 29 09 9A
##$RELAX= 
##$RELAX= 
##$RELAX= 
##$RELAX= 
##$RELAX= 
##$RELAX= 
$$ Bruker specific parameters
$$ --------------------------
##$DU= <F:/spectra>
##$EXPNO= 1
##$NAME= <H-F>
##$PROCNO= 1
##$TYPE= <nmr>
##$USER= <she>
##$AMP= (0..31)
100 100 100 100 100 100 100 100 100 100 100 100 100 100 100 100 100 100 
100 100 100 100 100 100 100 100 100 100 100 100 100 100 
##$AQSEQ= 0
##$AQ_mod= 1
##$AUNM= <au_zg>
##$AUTOPOS= <>
##$BF1= 200.13
##$BF2= 200.13
##$BF3= 200.13
##$BF4= 200.13
##$BF5= 200.13
##$BF6= 200.13
##$BF7= 200.13
##$BF8= 200.13
##$BYTORDA= 1
##$CFDGTYP= 0
##$CFRGTYP= 5
##$CHEMSTR= <none>
##$CNST= (0..31)
1 1 145 1 1 1 1 1 1 1 1 1 1 1 1 1 1 1 1 1 1 1 1 1 1 1 1 1 1 1 1 1 
##$CPDPRG= <>
##$CPDPRG1= <>
##$CPDPRG2= <>
##$CPDPRG3= <>
##$CPDPRG4= <mlev>
##$CPDPRG5= <mlev>
##$CPDPRG6= <mlev>
##$CPDPRG7= <mlev>
##$CPDPRG8= <mlev>
##$CPDPRGB= <>
##$CPDPRGT= <>
##$D= (0..31)
0 1.2 0 0 0 0 0 0 0 0 0 0.03 0 0 0 0 0 0 0 0 0 0 0 0 0 0 0 0 0 0 0 0 
##$DATE= 1549628690
##$DBL= (0..7)
120 120 120 120 120 120 120 120 
##$DBP= (0..7)
150 150 150 150 150 150 150 150 
##$DBP07= 0
##$DBPNAM0= <>
##$DBPNAM1= <>
##$DBPNAM2= <>
##$DBPNAM3= <>
##$DBPNAM4= <>
##$DBPNAM5= <>
##$DBPNAM6= <>
##$DBPNAM7= <>
##$DBPOAL= (0..7)
0.5 0.5 0.5 0.5 0.5 0.5 0.5 0.5 
##$DBPOFFS= (0..7)
0 0 0 0 0 0 0 0 
##$DE= 6
##$DECBNUC= <off>
##$DECIM= 32
##$DECNUC= <off>
##$DECSTAT= 4
##$DIGMOD= 1
##$DIGTYP= 9
##$DL= (0..7)
0 120 120 120 120 120 120 120 
##$DP= (0..7)
150 150 150 150 150 150 150 150 
##$DP07= 0
##$DPNAME0= <>
##$DPNAME1= <>
##$DPNAME2= <>
##$DPNAME3= <>
##$DPNAME4= <>
##$DPNAME5= <>
##$DPNAME6= <>
##$DPNAME7= <>
##$DPOAL= (0..7)
0.5 0.5 0.5 0.5 0.5 0.5 0.5 0.5 
##$DPOFFS= (0..7)
0 0 0 0 0 0 0 0 
##$DQDMODE= 0
##$DR= 18
##$DS= 0
##$DSLIST= <SSSSSSSSSSSSSSS>
##$DSPFIRM= 0
$$ [...]
##$SUBNAM2= <"">
##$SUBNAM3= <"">
##$SUBNAM4= <"">
##$SUBNAM5= <"">
##$SUBNAM6= <"">
##$SUBNAM7= <"">
##$SUBNAM8= <"">
##$SUBNAM9= <"">
##$SW= 20.0189088683792
##$SWIBOX= (0..15)
0 0 2 0 0 0 0 0 0 0 0 0 0 0 0 0 
##$SW_h= 4006.41025641026
##$TD= 16384
##$TD0= 1
##$TE= 0
##$TE2= 300
##$TE3= 300
##$TEG= 300
##$TL= (0..7)
0 120 120 120 120 120 120 120 
##$TP= (0..7)
150 150 150 150 150 150 150 150 
##$TP07= 0
##$TPNAME0= <>
##$TPNAME1= <>
##$TPNAME2= <>
##$TPNAME3= <>
##$TPNAME4= <>
##$TPNAME5= <>
##$TPNAME6= <>
##$TPNAME7= <>
##$TPOAL= (0..7)
0.5 0.5 0.5 0.5 0.5 0.5 0.5 0.5 
##$TPOFFS= (0..7)
0 0 0 0 0 0 0 0 
##$TUNHIN= 0
##$TUNHOUT= 0
##$TUNXOUT= 0
##$USERA1= <user>
##$USERA2= <user>
##$USERA3= <user>
##$USERA4= <user>
##$USERA5= <user>
##$V9= 5
##$VALIST= <valist>
##$VCLIST= <CCCCCCCCCCCCCCC>
##$VD= 0
##$VDLIST= <DDDDDDDDDDDDDDD>
##$VPLIST= <PPPPPPPPPPPPPPP>
##$VTLIST= <TTTTTTTTTTTTTTT>
##$WBST= 1024
##$WBSW= 4
##$XGAIN= (0..3)
0 0 0 0 
##$XL= 0
##$YL= 0
##$YMAX_a= 164823
##$YMIN_a= -166160
##$ZGOPTNS= <>
##$ZL1= 120
##$ZL2= 120
##$ZL3= 120
##$ZL4= 120
##$ABSF1= 10
##$ABSF2= 0
##$ABSG= 5
##$ABSL= 3
##$ALPHA= 0
##$AQORDER= 0
##$ASSFAC= 0
##$ASSFACI= 0
##$ASSFACX= 0
##$ASSWID= 0
##$AUNMP= <proc_1d>
##$AZFE= 0.1
##$AZFW= 0.1
##$BCFW= 1
##$BC_mod= 2
##$BYTORDP= 1
##$COROFFS= 0
##$CY= 11.3945322036743
##$DATMOD= 1
##$DC= 2
##$DFILT= <>
##$DTYPP= 0
##$F1P= 18.9103706918063
##$F2P= -1.10871071338519
##$FCOR= 0.5
##$FTSIZE= 0
##$FT_mod= 4
##$GAMMA= 1
##$GB= 0.15
##$INTBC= 1
##$INTSCL= 1
##$ISEN= 128
##$LB= 0.24
##$LEV0= 0
##$LPBIN= 0
##$MAXI= 10000
##$MC2= 0
##$MEAN= 0
##$ME_mod= 0
##$MI= 1.114404
##$NCOEF= 0
##$NC_proc= 0
##$NLEV= 6
##$NOISF1= 3.799351
##$NOISF2= 2.8
##$NSP= 1
##$NTH_PI= 0
##$NZP= 0
##$OFFSET= 15.70392
##$PC= 1
##$PHC0= -8676.503
##$PHC1= 8.80019
##$PH_mod= 1
##$PKNL= yes
##$PPARMOD= 0
##$PSCAL= 0
##$PSIGN= 0
##$REVERSE= no
##$SF= 200.130013532006
##$SI= 16384
##$SIGF1= 3
##$SIGF2= 2
##$SINO= 400
##$SIOLD= 16384
##$SREGLST= <1H.CDCl3>
##$SSB= 0
##$STSI= 0
##$STSR= 0
##$SW_p= 3612.71676300578
##$SYMM= 0
##$S_DEV= 0
##$TDeff= 0
##$TDoff= 0
##$TI= <>
##$TILT= no
##$TM1= 0
##$TM2= 0
##$TOPLEV= 0
##$USERP1= <user>
##$USERP2= <user>
##$USERP3= <user>
##$USERP4= <user>
##$USERP5= <user>
##$WDW= 1
##$XDIM= 8192
##$YMAX_p= 0
##$YMIN_p= 0
$$ End of Bruker specific parameters
$$ ---------------------------------
##NTUPLES= NMR FID
##VAR_NAME=  TIME,          FID/REAL,        FID/IMAG
##SYMBOL=    X,             R,               I
##VAR_TYPE=  INDEPENDENT,   DEPENDENT,       DEPENDENT
##VAR_FORM=  AFFN,          ASDF,            ASDF
##VAR_DIM=   8192,          8192,            8192
##UNITS=     SECONDS,       ARBITRARY UNITS, ARBITRARY UNITS
##FACTOR=    0.0002496,     1,               1
##FIRST=     0,             0,               0
##LAST=      2.0444736,     0,               0
##MIN=       0,             -166160,         0
##MAX=       2.0444736,     164823,          0
$$ Real data points
##PAGE= N=1
##DATA TABLE= (X++(R..R)), XYDATA
0@%%%%%%%%%%%%qJ6j6J6j7K5l2M0m9N7p2Q6j00J17j36J54j77K08k40K73l10L50
$$ 0 0 0 0 0 0 0 0 0 0 0 0 0 -8 8 -8 8 -9 16 -16 24 -25 32 -40 46 -54 63 -73 81 -96 112 -128 145 -165 185
34A85l94M46n04N66o33P08p89Q77r74J080j196J322j460J611j776J956k155K373
$$ 185 -209 237 -267 299 -334 374 -415 462 -512 568 -628 694 -766 845 -931 1025 -1130 1243
52A243k615K886l184L518l897M329m827N409o097O925p948R250j0968J3351j6906
$$ 1243 -1372 1514 -1670 1848 -2049 2280 -2547 2862 -3235 3690 -4258 4992 -5976 7375 -9531
67i531K2857l5315J09252j31721j7608K17140k14203J4462J78911j59138m1221
$$ -9531 13326 -21989 87263 -44458 -62066 155074 -59129 -44667 134244 -24894 -66115
78f6115K11050j63813j05219J92736n2932q9790J58780r6715j11070J72321n9402
$$ -66115 144935 -18878 -124097 68639 15707 -74083 84697 -12018 -123088 49233 -10169
89a0169j33819K06878m05j61970J54172M03j96294J74645P6048k23653J23382
$$ -10169 -143988 62890 62485 -99485 54687 55090 -141204 33441 109489 -114164 9218
100I218J42994k33315K2957J52684j74834K5412J89314j76848n5665J96608j11123
$$ 9218 152212 -81103 -58146 94538 -80296 -54884 134430 -42418 -98083 98525 -12598
111a2598q3316J73823p0698o5345J72176j01622j37346J85865j9079j27658J74495
$$ -12598 -95914 77909 7211 -58134 114042 12420 -124926 60939 41860 -85798 88697
122H8697o343j63262J53906P789k09459J47587R8874k09433P6156J12274k03383
$$ 88697 82354 -80908 72998 80787 -128672 18915 117789 -91644 -15488 96786 -106597
133a06597M1926J49651j72897K2931J87383j65588o5320J73844j00492n0907J79874
$$ -106597 -64671 84980 -87917 -64986 122397 -43191 -108511 65333 -35159 -86066 93808
144I3808r3146q3619J85869p8174j45938J72178j25j16844J57354j6645j73507
$$ 93808 662 -82957 102912 24738 -121200 50978 50853 -65991 91363 74718 -98789
155i8789J46101M0550j91553J09170R2522j70659O7413Q5129j85038O0641J56318
$$ -98789 47312 87862 -103691 5479 98001 -72658 -5245 79884 -105154 -44513 111805
166A11805j59341M500J59702j46414m6963J51533j15312m1489J92680r4898j11483
$$ 111805 -47536 -43036 116666 -29748 -76711 74822 -40490 -81979 110701 15803 -95680
177i5680J69950n2750j31164J55976q792j23128J52019n567j84758J20640O8021
$$ -95680 74270 21520 -109644 46332 37540 -85588 66431 60864 -123894 -3254 64767
188F4767j52644R1560P3098j56461P4699Q8708j77410N3398J58812j37329k865
$$ 64767 -87877 3683 76781 -79680 -4981 83727 -93683 -40285 118527 -18802 -21667
199b1667J28282j48815k4188J64579j23361n7567J94819p9842j20202J51444m5406
$$ -21667 106615 -42200 -66388 98191 -25170 -82737 112082 32240 -87962 63482 18076
210A8076j13396J62666j4991j50472J35951K1925j70160R5370O7544j24726R2028
$$ 18076 -95320 67346 52355 -98117 37834 59759 -110401 -15031 52513 -72213 19815
221A9815N9831j64849O2811J03165j50651L1143J28872j20851Q569J13716j52715
$$ 19815 79646 -85203 -22392 80773 -69878 -38735 90137 -30714 -22145 91571 -61144
232f1144k2144J77431r9029p0233J61885o7294r6515J43507n1466j12220J66625
$$ -61144 -83288 94143 -4886 -75119 86766 19472 -77043 66464 14998 -97222 69403
243F9403L344j57227J01433K9164j34389R7292N2733j29607R1649P1664j64574
$$ 69403 72747 -84480 16953 46117 -88272 9020 61753 -67854 23795 95459 -69115
254f9115L4369R9426j20438L5527J05813j36427Q302J32093j35984l8022J66719
$$ -69115 -34746 64680 -55758 -20231 85582 -50845 -42543 89550 -46434 -84456 82263
265H2263p5704o2391J37272q2980r2189J58330l5697j23129J43109J2406j36505
$$ 82263 6559 -55832 81440 -1540 -93729 64601 28904 -94225 48884 61290 -75215
276g5215R1240J6221j24057J11617N9809j41385O6661P5104j38677L3383Q3704
$$ -75215 16025 32246 -91811 19806 79615 -61770 4891 79995 -58682 -25299 58405
287E8405j16500M3402J09967j38457j0978J31412j02471l2135J38539p8560n4827
$$ 58405 -58095 -14693 95274 -43183 -54161 77251 -25220 -57355 81184 2624 -52203
298e2203J32206q2983r9748J48377j3518j07359J17127P31j19632R8072J7523
$$ -52203 80003 -2980 -102728 45649 32131 -75228 41899 42630 -77002 21070 38593
309C8593j26568J01646O8845j31819M4598O3381j20893M4610Q7153j18353K8563
$$ 38593 -87975 13671 82516 -49303 -4705 58676 -62217 -17607 69546 -48807 -20244
320b0244J12722j21700k5059J16881q2827k1556J26874q7907o4702J30500o3100
$$ -20244 92478 -29222 -54281 62600 -20227 -41783 85091 -2816 -67518 62982 -118
331a18r6687J31899o851r1271J10311j1741j21242J06741L2989j27071Q1931O3742
$$ -118 -96805 35094 28243 -63028 47283 35542 -85700 21041 54030 -73041 8890 72632
343G2632j20931M4203N6419j19810N0689J00461j15856M849J03710j01751k0800
$$ 72632 -48299 -4096 52323 -67487 -16798 83663 -32193 -27344 76366 -25385 -46185
354d6185J03682q3209j8945J28446q1937p6401J18274l9826p7402J16263j6201
$$ -46185 57497 -25712 -44657 83789 1852 -74549 43725 3899 -73503 42760 26559
365B6559q5166J10679r015j25617R2799M5222j07833O4164M4406j15341N0610
$$ 26559 -58607 52072 43057 -82560 10239 55461 -52372 11792 56198 -59143 -8533
376h533O3513j17140L6735J03304r7394p143Q1096r4352o976J08041q2229l2539
$$ -8533 54980 -62160 -25425 77879 -19515 -26658 54438 -39914 -46890 61151 -21078 -53617
388e3617J21920o1456p1514J02076l4697n9503J17906k4629j00014J02469O627
$$ -53617 68303 6847 -64667 37409 2712 -56791 61115 36486 -63528 38941 45568
399D5568j13646P9050L7526r6724O8509L8106j24669M7749P9160j04007K2504
$$ 45568 -68078 10972 48498 -48226 20283 58389 -66280 -18531 60629 -43378 -20874
410b0874Q7319r1143L92P8284r9409j1088J17090o7992m3256J02338n3665n4980
$$ -20874 66445 -24698 -24306 53978 -45431 -56519 60571 -7421 -50677 51661 -2004 -56984
422e6984J01073m0290o4960J16521j3930j04294P9987J0986q9752P9993K8669
$$ -56984 44089 3799 -61161 55360 41430 -62864 17123 28109 -61643 18350 47019
433D7019r9454O6827M7214j16402L2462P5364q2621K3976P0743r7905J130Q8708
$$ 47019 -52435 14392 61606 -54796 -22334 53030 -29591 -5615 65128 -32777 -31647 57061
445E7061q5443k1506J06421n3875l8203Q7162n8818n1703J07505k9561p5375R5754
$$ 57061 -28382 -49888 56533 2658 -35545 51617 -7201 -58904 48601 19040 -56335 39419
457C9419p764r0762P2119N339q3475Q5351L2959j05015N1280M9614r9302L2854
$$ 39419 31655 -59107 13012 18351 -65124 20227 53186 -51829 -549 49065 -50237 -17383
469a7383O4130q5264K7619P4110r9729o896R3390o7942j8546R5048n7871l6100
$$ -17383 46747 -38517 -10898 63212 -36517 -43413 49977 -17965 -36511 58537 666 -35434
481c5434R0951n5618n8812J04278j6191p2349P9923j1840q0827P5755Q323q4810
$$ -35434 55517 -101 -58913 45365 29174 -43175 36748 24908 -55919 19836 28159 -56651
493e6651P6190L6486r8428L7163M1354q6782L8967N9959q9251J9954P6128q8602
$$ -56651 19539 56025 -42403 -5240 36114 -50668 -11701 48258 -40993 -21039 55089 -33513
505c3513j2138Q7229n5605j3080Q5183o2420m2388R1623m0388o0255R0156r643
$$ -33513 -45651 41578 -14027 -27107 58076 -4344 -46732 44891 4503 -55752 34404 24761
517B4761o2757P0777j5320p7231P9779J8303q4395N9380L3557q6095L8300L5648
$$ 24761 -37996 32781 17461 -59770 20009 38312 -46083 13297 46854 -39241 -941 34707
529C4707q5726M3647O8033q9597O316P4129p4054p374P9246o1197j4998Q9061
$$ 34707 -51019 -7372 60661 -28936 -22620 51509 -22545 -29919 49327 -11870 -26868 62193
541F2193o1740n4671Q4612k7316n0883P9656j8514o1425P6069j0741q1624P2221
$$ 62193 453 -54218 30394 3078 -47805 31851 13337 -48088 27981 17240 -64384 7837
553G837K6678p4498N0434K2468q3422M6914M5101q5092L3554P1298p7059m55O1481
$$ 7837 34515 -39983 10451 32919 -50503 -3589 41512 -43580 -10026 61272 -15787 -16242 45239
566D5239o8050m6Q1158o1648k8531Q1451m6847n0125P2388k4187m0700P9185k1785
$$ 45239 -22811 -22857 58301 -3347 -31878 49573 2726 -47399 24989 802 -39898 39287 17502
579A7502o9057P1175K829p2484O0330K0397o9168N2003K1662q7716M2438N6383
$$ 17502 -51555 19620 22449 -50035 10295 30692 -38476 13527 35189 -52527 -10089 46294
591D6294p5812J9807N9746p1450K899O0473p0442o441Q4184n2078l4560O9730
$$ 46294 -29518 -9711 50035 -21415 -18516 41957 -28485 -34926 49258 -2820 -37380 32350
603C2350m0080l6447P5373k7938m4599Q1455j4449p0783O2111N473o1502O2739
$$ 32350 -7730 -44177 31196 3258 -41341 40114 25665 -45118 16993 22466 -39036 23703
615B3703J4576p6944N0213L0867q4039L2124N4550o6217J7357M9789p5804J581
$$ 23703 38279 -38665 11548 42415 -41624 -9500 45050 -21167 -3810 45979 -29825 -28244
627b8244O6644o1262j3543P4576m4038k9183O2967m0369l1545P9562k2584n1738
$$ -28244 38400 -22862 -36405 38171 -5867 -35050 27917 -12452 -43997 35565 12981 -38757
639c8757O8952r564o2646N8370L690n9946O1697J8685p8856L8495L6240p0710
$$ -38757 30195 20631 -42015 16355 20045 -39901 21796 40481 -38375 120 36360 -34350
651c4350K7498M7186o4402J7014N0406p1980k902O7912m9655j2403O5490m4817
$$ -34350 -6852 40334 -24068 -7054 43352 -28628 -31530 36382 -13273 -25676 39814 -5003
663e003k4646O6183l9894l6754P8043j7324n4434N8964j1681n8468O0765O215
$$ -5003 -29649 36534 -3360 -40114 37929 20605 -33829 25135 13454 -45014 15751 21966
675B1966o4654N6008K3915p5672L0158L4477o1404L0845M4136o8341J2985N4444
$$ 21966 -42688 13320 37235 -38437 -8279 26198 -35206 -4361 39775 -28566 -15581 38863
687C8863o3556m484O4513m3677q598O1591n0535k7966P1441l1240m1884O8067
$$ 38863 -24693 -29177 35336 -8341 -16939 44652 -5883 -33849 37592 6352 -35532 32535
699C2535j4526n0632N4802j1370n7900O1904J5180o5067M1492K4334o3103K8799
$$ 32535 18009 -32623 22179 10809 -47091 14813 29993 -35074 6418 30752 -32351 -3552
711c552K9346n9920L0552M5925o5567L850N0825n1870M99N7271m8323r994O4701
$$ -3552 25794 -34126 -3574 42351 -23216 -19366 31459 -20411 -19912 37359 -10964 -20958 43743
724D3743m8218l6265O7304k0982l8035O1320j7593n0880N8696k588n9730N3700
$$ 43743 -4475 -40740 26564 5582 -32453 28867 11274 -39606 19090 16502 -43228 10472
736A0472K1888n7277L3720J6915o0402L3838L4276o1339K2292M5184n9110L269
$$ 10472 32360 -24917 8803 25718 -34684 -846 33430 -27909 -5617 39567 -19543 -16274
748a6274M5259n1655N237O1457n2189k0673O3429l8110l4285O1975k0390l5536
$$ -16274 28985 -22670 -17433 44024 -8165 -28838 34591 -3519 -37804 24171 3781 -31755
760c1755O1826j5665n5986N4830Q245n3677M3820J5676n4004L4498J7554o1440
$$ -31755 30071 14406 -41580 13250 21495 -32182 11638 27314 -26690 7808 25362 -36078
772c6078K9876L9257n4105J4556L8476n4349P277M7070n1694j149O1813m3774
$$ -36078 -6202 33055 -21050 -6494 31982 -22367 -15090 31980 -19714 -20863 40950 -2824
784b824k5561N5508l1869k8193O1227j9855m0008N8566q843n5133M6841Q688m6749
$$ -2824 -28385 27123 -4746 -32939 28288 8433 -31575 26991 18148 -36985 9856 18544 -28205
797b8205M2245J1127n7778L3402K3477n7525K6132L8106n0247J5129L5942n6372
$$ -28205 14040 25167 -32611 791 24268 -33257 -7125 30981 -19266 -4137 31805 -24567
809b4567P259N2952m7395q160N6949m0133k3005N3476l1778k6627O2785j8699
$$ -24567 -17308 35644 -11751 -19911 37038 -3095 -26100 27376 -4402 -31029 31756 13057
821A3057m4832N1850o027m8728M4753N633m6872M2536J2747n9029L0084K7992
$$ 13057 -31775 20075 14048 -34680 10073 15706 -31166 11370 24117 -34912 -4828 23164
833B3164n0240K3783L3981m9863J4171L7974n3868J368N3342l9963j0731M8500
$$ 23164 -27076 -3293 30688 -19175 -5004 32970 -20898 -19530 33812 -6151 -16882 31618
845C1618l7181k0788N3535k8405k9002N8240j3843m3355M3997n930m2786M6808
$$ 31618 -5563 -26351 27184 -1221 -30223 28017 14174 -29181 14816 8886 -33900 12908
857A2908O336m9396L9244J7047n5561K5368K8075m6085K4057L1876n4127Q663
$$ 12908 19244 -30152 9092 26139 -29422 -4054 24021 -22064 1993 33869 -20258 -11595
869a1595M2101m8282k566M8878l6147j0030M5824l8939k1405N6923k1675l1975
$$ -11595 30506 -17776 -20342 28536 -7611 -17641 28183 -10756 -32161 24762 3087 -28888
881b8888N1095j2603l8606M4584p194m2837M9434J0715n1196L2314J7852m8712
$$ -28888 22207 9604 -29002 15582 8388 -34449 14985 25700 -25496 6818 24670 -24042
893b4042K5804K6265m9008K1296L5247n3073J302M0717l9486j056M4425l8298
$$ -24042 1762 28027 -20981 315 35562 -17511 -16209 24508 -14978 -16034 28391 -9907
905i907j1352M8161l3347k4956N1225j5331k7880M4833j5237l8241M6285j200
$$ -9907 -21259 26902 -6445 -31401 19824 4493 -23387 21446 6209 -32032 14253 13053
917A3053m3556M1813J3075m6423K7635J4190m7698K8101K9365m9589J3328L5359
$$ 13053 -30503 11310 24385 -22038 5597 19787 -27911 190 29555 -20034 -6706 28653
929B8653m6001J843L8265l7755J355M6178l7934j6749M6629k5998k2329M7529
$$ 28653 -17348 -15505 22760 -14995 -13640 32538 -5396 -22145 24484 -1514 -23843 23686
941B3686j7790k7765M5685j4976m0949M5330L651m1877L6591Q922m6424K9619
$$ 23686 5896 -21869 23816 8840 -32109 13221 16872 -25005 11586 20508 -25916 3703
953C703J6033m9205K4690L1592m6112R332L2196m2883N280M0054l7678k665M5914
$$ 3703 19736 -29469 -4779 26813 -19299 -9967 22229 -20654 -15374 24680 -12998 -15663 30251
966C0251l3607j8488M2688k3130j8723M6275j8196l0484M3968r524l8930L9856
$$ 30251 -3356 -21844 20844 -2286 -21009 25266 7070 -23414 20554 11030 -27900 11956
978A1956N051l7976L4403O809m7352K7904K0886m5331J9596L0001m2247Q372L0069
$$ 11956 17007 -20969 13434 20243 -27109 795 21681 -23650 -4054 25947 -16300 -7928 22141
991B2141m1553N032M1804l5186q324M0747k9786j6894M1089k2727j9097M6462
$$ 22141 -19412 -14380 27424 -7762 -16086 24661 -5125 -22019 19070 -3657 -22754 23708
1003B3708j6753l3290M0475n716l4629L8729K743l8602L4295Q451m7638K6515
$$ 23708 6955 -26335 14140 8424 -26205 12524 15267 -23335 10960 19411 -28227 -1712
1015a712K3359m0951J8380K6507m2420J0003L2332m1095K230M1580l1963r985
$$ -1712 21647 -19304 -924 25583 -16837 -6834 25498 -15597 -13367 28213 -3750 -13735
1027a3735L6868k9515j4539M2353k1245k2374M3831j3193l2404L5579n496l1378
$$ -13735 23133 -6382 -20921 21432 187 -22187 21644 8451 -23953 11626 6130 -25248
1039b5248L8505K242m1003L0587J1628m2561K2891K1651l7511J8503K4780m3238
$$ -25248 13257 15499 -25504 5083 16711 -25850 -2959 18692 -18819 -316 24464 -18774
1051a8774P408L4728l4820j191L7923k9899r477L6289k8026j5695M3933j6112
$$ -18774 -11366 23362 -11458 -12649 25274 -4625 -14102 22187 -5839 -21534 22399 6287
1063F287k4849L7163j1471k9474L5345n149l2792L7314N141m0735K5511J2497
$$ 6287 -18562 18601 7130 -22344 13001 7852 -24940 12374 17515 -23220 2291 14788
1075A4788l8147K4369J9913l9842J6722K7385m2065M079L4111l1927L09L4987
$$ 14788 -23359 1010 20923 -18919 -2197 25188 -16877 -12798 21313 -10614 -10305 24682
1087B4682l2091r921L8595k5057j7704M0349j3735k3012L4504j2858k9267L7076
$$ 24682 -7409 -17330 21265 -3792 -21496 18853 5118 -17894 16610 3752 -25515 11561
1099A1561j199l2743L2157O264l6921K4421J1072l6519K4768K1785m0102J1446
$$ 11561 10362 -22381 9776 16040 -20881 3540 14612 -21907 2861 24646 -15456 -4010
1111d010K6375l7216M595L1993l1071j182L5222l0700j3733L7135j9243j6601
$$ -4010 22365 -14851 -10256 21737 -9334 -10516 24706 -5994 -19727 17408 -1835 -18436
1123a8436L6260j4336k2871L3394j0530k8615L4804K093l0386K7706M466l4520
$$ -18436 17824 3488 -19383 14011 3481 -25134 9670 11763 -18623 9083 13549 -20971
1135b0971K5432J2104l6466K1756K1975l8067R666K3875l4712O153L2108l1959
$$ -20971 4461 16565 -19901 1855 23830 -14237 -4571 19304 -15408 -9255 22853 -9106
1147i106l065L4853k8259j3686L5369j8144j4824L5658j5343k4256L3597p412
$$ -9106 -12171 22682 -5577 -19263 16106 -2038 -16862 18796 3453 -20803 12794 5382
1159E382k7512L2537J915k8869K6441L066l4489K4669J4345l4722J7551K0047
$$ 5382 -22130 10407 12322 -16547 9894 12960 -21529 3140 17485 -17237 314 20361
1171B0361l5366Q731K3257l2664O011L2857k9683o916L1900k3971j1593L3503
$$ 20361 -15005 -6274 16983 -15681 -9670 23187 -6496 -13412 18488 -5483 -17076 16427
1183A6427j7000j5402L4318j3224k5814L1216l808k4604K9430O33k9755K5279
$$ 16427 -573 -15975 18343 5119 -20695 10521 6713 -17891 11539 12172 -17583 7696
1195G696N514l4574K1697J6157l1424J4489J8012l4028R410K5062l1243L321L1911
$$ 7696 13210 -21364 333 16490 -14934 -445 17567 -16461 -7051 18011 -13232 -9911 22000
1208B2000k6802p424K9332k3340r730L4471j6829j7946L2631j1016k4280K9034
$$ 22000 -4802 -12226 17106 -6234 -15964 18507 1678 -16268 16363 5347 -18933 10101
1220A0101m040k2904K9503O00l2138K3320Q083l1385J9820J5271l0579J4553J7387
$$ 10101 6061 -16843 12660 13260 -18878 4442 12525 -18860 960 16231 -14348 205 17592
1233A7592l3881P764K6662k7478J146K7781k6204o393K8586k2107j0055L3719
$$ 17592 -16289 -8525 18137 -9341 -8195 19586 -6618 -13011 15575 -6532 -16587 17132
1245A7132j3999j8799K8011r702k0344K8241l336k4105K7595K349l0457K0440
$$ 17132 3133 -15666 12345 2643 -17701 10540 7204 -16901 10694 13043 -17414 3026
1257C026Q296k6998J9324J3463l0385J2363J8705l1001N500K4705k5014J062K5675
$$ 3026 11322 -15676 3648 17111 -13274 -911 17794 -13207 -7707 16998 -8016 -6954 18721
1270A8721k6046o969K9458j9008j1314L0706j2704j7537K6991j0437k0459K9171
$$ 18721 -7325 -14294 15164 -3844 -15158 15548 2844 -14693 12298 1861 -18598 10573
1282A0573j523k4671K3905K410k8125J9737Q449k6795J8711J4415l0549R124J8801
$$ 10573 9050 -15621 8284 10694 -17431 2306 10755 -16040 2671 17086 -13463 -4339 14462
1295A4462k7469O280K3611k4844N53K4858k3666p678K8720j4946j1176K7929j3607
$$ 14462 -13007 -6727 16884 -7960 -7407 17451 -6215 -13893 14827 -119 -11295 16634 3027
1308C027j6869K6241q372k0351K6661l03k4140K0621K044k6105J9349R468k6655
$$ 3027 -13842 12399 4027 -16324 10337 10034 -14106 6515 8559 -17546 1803 11271 -15384
1321a5384J5731J4397k8134P160J8236k4399O065K2704k3643j488K4411k0640
$$ -15384 347 14744 -13390 -6230 12006 -12393 -6328 16376 -7267 -8755 15656 -4984
1333d984p369K6704j4249r829K5710j3641j7375K5613o092j9275K4349m84k2729
$$ -4984 -12353 14351 102 -9727 15983 2342 -15033 10580 4488 -14787 9562 9078 -13651
1346a3651J9756J551k4991J9691J0955k5574J2871J3331k6028Q011J7228k3249
$$ -13651 6105 7656 -17335 2356 13311 -12263 608 13939 -12089 -4078 13150 -10099
1358a0099O071K1927k3048l535K2046j8385n520K4312j4681j0727K4568j2667
$$ -10099 -4028 17899 -5149 -8684 13362 -5023 -10543 13769 -912 -11639 12929 262
1370B62j7229K4285m402j7358K2474j384k2264J9827M006k3576J7402J1272k2805
$$ 262 -16967 7318 2916 -14442 8032 6648 -15616 4211 8217 -15359 2043 13315 -9490
1383i490J0890J1359k3690Q019J7836k1517K775K0517k0218m153J9767j6871n138
$$ -9490 1400 12759 -10931 -2912 14924 -6593 -3818 16699 -3519 -7672 12095 -4776 -9914
1396i914K4135j4132j2362K2565j0144j5792K2760m068j6238K1750j003k2946
$$ -9914 14221 89 -12273 10292 148 -15644 7116 3048 -13190 8560 7557 -15389
1408a5389J8064N751k1143J5309R726k2478J0081J1916k3491O868J8216j9615
$$ -15389 2675 8426 -12717 2592 12318 -10160 -79 11837 -11654 -4786 13430 -6185
1420f185J963J7213j9682k377J9961j5668n140K3172j2765j1633K0381q784j3017
$$ -6185 -4222 12991 -6691 -9068 10893 -4775 -9915 13257 492 -11141 9240 456 -12561
1433a2561K2647l957j7175J9968n34k1074J6137N602j9437J3962Q504k2730Q612
$$ -12561 10086 6129 -11046 8922 8388 -12686 3451 9053 -10384 3578 12082 -10648 -2036
1446b036J2360k0519N258J6322j7841J256J6118j8575k542J9736j2895n670K0277
$$ -2036 10324 -10195 -4937 11385 -6456 -5200 10918 -7657 -10199 9537 -3358 -9028 11249
1459A1249j1170j0722J9343p835j2782K1559k564j7402J6782M43j9239J5618N363
$$ 11249 79 -10643 8700 865 -11917 9642 7078 -10324 6458 6901 -12338 3280 8643
1472H643j8605J3229Q294k1661P266J2587j8369N368J5336j7683P38J5745j6820
$$ 8643 -9962 3267 11561 -10100 -2834 9753 -8616 -3248 12088 -5595 -4857 10888 -5932
1485e932l051J9696j2054n772J8048j1314j0404J9086o798j2773J9656k526j6964
$$ -5932 -8983 10713 -1341 -7113 10935 -379 -10783 8303 1505 -11268 8388 5862 -11102
1498a1102J5202O55j7386J5050O303j8496J1163Q277j9499O672J2250j6480N363
$$ -11102 4100 4755 -12631 2419 8722 -9774 1389 9666 -9833 -3161 9089 -7391 -2028
1511b028J4231j7164n46J5626j4560k872J7847j0807n946J6339j0611j0365J8323
$$ -2028 12203 -4961 -5507 10119 -4441 -7313 10534 -273 -6219 10120 -491 -10856 7467
1524G467m799j2081J6868k628j5209J3925Q44j6183J4501O249j7379R071P597
$$ 7467 2668 -9413 7455 4827 -10382 3543 4387 -11796 2705 8954 -8425 646 8243
1537H243j7632O717J1668j6042M656J3549j6442j441J4904j2237k101J6473j1496
$$ 8243 -9389 -2672 8996 -7046 -2390 11159 -5283 -6724 8180 -4057 -6158 10315 -1181
1550a181o065J6215r393r903J7174l637j0995J5156l448j4509J4164J881j4993
$$ -1181 -7246 8969 -424 -10327 6847 3210 -7785 7371 3923 -10586 3578 5459 -9534
1563i534J2472N552j5886Q147O285j6372P319J1567j5268K906J2292j4865p25
$$ -9534 2938 8490 -7396 751 7036 -9336 -2017 9550 -5718 -2812 9480 -5385 -6110
1576f110J3824j1627j990J5901j0552p031J4617p527q197J5544l700j0656J3845
$$ -6110 7714 -3913 -5903 9998 -554 -7585 7032 -495 -8692 6852 3152 -7504 6341
1589F341k232j4260J2842K977j3589J0924M517j5379P500O727j4682O361J1068
$$ 6341 4109 -10151 2691 5668 -7921 3003 7520 -7859 -359 6368 -8314 -1953 9115
1602I115j3655K255J0696j3618l84J3788j0333k836J4159r477p007J3461o378
$$ 9115 -4540 -2285 8411 -5207 -5591 8197 -2136 -4972 9187 -290 -7297 6164 -214
1615b14p873J5087l559j1093J2482j545j2818J1917K788j2465R701M256j4684
$$ -214 -8087 7000 3441 -7652 4830 3285 -9533 2384 5172 -7293 2408 6664 -8020
1628h020P220P376j3187N540R925j3054K233R856j2591M3J3138r688l161J2547
$$ -8020 -800 6576 -6611 -1071 8854 -4200 -1967 7889 -4702 -4659 8479 -1209 -4370 8177
1642H177r214o226J2892n912p120J3850l686j0733J1110q57j0908J1488K154j1767
$$ 8177 -1037 -7263 5629 -283 -7403 6447 2761 -7972 3138 2281 -8627 2861 5015 -6752
1656f752R087L662j3504O414P528j1659M905Q676j2400J382R542j0956j74J2259
$$ -6752 2335 5997 -7507 -1093 6435 -5224 -319 8357 -4043 -2661 6881 -4075 -4249 8010
1670H010r088l287J1165q551n364J2581m782p190J2312k999r960J0188p49r651
$$ 8010 -1078 -4365 6800 -1751 -7115 5466 684 -6506 5806 2807 -7153 3035 2286 -7365
1684g365J0626K217j1496P371M056j2251N994O864j0943M734P744j2500J205R612
$$ -7365 3261 5478 -6018 1353 5409 -6842 -848 6016 -4927 -193 7551 -4949 -3744 5868
1698E868r518n71J1429q801k956J0341p486n136J2238l877p213J1168l210r029
$$ 5868 -3650 -4221 7208 -1593 -4549 5792 -1694 -6830 5408 1531 -5682 5486 2276 -6753
1712f753R924l05r070R748K305j0943O256L449j0581N871O127j0286L563P139
$$ -6753 3171 2866 -6204 3544 5849 -5094 1162 4611 -5970 -99 6028 -4258 -695 6444
1726F444j1073O83R123q489k1R956q257l521J0080o311m573J0828l257o626R663
$$ 6444 -4629 -3946 5177 -3312 -3333 6623 -1634 -5155 4925 -1386 -5959 4869 1612 -5014 4649
1741D649k704q803R567N44q629Q669J653j0488O195L441r657N773O013r791K614
$$ 4649 1945 -6858 2709 3253 -5376 3293 4946 -5542 653 4094 -5563 210 6223 -3568 -954
1756i54O262r642J287Q701q416L3R470p929l411R440o036l866J0478l822o358
$$ -954 5308 -4334 -3047 5654 -2762 -2729 6741 -1188 -4599 4841 -1195 -5061 5417 1595 -4763
1771d763R064l004q014R325L63p995P528J265r442N692L522q831N175N784r382
$$ -4763 4301 1297 -6717 2608 2971 -5024 2504 3769 -5673 19 3541 -5290 -115 5669 -3713
1786c713K429N754q770J518Q159p254o92Q543p164l323R153m902l517R080l527
$$ -3713 -1284 4470 -4300 -2782 5377 -1877 -2569 5974 -1190 -4513 4640 -262 -3779 5301 1774
1801A774o346P905j726o912Q238M22p597O394J177q871N228L859p850M385M631
$$ 1774 -4572 3333 1607 -5305 2933 3355 -4242 2152 3329 -5542 -314 3545 -4305 80 4711
1816D711q827K177N840p845J063P967o907r56P716o396l122Q908m259l607Q449
$$ 4711 -4116 -1939 3901 -3944 -2881 5086 -1821 -2777 4939 -1457 -4579 4329 70 -3537 4912
1831D912l363o174P506j614o123P734P6p144N967J230q135N105M025p384L600
$$ 4912 1549 -4625 2881 1267 -4856 2878 2954 -4190 1777 3007 -5128 -23 4002 -3382 218
1846B18M044p640J691O131p423J305P128o233j452O612n784k492Q071m073l614
$$ 218 4262 -3378 -1687 4444 -2979 -1674 5454 -779 -2231 4381 -1403 -3895 4176 103 -3511
1861c511P328l418n393O939j285n450P037L72p151N152J400o900N003L888p194
$$ -3511 3817 399 -4994 1945 660 -4790 2247 2619 -4532 620 2020 -4880 123 4011 -3183
1876c183L277M272p859K084N708o218Q24O499o326j334O108m949k180P286l948
$$ -3183 94 4366 -3493 -1409 4299 -1919 -1095 5404 -922 -2256 3852 -1097 -3277 4009 61
1891F1l537O648l077m669O702j199n088O555j75o465N046J152o019N109K823o606
$$ 61 -3476 3172 95 -4574 2128 929 -4159 2396 2221 -4244 802 1954 -4065 1044 3867 -2739
1907b739K702L586o782K141M875n922Q46N428n800j181O086m587j927O937l724
$$ -2739 -37 3549 -3233 -1092 3783 -2139 -1293 4135 -1665 -2846 3240 -1347 -3274 3663 -61
1922f1l356O078k612m015O595q55m608N195J32o032M881J531o060M509K659o521
$$ -61 -3417 2661 49 -3966 2629 1774 -2834 2361 2493 -3539 1342 2873 -3187 1322 3981 -2540
1938b540K189L647o298J513M955n578M77M984n299j061N460l706j506O271l539
$$ -2540 -351 3296 -3002 -1489 3466 -2112 -1635 3349 -1950 -3011 2449 -1257 -2763 3508 -31
1953c1l253N710k325l597O075q52m421M913l30n476M567J419n264L646K301o113
$$ -31 -3284 2426 101 -3496 2579 1727 -2694 2219 1889 -3587 980 2399 -2865 781 3082 -3031
1969c031K636K832n311K084M263n234K66M263m542n69N333l535j647N789l456
$$ -3031 -395 2437 -2874 -790 3473 -1761 -1495 2768 -1774 -2343 2990 -545 -2192 3597 141
1984A41l093N309k141l007N339j078m273M357jn071M226J439m929L393J744n377
$$ 141 -2952 2357 216 -2791 2548 1470 -2803 1554 1553 -3518 708 2147 -2782 611 2355 -3022
2000c022K131L057m877K036M084m807J30M093m294k78N046l412j451M773l204
$$ -3022 -891 2166 -2711 -675 3409 -1398 -1268 2825 -1469 -1747 3299 -113 -1564 3209 5
2015Ek732M709j697k943M819q68m075M443n15m446M107J132m666L483J424m790
$$ 5 -2727 1982 285 -2658 2161 1293 -2782 1661 1146 -3300 807 1939 -2727 756 2180 -2610
2031b610J828L047m116J516L526m628J5M018l899m30M868l567j276M494l086k299
$$ -2610 -782 2265 -1851 -335 3191 -1437 -1422 2596 -1303 -1733 3135 -432 -1708 2786 -300 -2599
2047b599M431j595k787M829j199l945L857M0l916L867J421m408K404J850m642
$$ -2599 1832 237 -2550 2279 1080 -2865 992 1032 -2884 983 2404 -2004 400 2250 -2392
2062b392J967K909l960J206L008m403P1M061l987J54M092k863j926L916k613j800
$$ -2392 -425 2484 -1476 -270 2738 -1665 -1594 2467 -1520 -1366 2726 -137 -2063 1853 -760 -2560
2078b560M584j432k893M381j350l505L925j23l214L225J083m542K582J460l847
$$ -2560 2024 592 -2301 2080 730 -2775 1150 1027 -2187 1038 2121 -2421 161 1621 -2226
2093b226K261K267l860J436K579l954R0L624l084k95L545k881j352L552k254j456
$$ -2226 35 2302 -1558 -122 2457 -1497 -1407 2217 -867 -1162 2383 -498 -1850 1702 -552 -2008
2109b008M277j592k613L662j070k865L282K58l500L366K42l472J937J320l237
$$ -2008 2269 677 -1936 1726 656 -2209 1073 1331 -2169 1197 1439 -2033 -96 1224 -2013
2124b013J648K606l341N20K673l598L54L649l324l2L342k894j141L188k024j495
$$ -2013 -365 2241 -1100 -580 2093 -1505 -1151 2498 -826 -858 2484 -410 -1551 1637 -387 -1882
2140a882L662j226k335K900j163k228L052M9k615K631M33l608K673P04k819K085
$$ -1882 1780 554 -1781 1119 -44 -2272 780 829 -1786 845 1278 -2330 343 1047 -1772 313
2156C13K026l419M32K521l238N54L073k799n30L255k655j385L465j989j209L337
$$ 313 2339 -1080 -648 1873 -1365 -811 2262 -537 -1067 2188 -467 -1852 1613 -376 -1585 1752
2172A752j390k137K970p50k457K935L90k869K210R88l621K074J543l450J997J766
$$ 1752 362 -1775 1195 445 -2012 923 1313 -1556 654 1642 -1979 95 1638 -1812 185 1951
2188A951l315R40J964k895K44L021k684j72K433k173j124L181j583j361L085j175
$$ 1951 -1364 -424 1540 -1355 -1111 1910 -774 -946 1487 -686 -1810 1371 -212 -1573 1512 337
2204C37k143K829l06k284K914j81k594K190K38k942K364J023k718J655J363l311
$$ 337 -1806 1023 717 -1567 1347 1166 -1428 762 1000 -1942 422 1445 -1273 382 1745 -1566
2220a566O29K402k869Q21K504k604l26K351k299l64K977j697j453L027j097k246
$$ -1566 -937 1465 -1404 -583 1921 -683 -1009 1342 -957 -1321 1656 -41 -1494 1533 436 -1810
2236a810K910n45k053K514l04k228J891L61k274J784J108k748J633J168k935R26
$$ -1810 1100 555 -1498 1016 712 -1516 375 736 -1538 246 1354 -1394 239 1407 -1528 -602
2252f02K049k355M35K475k763k60K620j947q30K940j493j140K579j557j559K648
$$ -602 1447 -908 -473 2002 -761 -1021 1599 -348 -1178 1762 269 -871 1708 151 -1408 1240
2268A240j118j405K183l11k491K414J80k326J846R88k652J254Q46k071J012J806
$$ 1240 122 -1283 900 589 -1902 512 692 -1634 212 1200 -1452 -198 648 -1423 -411 1395
2284A395k017M97J665j956n67K256j918n7K122j529o43J854q65j362J968l80j382
$$ 1395 -622 -125 1540 -416 -983 1273 -645 -702 1420 -109 -752 1102 237 -1125 843 463 -919
2301i19J862l73k246K066K02k066K013P65k474R62R80j977P59J754k035M06J468
$$ -919 943 570 -1676 390 592 -1474 539 1304 -1170 -208 772 -1205 -446 1308 -727 -321 1147
2318A147k082K73J890j561k07J714j269j118K199j164j020K011l04j581J697m15
$$ 1147 -935 -662 1228 -333 -540 1174 -95 -1213 986 -178 -1198 813 509 -1072 625 210
2334B10j676K197L8j978J532Q78k397J204J167k348J029J653k150L23J368j609
$$ 210 -1466 731 769 -1209 323 1201 -1196 8 1175 -1173 -144 1509 -641 -318 1050 -559
2350e59J65J392j437m69K068j414q34J734o56j019J688l00j644J730j97j647J403
$$ -559 -394 998 -439 -908 1160 -254 -1088 646 -10 -1029 659 359 -1285 445 248 -1399 4
2367DO66j744J282N47j956J125Q84j375M77J323j688J5J490j580L23J436j322
$$ 4 670 -1074 208 755 -1201 -76 808 -567 -90 1233 -455 -440 1050 -530 -207 1229 -93
2384i3m22J339j075r57K044p79j096J816l30j223J343k63j246J360M89j779J154
$$ -93 -515 824 -251 -1208 836 57 -1039 777 447 -776 567 304 -942 418 907 -872 282
2401B82M30j631J058P03j452N73P82j225L5J289j375J2J562j416J53R31j116m31
$$ 282 712 -919 139 842 -610 -37 745 -480 -445 844 -531 -519 1043 -373 -220 711 -405 -836
2419h36J662p72m93J132n40j024J477j4j390J526n3j335Q65K04j348J201L77j023
$$ -836 826 54 -439 693 153 -871 606 592 -798 728 675 -660 205 409 -939 262 639 -384
2437c84M49Q29j719M93J170j281J37J163j221l05J248q15m08J304n68n66J176
$$ -384 65 894 -825 -332 838 -443 -306 857 -364 -669 579 -236 -644 660 92 -474 702
2454G02p11o06J365n07r27J260j81j206R03N27j398Q52N70j026L84N10j301N77
$$ 702 -9 -615 750 243 -684 576 395 -811 92 619 -779 73 643 -383 1 511 -790 -213
2472b13P91r55K57R37j025k49J239r64k37J174n55o71R18o00m98J078L5r35O85
$$ -213 578 -377 -120 817 -208 -457 782 -182 -419 755 200 -471 447 -153 -651 427 462 -473 212
2491B12M4j015P01L03r67O98M14p64N10O5q64N60N65n96k6Q37j119P1J153q20
$$ 212 256 -759 -58 245 -722 -24 390 -374 136 201 -663 -103 462 -134 -160 677 -442 -371 782 -38
2511c8n83J141n48o09J057l94o64R64o6j017J212k61r64Q30K38p02P12J31p53
$$ -38 -621 520 -28 -637 420 26 -638 326 260 -757 455 194 -770 60 298 -404 308 439 -314
2530c14J35P58j059J84Q04p39m3R83r74M9O18l14m92R43n89m90J138l87p92R20
$$ -314 -179 579 -480 -296 508 -231 -274 709 -265 -216 402 88 -404 539 -50 -540 598 211 -581 339
2550C39N5p76N68K9p30P03M34j096M71N88j002J66P86q80M27K21o37O4Q11j013
$$ 339 394 -382 186 215 -515 188 622 -474 -3 585 -417 -251 535 -345 82 303 -334 -270 541 -472
2570d72J82R65o18l35O40l06o65Q15j5l38N48k29m67N18N2p67O73N27j173Q56
$$ -472 -290 675 57 -278 362 56 -609 206 191 -147 401 172 -295 223 275 -492 181 708 -465 391
2590C91j17q98O44L32n99J62N94o59J93N53o94l42R04o00K0L40m74k1M84k93r9
$$ 391 274 -624 20 352 -247 -85 509 -150 43 596 -98 -440 464 -136 -116 224 -250 -271 213 -80 -179
2611a79M39Q0r74P81l5m52O90k82o18R18m65m81O90K01o13L11M47o73J26K98n51
$$ -179 260 340 -634 147 112 -340 350 68 -550 368 -97 -578 112 313 -300 11 458 -215 -89 209 -342
2632c42N79K14n91J87M22o23j44P07m12m44O06j94m56Q29m07k57O71M1q05O63
$$ -342 237 451 -140 47 469 -154 -298 409 -3 -447 159 -35 -491 338 -69 -326 345 386 -419 244
2652B44Q8q15M54J50l91L36J97n86L50L32p28K37N46m63k15M33m54J52K56R8k43
$$ 244 332 -483 -29 121 -270 66 263 -323 27 359 -369 -132 414 -49 -264 169 -285 -133 123 221 -22
2673b2M08m79j22N10k73r9L78k77l54L27Q2m34P63j84n22L11J13n24M63L20n48
$$ -22 386 -93 -215 295 22 -77 301 24 -330 -3 79 -355 408 224 -298 13 126 -398 65 385 -163
2694a63Q7M21n77nM94l64ON79o16j28M83k58k0J96J2l87N06k32k96L53J45m26
$$ -163 -76 345 -232 -237 257 -107 -101 478 -138 -266 217 -41 -61 135 147 -240 266 34 -262 91 236 -190
2716a90J21L06o47N31l94l29O68j76Q4J6K50n21K61M22m47J17K9j66r0L98m94
$$ -190 -69 237 -410 121 -273 -602 66 -110 -26 -10 240 -281 -20 402 -45 72 101 -65 -155 243 -251
2737b51K32J88N1k39N7k31J45L82k92j67M43k39m2L23n50M8N29m32k53N9L29k82
$$ -251 -19 169 220 -19 38 -193 -48 334 42 -125 318 79 37 360 -190 -142 387 -45 -298 -239 90 -192
2759a92K70l0k64K89K42l21k21J63J85n1L6k82r3L27l05N2K61j53K9j7m6j36M97
$$ -192 78 48 -216 73 315 -6 -227 -64 121 70 106 -176 -269 58 -247 -195 66 -87 -58 -75 -121 -257 240
2782B40l58j02M98r6n14M54J4l65N68j01k14j31M12m32J05M19n13J55L34o57K74
$$ 240 -118 -220 278 182 -332 122 136 -229 339 238 24 -107 305 -127 -22 397 -116 39 373 -284 -10
2803a0N27p01J62M58l54j51K79k11k22P09n02l27O82l42j80K83j95LK35Q1p95
$$ -10 517 -184 -22 436 82 -69 210 -1 -223 486 -16 -343 339 -3 -183 100 -95 -92 143 224 -571
2824e71N35M40n79K37J13k5Ll9m73L87K1m51O84Q7k51l69L99q3k98O34j12o68
$$ -571 -36 404 -175 62 175 150 153 114 -359 28 49 -402 282 369 118 -251 148 65 -233 401 289 -379
2846c79M80j34q0K29Qk53M71r5m69L64k83k70O2N54m03J71J27n55K72M00m26J96
$$ -379 101 -33 -113 116 124 -129 342 247 -222 142 -141 -411 -349 205 -198 -27 100 -455 -183 217 -209 -13
2868a3L85k34n06N34m33K66L36j17l26L93n39O7N41k43k34M88k39m39K64K0l34
$$ -13 372 138 -368 166 -267 -1 335 218 -108 285 -254 -187 354 111 -123 365 126 -313 -49 -29 -363
2889c63N66J5m21N25r7p22O18P3l29K1J38j46J52M10r03L07M80l19k46Q18m52
$$ -363 203 218 -203 322 225 -497 121 194 -135 -114 24 -122 30 440 -463 -156 324 5 -241 577 125
2910A25j38K27k14n44R19l97k94O63k06l13M72m4o42O19R5n51K48L88o90L18K02
$$ 125 -13 214 0 -544 375 -22 -316 347 141 -172 300 256 -386 233 328 -223 25 413 -277 41 243
2931B43o01K15L73m95L8P59p44k89R57m67j38M58o2n13P99m59n85Q80m14r3M21
$$ 243 -358 -143 230 -265 -227 532 -212 -501 456 -11 -149 309 247 -266 533 74 -511 369 -45 -138 283
2952B83j76m80N06J92q55O51J93n43J06L52q62O95M15q40K23O24o48R1M38o12
$$ 283 107 -373 133 325 -530 121 314 -229 -123 229 -633 62 477 -363 -140 484 -164 -73 365 -247
2972b47o1P08m26l64P96n72j78N49m4n32M65p4l13L88J00j001R87L1r11P48K90
$$ -247 -308 400 -26 -390 406 -166 -344 205 161 -371 94 20 -293 95 195 -806 181 212 -699 49 339
2993C39p92M09L47o63R7P06n98n9P58r02L2O97m90K5M10n35nP94n89l66P37k97
$$ 339 -453 -44 303 -360 -263 443 -155 -214 544 -358 -326 371 -119 -94 316 -219 -224 570 -19 -385 352 55
3015E5o26N68L28p86N38K72p06M43L94p79K84N63r60K28P74p56K0P17p03l21J143
$$ 55 -571 -3 325 -461 77 349 -357 86 480 -299 -15 548 -412 -184 590 -166 -146 571 -132 -453 690
3036F90r85k2O35o22K9O28j56n84Q10j30q92J010j55q01Q29n8o80L79L39m85K82
$$ 690 -295 -317 318 -304 -275 353 197 -387 423 293 -599 411 256 -545 284 226 -454 -75 264 -221 61
3057F1M27j067J12Q44o96L41O26q98J20N93o74j28Q22l92k84N87l97n57P70o5
$$ 61 488 -579 -467 377 -319 22 648 -250 -130 463 -211 -339 483 91 -193 394 -3 -560 210 145
3077A45q33Q80P2j050O91M07r50O58N28j105N95O42j173K75O84q81L52O41p93
$$ 145 -688 192 264 -786 -95 312 -638 20 548 -557 38 680 -493 -218 466 -415 -63 578 -215
3096b15j70J085j065J2Q57o78j62P30l29o75J090l77r15J016J73r52P83K01q57
$$ -215 -385 700 -365 -353 504 -174 -336 394 65 -610 480 103 -812 204 377 -575 208 409 -448
3115d48O70N11j283N57M51j097M44N27m25J26N89q19q8Q62r58N8J071r14m98J450
$$ -448 222 733 -550 7 458 -639 -195 332 -93 33 622 -197 -285 577 -381 -323 748 -166 -664 786
3135G86q18n74R35m2r56J129l66p27Q47J53q14P29J65p72L34O84j314L91R13j072
$$ 786 -32 -606 329 287 -669 460 94 -633 214 367 -447 282 447 -325 9 693 -621 -230 683 -389
3155c89K56P58j069m9J002q74l9R30m99p68J389o34o14J089j41j014J279l53r54
$$ -389 -133 625 -444 -493 509 -365 -404 526 27 -741 648 14 -600 489 348 -666 613 260 -694
3174f94Q33K30q89N81N36j202R51L43j228N06O55r77J24Q38j079L46J036j118
$$ -694 139 369 -520 61 597 -605 346 689 -539 -33 622 -355 -231 607 -472 -126 910 -208
3192b08j86R78m67r82J296n74k01O45k34m55R00p7j305R55M48j204O27O39j299
$$ -208 -394 584 117 -865 431 -143 -344 301 67 -388 512 435 -870 85 533 -671 -44 595 -704
3211g04O06K00n55N58N47j228L76P75j040O4J541j261j64J209j116k99J081m32
$$ -704 -98 102 -453 105 652 -576 -200 575 -465 -401 1140 -121 -285 924 -192 -491 590 158
3229A58r93J705o99p45O34N2q82R78Q7p79O32L49j243M20Q79j206O35J031j524
$$ 158 -835 870 171 -574 60 112 -770 208 295 -484 148 497 -746 -326 553 -653 -18 1013 -511
3248e11K29R64j279J2J338j112k80J312r26n56J445k86j161J405l86q68J084j83
$$ -511 -282 682 -597 -585 753 -359 -639 673 -253 -809 636 350 -811 594 208 -660 424 241
3266B41p85J046J71j210O51K32q56N95P09j501P36J000j698L90R14q15l72J504
$$ 241 -544 502 673 -537 114 346 -510 85 794 -707 29 1029 -669 -279 635 -180 -552 952
3284I52j106k09J350j215o16J302l47n27J091m67q08J035P5j369J049M34j300
$$ 952 -154 -363 987 -228 -844 458 111 -416 675 208 -600 435 510 -859 190 624 -676
3301f76Q54N66j374M64N44r88M67J024j355J08J033j186L99Q78r92n2J127j008
$$ -676 178 744 -630 -166 378 -610 -143 881 -474 -366 667 -519 -120 758 -234 -286 841 -167
3319a67n61J538p76p05J299k18j282J186m2q40J044J56j279O23N39j403O44Q01
$$ -167 -728 810 34 -671 628 410 -872 314 272 -568 476 632 -647 -24 515 -888 -244 557
3337E57j063M71R42j652L49Q87o79k01J188j120k59J081n23n55J231o35p30J371
$$ 557 -506 -35 907 -745 -396 491 -188 -389 799 -321 -580 501 -22 -577 654 19 -711 660
3355F60m58j106J228L76j607J303R9j368R36O12j460J039N24j226K59P86j493
$$ 660 202 -904 324 700 -907 396 495 -873 63 675 -785 254 778 -448 -189 597 -896
3372h96M04J247j325K6J294j345l9J197o07o48J368n41j213J477j21r97R04L60
$$ -896 -492 755 -570 -544 750 -595 -634 563 -44 -692 676 135 -1078 399 278 -719 185 545
3390E45j354J037J64j272O55Q18j182O99M94j168M97P57j395L56J304j019m00
$$ 545 -809 228 392 -880 -225 593 -589 110 604 -564 -67 690 -705 -349 955 -64 -464
3407d64J248r37n46J259n80p63J806q04o86Q98n2r97J355k93j542J453J59j457
$$ -464 784 -153 -699 560 -20 -783 1023 219 -467 431 379 -618 737 444 -1098 355 514 -943
3425i43Q37O86j160M30J167j468K1J042j336M62J128j349n6J396q47m85J277q47
$$ -943 -106 580 -580 -150 1017 -451 -430 612 -724 -262 866 -483 -539 857 10 -475 802 -45
3443d5q41J773r66q12J495n17q68J302j3j664J527J50j418R03Q24j539O53J091
$$ -45 -886 887 -79 -891 604 87 -781 521 508 -1156 371 521 -897 6 830 -709 -56 1035
3461A035j425K10J136j448K01J104j215k21J526j292m46J882r24q08J304n19j095
$$ 1035 -390 -180 956 -492 -291 813 -402 -623 903 -389 -835 1047 123 -685 619 100 -995
3478i95J591r8j635J619pj549J268N27j670R45Q02j658P58R58j545N93R01j241
$$ -995 596 498 -1137 482 475 -1074 194 721 -949 -4 798 -860 -102 856 -689 -96 805 -436
3496d36L82R59j352k9J411j381k29J646r47q28J634r42q58J473J76j323J215k78
$$ -436 -54 905 -447 -476 935 -446 -675 971 24 -804 830 -112 -970 503 679 -644 571 293
3514B93j254J298L69j862J513N40j834J146N83j550O48Q94j436L12J365j332k75
$$ 293 -961 337 706 -1156 357 897 -937 209 792 -758 -110 784 -652 -340 1025 -307 -582
3531e82J503j183n58J228k90p29R82m39o02J355l05j219J226J60j505J279N17
$$ -582 921 -262 -820 408 118 -611 371 -68 -670 685 380 -839 387 547 -958 321 838
3548H38j774R61J144j778L94P48j193N55J031j507O5J155j002j80J536r78q46
$$ 838 -936 25 1169 -609 -215 533 -660 -105 926 -581 -516 639 -363 -543 993 15 -831
3565h31J793r18r91J470l58q05J327k70j580K099m31j465J368L52j480M33J231
$$ -831 962 44 -947 523 165 -640 687 417 -1163 936 505 -960 408 760 -720 -287 944
3582I44j657M98J081j828O26J296j316r9J226j102j85J357j247j74J577r35q42
$$ 944 -713 -215 866 -962 -336 960 -356 -455 771 -331 -516 841 -406 -580 997 62 -780
3599g80J483l62j176J482m01j107J358p6j408J534O0j384J056M21j742J015R54
$$ -780 703 341 -835 647 246 -861 497 421 -987 547 607 -777 279 700 -1042 -27 927
3616I27j563N37R45j514J15J572j457k41J548r32p92J718j135n19J464m06p26
$$ 927 -636 -99 846 -668 -553 1019 -438 -679 869 -63 -855 863 -272 -791 673 267 -459
3633d59Q91Nj391J005M70j419J223J68j401Q51N57j372O38R73r13j09R74j382
$$ -459 432 437 -954 51 521 -898 325 493 -908 -57 500 -872 -234 739 -174 -283 691 -691
3651f91K32J390j065m65J551j045n83J530j085m58J291l35j241J464j50j300J374
$$ -691 -459 931 -134 -599 952 -93 -676 854 -231 -689 602 267 -974 490 340 -960 414
3668D14J17j431J403K09j610O82P57j257P72J110j817N11J201j664o8J396r96
$$ 414 531 -900 503 712 -898 -216 541 -716 56 1166 -651 -140 1061 -603 -671 725 -271
3685b71l63J349q56l54J283p36p78J229k9j342J301k41j287J548%j156Q08N22
$$ -271 -634 715 -141 -495 788 52 -726 503 474 -868 433 192 -1095 453 453 -703 105 627
3703F27j407P84N70j531P51P77j324L47J222j256j6J298j147m03J331q17m91J559
$$ 627 -780 4 574 -957 -206 571 -753 -406 816 -440 -456 842 -305 -708 623 -194 -685 874
3721H74j007o60J495n20j085J617l76j447J640p9j504J221M32j249Q62L92j430
$$ 874 -133 -793 702 182 -903 714 338 -1109 531 452 -1052 169 601 -648 214 606 -824
3738h24P41R85j583L98R91j183M6J296j334K7J343j005q78J755p99p16J573o64
$$ -824 -83 902 -681 -283 708 -475 -429 867 -467 -440 903 -102 -980 775 -24 -740 833 169
3756A69q38J359m73j295J487R1j329J106J56j240J014N66j376M90Q96j391J34
$$ 169 -669 690 217 -1078 409 500 -829 277 433 -807 207 773 -603 -113 783 -608 -474
3773d74J359j557J57J553j408j14J312r96p68J559m80o33J173n60j098J438R5
$$ -474 885 -672 -515 1038 -370 -484 828 -168 -936 623 143 -490 683 123 -975 463 558
3790E58j357J249l0j472J180L94j344R22N36j091M25P74j282P2J381j589K08J426
$$ 558 -799 450 420 -1052 128 522 -822 100 636 -455 -30 744 -538 -466 915 -674 -466 960
3808I60j112m64J346r30k87J277q60p87J633m11j522J443J03j317J178J2j119
$$ 960 -152 -616 730 -200 -487 790 -70 -857 776 365 -1157 286 389 -928 250 262 -857
3825h57J102M55j666Q95R02j394L61J216j796M74J410j388J4J227j264n75J730
$$ -857 245 700 -966 -71 831 -563 -202 1014 -782 -308 1102 -286 -272 955 -309 -884 846
3842H46j180j89J383r07n44J022k94j036J319k02j020J074M50j694J114M44j342
$$ 846 -334 -523 860 -47 -591 431 137 -899 420 218 -802 272 722 -972 142 586 -756
3859g56J029M14j315M53J087j717L97J516j635N3J241j340j57J476j006k70J201
$$ -756 273 687 -628 -175 912 -805 -408 1108 -527 -474 767 -573 -730 746 -260 -530 671
3876F71m17j124J388k91j103J505m4j237J034K24j593J135M92j484R98M65j475
$$ 671 254 -870 518 227 -876 629 585 -652 382 606 -987 148 640 -844 154 619 -856
3893h56R13P24j468J32J326j165r2J131j113p7J320r25n28J232n08p30J413m75
$$ -856 57 781 -687 -555 771 -394 -486 645 -468 -545 775 -150 -678 554 46 -684 729 254
3911B54j025J547k39j377J235K17j374J173L71j677J132K96j363N45R10j293M26
$$ 254 -771 776 537 -840 395 612 -762 411 782 -895 237 533 -830 -285 625 -668 -242
3928b42J131j279L8J211j118m16J516p95n90J404r16p04J577o12q89J130k2j220
$$ -242 889 -390 -352 859 -259 -675 841 46 -544 860 -56 -760 817 205 -684 446 424 -796
3946g96R63J50j337J227K82j330P35P74j345L50R82j133M00J071j344j03J314
$$ -796 167 317 -1020 207 489 -841 -106 668 -677 -327 655 -478 -78 993 -351 -454 860
3963H60j157l49J538p96p22J284o66p24J179l29p89J178Q9j239R12J39j326J022
$$ 860 -297 -646 892 96 -626 658 -8 -732 447 118 -671 507 596 -643 269 408 -918 104
3981A04M80j018O82M32j357M49Q96j100J18J125j425j77J388p61m93J399q09o05
$$ 104 584 -434 248 680 -677 -228 668 -432 -314 811 -614 -791 597 -164 -657 742 -67 -672
3999f72J487j020m11J251l56j030J175k2j225J058J26j068N63J158j965Q77J039
$$ -672 815 -205 -616 635 279 -751 424 402 -823 235 361 -707 -144 1014 -951 -74 965
4016I65j606L10J047j267L25J066j282l8J287j249j44J329o98o68J222m68q98
$$ 965 -641 -331 716 -551 -226 840 -442 -480 807 -442 -586 743 45 -623 599 131 -767
4033g67J391n77o09J063K1j588J339K29j094Q75M24j312L81J056j470M10J081
$$ -767 624 47 -562 501 522 -1066 273 502 -592 283 707 -605 -224 832 -638 -228 853
4050H53r25J42O68j220l6J240r42l72J519j150m39J130l05q28J241o7j178J036
$$ 853 -72 70 738 -482 -518 722 -220 -592 927 -223 -662 468 163 -665 576 509 -669 367
4068C67o3j317J333K49j272R06O27j321J37J102j425M51J117j149j46R69r78j1
$$ 367 304 -1013 320 569 -703 203 830 -491 -354 748 -677 -226 891 -258 -404 565 -413 -424
4086d24J370j134m88J426q27o61J423q33l87J049k57j166J365k70j379J489L40
$$ -424 946 -188 -676 750 -77 -738 685 -148 -535 514 257 -909 456 186 -1193 296 636
4103F36j292Q08N64j597O42R60j338M84P24j043K25R34r96j24J107q90k64Q11
$$ 636 -656 152 716 -881 -239 721 -617 -133 591 -452 -227 707 -289 -413 694 -196 -460 351
4121C51j33q59J178n84q57J540l93r75J197j53j230J289K07j231J016L24j432
$$ 351 218 -641 537 -47 -904 636 243 -732 465 312 -918 371 578 -653 363 687 -745
4138g45O23Q94j335N77O38j015J14J003j074R6R99r56m93J413q67p68J513l07
$$ -745 -122 772 -563 14 652 -363 -249 754 -320 -224 775 -181 -674 739 -128 -896 617 310
4156C10j015J069j23r90Q59K89j042R54J91j081O66L29j198P47O05r05K17Q57
$$ 310 -705 364 241 -749 110 399 -643 311 502 -579 87 416 -782 -35 570 -335 -118 739
4174G39r21j97Q37o65k61J334r67m74J394q63o36J218k64r05J214k17j288J169
$$ 739 -182 -379 458 -207 -468 866 -101 -575 819 -44 -680 538 274 -631 583 366 -922 247
4192B47Q2j242J149K25j025P66L62j390Q67N30r80K10N95q90O1R21r34M21Q64
$$ 247 329 -913 236 461 -564 202 564 -826 41 571 -409 -199 396 -494 -433 488 -446 -25 839
4211H39j099n68J523n26o96J080n77p93J257j7j209J171j62p64P72K95j345Q14
$$ 839 -260 -828 695 169 -527 553 -24 -817 440 423 -786 385 223 -541 231 526 -819 -5
4229eN44j234N15P05j013M53O48q67j81J152r13l25J217q70n02J050l46n65R55
$$ -5 539 -695 -180 525 -488 -35 613 -254 -435 717 -196 -521 696 -174 -676 374 28 -537 418
4248D18j73r28J259m67p77Q58J87r88P26M30j266J154p8r54N72L77o59J77O97
$$ 418 245 -683 576 109 -668 190 377 -611 115 545 -721 433 355 -599 -27 350 -309 -132 565
4267E65j119N58L26n63Q7O45n35m82R79n89m86J186l86r85R44K08p99R32n5j008
$$ 565 -554 4 330 -233 -146 499 -36 -518 461 -128 -614 572 186 -799 145 353 -446 486 431 -577
4287e77R31J2j078N17R37j258N36P58j166K48O99q31o2Q43n54k90O71l63n55J161
$$ -577 354 366 -712 -195 742 -516 20 778 -388 -140 559 -272 -334 509 -45 -335 336 -27 -582 579
4307E79m26p29J286q29n56J100j18j056J022L77j232R81j76r15N83N28r85P90
$$ 579 153 -576 710 -119 -675 425 307 -749 273 650 -582 399 223 -692 -109 419 -566 224
4325B24M62j373L95R46j016K14P98r48l80J252q18l00J393r99k70R57m85o64J080
$$ 224 686 -687 -292 654 -362 -148 650 -298 -678 574 -244 -544 849 -150 -420 537 52 -612 468
4344D68l6r70Q16k66q28R51K6m43K96L67r92N31N05j057M13Q92p06j09O56o77
$$ 468 432 -538 278 12 -816 135 161 -282 14 381 -611 -80 425 -632 -219 673 -33 -142 514 -163
4364a63j59R87q17k33J027l98q15Q79Rp99Q86m0r91O43J61o82R31N5j096O98M91
$$ -163 -322 665 -152 -385 642 244 -571 308 317 -482 404 364 -627 16 177 -505 426 481 -615 83 574
4385E74j027K12P05r96L07R44j101J36R98j220k9J143o08k89N43j76n35P70q8
$$ 574 -453 -241 464 -532 -225 719 -382 -246 752 -468 -497 646 38 -251 292 116 -419 351 263
4404B63p09J124m12q68J142j17j248R28N31j082N57M50j030L31P70r91K18P20
$$ 263 -446 678 266 -602 540 423 -825 103 634 -448 109 559 -471 -140 630 -361 -143 577
4422E77j039J50Q72p76j52R75n88l32P55l06p67J056k03q19J132l40o48N26K64
$$ 577 -462 -312 560 -216 -368 607 19 -313 442 136 -631 425 222 -597 535 195 -453 73 337
4441C37q38M24N44j243O83M19p98N74L68q61N4Q93p00l26J083r16k60J223o78
$$ 337 -501 -77 467 -776 -93 326 -472 102 470 -391 -337 556 -144 -470 613 -303 -563 660 -18
4460a8l55Q42l75o69R69j99r35J188l92o40Q16J91j175P66L99j012Q31M96j261
$$ -18 -373 469 94 -575 394 195 -740 448 56 -584 232 423 -752 14 413 -599 232 728 -533
4479e33L50Q95j203L35O82p96j96J020q54j4J001p64k45N58l08n45R77l57o15
$$ -533 -183 712 -491 -156 526 -270 -466 554 -300 -314 687 -77 -322 236 -72 -617 360 3 -612
4498f12J015j02r70Q23K61q73P48j66n88M34P57j527Q82N54r70K05Q93r38k59
$$ -612 403 301 -669 154 415 -458 290 124 -464 -30 727 -800 82 636 -334 -129 764 -174 -433
4517d33P78n83J74N51o18m68R80n59m35J371o00n97R46k93p78O95J26q54J005
$$ -433 345 -238 -64 487 -131 -599 381 -178 -613 758 158 -439 507 214 -564 131 257 -597 408
4536D08N1j221R41K82j088M96Q04r18j76J008r33PR49o83k26R49l41o15P41l44
$$ 408 459 -762 179 461 -627 -131 673 -245 -421 587 -346 -339 610 -73 -299 650 309 -306 435 91
4556I1l54Q20l26p90O88M59j350J221j20p82N33K71j102O69K35r61O85L53o62
$$ 91 -263 557 231 -559 129 588 -762 459 339 -443 90 361 -741 -72 163 -798 -113 240 -422
4575d22m1J226j237J44P39q26l00J340m89o37J029l26p39Q40J9q65Q09J06j137
$$ -422 -463 763 -474 -330 409 -417 -717 623 134 -503 526 200 -539 301 320 -545 264 370 -767
4594g67Q40L29j113O40K51p39O99L67r38L14O26p15k4O54j038M55P46r30p0R67
$$ -767 73 402 -711 -71 180 -559 140 507 -431 -117 509 -206 -230 424 -614 -159 587 -343 -413 554
4614E54l53p23P94l42o87J301m50q94J324j80j022N35Q33j353P50M19j046L38
$$ 554 201 -522 272 -70 -757 544 94 -800 524 344 -678 -143 690 -663 87 506 -540 -202
4632b02R07j138L33Q68j017r5Q45p53p8P42o14k88Q66o36k06Q67k13l77P18k67
$$ -202 705 -433 -100 768 -249 -344 501 -252 -330 412 -202 -490 376 -260 -466 401 188 -189 529 262
4652B62p86P33O4r19Q35K77r27O50L74r14M82N91j170L37P51j075Q5O94o94N5
$$ 262 -524 209 273 -646 189 466 -461 189 563 -351 131 722 -448 -111 640 -435 -350 344 -350 -295
4672b95N47p12J5P67l63l27P13l46o75J288m21p00J065m3j154Q98M00j032O29
$$ -295 252 -460 -445 322 -41 -368 345 -1 -676 612 191 -509 556 513 -641 257 657 -375 254
4691B54N6r07O51N16j019K0R32p71J63O08q07P8J018r32k91Q21m25m37J100o29
$$ 254 310 -597 54 570 -449 -429 503 -268 -105 503 -304 -226 792 -140 -431 390 -35 -472 628 -1
4711an23P40p8p74R26K73r68M02M21q52M81L59q19N96J67p36J67N28o40o2Q85
$$ -1 -524 216 138 -636 290 563 -405 -3 418 -434 47 406 -413 183 350 -386 -219 309 -331 -393 492
4732D92o43k57R01n00n08J006o00k66Q84m35l96R20l68q99J091j88q90O62M60
$$ 492 -151 -408 493 -7 -515 491 -109 -375 509 74 -322 598 230 -669 422 234 -656 6 466
4751D66q95Q30mq30K62O81p35K9O27o75J10O77p50j62Q62q00m5J006p93n81J009
$$ 466 -429 401 397 -433 -171 510 -225 -196 431 -244 -134 543 -207 -369 493 -307 -352 654 -139 -720 289
4772B89j61q76R48j57p04Q02K42q93O52K0o79P44K87r48L54Q13j096L1R54p02
$$ 289 128 -748 200 43 -661 141 383 -510 142 162 -517 227 514 -434 -80 733 -363 -332 622 -80
4792h0l74Q83p45o9P59m29o47J116k77o31P50j23n96R44l73p49J010M5j038O39
$$ -80 -454 429 -316 -385 374 -55 -702 414 137 -494 256 133 -463 481 108 -641 369 414 -624 15
4812A5K82r78O05O16j195N72P70r11J7O95q36M73K22m68k75P99n21p4P70m38o16
$$ 15 297 -681 -76 540 -655 -83 687 -224 -207 488 -348 125 347 -121 -396 403 -118 -192 578 140 -476
4833d76R13l58p75J143k12q18P03K01q22O28M3p22P84Q4n89J70P05j149M31P23
$$ -476 437 79 -696 447 235 -583 120 321 -501 127 170 -552 232 316 -273 -103 602 -547 -116 607
4853F07r30l4P08p24J50N64m66j61P82m94m05J226p70m68N16J58o97N58m4n22
$$ 607 -323 -357 351 -373 -223 341 -125 -286 496 2 -403 823 53 -415 101 259 -438 120 76 -446
4873d46M88K21p43M42L93o10J12L11n66L31N14q20j26J059p82k5L80m08K7M18
$$ -446 42 263 -480 -38 355 -255 -143 168 -398 -67 447 -373 -499 560 -222 -247 133 -275 -248 170
4893A70J19q74Q60n9p30Q32q4n08M45K14q06L89K73m05K73J99p80L17P95r87J65
$$ 170 289 -585 275 216 -514 318 234 -274 171 385 -421 -32 241 -164 109 308 -472 -155 640 -347 -182
4914a82N96o05kN94l73k01L36l34k47Q42k29n50N23j39k94N41j26p97R83k18m11
$$ -182 414 -191 -193 401 28 -173 163 -171 -418 424 195 -355 168 29 -265 276 150 -647 336 118 -293
4935b93O32j28n58K44P03j200O34L67r33K04O67n93r0O96o20l08R36o53j57P47
$$ -293 339 211 -347 -103 600 -600 34 401 -532 -328 339 -254 -344 352 -268 -576 360 -293 -450 297
4955B97j40n18P18k79p58J140l59l75K89M30r57P92K61j036P36J53o30J82N87
$$ 297 157 -361 357 78 -680 460 101 -274 15 445 -512 280 541 -495 241 394 -236 -54 533
4974E33q36L14L14n90j99Q73n23J1N60o29k23P25m57m07P67J60o85P70m29n81
$$ 533 -303 11 325 -265 -464 409 -114 -103 457 -172 -395 330 -127 -534 233 393 -292 478 49 -532
4994e32N04O36q84J66M66q79N59L81q71K62O75p44L88L26o39J05N36o30n4N50
$$ -532 -28 608 -276 -110 356 -523 36 417 -454 -192 483 -261 127 453 -186 -81 455 -175 -229 321
5014C21l16m34Q77l44n61P23j40o44P39L2p05N26J60p46O60K34p44O17J63o27
$$ 321 5 -429 448 104 -457 266 126 -518 221 253 -452 74 234 -512 148 382 -362 255 418 -209
5034b09J63O07p32J36N43p71P8N06n02j05P53m84k15O92n60l86Q18m75j99O24
$$ -209 -46 561 -171 -35 508 -263 -185 321 -181 -286 467 -17 -232 460 -100 -486 332 -143 -342 282
5054B82k12m61P69j69m67M12K24n77Q7N91n27q4M88p52K85L93o05J39N73n92k8
$$ 282 70 -391 378 209 -258 154 378 -199 -112 479 -48 -132 356 -396 -111 282 -323 -184 389 -203 -231
5075b31N27k65l22N65m10k58N80k96k48P21k52m79M46Q9l73P2N05p26K64M90o82
$$ -231 296 31 -291 274 -136 -394 186 -110 -358 363 111 -368 78 167 -206 -134 371 -355 -91 399 -283
5096b83n6P02r26L36O90o52K0K81k99m9N21j83m69M47J7m70Q31k60l75M50k32
$$ -283 -339 363 -563 -227 463 -189 -169 112 -187 -236 285 102 -367 80 97 -373 458 198 -177 273 41
5117D1k34j6O34q01L58L87r16M95L87p76L80L67n57K32N8q4J07K59k20k48L53
$$ 41 -193 -209 425 -376 -18 369 -547 -52 335 -441 -61 306 -251 -19 39 -45 62 321 101 -147 206
5138B06l38l70P92j40l04O61m91l71N61k12l49L12M32q28L90J67n24N00K72n75
$$ 206 -132 -502 290 150 -154 507 16 -355 206 -6 -355 -43 389 -439 -49 118 -406 94 366 -209
5158b09R2L87m73J5M46m33NO27o99l44Q04l98l12Q26m28m25Q40k20m40L15L25
$$ -209 -117 270 -203 -188 258 -175 -170 457 -242 -586 218 -180 -492 334 -94 -519 321 101 -339 -24 301
5179C01m49L91K02q74N65L16o26K71K08k43R5L75p82M9M70k63m65P54l20k40P27
$$ 301 -148 243 445 -429 136 452 -174 97 305 62 157 532 -250 -201 269 6 -459 295 -25 -265 462
5200D62n86j02N13j01m94L66n3n48N71J10m77M85M2m64L34O6o59L51O37q82L51
$$ 462 -124 -226 287 186 -308 58 5 -543 28 138 -339 146 188 -276 58 124 -535 -184 453 -429 -78
5221g8L47p02K81K84k55j52P85p02k76Q94m54k07L91o9l98O15n9q10P55q5k23
$$ -78 269 -433 -152 132 -123 -275 510 -192 -468 426 -28 -235 156 87 -311 304 245 -565 190 105 -118
5242a18J78J06p60Q80P0r41O08K73n19PN50l45R1J69n12J84O76n59l91O93k52
$$ -118 60 166 -594 286 356 -585 23 296 -223 -216 334 -11 80 249 -263 -79 597 38 -353 340 88
5263H8m79N45j15k98L29K57o54O94k46m09N17j6m05J02K24m64M79K17p28L52M10
$$ 88 -391 154 39 -259 70 327 -327 367 121 -288 229 213 -192 -90 134 -330 149 366 -362 -10 400
5284D00o57l9O50l73j63L67j64o06J002k78k53M57j36m69N48j75k16L90j54m35
$$ 400 -257 -296 354 -19 -182 185 21 -585 417 139 -114 343 207 -262 286 111 -105 285 131 -304
5304c04L31N7l74M33K3k77R4L13n85K73L41n69O7O71n59j68K81k11R1M26k58n77
$$ -304 27 84 -290 143 166 -111 -17 296 -289 -16 325 -244 -177 494 -65 -233 48 -163 -72 354 96 -481
5326d81Q15j71n86O62n5m01O32k16l81L9M00m74J54mJ75j65J22m65J13M72m09
$$ -481 334 163 -423 239 184 -217 415 199 -182 -143 257 -217 -63 -67 108 -57 65 -400 -287 185 -224
5347b24M11J16k95j75J34j63m9O80m38j73M95l28k20O85k35o54M51L45o97M83
$$ -224 187 303 8 -167 -33 -196 -245 435 -3 -176 319 -9 -229 456 221 -433 18 363 -334 149
5367A49pn30O77K27p39k7O78n26K1K61m15K55K87k87l26O82l20j55L02j91m52
$$ 149 142 -388 289 516 -223 -250 428 -98 -77 184 -231 24 311 24 -302 380 60 -95 207 16 -436
5388d36P60k00l26M60K3n45M10M1n57M24o5j03j21M89n28K17K52n20n5R42q65
$$ -436 324 124 -202 258 281 -264 146 187 -370 54 -11 -114 -235 254 -274 -57 195 -325 -380 562 -303
5409c03k4P65m49j35N13n72j12M52N4l58K79k17p7M84m30k11K05K20m66O11j50
$$ -303 -327 438 -11 -146 367 -205 -317 135 189 -169 110 -107 -184 300 -130 -341 -136 84 -382 229 79
5430G9k75J2N59o39K38J57l36K86J72m09j46M65q7j97R28q57m36M93L6k52L58
$$ 79 -196 -184 375 -264 -26 131 -205 81 253 -156 -302 163 76 -121 807 -50 -486 7 43 -209 149
5451A49K55p91Q10l75k46L59rm49M39L25j005O06L91o57j87O71l07O1K59n73J8
$$ 149 404 -387 423 48 -198 161 152 -297 142 467 -538 68 459 -198 -385 286 -21 40 299 -274 -256
5472b56L18K2j65M80m80k20M72l80n5N23r5l30K42L02o40L28K43p65M42K91n35
$$ -256 62 84 -81 399 -81 -301 171 -209 -264 259 164 -166 76 378 -262 66 309 -456 -14 277 -258
5493b58L90K05p19m3O55j84n1K98n47rM17j18l71P09l81o4L83k84m30O47l3m68
$$ -258 132 337 -382 -425 230 46 -5 293 -254 -263 154 36 -335 374 -7 -71 312 28 -402 245 212 -256
5515b56L58k1o12L88L46n47K33k47n1L66M97l62N1N9k27l05M54l26J08K26q2k14
$$ -256 102 81 -531 -143 203 -344 -111 -358 -409 -43 454 92 143 202 -25 -330 124 -202 -94 132 50 -164
5537a64M15j43l37M84k12O4j3l4k50K15k28k51M37L88p72N43R6m71K38o2j09K19
$$ -164 251 108 -229 255 43 107 94 60 -190 25 -203 -454 -17 371 -401 142 238 -233 5 -57 -166 53
5559E3L13o58K79K08l80J54J68k56j69K70q1m95P13m6k59N58lp18L74l2l57M84
$$ 53 366 -292 -13 195 -185 -31 137 -119 -288 -18 -99 -594 119 73 -186 372 369 -349 25 -7 -364 120
5581A20j16k56K75L42n43j02L80j25j6K77l79j73M54k03q5L17j24J74M1k28j82
$$ 120 4 -252 23 365 -178 -280 100 -25 -41 236 -143 -316 138 -65 -150 167 43 217 258 30 -152
5602a52K31j50k14L11m0l13P79l82l14J43K01j80J91J3k05J29K43l54O1K97l27
$$ -152 79 -71 -285 26 -14 -327 452 70 -244 -101 100 -80 111 124 -81 48 291 -63 -2 295 -32
5623c2o6K85m58K01N38m46l01N98m01k98P51k47l80L95pn82N73Q9l99J93N1l49
$$ -32 -98 187 -271 -70 468 22 -279 319 -82 -380 371 124 -256 139 132 -450 123 212 -187 6 57 -292
5645b92K91J77k86R3J73l22K16J72l87K58K38m35l4L53k93k21O34k87j30L12j34
$$ -292 -1 176 -110 -17 156 -166 50 222 -165 93 331 -104 -138 215 -78 -299 335 48 -82 230 96
5666I6k58K37k37k7L62Mn15N16R7o28O83k72m15M32J63n50L09K9l73K17O40l79
$$ 96 -162 75 -162 -189 173 177 -338 178 275 -353 330 58 -357 75 238 -312 -3 26 -347 -130 510 131
5688A31k55M23l44k31M47k54L2J53k85j3O14j26n25J69J97m15J27L38l91J34L09
$$ 131 -124 299 -45 -276 171 -83 -51 102 -183 -196 418 292 -233 -64 133 -282 -155 183 -208 -74 235
5709B35m48K02L64p41L75K54k91r1K60q5r4J94r3j66N19r4n10M19k9n62L46l9
$$ 235 -213 -11 353 -388 -13 241 -50 -141 119 34 -60 134 41 -125 394 300 -210 209 180 -382 -36 -75
5731g5l84N02R0n22P71k02n36L88j4j42o8O25p14K30O11p18K7J03j35J25J04m11
$$ -75 -459 43 133 -389 382 180 -356 32 18 -124 -192 433 -281 -51 560 -158 -131 -28 -163 -38 66 -345
5753c45M45k10J87j91K41j23l19O35j32l55J56N2k65K99j91o2J56K08n81M95R1
$$ -345 100 -110 77 -114 127 4 -315 320 188 -167 -11 41 -224 75 -116 -178 -22 186 -395 100 191
5774A91n50J92P1j20J30M98l92r9L41j9o27L95k54N8N81n31k76Q47l88k13K58
$$ 191 -359 -167 -96 -216 -86 412 20 -79 262 243 -384 11 -243 -185 396 -135 -411 436 48 -165 93
5795I3J84o65M63O1l51K23J18k55K97k32k38J33O7j68J51P2p6JL97l22r2N96n70
$$ 93 277 -388 75 136 -215 8 126 -129 168 -64 -302 -169 -102 -270 -119 -47 -123 -122 275 -47 -139 457 -113
5818a13j32L68k20K2L58j47n77M79J4k58L15L41p66K5L47k14J68J31j39j61N56
$$ -113 -245 123 -97 -75 283 136 -441 38 52 -206 109 450 -316 -291 56 -158 10 141 2 -159 397
5839C97o94M4O85o44L1J59j77r5M83j75j57K56k7k48M45j77k58O03m23o9K44J9
$$ 397 -297 -253 432 -212 -181 -22 -199 -294 189 14 -143 113 86 -162 283 106 -152 451 28 -41 203 222
5861B22n53N34o6o31M64M7k86M90Q2n10K3M27l70L9M20m84Q5K88k81r8K07k02
$$ 222 -331 203 137 -494 -30 17 -269 221 303 -207 -184 243 -127 -88 332 -152 -67 221 -60 -158 49 -153
5883a53j06L86o4l40M45k23l02O47j73l81K68N2l56L98K29m17J9L59k49N5J17
$$ -153 -259 127 63 -277 168 -55 -357 290 117 -264 4 56 -300 98 327 -90 -71 288 39 94 211
5904B11l15R2K77n86K47K99m10n6M22m28J48L50k07l86P11l67J75q0l9l83K16
$$ 211 -104 -12 265 -321 -74 225 -185 -241 181 -247 -99 251 44 -342 369 2 177 97 58 -325 -109
5925a09K32m91K79K60m06L24L91p36K06J35k15J99L47l99j88K98k43J80K22j78
$$ -109 123 -368 -89 171 -235 89 480 -256 -50 85 -130 69 416 17 -171 127 -116 64 286 108
5945A08j51K05l48l8O07k70n08N71r0m62L73J9o1J21K06o00J13M61n20K43M09
$$ 108 -43 162 -186 -224 383 113 -395 176 86 -376 -3 16 -45 76 282 -318 -205 256 -264 -21 388
5966C88p28K54L83n04P0K60L8k52N20m44k62N10j39k69K3M16l87J03m3j55L41
$$ 388 -340 -86 297 -207 -137 123 161 -91 429 -15 -277 233 94 -175 -152 264 -123 -20 -63 -218 123
5987A23K33n86J27J29j49P5O11q45L08L7m17J60M56j63n21P60m72m8P00n60j04
$$ 123 356 -230 -103 26 -123 -48 563 -282 26 63 -354 -194 262 99 -422 338 -134 -182 518 -42 -146
6008a46N47n37n8N24k77o77N98r4k03N02m0n49M02K13o52M54L48p31M04M47m85
$$ -146 401 -136 -194 330 53 -624 -26 -120 -323 179 139 -410 -8 205 -447 7 355 -376 28 475 -10
6029a0QM12o97l2O84m48k22M69J33l24K90l28j95M96l54N5M29j54m41N17Pp43
$$ -10 -2 410 -287 -319 365 -83 -305 164 297 -27 263 -65 -260 236 -118 -63 366 212 -229 288 295 -448
6051d48M44M42m41j90L82k91K3K17k36j58N76p44J21O26l67q0K28l35J34L39j57
$$ -448 -4 438 -3 -193 189 -102 -79 138 -98 -256 320 -424 -303 323 -44 -124 104 -231 -97 242 85
6072H5m97P23m45N1O11n00m68O39q4m54L70J73n23J84M78n59R2M74n50J59K91
$$ 85 -412 311 -134 -83 528 28 -440 199 115 -339 31 204 -319 -135 343 -216 -124 350 -200 -41 250
6093B50k06k04M17o34L44K89l05j51M60j69l84O09k42k27R1K20l84L32J93o20
$$ 250 44 -160 257 -377 -33 256 -49 -200 260 91 -293 316 74 -153 -62 158 -226 106 299 -321
6113c21L87K17m95J0J72q7N9L22l85J79J80m87J58K98m87L10L14n95k8M33M9l12
$$ -321 66 283 -212 -202 -30 -117 -58 264 -121 58 238 -249 -91 207 -280 30 344 -251 -279 154 203 -109
6135a09M57k1m67o5L66k87j17M32l86J76MJ04j36K96m07J53M24m43L5K42k23l40
$$ -109 348 327 -140 -205 161 -126 -243 189 -197 -21 -17 87 -49 247 -160 -7 417 -26 9 251 28 -312
6157c12L77j12l6K16p4l70L42O1k59P4J76o55O59J04n31M34P8m16K56J66k65N0
$$ -312 65 -47 -83 133 59 -311 31 92 -167 -93 83 -572 87 191 -340 94 172 -244 12 178 -87 -37
6179c7K12j49k30L56n8j37J31k43J5L42k84j00L79p0m23L87k4o4Q5p3n09O19J
$$ -37 175 26 -204 152 94 -43 88 -155 -140 202 -82 -182 197 127 -296 91 67 3 88 15 -494 125 126
6202A26l90K77L17o73K92J55l47M16Q7n32L75L08n21j57L47j34KM21m83q7O25
$$ 126 -264 13 330 -343 -51 104 -243 173 260 -272 103 411 -110 -267 80 -54 -52 369 -114 -201 424
6223D24n21j03L52j53N0R2J13o86O31j07m63M02L20m26J44j19Pn1J46l45mO58
$$ 424 -97 -200 152 -1 49 141 254 -432 199 92 -371 31 351 -75 69 -50 -43 -94 52 -293 -297 361
6245C61n98R0N85k68m10M26m58Q4N09l82l40P14k03j85J37o9n03O39q3m76M59
$$ 361 -237 -147 438 170 -240 186 -272 -188 321 -61 -401 313 110 -75 62 -7 -510 129 46 -430 29
6266B9N6j98M3J67j52p0M96l22k9J53l89J25L22k54J02j6k04j35L54J54m99O15
$$ 29 85 -113 -70 97 -55 -125 371 49 20 173 -216 -91 231 -23 79 63 -141 -276 78 232 -267 348
6288C48m46j23O76n26l61M29l0k28M91k00m20L71rj88K52j3k89L71K31m38J47
$$ 348 -98 -221 455 -71 -432 -3 -33 -261 230 30 -390 -19 -28 -216 36 23 -266 105 336 -102 45
6309D5K12l85k23N04k70k76N78l56k43P39k20l13L81O6n12L99K70q41M33J35n77
$$ 45 257 -128 -351 153 -117 -393 185 -171 -414 325 105 -208 173 239 -273 126 396 -445 -12 123 -454
6330d54N88J16m30j5L47k79q3P34r42J61O13n70M2K07o4k63L60J48n79P25l49
$$ -454 134 250 -180 -195 152 -127 -210 524 -418 -257 356 -214 -172 35 -29 -292 68 216 -363 362 13
6351A3m77L41L97m72K99J45n46K50J42m65L41J05k24K09L06n06K6L04k08m17N04
$$ 13 -464 -123 274 -198 101 246 -300 -50 92 -373 -32 73 -151 58 364 -142 -116 188 -20 -437 67
6372F7p4j5N3k01j99M31j14k10M75L7o98P27q2k98L64l48k35K92L74o36J43J70
$$ 67 -7 -22 31 -170 -369 62 -52 -262 213 250 -448 279 197 -101 263 -85 -320 -28 346 -290 -147 23
6394B3k05K73R0l72Q6L41k52m51O91m46J02M43m49n6J92j54p2O75k99m53M07J80
$$ 23 -182 91 181 -191 -105 236 -16 -467 224 -222 -120 323 -126 -182 10 -144 -216 459 160 -293 114 294
6416B94p31M39K60n19N36Mk40K17j58k44n5L92m25J23L56l77N9L04l22r6M20r6
$$ 294 -437 2 262 -257 279 283 43 260 102 -142 -197 195 -230 -107 249 -128 -69 235 -87 -183 237 141
6438A41m02M80k20m89O52j49l01M37o8j68J80j54l02M30k1j94R9L59n09K13j50
$$ 141 -261 219 -1 -490 162 13 -288 149 81 -87 93 -61 -363 67 46 -148 -49 310 -199 14 -136
6459a36ok32O47l75q4Q17q22L27j54K9n7L55k90q3K83pn18P62j86k92m2J32n31
$$ -136 -142 -374 273 -102 -186 631 -191 136 -18 11 -46 309 19 -64 219 212 -306 456 270 -22 -64 68 -463
6482d63L15M99o98M28O1k81J18K8j67q2N44m87k4J54k85J53M52m17RJ88k53j8
$$ -463 -148 351 -347 81 142 -139 -21 7 -160 -242 302 -185 -209 -55 -340 -187 265 -152 -143 45 -208 -226
6504b26K98j3k79K55K4k40J07N3p1j32L91l54L36Q0l41J91j0N2N3M2l06j46L66
$$ -226 72 59 -220 35 59 -181 -74 -21 -92 -224 167 -187 149 229 -112 79 69 121 174 216 -90 -236 130
6527A30j35j63K46K6k46L75k25l81N73l36l7J89L8m69O11J5m16J64J58k98j56
$$ 130 -5 -168 78 104 -142 233 8 -373 200 -136 -173 16 54 -415 196 211 -205 -41 117 -181 -337
6548c37O09m41J51L15n27N4J18j02L15J17k35l83O45j25l00J9K05j01j68L42l93
$$ -337 272 -169 -18 297 -230 -176 -58 -160 155 272 37 -346 299 174 -126 -107 98 -3 -171 171 -222
6569b22J86J26n16M25J67l06J11O1o9R3pk83K80J69k45N1L9j63K90qk34j50M23
$$ -222 -36 90 -426 -1 166 -140 -29 32 -37 56 49 -234 46 215 -30 21 60 -103 187 179 -55 -205 218
6592B18k72o4L07J39o59M86m6n11M23o0q3J66K10o72K94J58k48J02L31m14K41
$$ 218 -54 -118 189 328 -331 155 109 -402 21 -39 -122 44 254 -418 -124 34 -214 -112 219 -195 46
6613D6mk62L23K86k62p8L4p7m80P06l15j11L85l14q2ON2K43j53K8k91K89K76l54
$$ 46 42 -220 103 389 127 49 83 6 -474 232 -83 -194 191 -123 -205 -199 -147 96 -57 -29 -320 -31 245 -109
6637a09J37k60l8K42K19k39Q0K92j81j39K03l80N8L3J12j75K47J97l95L23l74
$$ -109 28 -232 -270 -28 191 -48 32 324 143 4 207 -173 -115 -82 30 -145 102 299 -96 227 -147
6658a47j94M93L0m91K56K92l18N0j3o6N4L40n21L85j88j26J83J74j05r0L23m24
$$ -147 -341 152 182 -309 -53 239 -79 -29 -42 -108 -54 286 -235 150 -38 -164 19 193 88 -2 321 -103
6680a03o7M56l00k31N54k70j10J74j16K0R3N1j78J30O8j62j8K7q4Q7q2q4J99J76
$$ -103 -170 286 -14 -245 309 39 -71 103 -13 7 100 151 -27 103 171 9 -9 18 -66 21 -61 -145 54 230
6704B30j92j36M18l77n6L54j80o6K27k17K11l55J52J52k25J59m42K32m9O5J63
$$ 230 38 -98 320 -57 -113 241 61 -5 222 5 216 -139 13 165 -60 99 -343 -111 -160 -95 68
6725F8J05l39J9J95l18J04M96m76J82J98j75k87M31j75j37N04n16l6M47j86k00
$$ 68 173 -166 -147 48 -270 -166 330 -146 36 234 59 -228 203 28 -109 395 -121 -157 290 104 -96
6746i6K45J3l42N05K2n07K07J13l60J76M9m41L31J22j40N7J35l20K5K70O4r0J56
$$ -96 149 162 -180 325 347 -160 47 160 -200 -24 25 -416 -85 37 -103 -46 89 -231 -206 64 128 38 194
6769A94j53n5L53k13l24J63Q9k72J83J86k51K05q7l39J85M02l34J89r8o7M1J0
$$ 194 41 -14 339 126 -198 -35 54 -218 -35 151 -100 105 18 -321 -136 266 -68 121 23 -44 -3 7
6791GQ2k11J06k2j36J20L39l74O5J21l07N64o85M57J4J4l71K89m7k11K95j96k47
$$ 7 89 -122 -16 -38 -174 -54 285 -89 -24 97 -210 354 -331 126 140 154 -217 72 25 -186 109 -87 -334
6814c34N08j75P1j46J21k36M21l2k87K50Q2l41K44J24m90L43J38l14O7j4J37m1
$$ -334 174 -1 70 -76 45 -191 230 198 -89 161 243 -98 146 270 -220 123 261 -53 14 0 137 96
6836I6k0j07l50N43P4l95P8J50O5N4N0m60K58J70m01J26Q4j32j01K19L7k05L36
$$ 96 76 -31 -381 162 236 -159 -81 69 134 188 238 -222 36 206 -195 -69 15 -117 -218 1 38 -167 169
6859A69l22K39n2P4m26M93m04q3L75k34J95K02k26O2K26j25j6j65L24n09K19o6
$$ 169 -153 86 34 108 -318 175 -229 -312 63 -171 24 226 0 62 288 163 147 -18 306 -203 16 -50
6881e0j07L33j30m08L65J61k03k00L82j70r9K43k23J41m0o2q3K51kr3j06K74j97
$$ -50 -157 176 46 -362 3 164 -39 -239 143 -27 -126 117 -106 35 -5 -67 -150 101 99 6 -100 174 -23
6904b3mj18N0J65r4k68M68m2k04j64J13r7K66N0k50Q0M17p12N71K3m30J4K55j60
$$ -23 -27 -145 -95 70 -24 -292 176 134 -70 -234 -121 -218 48 98 -152 -72 345 -367 204 227 -203 -189 66 -94
6928i4l8R1L18l93J7J76l7N9p5j05l4L8J4j43J87k51N3M35j33q8P3k61O19k7l76
$$ -94 -132 -41 277 -116 -99 77 40 99 24 -81 -115 -77 -63 -206 -19 -270 -217 218 85 -3 70 -191 428 401 25
6953B5k11M25j72k56L29m0l26J28R9l05M00j23O5k41K11j54J37j29K00J4J12l16
$$ 25 -186 239 67 -189 140 100 -226 -98 1 -304 96 -27 38 -203 8 -146 -9 -138 62 76 188 -128
6975a28O4L70j37l07L88m43L6L90l42J40M8j34K28J4q3k26K65m7j55K06J58l51
$$ -128 -64 306 169 -138 250 -193 -157 233 -109 31 79 -55 173 187 104 -122 143 96 -59 147 305 -46
6997d6K68o4r8l2O8RO5j81m0P9l9j68L17m6j89P9m2o0N7n6J14j1jN2j30J27J3
$$ -46 222 158 60 28 96 105 170 -11 -51 28 -11 -179 138 92 -97 -18 -60 -120 -63 -119 -5 -16 -17 35 -95 32 45
7024D5p1P4K7k11K33l5R6J27j37j02p3k4m2K46j8k94O1K50n00P5M26l30J53J19
$$ 45 -26 48 75 -136 97 62 158 285 148 46 -27 -51 -93 153 135 -159 -98 152 -348 -273 153 -177 -24 95
7048I5j41M9L9m5r3J53j46k7J90l7k02J26J51j95J73L4k43q3L57l32k2L96k18
$$ 95 -46 3 42 -3 -96 57 -89 -116 74 37 -165 -39 112 -83 90 124 -119 -202 155 -177 -199 197 -21
7071b1J04Ml49N53k0m92J87L00m94L6J83o1J59P6K4l91K42q4k90N54j65j84K0
$$ -21 83 87 -262 291 271 -221 -34 266 -228 -192 -9 -70 89 165 189 -202 40 -44 -334 220 55 -129 -109
7094a09M11m00J91K5l24J01m6r4L09K73o40J39L35k17j46L80Om50J30K07j79K22
$$ -109 302 -98 93 118 -206 -105 -151 -245 64 337 -303 -164 171 -46 -192 188 194 -256 -126 81 -98 124
7116A24j59Q0J35k33RK22P1j79j52J36j18N4lo6r0K69j46R8m0J72l15K15j41R4
$$ 124 -35 45 180 -53 -44 178 249 70 -82 54 -64 -10 -13 -79 -169 100 -46 52 12 184 -131 84 -57 37
7140C7K9j07J08J40k80q1L30j88n4J31o2KL37m61k11L93J46k71O0o3j02J54J06
$$ 37 66 -41 67 207 -73 -154 176 -12 -66 65 3 5 342 -119 -330 63 209 -62 -2 -65 -167 -13 93
7163I3n2l67N83m88L83r9j46pK05n8l8K68l66j16L27j73j5K38j19l18P06l82J6
$$ 93 41 -326 257 -231 152 53 -93 -100 105 47 9 277 -89 -205 122 -51 -66 172 53 -265 441 59 75
7186G5l5J93l03K9J85k80P3j2L7j99L20l71K11K15j56k1j8K08k84J12J05l47L13
$$ 75 40 233 -70 -41 144 -136 -63 -75 -38 -237 83 -288 -77 138 -18 -39 -57 151 -133 -21 84 -263 50
7209E0q5k07k1M25l39J22J55m8r4K54m60K07J5j06M9K51p3Q0p5j76L34j0k13m0
$$ 50 -35 -242 -263 162 -177 -55 100 52 -42 212 -248 -41 -26 -132 -83 168 95 175 100 -76 258 248 35 -5
7233eJ17p6k85N63k49m8J78k37m4J72q7M3O2j60K77p1k06J63p8l2j59L75j12l56
$$ -5 112 36 -249 314 65 17 195 -42 -86 86 -1 42 104 -56 221 150 -56 107 29 -3 -162 213 101 -255
7257b55K71J04P5j51N8j59p7J90j68M3J37j65K44J37q2k69j36L80l02K04k13P7
$$ -255 16 120 195 44 102 -57 -134 56 -112 -69 68 -97 147 284 202 -67 -203 177 -125 79 -134 -57
7279e7K00j55L4j33M62m45kJ59j54Pl2J94m1L5k45J59L62k96k64N06n64K86J07
$$ -57 143 -12 22 -111 351 -94 -96 63 -91 -84 -116 78 37 72 -173 -14 348 52 -212 294 -270 16 123
7302A23k42J36K38l60J84J1o2j80K16K4k41J58L50n31K65Q1k69L02k63P3k6J24
$$ 123 -119 17 255 -105 79 90 28 -152 64 88 -153 5 355 -176 89 170 -99 203 -60 13 -13 111
7324A11l04J54K04j21j0Mj56J86k23L3j33JJ82n9L77k5j44m6J2q2k2K54m18J21
$$ 111 -193 -39 165 44 34 38 -118 68 -155 -122 -255 -254 -72 -131 246 221 77 31 43 -39 -61 193 -225 -104
7348a04L88k80N0j10N4o5L13n57L11L39m43J33n2J8j00L27j26j41L75l63j68O6
$$ -104 284 4 54 -56 -2 -67 246 -311 0 339 -104 29 -23 -5 -105 222 96 -45 330 -33 -201 -135
7370a35P1j8O4J5J53j52j94K78R8j66r5P0K05j95K0N8k7L7Q5k25j11L78m10K27
$$ -135 -64 -82 -18 -3 150 -2 -196 82 180 14 -81 -11 194 -1 19 77 50 87 172 -53 -164 214 -196 31
7394C1J48j59m07M89j51j06K05j21O5J0J30j13j6j1j63J16K35j17l57K71q6L29
$$ 31 179 20 -387 102 -49 -155 50 -71 -6 4 134 21 5 -6 -169 -53 182 65 -292 -21 -107 222
7416B22N2k72R1r8j20J19O9lk81M13k24J46J65l21p1K19j09j88M34k08k79L66
$$ 222 274 2 93 -5 -125 -6 63 60 -221 192 -32 114 279 -42 -113 106 -3 -191 243 35 -244 122
7438A22j30k07J61l4j52L47k3l61K80J8j77J45J25o4N7k7j21j73L57k22j08L32
$$ 122 -8 -215 -54 -88 -240 107 84 -277 3 21 -156 -11 114 50 107 80 -41 -214 143 -79 -187 145
7460A45j10j47P9M7r2J68o1j37j6L4l93L01K36j13NL4j98J15N42n31K5j13K51
$$ 145 35 -112 -33 14 -78 90 29 -108 -124 -90 -483 -182 54 -59 -54 -20 -218 -103 439 -92 -67 -180 71
7483G1Jk88K73j88K92K7l79J79j4j1J92j95q4L50N6m58J48j53K04J87j3j53k19
$$ 71 72 -216 57 -131 161 188 -191 -12 -26 -37 155 -40 -124 226 282 -176 -28 -181 23 210 197 44 -175
7506a75k81M72l13M47j23j24J10Q8N4m47M70k81K99k46q7L87j90l39K88Q3j74
$$ -175 -456 16 -297 150 27 -97 13 101 155 -292 178 -103 196 -50 -137 250 60 -279 9 92 -82
7527h2l1J02j98J31K98n10K69l2K31k50j13j80N89K1m37K99J15m57K12K23l02
$$ -82 -113 -11 -209 -78 220 -290 -21 -53 178 -72 -185 -365 224 245 -192 107 222 -235 -23 200 -102
7548a02M5J51K9r1P1m06K24L17l81P8J2j03o4N15k95k39K57n6Q5k23L02k32J80
$$ -102 -57 94 123 32 103 -303 -79 238 -143 -65 -53 -156 -220 295 0 -239 18 -38 47 -176 126 -106 74
7571G4j75R7o6N39l17k12J16j00j28L27j36m1J02N0l26L46o8m54L62J26m15K93
$$ 74 -101 -4 -70 469 152 -60 56 -44 -172 155 19 -22 80 130 -196 150 82 -372 -10 116 -299 -6
7593fk6j46K65R3m46K41J47m84P14k39j21O6K21r8k24K51m63J16K52k23J45J64
$$ -6 -32 -178 87 180 -266 -25 122 -362 352 113 -8 58 279 181 -43 208 -255 -139 113 -110 35 199
7615A99j95Lp5R4l15L67j55P3P6m28l9O62n4l16m8K77m81L40L5m60O59k12j15
$$ 199 4 7 -68 26 -289 78 -77 -4 72 -356 -395 267 213 -103 -151 126 -355 -15 20 -440 219 7 -108
7638a08J75m8j65oL57l10J61j26l69J73O23m44k34K61L77l82l1K12m85L83M6j24
$$ -108 67 19 -146 -152 205 -105 56 -70 -439 -266 357 -87 -321 -60 317 -65 -96 116 -369 14 60 -64
7660f4PJ83n18K39M72n82L10K53m13M4K36j9k37L56j23m39L60j09p5K04j24L0
$$ -64 -57 126 -392 -153 319 -263 47 300 -113 -69 167 148 -89 267 144 -295 65 -44 -119 85 -39 -9
7682iJ6o0j50R3J44k38K29K60n30K27jJ82J92j84k25l1M4N2j41L25k59J75K72
$$ -9 7 -53 -203 -110 34 -204 25 285 -245 -18 -19 163 355 171 -54 -85 -41 11 -130 195 -64 111 383
7705C83m08K4J60m4k45L62j08l61M30J19n18L27Lm02L59j92k9j7K57k21L78j15
$$ 383 -25 -1 159 115 -130 232 124 -237 193 312 -206 121 124 -278 81 -111 -140 -157 100 -121 257 142
7727A42k42K28j07o7o8L94j11l17L12l37J21J62l61n0N22o5l50J51P5l33O3J95
$$ 142 -100 128 21 -46 -114 280 169 -148 164 -173 -52 110 -251 -301 221 156 -194 -43 32 -301 -238 -43
7749d3j91L53j18j62J37J19j20J7J69n36L39P1J16j37J23k88K90P4l05k01M75
$$ -43 -234 119 1 -161 -24 95 -25 -8 161 -375 -36 35 151 14 137 -151 139 213 -92 -293 182
7770A82k30M9K93m62M8L66k1l78K95J13l75J93J6j98K19k5k15K7K68k69K83o7
$$ 182 -48 1 294 -168 -120 246 225 -153 142 255 -120 73 89 -109 110 85 -130 -103 165 -104 179 112
7792A12k38L3L09k11N2L01m77J36R8P0%k0k16q3L48l25Q1O4L9l01L70R6n28L09
$$ 112 -126 -93 216 5 57 358 -119 17 115 185 185 165 -51 -134 214 -111 -30 34 73 -228 142 238 -290 19
7816A9O9j22M2j20N8k35J84j49j6M78j17O7m4j07j31L21l15k27O09j80k85N6J24
$$ 19 88 -34 8 -112 -54 -289 -105 -254 -270 208 91 158 114 7 -124 197 -118 -345 264 84 -201 -145 -21
7839b1j82K88R9m51P32m87j77J44Q4j14r5L67l32j7M11n61O14j9l20J26K66k81
$$ -21 -203 85 184 -267 465 -22 -199 -55 29 -85 -180 187 -145 -162 249 -312 302 283 -37 89 355 74
7861G4m5K91j98j17j55j4Q7K10r3j12P0J65l33n2K55q3P8J95k76J25j89k84L93
$$ 74 29 320 122 5 -150 -164 -77 133 40 -72 -2 163 -170 -222 33 -50 28 223 -53 72 -117 -401 -8
7884hK6r4J49M39m59n1mk32Q4L4K44L1J68k63j58M18k92P0J70l47j81N45j92j25
$$ -8 18 -76 73 512 53 2 -2 -234 -150 -116 128 159 327 64 -94 324 32 102 272 -75 -256 289 97 -28
7908b8J75K2j74l5J05m78L93J72L9k19K38k64l41O08o3k30J18o6j66N25k85o7
$$ -28 147 169 -5 -40 65 -413 -20 152 191 -28 210 -54 -395 213 150 -80 38 -28 -194 331 46 -21
7930b1L14n21l5K32J14p4o3L01m22K14j7lj39L32l08jL51k21Q0j87J48k60L41
$$ -21 293 -228 -263 -31 83 9 -54 247 -175 39 22 19 -120 212 -96 -97 254 33 113 -74 74 -186 155
7953A55l21R4K99l32J4K65l32J46K98m45J92m7K02n22L53K80n35M85R7n73K29
$$ 155 -166 -72 227 -105 -91 174 -158 -12 286 -159 33 -14 188 -334 19 299 -236 249 346 -227 2
7974BN07o63J57J9k28J21J24l38N25j06q0r6K08m26q3N32k26l3L83k32k03J86
$$ 2 509 -154 3 22 -206 -85 39 -299 226 120 40 -56 152 -274 -357 175 -51 -84 299 67 -136 50
7996E0J86k85J70j77j2K1J98l30M2K52p5r3K09k20q2N02n64K47r6Mr8R6P9j65
$$ 50 236 -49 121 -56 -68 -47 151 -179 -137 115 40 -53 156 -64 -146 356 -208 39 -57 -53 -151 -55 24 -141
8020a41K19j00k35M44j65k60L48N4l20K81k43j41J03K23k32L92nl80N2J19k80
$$ -141 78 -22 -257 187 22 -238 110 164 -156 125 -118 -259 -156 67 -165 227 222 -158 -106 13 -267
8041b67N5L64l54K8N86n37p5N87j97l40L03j90l65N11Jk69M0K70j98K53l62J52
$$ -267 -212 152 -202 -174 412 -125 -200 387 190 -150 153 -37 -402 109 110 -159 -119 151 -47 206 -156 -4
8063dJ52q0k9n7K32o06L97P0k23o7K54j10R2P4l16J22Q1Q6n3j37K0r7L19Pm91
$$ -4 148 68 39 -18 214 -392 5 75 -148 -215 39 -71 21 95 -221 -99 -18 68 15 -122 -102 -199 120 127 -364
8088c64P0L19jj30m6K19n0n9L2K0K00m33l1M86l22J72L7j90Q9m5Q1j83L43N3k46
$$ -364 -294 25 24 -106 -152 67 17 -42 -10 10 210 -223 -254 232 -90 82 119 -71 18 -27 54 -129 214 267 21
8113B1K57j47k53M00P7m22o5M01m21L85k5j07k04J23m2J86J72l57r1K94l17P4
$$ 21 278 131 -122 278 355 -67 -132 269 -152 233 208 101 -103 20 -22 164 336 -21 -112 182 -135 -61
8135f1J44l65J30L25k66MJ37oo20M80r2J60k3R6j89K37p3j63K5J65k39j1L03l29
$$ -61 83 -282 -152 173 -93 -89 48 42 -578 -98 -190 -30 -53 43 -146 91 18 -145 -120 45 -194 -205 98 -231
8159b31K78M9P0m36L12k25K71L7l59J94K74l30j86L91j88j16L49j61k25J98L7
$$ -231 47 96 166 -270 42 -183 88 125 -234 -40 234 -96 -282 109 -79 -195 154 -7 -232 -34 3
8180Ck41M52Jm07N2P5p6K47j6J9l83
$$ 3 -238 214 215 -192 -140 -65 -141 106 90 109 -274
8191b74
$$ Imaginary data points
##PAGE= N=2
##DATA TABLE= (X++(I..I)), XYDATA
0@%%%%%%%%%%%%%qJ6j6J6j6J9k7L2l5M3n1N9p0Q1r2J06j23J41j58J79k04K31k61
$$ 0 0 0 0 0 0 0 0 0 0 0 0 0 0 -8 8 -8 8 -8 11 -16 16 -19 24 -27 32 -38 43 -49 57 -66 75 -83 96 -108 123 -138
36a38K92l26L65m07M51n01N56o15O80p52Q29r13J005j106J218j341J479j634J805
$$ -138 154 -172 193 -214 237 -264 292 -323 357 -395 434 -479 526 -580 638 -703 776 -858 947
55I47k000K225k481K779l132L560m087M753n628O831q589J1401j6573K8954j08673
$$ 947 -1053 1172 -1309 1470 -1662 1898 -2189 2564 -3064 3767 -4822 6579 -9994 18960 -89713
70h9713p6447K94172j20856q9855K08700r6084j30369K13459o6472j62068K01141
$$ -89713 -166160 128012 7156 -82699 126001 29917 -100452 113007 46535 -115533 85608
81H5608K7217j66443J16309j4619j58434J44251K9026j76550J43758O9911k06739
$$ 85608 112825 -53618 62691 48072 -110362 33889 62915 -113635 30123 100034 -106705
92a06705Q7307R8109j90142R7808J50166k22871J8747J97331j95587n6718K23747
$$ -106705 -19398 78711 -111431 -13623 136543 -86328 -67581 129750 -65837 -122555 101192
103A01192j01904o5711K00444j19408j43141J99685l6904j54580J62900N144j35995
$$ 101192 -712 -66423 134021 14613 -128528 71157 34253 -120327 42573 47717 -88278
114h8278J34374j9370j73578J61466O9212j71781J10599O9785j86296R2855J04889
$$ -88278 46096 26726 -146852 14614 83826 -87955 22644 92429 -93867 -1012 103877
125A03877j92888Q1846J71988k00202j7938J71571j59207l7677K00140j16289
$$ 103877 -89011 -7165 164823 -35379 -53317 118254 -40953 -78630 121510 5221
135E221p0536J94946j13394j48860J80248k8566j28471J57387k2938j47590J56312
$$ 5221 -65315 129631 16237 -132623 47625 19059 -109412 47975 25037 -122553 33759
146C3759P085j78736J44421Q3423j60253Q8110N6098j84492R2044J25179j79797
$$ 33759 40844 -137892 6529 89952 -70301 17809 73907 -110585 -18541 106638 -73159
157g3159M4374J57983j58808j7328J37976j43947j4769J91445j19581q2712J75751
$$ -73159 -28785 129198 -29610 -46938 91038 -52909 -67678 123767 4186 -78526 97225
168I7225q8200j16987J64692l9439j08158J71161k8359j67135J48989L5292j62377
$$ 97225 9025 -107962 56730 17291 -90867 80294 51935 -115200 33789 69081 -93296
179i3296J20974O8137j59784Q3134N9498j91257O8613J41561j48779J7619J26675
$$ -93296 27678 95815 -63969 19165 78663 -112594 -43981 97580 -51199 -33580 93095
190I3095j42420m179J33669j41014k0612J86734j05234q7704J50213q0066q2983
$$ 93095 -49325 -53504 80165 -60849 -81461 105273 39 -87665 62548 -17518 -100501
201a00501J78592n0551j21549J75693j4122j74102J31009M3473j43414J19031
$$ -100501 78091 27540 -94009 81684 67562 -106540 24469 67942 -75472 43559
211D3559N4651j77231P7988Q9021j73259M2269J32950j21910J6256J03900j44230
$$ 43559 98210 -79021 -1033 87988 -85271 -43002 89948 -31962 -15706 88194 -56036
222e6036j592J47151j20328m0905J54287q7459o8843J32720q6103p2860J86477
$$ -56036 -57628 89523 -30805 -71710 82577 -4882 -73725 58995 -27108 -99968 86509
233H6509l9352j36514J41527k942j46634J17596K7851j38838J23493O4578j79499
$$ 86509 47157 -89357 52170 49228 -97406 20190 48041 -90797 32696 97274 -82225
244h2225N3606J00202j32500M0450J07090j26044K1192J12725j42577k0242J46870
$$ -82225 -28619 71583 -60917 -20467 86623 -39421 -18229 94496 -48081 -68323 78547
255G8547q7320l6661J25232r8341n8486J49075p5814q9781J70282k0432j28628
$$ 78547 -8773 -45434 79798 -18543 -77029 72046 -3768 -93549 76733 56301 -72327
266g2327J15611j4900j31788J32568L3744j52514J01535P4588j55325M5705Q4961
$$ -72327 43284 28384 -103404 29164 62908 -89606 11929 86517 -68808 -23103 61858
277F1858j21181N2663J02488j42207K342J18316j15022k0416J27319q2410k4119
$$ 61858 -59323 -6660 95828 -46379 -44037 74279 -40743 -61159 66160 -16250 -40369
288d0369J25253j02147o8914J49430m8384q6542J37538k5409j09185J14593j7248
$$ -40369 84884 -17263 -86177 63253 14869 -71673 65865 40456 -68729 45864 28616
299B8616j30001J27417M8097j39982P4330N8851j33482N4845P7329j25061M5479
$$ 28616 -101385 26032 74129 -65853 8477 67328 -66154 -11309 66020 -59041 -13562
310a3562J05384j33059j5161J07291r1587p293J21477q7449l2656J27765q4683
$$ -13562 91822 -41237 -56398 50893 -40694 -47987 73490 -13959 -46615 81150 -3533
321c533p7490J33328l1558p5624J18698l5780j08432J19160P83j25578J08476
$$ -3533 -81023 52305 20747 -54877 63821 28041 -80391 38769 39552 -86026 22450
332B2450M8726j25861O4152M3019j29943O5997Q6421j28532K7118J03150j16000
$$ 22450 71176 -54685 9467 52486 -77457 -11460 74961 -53571 -26453 76697 -39303
343c9303j1403R9445q9170k88J26985q9692n2017J20876o1989p0349J14952l4734
$$ -39303 -50706 48739 -40431 -40719 86266 -3426 -55443 65433 3444 -66905 48047 13313
355A3313o9177J17193l4882j13697J10927K0378j07510Q8263L3179j14793O7458
$$ 13313 -55864 61329 26447 -87250 23677 44055 -63455 24808 57987 -56806 10652
366A0652M1477j30187N8083R6202j09740J2326Q3862j02520K681J00540r1223
$$ 10652 52129 -78058 -19975 76227 -33513 -21187 62675 -39845 -37164 63376 -27847
377b7847j3019J23510p5180o2038R8142n0844n1129J12272m1586p9426J11588
$$ -27847 -40866 82644 7464 -54574 43568 -7276 -58405 53867 12281 -67145 44443
388D4443j7478j06676R3048K1899q9282Q6191J9218j23167O8102N8342j18145
$$ 44443 26965 -79711 13337 35236 -54046 32145 51363 -71804 -3702 54640 -63505
399f3505M3980Q6788r6268J8651P5658j08180N051J12806q3773l0362J05717o5914
$$ -63505 -19525 67263 -29005 -10354 65304 -42876 -37825 74981 -8792 -39154 66563 649
411F49m9849R4114n5355n0097J20184l2241q9994R3614p981q8027Q7563J0796
$$ 649 -49200 44914 -10441 -60538 59646 27405 -62589 31025 23044 -64983 22580 33376
423C3376r1776Q6084K6985j24295N0972O2993r3424M0764O8554r8506K1025Q0988
$$ 33376 -58400 27684 54669 -69626 -18654 44339 -49085 -8321 60233 -38273 -17248 63740
435F3740j01873p354J06658o5190k8709Q5318o9394l9612J04467m5639n8060J07391
$$ 63740 -38133 -45487 61171 -4019 -32728 52590 -16804 -56416 48051 2412 -55648 51743
447E1743j9179q1374P7126j1907p7909R3200J4439j00758O9099L5692j05025M4920
$$ 51743 32564 -48810 28316 16409 -61500 31700 46139 -54619 14480 50172 -54853 -9933
459i933N4044q5891M4279O6090j05930Q312Q4686q4281q874R1156o7364k1982
$$ -9933 44111 -41780 2499 68589 -37341 -29029 55657 -28624 -37498 53658 -13706 -35688
471c5688Q7452p1997m5295J08138l2489o0034R2344k2974p5163Q1705j0633q2338
$$ -35688 51764 -20233 -65528 42610 10121 -49913 42431 19457 -55706 25999 15366 -66972
483f6972R0504K5008r6617N4713L3486q9105N0096N1747q8278L7707O6299r8738
$$ -66972 23532 48540 -48077 6636 40122 -48983 1113 52860 -35418 2289 68588 -30150
495c0150K40P7025o9735j199Q2442p2191k5000Q9703o1411m8790R8278k4072n5762
$$ -30150 -29910 47115 -22620 -23819 58623 -13568 -38568 51135 -10276 -59066 39212 15140 -40622
508d0622P8822k8060p3102Q4678J504q2591P4341K8104q4755M5904K7565q2118
$$ -40622 38200 10140 -62962 21716 23220 -59371 14970 43074 -41681 4223 31788 -50330
520e0330N3336N4222r0931K1801O3309q3326K076O8521o7690M725Q6282p3591
$$ -50330 3006 57228 -33703 -11902 51407 -31919 -29843 38678 -29012 -24287 61995 -11596
532a1596l4725Q9900m4994m4227Q7434k8866n2458Q3644k6122p9344Q2146J4995
$$ -11596 -46321 43579 -1415 -45642 41792 12926 -39532 44112 17990 -61354 20792 35787
544C5787p4592O1173J7512q0783N0992K7904q7838M5307N8922q3453J1380N1817
$$ 35787 -38805 22368 39880 -40903 10089 37993 -49845 -4538 54384 -29069 -17689 34128
556C4128p7169J2891P2670p0717n509Q7355o1049l8955P7747l7016l3211Q5214
$$ 34128 -43041 -30150 42520 -28197 -33706 53649 -7400 -46355 31392 -5624 -38835 46379
568D6379l2747o0381P9771j0392p1828O7957J4544o3375N7387R298q4443M9681
$$ 46379 13632 -46749 33022 22630 -49198 18759 33303 -30072 27315 36613 -47830 1851
580A851L8966p9731L2341N0981p3344J6143N0140p7490J2256Q1021o3707j8803
$$ 1851 40817 -38914 -6573 44408 -28936 -12793 37347 -40143 -27887 53134 -10573 -29376
592b9376P5655n1503l1897P3740m0140l7238Q5304k5663o6564O6880m400n9500
$$ -29376 46279 -5224 -37121 36619 -3521 -40759 44545 18882 -47682 19198 14798 -44702
604d4702O5015N745o7997N9026J5020q5914M2695M2890o7895L3972M4153p7039
$$ -44702 20313 26058 -41939 17087 32107 -53807 -11112 31778 -36117 -2145 42008 -35031
616c5031J9874O0762p2675K869P8553n4319k0312O3902n2643k7687P9079l4888
$$ -35031 -15157 45605 -27070 -24201 54352 33 -20279 43623 -9020 -36707 42372 7484
628G484m4813P4318j9110n9381N9112p419n3659O7206M981p3830M9907K2011p3328
$$ 7484 -37329 36989 17879 -41502 17610 10191 -43468 23738 28719 -45111 4796 26807 -46521
641d6521L8933L8258o4226L3522M4969p7315J1515O4021o0092l725O6069n2394
$$ -46521 -7588 30670 -33556 -34 44935 -32380 -20865 43156 -16936 -20661 45408 -6986
653f986j8447O2837n0064k9378P7914k5944m4264O4127j9274n1674O2425p772
$$ -6986 -25433 37404 -12660 -42038 35876 9932 -34332 29795 10521 -41153 21272 13500
665A3500n6168O5803J1443p2816M1744K3696o5336M1643L7727o9259K7406M8512
$$ 13500 -42668 23135 34578 -38238 3506 27202 -38134 3509 41236 -28023 -617 47895
677D7895p4358K934O0770n2082k370N7985n6503j9124O7101m2826l1324P2199
$$ 47895 -26463 -23529 37241 -14841 -17211 40774 -15729 -34853 32248 -10578 -41902 30297
689C0297k1263m0259N8681k3419n0137O8196l01o1664N6442J4918o5813L8481
$$ 30297 9034 -31225 27456 4037 -46100 22096 21795 -39869 16573 31491 -34322 4159
701D159K2349o1898M1067M0363p0362J4117M7887n9395K259N1964m9444l12N8926
$$ 4159 26508 -35390 5677 46040 -24322 -10205 37682 -21713 -19454 32510 -16934 -17246 41680
714D1680n4216k3757O4947l0673k6895O1847k6337l8204O1906k1097n6309O3969
$$ 41680 -12536 -36293 28654 -2019 -28914 32933 6596 -31608 30298 9201 -47108 16861
726A6861Q813n7737M5512J1334o3545M1754K7414o5245L2200M4380o2498O313
$$ 16861 25674 -32063 13449 24783 -38762 2992 30406 -34839 -2639 41741 -20757 -14444
738a4444M0773n3249J0361N4076n1561p226N9488m5122k3582N8994k9964k2299
$$ -14444 26329 -26920 -16559 37517 -14044 -21270 38218 -6904 -30486 28508 -1456 -23755
750b3755O2944l1781m6470O2485j0147n4043N6159P521n4508M5716J0614o5759
$$ -23755 39189 7408 -39062 23423 13276 -40767 15392 22913 -31595 14121 24735 -41024
762d1024L9186L6047n9817K0659L8219n5643J0329L9939n2859P590N6670m6265
$$ -41024 -1838 34209 -25608 -4949 33270 -22373 -12044 27895 -24964 -17374 39296 -6969
774f969j3255N1157l8964j8250N6431l2017k7149O2335k4376m9082N4937l447
$$ -6969 -20224 30933 -8031 -26281 30150 -1867 -29016 33319 8943 -40139 14798 11351
786A1351m5839N3000M928n6033M3565J6342o2750L2019L5376n1734J8850L2052
$$ 11351 -34488 18512 23440 -32593 10972 27314 -35436 -3417 31959 -19775 -925 31127
798C1127n6892J1862M5110n0090J332N3814m2880j3663M6958l9819j6347O1393
$$ 31127 -25765 -13903 31207 -18883 -17551 36263 -6617 -20280 26678 -13141 -29488 31905
810C1905k9894l4043N8189j8275m4141N2593l292m3444N2889N323o0120L8679
$$ 31905 2011 -32032 26157 7882 -36259 16334 13042 -30402 22487 27810 -32310 6369
822F369K0734n6196K9045L0325n1807J9918L2421n7489R396M7866m4439j972M6671
$$ 6369 27103 -29093 -48 30277 -21530 -1612 30809 -26680 -17284 30582 -13857 -15829 30842
835C0842m1913j1835M8804l7341j9686O0134k2301l4855M9540j4675l8313N1154
$$ 30842 -11071 -22906 25898 -11443 -31129 29005 6704 -28151 21389 6714 -31599 19555
847A9555l241m5288M8193P810n7389L1201K0150m8413K9514K7632n3997J7942
$$ 19555 16314 -28974 19219 27029 -30360 841 20991 -27422 2092 29724 -24273 -6331
859f331L6283n2815N129M6741l8928j810M2972m3203j3577N3736l0843k3675N4922
$$ -6331 29952 -22863 -17734 29007 -9921 -11731 31241 -11962 -25539 28197 -2646 -26321 28601
872B8601j9257l3390M5719j6055l7943N2506k79m9440L9693R297n1354L1449J7897
$$ 28601 9344 -24046 21673 5618 -32325 20181 19902 -29538 10155 19452 -31902 -453 17444
885A7444m8455L1684K9944n5546J2162L8492m4403N971M2560m1473j597M6525
$$ 17444 -31011 673 30617 -24929 -12767 25725 -18678 -12707 29853 -11620 -13217 33308
897C3308m1365j8231N2246k2571k2509M7216k1097l2263M7307j2826m1273M6956
$$ 33308 -8057 -26288 25958 3387 -19122 28094 6997 -25266 22041 9215 -32058 14898
909A4898M801m4815L2798O764m6992L4494K1026m9237K4418L1903m9372Q161L4177
$$ 14898 19699 -25116 7682 14446 -32546 1948 22974 -26263 -1845 30058 -19314 -11153 23024
922B3024m1892Q082M3263m2812r072M6163l3330j7943M6969k1759k1157M6764
$$ 23024 -18868 -10786 32477 -10335 -19407 26756 -6574 -24517 22452 693 -20464 26300
934B6300k1918l5930M6752n246l8374M1814K721m1961L5674P441m7646L3691K5646
$$ 26300 4382 -31548 15204 9958 -28416 13398 16119 -25842 9832 17273 -30373 3318 28964
947B8964m7523J9111K7277m6420J1100L4497m3850N209M4479m0016j2998M2846
$$ 28964 -18559 552 27829 -18591 -7491 27006 -16844 -11635 32844 -7172 -20170 22676
959B2676k9916j5249M6457k3830k4266M5873j7825l6081M2502k475l3141L9090
$$ 22676 -7240 -22489 23968 138 -24128 21745 3920 -32161 10341 7866 -25275 13815
971A3815Q70m2627L4575J2097m5562K8762K4792m3426J6291K4869m5962J1580
$$ 13815 14685 -27942 6633 18730 -26832 1930 26722 -16704 -413 24456 -21506 -9926
983i926L7799m0195L03M1567l5313j2026L9480k7680j3831M6578k2455k8151M1743
$$ -9926 27873 -12322 -12019 29548 -5765 -17791 21689 -5991 -19822 26756 4301 -23850 17893
996A7893j2686l2365M0090k983l2699L8092Q48m4351L1844J5080m1738K4867K0905
$$ 17893 5207 -27158 12932 9949 -22750 15342 16190 -28161 3683 18763 -22975 1892 22797
1009B2797m3173J6861K5876m5315R946L9430l6739k284L7219l4266r420M1857
$$ 22797 -20376 -3515 22361 -22954 -13008 26422 -10317 -12601 24618 -9648 -19068 22789
1021B2789k8017j6240M6171j9055k8914L8535j1131k7980M0657l370l5731L6328
$$ 22789 -5228 -21468 24703 5648 -23266 15269 4138 -23842 16815 13445 -22286 14042
1033A4042M646m2837K7190J5075l7597K4915J8372m4524J4915K8661m0774O298
$$ 14042 18688 -24149 3041 18116 -19481 5434 23806 -20718 -5803 22858 -17916 -11618
1045a1618L6391l3644k414L4175l4633j0154M3815k3886j9302M0674j6559k5860
$$ -11618 24773 -8871 -11285 22890 -11743 -21897 21918 -1968 -21270 19404 2845 -23015
1057b3015L6871j0303k8360M0798K00l7680K9347O992l7020K6564J3634l7641
$$ -23015 13856 3553 -24807 15991 16191 -21489 7858 14850 -22170 4394 18028 -19613
1069a9613K3076K0969m3467J1015K9419l5318O893L2181l5637k740L7086l3078
$$ -19613 3463 24432 -19035 -8020 21399 -13919 -7026 25155 -10482 -13222 23864 -9214
1081i214j2797M2602j9779j8683L7705j7803k5757L9027p544l1021L6886K108
$$ -9214 -22011 20591 812 -17871 19834 2031 -23726 15301 7757 -23264 13622 15730
1093A5730l5803K6703N005l5604K7692J5952l8815J8561K1207l8898J0339K6609
$$ 15730 -20073 6630 11635 -23969 3723 19675 -19140 -579 20628 -18270 -7931 18678
1105A8678l3421P558L2452l5754n742L6611k6694j1903L9211j9070j8154L6732
$$ 18678 -14743 -7185 25267 -10487 -16229 20382 -6312 -18215 20996 1926 -16228 20504
1117B0504j6894k6999L7692k977k9910L1262M44l4133K6475O520l4516K5335J6978
$$ 20504 3610 -23389 14303 11326 -18584 12678 13122 -21011 5464 11984 -22532 2803 19781
1130A9781l6569J4315J9227l5052J1590K6374l3388N221L2404l3070p079L5051
$$ 19781 -16788 -2473 16754 -18298 -6708 19666 -13722 -8501 23903 -9167 -16246 18805
1142A8805k4176r800L7947k0875j9864L6529j4280k7071L5766l026k8198K9710
$$ 18805 -5371 -15171 22776 1901 -17963 18566 4286 -22785 12981 9955 -18243 11467
1154A1467o81l3856K7176R295l3706K2836J6570l4360J3281J8313l4384J2375
$$ 11467 10786 -23070 4106 13401 -20305 2531 19101 -15259 -1978 16335 -18049 -5674
1166e674K7941l2728J822K9997k9733n975L2376k2879r356L6411k0094k2236L3896
$$ -5674 22267 -10461 -8639 21358 -8375 -14350 18026 -4853 -14209 22202 2108 -20128 13768
1179A3768j0197k4188L2190k899k7049K8364P98l3178K4790J2617l0529J8685
$$ 13768 3571 -20617 11573 8674 -18375 9989 10787 -22391 2399 15016 -15513 3172
1191C172J4469l3436J3502J9694l3295R293K8550k9989r43K7404k7356n219L3222
$$ 3172 17641 -15795 -2293 17401 -15894 -6601 21949 -8040 -8983 18421 -8935 -14154 19068
1204A9068k2267j2310L4756j6990k2039L0651q545k1278L1970l455k8924K7344
$$ 19068 -3199 -15509 19247 2257 -19782 10869 2324 -18954 13016 9561 -19363 7981
1216G981L543l1434K2787J1581k9067J8787J3022l4745J2756K2294l0254P191
$$ 7981 11524 -19910 2877 14458 -14609 4178 17200 -17545 -4789 17505 -12749 -5558
1228e558K5771k8103m23K6080k7059m847L3583j9533j3996L0267j5530j8822L0327
$$ -5558 20213 -7890 -8313 17767 -9292 -14139 19444 -89 -14085 16182 652 -18170 12157
1241A2157q612k1113L0691k454k9383K3700M413k7238K1670J0113k9855J7171
$$ 12157 3545 -17568 13123 10669 -18714 4986 9399 -17839 3831 13944 -15911 1260
1253A260J4307l2071R907K2028k5949O208K3129k7703j125K7455k3604p172L0943
$$ 1260 15567 -16504 -6597 15431 -10518 -4310 18819 -8884 -10009 17446 -6158 -13330 17613
1266A7613j6556j3551K7450j4865j8145L0764o359k2340K7223j123k7234K2161
$$ 17613 1057 -12494 14956 91 -18054 12710 6351 -15989 11234 10111 -17123 5038
1278E038L504k6183K2241J1026l0167J4119J4658k9011R814K0778k5452N914K2801
$$ 5038 8542 -17641 4600 15626 -14541 -422 14236 -14775 -4961 15817 -9635 -3721 19080
1291A9080k8286k982K7402k0547o767K8041j6829j3670K7333j3390j8261K9616
$$ 19080 -9206 -12188 15214 -5333 -12100 15941 -888 -14558 12775 -615 -18876 10740
1303A0740l922k1524K3921j615k5058K2529N121k4937J9740J1300k8307J1645
$$ 10740 6818 -14706 9215 7600 -17458 5071 10192 -14745 4995 16295 -12012 -367
1315c67J4591k6036R505J9970k5421K900K2188k5091m490K5626j7990o632K5982
$$ -367 14224 -11812 -2307 17663 -7758 -4858 17330 -7761 -12251 13375 -4615 -11247 14735
1328A4735j6547j3635K6209j0280j7606K6752l339j9997K1898k044k3715K1957
$$ 14735 -1812 -15447 10762 482 -17124 9628 6289 -13708 8190 6146 -17569 4388
1340D388P044k5020J7424J0681k6715J1321J3341k5010R500K0310k5205P40K1072
$$ 4388 11432 -13588 3836 14517 -12198 -877 12464 -12546 -3046 17264 -7941 -7201 13871
1353A3871k1861k797K4338j7047o022K5097j6098j3968K5403q013j5405K4348
$$ 13871 -7990 -10787 13551 -3496 -9518 15579 -519 -14487 10916 2903 -12502 11846
1365A1846m847j9791K1538j411k3489K0438P395k3333J4693Q055k5469J1511J4457
$$ 11846 6999 -12792 8746 7335 -16154 4284 11679 -11654 3039 11094 -14375 -2864 11593
1378A1593k4272P460J9342k2374j57J9303j9299j627K3884j5948p986K3846j2981
$$ 11593 -12679 -5219 14123 -8251 -8408 10895 -8404 -10031 13853 -2095 -10081 13765 784
1391G84j3405K2892p163j3709K3294m863k0824J9627O76k0797J7806O616k2093
$$ 784 -12621 10271 3108 -10601 12693 7830 -12994 6633 7309 -13488 4318 10934 -11159
1404a1159J3917P909k4918J0322J5865k1311N325J7657k1334M66J9006j8296k466
$$ -11159 2758 10667 -14251 -3929 11936 -9375 -4050 13607 -7727 -7261 11745 -6551 -9017
1417i017K3442j4416r499K0395j2288j1095K2401p371j4405K1910m754j9732J8174
$$ -9017 14425 9 -9490 10905 -1383 -12478 9923 2552 -11853 10057 5303 -14429 3745
1430C745J672j9004J8299N327k2342J3184R364k2460R396J5483j9571N196J5838
$$ 3745 5417 -13587 4712 10039 -12303 881 10245 -12215 -2819 12664 -6907 -1711 14127
1443A4127k0654M8J9423j6089l851K0550j3421q617J8527j1432j0721K1366o166
$$ 14127 -6527 -6479 12944 -3145 -6996 13554 133 -8484 10043 -1389 -12110 9256 3090
1456C090j4318J8689l669j7574J6942J905j7501J6587N815k1615J0993R654j9688
$$ 3090 -11228 7461 3792 -13782 3160 5065 -12436 4151 9966 -11649 -656 8998 -10690
1469a0690Q971J3903j8852M689J4566j9485n99J8976j4305l298J8059j3313p924
$$ -10690 -1719 12184 -6668 -1979 12587 -6898 -7497 11479 -2826 -6124 11935 -1378 -9302
1482i302J7995r670j0243K0542n042j4253J6724k880j6318J7492J930j7264J4544
$$ -9302 8693 -977 -11220 9322 4280 -9973 6751 3871 -12447 5045 6975 -10289 4255
1495D255N660k0279R906R043j7970Q663J2400j8766L130J4220j7258r22J7442
$$ 4255 9915 -10364 -458 8585 -9385 -722 11678 -7088 -3958 10262 -6996 -7918 9524
1508I524j2801l470J7079j2699p948J8088p732r870J8462m407j3310J5086k558
$$ 9524 -3277 -6747 10332 -2367 -10315 7773 41 -9829 8633 4226 -9084 6002 3444
1521C444j4856J6046L194j6701J2385M967j7942Q944Q995j6801P539J2517j7581
$$ 3444 -11412 4634 7828 -8873 3512 8479 -9463 -519 8476 -8325 -786 11731 -5850
$$ [...]
8191A66
##END NTUPLES=NMR FID
##END=
