##TITLE=1H_Pr 4896
 CDCl3, 8 sc, 
 7.2.2019
##JCAMPDX= 6.0         $$ Bruker NMR JCAMP-DX V2.0
##DATA TYPE= NMR FID
##DATA CLASS= NTUPLES
##ORIGIN= UXNMR, Bruker Analytische Messtechnik GmbH
##OWNER= root
$$ XWIN-NMR		Version 3.5
$$ Thu Feb  7 16:17:29 2019 Russian Standard Time (UT+4h)  she@DPX200
##.OBSERVE FREQUENCY= 200.1313
##.OBSERVE NUCLEUS= ^1H
##.DELAY= (6, 6)
##.ACQUISITION MODE= SIMULTANEOUS
##.ACQUISITION SCHEME= undefined
##.AVERAGES= 8
##.DIGITISER RES= 18
##SPECTROMETER/DATA SYSTEM= spect
##.PULSE SEQUENCE= zg30
##.SOLVENT NAME= CDCl3
##.SHIFT REFERENCE= (INTERNAL, CDCl3, 0, 15.7039)
##AUDIT TRAIL= $$ (NUMBER, WHEN, WHO, WHERE, WHAT)
$$ ##TITLE= Audit trail, XWIN-NMR		Version 3.5
$$ ##JCAMPDX= 5.01
$$ ##ORIGIN= Bruker BioSpin GmbH
$$ ##OWNER= she
$$ F:/spectra/data/she/nmr/H-F/1/audita.txt
$$ ##AUDIT TRAIL=  $$ (NUMBER, WHEN, WHO, WHERE, WHAT)
(   1,<2019-02-07 16:16:32.48 +0400>,<she>,<DPX200>,
      <created by zg, POWCHK disabled, PULCHK disabled
       configuration hash MD5:
       00 E9 B6 7A A2 85 ED C7 34 08 36 98 17 FE 4E 26
       data hash MD5: 16K
       17 C9 91 C4 F6 40 6D 2A 98 C2 7E BF 25 21 80 CC>)
$$ ##END=
$$ 
$$ hash MD5
$$ 99 F7 B3 3C 52 50 87 26 7C 89 EE DC 82 4D C6 FD
##$RELAX= 
##$RELAX= 
##$RELAX= 
##$RELAX= 
##$RELAX= 
##$RELAX= 
$$ Bruker specific parameters
$$ --------------------------
##$DU= <F:/spectra>
##$EXPNO= 1
##$NAME= <H-F>
##$PROCNO= 1
##$TYPE= <nmr>
##$USER= <she>
##$AMP= (0..31)
100 100 100 100 100 100 100 100 100 100 100 100 100 100 100 100 100 100 
100 100 100 100 100 100 100 100 100 100 100 100 100 100 
##$AQSEQ= 0
##$AQ_mod= 1
##$AUNM= <au_zg>
##$AUTOPOS= <>
##$BF1= 200.13
##$BF2= 200.13
##$BF3= 200.13
##$BF4= 200.13
##$BF5= 200.13
##$BF6= 200.13
##$BF7= 200.13
##$BF8= 200.13
##$BYTORDA= 1
##$CFDGTYP= 0
##$CFRGTYP= 5
##$CHEMSTR= <none>
##$CNST= (0..31)
1 1 145 1 1 1 1 1 1 1 1 1 1 1 1 1 1 1 1 1 1 1 1 1 1 1 1 1 1 1 1 1 
##$CPDPRG= <>
##$CPDPRG1= <>
##$CPDPRG2= <>
##$CPDPRG3= <>
##$CPDPRG4= <mlev>
##$CPDPRG5= <mlev>
##$CPDPRG6= <mlev>
##$CPDPRG7= <mlev>
##$CPDPRG8= <mlev>
##$CPDPRGB= <>
##$CPDPRGT= <>
##$D= (0..31)
0 1.2 0 0 0 0 0 0 0 0 0 0.03 0 0 0 0 0 0 0 0 0 0 0 0 0 0 0 0 0 0 0 0 
##$DATE= 1549541791
##$DBL= (0..7)
120 120 120 120 120 120 120 120 
##$DBP= (0..7)
150 150 150 150 150 150 150 150 
##$DBP07= 0
##$DBPNAM0= <>
##$DBPNAM1= <>
##$DBPNAM2= <>
##$DBPNAM3= <>
##$DBPNAM4= <>
##$DBPNAM5= <>
##$DBPNAM6= <>
##$DBPNAM7= <>
##$DBPOAL= (0..7)
0.5 0.5 0.5 0.5 0.5 0.5 0.5 0.5 
##$DBPOFFS= (0..7)
0 0 0 0 0 0 0 0 
##$DE= 6
##$DECBNUC= <off>
##$DECIM= 32
##$DECNUC= <off>
##$DECSTAT= 4
##$DIGMOD= 1
##$DIGTYP= 9
##$DL= (0..7)
0 120 120 120 120 120 120 120 
##$DP= (0..7)
150 150 150 150 150 150 150 150 
##$DP07= 0
##$DPNAME0= <>
##$DPNAME1= <>
##$DPNAME2= <>
##$DPNAME3= <>
##$DPNAME4= <>
##$DPNAME5= <>
##$DPNAME6= <>
##$DPNAME7= <>
##$DPOAL= (0..7)
0.5 0.5 0.5 0.5 0.5 0.5 0.5 0.5 
##$DPOFFS= (0..7)
0 0 0 0 0 0 0 0 
##$DQDMODE= 0
##$DR= 18
##$DS= 0
##$DSLIST= <SSSSSSSSSSSSSSS>
##$DSPFIRM= 0
$$ [...]
##$SUBNAM2= <"">
##$SUBNAM3= <"">
##$SUBNAM4= <"">
##$SUBNAM5= <"">
##$SUBNAM6= <"">
##$SUBNAM7= <"">
##$SUBNAM8= <"">
##$SUBNAM9= <"">
##$SW= 20.0189088683792
##$SWIBOX= (0..15)
0 0 2 0 0 0 0 0 0 0 0 0 0 0 0 0 
##$SW_h= 4006.41025641026
##$TD= 16384
##$TD0= 1
##$TE= 0
##$TE2= 300
##$TE3= 300
##$TEG= 300
##$TL= (0..7)
0 120 120 120 120 120 120 120 
##$TP= (0..7)
150 150 150 150 150 150 150 150 
##$TP07= 0
##$TPNAME0= <>
##$TPNAME1= <>
##$TPNAME2= <>
##$TPNAME3= <>
##$TPNAME4= <>
##$TPNAME5= <>
##$TPNAME6= <>
##$TPNAME7= <>
##$TPOAL= (0..7)
0.5 0.5 0.5 0.5 0.5 0.5 0.5 0.5 
##$TPOFFS= (0..7)
0 0 0 0 0 0 0 0 
##$TUNHIN= 0
##$TUNHOUT= 0
##$TUNXOUT= 0
##$USERA1= <user>
##$USERA2= <user>
##$USERA3= <user>
##$USERA4= <user>
##$USERA5= <user>
##$V9= 5
##$VALIST= <valist>
##$VCLIST= <CCCCCCCCCCCCCCC>
##$VD= 0
##$VDLIST= <DDDDDDDDDDDDDDD>
##$VPLIST= <PPPPPPPPPPPPPPP>
##$VTLIST= <TTTTTTTTTTTTTTT>
##$WBST= 1024
##$WBSW= 4
##$XGAIN= (0..3)
0 0 0 0 
##$XL= 0
##$YL= 0
##$YMAX_a= 226357
##$YMIN_a= -258838
##$ZGOPTNS= <>
##$ZL1= 120
##$ZL2= 120
##$ZL3= 120
##$ZL4= 120
##$ABSF1= 10
##$ABSF2= 0
##$ABSG= 5
##$ABSL= 3
##$ALPHA= 0
##$AQORDER= 0
##$ASSFAC= 0
##$ASSFACI= 0
##$ASSFACX= 0
##$ASSWID= 0
##$AUNMP= <proc_1d>
##$AZFE= 0.1
##$AZFW= 0.1
##$BCFW= 1
##$BC_mod= 2
##$BYTORDP= 1
##$COROFFS= 0
##$CY= 11.3945322036743
##$DATMOD= 1
##$DC= 2
##$DFILT= <>
##$DTYPP= 0
##$F1P= 18.9103706918063
##$F2P= -1.10871071338519
##$FCOR= 0.5
##$FTSIZE= 0
##$FT_mod= 4
##$GAMMA= 1
##$GB= 0.15
##$INTBC= 1
##$INTSCL= 1
##$ISEN= 128
##$LB= 0.24
##$LEV0= 0
##$LPBIN= 0
##$MAXI= 10000
##$MC2= 0
##$MEAN= 0
##$ME_mod= 0
##$MI= 1.114404
##$NCOEF= 0
##$NC_proc= 0
##$NLEV= 6
##$NOISF1= 3.799351
##$NOISF2= 2.8
##$NSP= 1
##$NTH_PI= 0
##$NZP= 0
##$OFFSET= 15.70392
##$PC= 1
##$PHC0= -8675.846
##$PHC1= 10.20019
##$PH_mod= 1
##$PKNL= yes
##$PPARMOD= 0
##$PSCAL= 0
##$PSIGN= 0
##$REVERSE= no
##$SF= 200.130013532006
##$SI= 16384
##$SIGF1= 3
##$SIGF2= 2
##$SINO= 400
##$SIOLD= 16384
##$SREGLST= <1H.CDCl3>
##$SSB= 0
##$STSI= 0
##$STSR= 0
##$SW_p= 3612.71676300578
##$SYMM= 0
##$S_DEV= 0
##$TDeff= 0
##$TDoff= 0
##$TI= <>
##$TILT= no
##$TM1= 0
##$TM2= 0
##$TOPLEV= 0
##$USERP1= <user>
##$USERP2= <user>
##$USERP3= <user>
##$USERP4= <user>
##$USERP5= <user>
##$WDW= 1
##$XDIM= 8192
##$YMAX_p= 0
##$YMIN_p= 0
$$ End of Bruker specific parameters
$$ ---------------------------------
##NTUPLES= NMR FID
##VAR_NAME=  TIME,          FID/REAL,        FID/IMAG
##SYMBOL=    X,             R,               I
##VAR_TYPE=  INDEPENDENT,   DEPENDENT,       DEPENDENT
##VAR_FORM=  AFFN,          ASDF,            ASDF
##VAR_DIM=   8192,          8192,            8192
##UNITS=     SECONDS,       ARBITRARY UNITS, ARBITRARY UNITS
##FACTOR=    0.0002496,     1,               1
##FIRST=     0,             0,               0
##LAST=      2.0444736,     0,               0
##MIN=       0,             -258838,         0
##MAX=       2.0444736,     226357,          0
$$ Real data points
##PAGE= N=1
##DATA TABLE= (X++(R..R)), XYDATA
0@%%%%%%%%%%jRj6J6j7K5l2M0m9N8p3Q7j03J21j42J67j95K27k60K98l43L92m47
33b38N07n73O45p26Q16r14J022j138J264j404J557j723J906k105K322k560K821
50A479l108L422l769M156m589N073n620O245o966P807q802J0007j1501J3401j5916
65h681J9427k4704L3627n2607J65768j72327r7950L59591j78324j21381J43161
76F5600n0448p9400J31199q9070m2135J09869r5303m8155J79742j24048j33288
87a75437K04469K508j73244J40662P3362r0361O0535m5896p8235K32200j5271
98A35292k74301J85933J79433k99257L53K38809j84213j08376J97720p7877j24915
109a31399J26372O092l4397N3689j02545K0411J91315j59910j60262K51782M4776
$$ plain form
0 0 0 0 0 0 0 0 0 0 0 0 -1 8 -8 8 -9 16 -16 24 -25 33 -40 47 -56 65 -77 90 -105 122 -138 160 -183 209 -238
33 -238 269 -304 341 -385 431 -483 539 -599 665 -739 818 -905 1001 -1104 1218 -1342 1479
50 1479 -1629 1793 -1976 2180 -2409 2664 -2956 3289 -3677 4130 -4672 5335 -6166 7235 -8681
65 -8681 10746 -13958 19669 -32938 132830 -39497 -137447 222144 43820 -77561 65600
76 65600 15152 -64248 66951 -22119 -64254 45615 -49688 -97843 81899 -42149 -175437
87 -175437 29032 31540 -141704 -1042 72320 -18041 42494 -3402 -81637 150563 135292
98 135292 -139009 46924 226357 -72900 -72547 166262 -17951 -126327 71393 -6484 -131399
109 -131399 -5027 1065 -33332 20357 -82188 -61777 129538 -30372 -190634 61148 105924
120A05924j92292R7471O1105j04279J01100J7369j37660J12888K5683j90271J27705
131B4743J09843k45523M5932K07206k13213q6859K38425o0901j47709J11040K7233
142A0217o158N9933j26228j2897K10364j00191j61757J84359R611j65901J42741
153D4093O3210j70904P2996Q8988j25355K2467K7525j03654J10323M7626k19158
164a41843Q1678K03606j96358q1129K10889m9571r9486J12091l5062m5237J15480
175G5058o3202o4730J35014p0695j11585J67148k3835j72504J64663Q9608k00536
186g5596K9790J26225p8273k811O275r1305J05934O1025j88525N3292J68291j48430
198c4108l1230J67892j13418q0619J74566m4039j14172J09544j2254o7985R8746
$$ plain form
120 105924 -86368 11103 72208 -32071 69029 86398 -51262 61626 87309 -102962 24743
131 24743 134586 -110937 -65005 142201 -71012 -157871 80554 19653 -128056 -17016 10217
142 10217 4059 63992 -62236 -75133 135231 35040 -126717 57642 67253 -98648 44093
153 44093 107303 -63601 9395 98383 -26972 -4505 23020 -80634 29689 77315 -141843
164 -141843 -60165 143441 -52917 -134046 76843 27272 -72214 39877 4815 -40422 75058
175 75058 11856 -52874 82140 11445 -100140 67008 43173 -129331 35332 124940 -75596
186 -75596 -45806 80419 2146 -665 5610 -85695 20239 81264 -107261 -53969 114322 -34108
198 -34108 -65338 102554 -10864 -91483 83083 39044 -75128 34416 22162 -45823 52923
209E2923o2105q7949J71840j9128j90601J36680J13923j58608J6944R1845q4876
220a9112K0272M0765j06394M8152P6681j17427L6697R8557j41213J8808J73939
231A29725j40814j03888J82745j9358j26355Q6364L45n2817J04224m9117j10992
242i9938J42688K7566j47523Q4829O7279j25302N4606P6612j26000J4886Q9581
253E9284q6525k895N1156q1444N9000R0400j56287J568J85362j08680j11540J47994
265D7393j8782r6734J05001k0239r4187J19047J4456j15423P8848K5446r9660
276e4834Q6552L1675j41161O8166J00672j28373j2937Q6057o1467J1942M9543
287C5835r9637L7123J15977j15905l1608J38924p3328o8903J22540n4485r3186
$$ plain form
209 52923 -9182 -97131 74709 55581 -135020 1660 115583 -43025 -26081 65764 -19112
220 -19112 1160 41925 -64469 -16317 60364 -57063 -20366 78191 -63022 -44214 129725
231 129725 -11089 -114977 67768 48410 -77945 8419 8764 -44053 60171 11054 -99938
242 -99938 42750 70316 -77207 7622 74901 -50401 4205 80817 -45183 -30297 59284
253 59284 -27241 -30136 21020 -60424 -1424 88976 -67311 -65743 119619 10939 -100601 47393
265 47393 28611 -68123 36878 16639 -77548 41499 55955 -59468 19380 44826 -54834
276 -54834 31718 63393 -77768 -9602 91070 -37303 -50240 35817 -25650 -13708 35835
287 35835 -63802 -26679 89298 -26607 -58215 80709 7381 -61522 61018 6533 -86653
298h6653J32916J57j19251Q4481L6905q2366O2293M388r9535R0281M5644j39938
310g0678L8223R5416r1873R28O4846q1157K2907Q7436r8609j2876J10067o6751
322b121l2166R8466p3533m8925J29986n5022j10812J18717K2673r9360O8355J6504
334C2762q1120Q1137J9488j21252O1089O9941j06222J7418O2886q1188L2552P6772
346F4263j02922j520J06065p0653l1988Q4586n7763k0568R9894p3978o8459J21065
358D8022j7943r3825Q0747L844p2384Q7563M299j07238P9980N3283j13433K3438
370b3647N9684p6279K8983N5190r2018K1711R2308p8128j8335Q1203n7724j4989
382b2041Q1749p4650m0455J15133l7141q3342Q0459l660o0327P4131j7667p8250
$$ plain form
298 -86653 46263 46420 -72831 11650 48555 -33811 28482 32870 -66665 23616 69260 -70678
310 -70678 -32455 62961 -28912 -27984 36862 -44295 -21388 66048 -32561 -45437 64630 -2121
322 -2121 -34287 64179 -9354 -58279 71707 16685 -94127 24590 47263 -52097 16258 32762
334 32762 -48358 32779 52267 -68985 -7896 62045 -44177 -26759 36127 -45061 -12509 64263
346 64263 -38659 -40179 65886 -4767 -36755 47831 -9932 -30500 69394 -4584 -73043 48022
358 48022 30079 -63746 17001 20845 -51539 36024 40323 -66915 13065 66348 -47085 -23647
370 -23647 36037 -40242 -11259 43931 -48087 -26376 65932 -12196 -30531 50672 -7052 -22041
382 -22041 59708 -14942 -55397 59736 22595 -60747 19712 16052 -44275 29856 12189 -66061
394f6061R7444K0295j14303N5854N6847r0486L0401N0639r1354K6444Q2153p8266
406b0393q368P7062m9572k940N9567p8805r936J04920o9936p0393R9821j1072
418A9955o7551O6106j2870n9057Q0819k932q6535P0546K9852q1928N1668L0702
430C8775r4499N0483P3474j00806n409Q9896m4432j8223M6473m8044J1859O4528
442F4075q4136l1206R7187m5296o0254Q2557k0899o2843Q2901J047q0693O0151
454B591K9147o0609M0475O217o2925P3335L0111j11622L9908Q8505q5587j8696
466b9150P3053m3933j0573N3179n7564j3441O7563n3909k9140P0852n1264l8891
478f3218J00427k9116q2989R0814L2459q2533L1138K9799l8984M1122k577o9060
$$ plain form
394 -66061 31383 51678 -62625 -6771 50076 -40410 -10009 40630 -50724 -24280 57873 -20393
406 -20393 -28761 48301 -1271 -4211 55356 -23449 -33385 71535 1599 -68794 31027 19955
418 19955 -47596 18510 5640 -53417 27402 24470 -62065 8481 38333 -43595 8073 38775
430 38775 -55724 -5241 68233 -32573 -37982 51914 7482 -10741 35732 -12312 -453 64075
442 64075 -20061 -51267 45920 624 -59630 22927 2028 -60815 22086 23133 -57560 2591
454 2591 31738 -28871 11604 17821 -45104 28231 58342 -53280 -13372 75133 -10454 -29150
466 -29150 43903 -30 -10603 42576 -14988 -28429 39134 -14775 -43915 26937 -24327 -63218
478 -63218 37209 8093 -74896 15918 48377 -34156 -3018 26781 -12203 28919 26342 -42718
490d2718O4215L7154r6103K8867O7798q0425k199P2827o5741k4945P4522l5244
502a992l5507M5698l1452p542O2480n9182l5622J11151j6818r2719P4947M1585
514E5027o9058K5718K1699n0066L3423J6012o0964L5786K4777p1327L9458M7556
526D8041r4805J1305R4260p1694m9682P9260j0148l5048L5520k7894m442O8686
538D3359m7863m5662R2674o512p2960O6896J6897p9354M2448L8112o9215R508
550a1672L0407l9704K2562Q273o1323N4590N0466j03374K185J03472n5004n1745
562e0867O9705j2458l3066M9317j8650k7777N2265j9713k8805O1830k7382n7468
574d3069Q0536Q505r6141M1426N5008o7181o302L4071k5734K3823R734o3289M2520
$$ plain form
490 -42718 21497 58651 -37452 -8585 59213 -21212 -23411 49416 -16325 -41270 33252 -1992
502 -1992 -37499 8199 -23253 -30795 31685 -27497 -63119 48032 31214 -61505 13442 55027
514 55027 -14031 11687 33386 -16680 16743 32755 -28209 7577 32354 -38973 485 48041
526 48041 -46764 -35459 58801 -12893 -62575 16685 6537 -28511 7009 -20885 -25327 43359
538 43359 -4504 -50166 42508 35996 -36964 29932 46829 -32525 9923 48035 -21180 -11672
550 -11672 18735 -20969 1593 9866 -51457 3133 53599 -49775 -47590 55882 878 -50867
562 -50867 18838 6380 -26686 22631 3981 -23796 28469 8756 -20049 41781 14399 -43069
574 -43069 37467 45972 -50169 -8743 46265 -20916 -27218 6853 -18881 4942 14676 -48613 -6093
587f093N9236p9279l843P8394n7039l2889Q1818k5282n6543N6555P574l6971K6687
600A2325j3250j3064N6344l8477n8440Q5520J3368r8222L5914N7233n9820L858
612a6711L6507m4192J3543L9662m3529J1511L5866n8991J3920O8167p0844l4344
624d9435R0579k0815o7668N1249J9891l3672J8182j4661j4368N7547k4998n9674
636d7843O4737J4724p4611M3685M0313p7181J3604O5947m5919j9206L6553j9910
648e107Q239K2455n4407J4633O2613o6323l4600Q6276j4165o0032M7367R218l6548
661b0381L5797P78l5188L4528n932l6488N1655l792p2029N5537M6768q4565L639
674b9673P0047l9970k4388L6148j7568L188K3448m8451P001N9145m8908k6733
$$ plain form
587 -6093 53143 -26136 -29979 48415 -8624 -41513 40305 15023 -41520 15035 22609 -14362 12325
600 12325 -925 -13989 42355 3878 -54562 30958 44326 -53896 -17982 39251 -20569 -16711
612 -16711 19796 -24396 -10853 28809 -14720 -3209 32657 -26334 -12414 55753 -15091 -49435
624 -49435 41144 20329 -47339 3910 23801 -9871 8311 -6350 -20718 36829 11831 -47843
636 -47843 16894 31618 -42993 692 41005 -36176 -22572 43375 -2544 -21750 14803 -5107
648 -5107 3132 25587 -28820 -14187 48426 -17897 -52497 33779 19614 -40418 6949 16167 -20381
661 -20381 15416 16194 -18994 15534 9602 -26886 24769 20977 -51052 4485 51253 -33312 -29673
674 -29673 40374 404 -23984 12164 -5404 -2216 21232 -27219 -20218 38927 -9981 -36714
686c6714O8014k6553m4566O8360K174o2446L4990K3473l5215J6642l700k8936
698b4477M5385l341o6952M8763M6134p4402J016O1026l6908j6015L8275k6312
710g808p500L5345k7486n446L6023l9660n208O7136m0199n1459P4140R228o8294
723c1188K8969K8038l6249J2452K126l1615L6657R783n5229L0808L4684n4610
735b5374J4536M7681n2327r618N6322k6654k5149L1466j4458r87L1524m3095r757
748b5890O9037l2418n4564O4711J0607o1894K9134K1718m3105J9581J9728l7554
760b0909J4488J6605l0245K7030J6573n3917K4621N0489n6817j6594N6695k0517
772G502k4799L0198j8820o616L9115l1539k2055N5589j7993m3519N0499P83n3946
$$ plain form
686 -36714 31300 4747 -39819 28541 30715 -31731 3259 26732 -8483 8159 4459 -24477
698 -24477 20908 17567 -49385 -622 45512 -28890 -27874 33152 -3756 -19771 18504 -7808
710 -7808 -15308 20037 -7449 -12895 23128 -16532 -21740 45396 5197 -46262 27878 37106 -31188
723 -31188 -2219 25819 -10430 2022 4148 -27467 9190 18973 -36256 -5448 29236 -25374
735 -25374 -10838 36843 -15484 -25102 31220 4566 -20583 10883 -3575 -4562 26962 -16133 -25890
748 -25890 43147 10729 -43835 20876 31483 -30411 -1277 20441 -22664 -3083 16645 -20909
760 -20909 -6421 10184 -20061 6969 23542 -30375 -5754 44735 -12082 -28676 28019 7502
772 7502 -17297 12901 -5919 -12535 26580 -4959 -27014 28575 10582 -32937 17562 18345 -35601
785c5601M0441K3454n5506J1943L4682k6636M389R767k5513K8434J8123n3691
797b5714J6191M9072m7321j4371M6669k7579j7141M2785k2609k4291M2003j2787
809D907k5195L8101j5178l0649N0669n247n8214M0384L1004n0532P605K8587k5977
822i735J0697J5414l3884J9021K6647m2893O496L5812m0761l273M6795l6931k4071
835c0666N2094j2549l2805L2824m235k0168L3776j5718l3185M6545M292n1143
847c0938K9119K3525m0523J6621K4007l6337J1364K7737l3408L240K5436l0444
859a0601O264K9324m2646l961N0295l0498k8442M5438p792k7773L1593q127k4759
872b1685L8458n275l8545L4301R344l8831K7503J4420m1492K3172K8213m3304
$$ plain form
785 -35601 4840 28294 -27212 -15269 19413 -7223 -2834 6933 -18580 9854 27977 -25714
797 -25714 -9523 39549 -7772 -22143 24526 -3053 -20194 22591 -18 -24309 17694 4907
809 4907 -20288 17813 2635 -28014 22655 17408 -40806 -422 30582 -19950 -12345 16242 -9735
822 -9735 962 16376 -17508 1513 28160 -14733 -8237 27575 -13186 -16459 30336 -6595 -30666
835 -30666 21428 8879 -23926 8898 4663 -15505 18271 2553 -30632 15913 20205 -30938
847 -30938 -1819 21706 -18817 -2196 21811 -14526 -3162 24575 -8833 -5593 19843 -10601
859 -10601 -4337 24987 -17659 -21620 28675 -1823 -30265 15173 7381 -20392 11201 3074 -21685
872 -21685 16773 11498 -27047 7254 16598 -22233 5270 19690 -21802 1370 29583 -13721
884a3721M570L2982k8291j123K1903l1575M392L5648l7469j3196M5406j9908k2994
897b3376L7444j2400k2884L9183q081l4480L4246O549l3224K4731N992l3841K8524
910H383J5154m4037J6577L1591l6090l44K5495k8485L166K8381l4026o459L8491
923A7797k2936j6067L4163j5710j4501L7646j5878k7849L9838K48l4394K6508
935H865M728l0280K7250O833m0071K3822K3158l8723P106K4093k9063O736K3659
948A8113l5441R12L6400k7997j2731L4669j6628j2081L2595j7813j7968L8626
960B0656p945k9764K9381r47k7031K8653l04l6513K9322J6104m1711J2109K5056
973A7066k8583O264J9000l0137O741K8648l0847m576L3116k1070r514L1552j9271
$$ plain form
884 -13721 -9151 23831 -4460 -5583 16320 -15255 -10863 24785 -12684 -25880 19526 -382 -23376
897 -23376 14068 1668 -21216 17967 9886 -24594 9652 16201 -17023 7708 13700 -20141 8383
910 8383 23537 -20500 -3923 27668 -8422 -8766 16729 -11756 -8590 19791 -14235 -20694 17797
923 17797 -5139 -21206 12957 -2753 -17254 20392 4514 -23335 16503 16751 -17643 8865
935 8865 13593 -16687 10563 17396 -22675 1147 24305 -14418 -7312 16781 -12282 -5546 18113
948 18113 -17328 -16416 19984 -8013 -20744 13925 -2703 -14784 17811 -2 -17970 20656
960 20656 12711 -17053 12328 11381 -15650 13003 12699 -23814 5508 21612 -20099 -7990 17066
973 17066 -11517 -5253 13747 -16390 -9649 18999 -11848 -16424 16692 -4378 -13892 17660 -1611
986a611j4847L7752j1129k6786K8379r07k2643K3285n944k6224L1816L085m0183
999b5957K3560K1432l4854Q999K2005k9429P202K5771k8931j803K7755k1597l268
1012i115K6112k3722n558L6598k1499k3547L6156k978k6362K1660k113k0186K4166
1025I612l958k8357K8505P418l3992K0752J6315l4576J4538K6338l4156n79L0531
1038A8391k0481p486K0553j7118N47K4172k5771q953L7324j5822k4350L0298k634
1051H670k4809K3635k63k4118K1168M418k4108J8888N653k6209K3266J3070l8854
1064a9593J3299L1743l2725p366K9462j5804p926J8890j7235k088K6275k0037
1076c105j1455L0737j4034j9397L1843o830k8591K7644P649k9337J3270R956j7267
$$ plain form
986 -1611 -16458 21294 10165 -16621 11758 10851 -11792 11493 5549 -20675 11141 14226 -25957
999 -25957 -2397 19035 -15819 -6820 15185 -14244 -7042 18729 -10202 -12005 15750 -5847 -9115
1012 -9115 16997 -6725 -12283 24315 2816 -20731 15425 12447 -13915 7745 5632 -14554 9612
1025 9612 5654 -22703 5802 13220 -20772 -20 16295 -18281 -3743 22595 -11561 -12140 18391
1038 18391 -2090 -9576 10977 -6141 -5594 18578 -7193 -16146 21178 5356 -18994 11304 8670
1051 8670 -16139 7496 7233 -16885 4283 8701 -15407 3481 9134 -17075 6191 19261 -19593
1064 -19593 -6294 25449 -7276 -14642 14820 -984 -8910 9980 -7255 -9343 16932 -3105
1076 -3105 -14560 16177 2143 -17254 14589 7759 -20832 6812 14461 -14876 -1606 8350 -8917
1089h917J5238J215k5610K3337J4789l8039R998K9759k9227o154K7979j8630q594
1102a2856K5283j2844j0725K1330j1121p085K4494j7700j6931L5033m866l3560
1114b1548K3632J3500k6383Q994Q732j6915J3745N336k3912J5884J3913k9800
1126a4822R464K3290k9996n10L2473k1456j6198K7973m426j2897J5431r735n724
1139g133K4085j5977j9427L2031k265l0886K1639J0124k6303J2323J2873k1514
1151a0430P503J1614j6940R107Q039k4169J4689K1716l3950k597L5955j7833j7922
1164a5218K5442m486j4325J6818o627j0268K0166r553j7565K4262k672k4046K3385
1177E313P221l0414J3705J9569k1376M20J2256j1709Q198O435k3625J1320K2012
$$ plain form
1089 -8917 6321 7536 -18074 5263 20052 -17987 -7989 21770 -7457 -13611 14368 -4262 -12856
1102 -12856 12427 -417 -11142 10188 -933 -8018 16476 -1224 -18155 16878 12012 -21548
1114 -21548 2084 15584 -10799 -1805 6927 -9988 3757 9093 -14819 1065 14978 -14822
1126 -14822 -5358 17932 -12064 -12574 19899 -1557 -17755 10218 5792 -7105 8326 -1409 -7133
1139 -7133 16952 975 -18452 13579 11314 -19572 2067 12191 -14112 -1789 11084 -10430
1151 -10430 -2927 8687 -8253 854 8893 -15276 -587 21129 -12821 -15418 20537 2704 -15218
1164 -15218 10224 5738 -8587 8231 1604 -8664 11502 1949 -15616 8646 5974 -18072 5313
1177 5313 12534 -17880 -4175 15394 -5982 -5562 6694 -5015 3183 9618 -14007 -2687 19325
1190A9325k8128l414L0869j7812j5812K6530n773j7953J8727j543j5015J3759
1202C760l211j0800J9845p216k2380K5805R924l1043J0462K0094k0412O46J3777
1215I251j3609L554J0893j9380N830J8427k2752j596K6125j9157j3354K9478o785
1228F925k3266J8304N564j4130R210l780r506J9238l244k0706K0444Q150k6341
1241a3138J1102J7426k1281Q31J6848j5667r32J3231j2361O88J2609j7944J452
1254g136K3849k0003j4679K9368k898k2854J5760M829j4458J0283J145j1692J3667
1267E181L67j6541J6062N729k2327J2647J4524k4809J217K1882j4331p063J2338
1280D876q919J138J2118j6633j600K2568j5090j3059K4267m333j9231J8159L763
$$ plain form
1190 19325 -8803 -12217 18652 840 -14972 11558 5785 -12168 6559 5016 -9999 3760
1202 3760 549 -10251 9594 2378 -20002 5803 15727 -15316 -4854 15240 -5172 -4526 9251
1215 9251 -4358 -804 10089 -9291 -3461 14966 -7786 -9382 16743 -2414 -15768 13710 6925
1228 6925 -16341 1963 7527 -6603 2607 -1173 -10679 8559 5315 -15391 5053 13203 -13138
1241 -13138 -2036 15390 -5891 -5060 11788 -3879 -4811 8420 -3941 -3253 9356 -8588 -7136
1254 -7136 16713 -3290 -17969 11399 8501 -14353 1407 6236 -8222 2061 3206 -8486 5181
1267 5181 5548 -10993 5069 10798 -11529 1118 15642 -9167 -7950 13932 -399 -7462 4876
1280 4876 -4043 -2905 9213 -7420 -9020 13548 -1542 -14601 9666 5333 -13898 4261 8024
1293H024j8112J1247N916j3118Q292K403j1280J3610J755k2040J3498J6290k4125
1306g640j372J9254j2766m997J4002r918l383J4276j0985m298J6932j0603r377
1319a0875K1036o192j7820J9662M857k0101Q891Q723j1265N374J785j1020J1856
1332D911M305j9911Q914J2994j9834J570J7333j5083m681J7380q798p925J4145
1345E320n455m934J2747r599o837K0142o198j7505J7548N061j8187Q332O894j2576
1359e247O725M761j3380P407O021j4972O956J0274j8659L550J7662j5706o211
1372a0819J9440o371r286J1990l887m922J2469p525q918J6357l217j4708J3875
1385D478K820j5420R653O438j5501N170Q437j1085K953O085j1910N992R760j6193
$$ plain form
1293 8024 -10088 1159 7075 -6043 2249 4652 -6628 6982 8737 -13303 195 16485 -7640
1306 -7640 -9012 10242 -2524 -7521 6481 -3437 -6820 7456 -3529 -7827 9105 -1498 -10875
1319 -10875 10161 3969 -13851 5811 10668 -9433 -542 8181 -3084 2290 4075 -6945 4911
1332 4911 9216 -10695 -1781 11213 -8621 -7051 10282 -4801 -9482 7898 -900 -8825 5320
1345 5320 -135 -5069 7678 -1921 -8758 11384 5186 -12319 5229 10290 -7897 435 7329 -5247
1359 -5247 1478 6239 -7141 266 6287 -8685 -1729 8545 -10114 -6564 11098 -4608 -10819
1372 -10819 8621 2250 -7036 4954 1067 -3855 8614 1089 -7829 8528 5311 -9397 4478
1385 4478 7298 -8122 1531 7969 -7532 -2362 6075 -5010 -2057 4028 -7882 -1890 7870 -8323
1399h323K003J7341j2752o852J6719n615p979J2253m283p991J1880l609r482J2191
1413E501k545j1162J3007N51j5927J0928P807j5286L636R179j0613K983P285j1767
1427f423M122J1018j3627m96J4548r834m929J4157p466p839J3329l437r605J0054
1441C572j287q085R528k200j0492J2795J934j5292Q744Q039j3189L862Q353j1272
1455d990K904R155j0927jJ0887q969k085J1345q897m125J3778o890q604J2274
1469D855j896q835Q842j426p928J0332o57j1342R806M168j2345O379O085j2097
1483f059N154Q159j2096R52J0736q923j841R698p798k042J1413q209n617J2285
1497E812m102p802J0030k026p235R397j069j0347R555K524j0786O854L911j0615
$$ plain form
1399 -8323 -6320 11021 -1731 -8583 8136 2521 -5458 6795 2512 -5479 6401 2792 -6690 5501
1413 5501 2956 -8206 4801 5352 -10575 353 8160 -7126 -3490 5689 -4924 -1941 5344 -6423
1427 -6423 -2301 8717 -4910 -5406 9142 -692 -5621 8536 1070 -6769 6560 3123 -6482 3572
1441 3572 2285 -5800 3728 1528 -8964 3831 5765 -9527 -783 7256 -5933 -2071 6282 -4990
1455 -4990 -2086 7069 -3858 -3859 7028 -1941 -4026 7319 -1578 -5703 8075 1185 -7419 4855
1469 4855 2959 -5876 2966 1540 -6388 3944 3287 -8055 1751 5919 -6426 -47 6038 -6059
1483 -6059 -905 7254 -4842 -3890 6846 -2077 -3918 5780 -2018 -4060 7353 -856 -6473 5812
1497 5812 1710 -6092 3938 1912 -5323 4074 3005 -7342 2213 4737 -6049 805 4716 -5899
1511e899N900N704j1711L820Q822j0118o32R398p834q74R685p930l250J1108n089
1526A100o731J0013k790o022Q670k379p952R516P74j0232P225L005r702N892M287
1541D674j0371M239P085j0023J081Q280p858L29Q533q840p48J0640p050n039J0298
1556E230l129o404Q354k515o104Q261j528q008P369J196q418O891K348r841O015
1571b83O122j0984K194P850p077L47O286o899P67Q180p929k011R857n436n641
1586d657R458l318o845Q518j083p460O417P24o492N701M96p001P142K216j0071
1601f255N262P293r528O66P453o421k36O705o242p12O997n702k608Q331n507m061
1617d565R081l248p984Q329J008p420M547J748m981M598Q33o982O427L099r007
$$ plain form
1511 -5899 1 5705 -6006 -2186 6636 -3482 -4114 5284 -2550 -3424 6261 -1669 -4919 6189 1100
1526 1100 -5631 4382 1592 -4430 4240 1861 -6091 3425 4199 -6033 1192 4197 -5505 387 4674
1541 4674 -5697 -1458 5627 -4396 -3315 4965 -2893 -2564 5969 -2871 -3619 7021 -29 -5068 5230
1556 5230 2101 -4303 4051 1536 -4568 3693 2165 -5843 1526 2722 -5696 1195 3543 -6298 -283
1571 -283 5839 -5145 -2951 4899 -2178 -1831 4455 -2444 -1677 6503 -1426 -3437 6420 984 -4657
1586 -4657 4801 1483 -5362 3156 2073 -5387 1030 1754 -4738 963 1459 -5542 1600 3816 -6255
1601 -6255 -993 6300 -3228 -2562 4891 -1530 -1766 4939 -1303 -2015 4982 -720 -3328 5003 -504 -4565
1617 -4565 4516 1268 -6716 1613 2621 -4799 -252 1496 -3485 1113 1946 -5036 1391 4490 -4517
1632d517M088O398q818J022P471o913j889P796m774k483N741m421j014O514n270
1647a069m289R563k399q238P650J912p217M143K588n752M049K200o179M073K401
1662C436o978M240M829r100J053Q220o544l327P087k471l270M991l350j881O315
1677C250l969l914Q054j810o810P414J300p461M553L474o728K505L148m879K603
1692G30K101o382L920M603q636M84Q113n580l528O861k389l408N106k138k457
1707b600M850k368l075O556k013o020P042J678q319M170M596o015M94L113l537
1722a448J593K170n332K558M441p175O43O557n002k958P283k531m417N095m11
1737A066l047L266j114k405N684k437n425P201J342q135L545M190n782J021L623
$$ plain form
1632 -4517 -429 5969 -2849 -1827 5644 -1269 -3158 4638 -136 -2619 3122 -1299 -2313 4201 -1069
1647 -1069 -5358 4205 1806 -6432 1218 3130 -4087 56 2644 -3108 941 3141 -3038 1035 3436
1662 3436 -3542 698 5527 -3573 -2520 5700 -844 -4171 2916 445 -2825 2166 -1184 -3065 3250
1677 3250 -719 -4633 3421 1611 -5199 2215 3515 -3946 607 4081 -2647 -142 3006 -1873 730
1692 730 2831 -3551 369 4972 -3664 -3180 4933 -647 -4175 2686 297 -3111 1995 -143 -2600
1707 -2600 2250 -118 -3193 3363 1350 -4670 2372 4050 -4269 -99 4497 -1518 -1024 2089 -1448
1722 -1448 145 2315 -3017 -459 3982 -3193 -2550 4007 -995 -3953 3330 799 -3618 1477 1066
1737 1066 -1981 1285 171 -2234 3450 1013 -4412 2789 4131 -4004 -459 3731 -2051 -1030 2593
1752B593m280L48K935l520R40L629n474P31O158n377k885P891k080n278M807R07
1768B045l610K996r47k273M515j535m935N728J227o907L560M134o686L04N074
1783B690l671j292L696k441J88K873m390Q51N680n282k275O435j317m741M499
1798A503N69l911K890p1k464K717l83l692M365N63o035L804L653o484N65N479
1814C068l589j696L275j501J76K260l254K91M186l386k294N694k111m157N023
1829A985L67m776K350J646k919J688J64k907L319P09n340L198L901n828J26N286
1845B969l579j125L955k140j255K770j920m79L147k884j422M785k147m068M991
1860A598P85n107K129K157l019J547L52k584K774J171m729K661K902m600P76M149
$$ plain form
1752 2593 -1687 -1339 1596 -1924 -984 2645 -2829 -2098 4060 -1317 -4202 3689 1609 -3669 1138 2045
1768 2045 -1565 1431 484 -1789 2726 1191 -3744 1984 3211 -3696 -136 3998 -2688 -2384 2690
1783 2690 -981 -2273 1423 -1018 -830 2043 -2347 -1496 4184 -1098 -3373 3062 1745 -2996 1503
1798 1503 2072 -1839 1051 980 -1484 1233 850 -2842 1523 2086 -3949 -145 3508 -2976 -2411 3068
1814 3068 -521 -2217 1058 -443 -267 1993 -1261 -970 3216 -170 -2464 3230 1119 -3038 1985
1829 1985 2352 -2424 -74 1572 -1347 341 505 -2402 917 1626 -3714 -516 3385 -2443 -2317 2969
1845 2969 -610 -1735 2220 80 -1175 1595 -325 -804 2343 -541 -1963 2822 675 -3393 1598
1860 1598 2383 -2724 -595 1562 -1457 90 442 -2142 632 1803 -2926 -265 2637 -1963 -1187 2962
1876B962l442j914M600j460k151K630j231r73K948k557j438M259j933l498M315
1891A117P02m228K344J818l426J482J738k878J400J328l224J602K338m032M87
1906a432M682l619k115M668j587k123K556o94j349K559j589j892L668j411k843
1921b521L753N61m356K429K341l749Q69J827j920M96J275k574J391K388l912N50
1937a152L776k938j698L947j342k520K975p35j517K356p81j620K637r78k437L172
1953A145K88l752K288J960l196M93K169k258K03J671k427Q00K159k495j1L280
1969B317k621j212L462j201k733L231m39j959K073l82j813K211k43k528K493N45
1985A201l205J517K079k958P93K002k386L6K487j779l47K002k092k31K460j722
$$ plain form
1876 2962 -480 -2394 2206 746 -1405 1225 -6 -979 1969 -588 -2026 2233 300 -3198 1117
1891 1117 1819 -2409 -65 1753 -1673 -191 1547 -1331 69 1397 -1827 -225 2113 -1919 -1432
1906 -1432 3250 -369 -2484 2184 597 -1526 1030 336 -1013 1546 -43 -1935 1733 322 -2521
1921 -2521 1232 1793 -2563 -134 2207 -1542 -673 1154 -766 -270 1005 -1569 -178 2210 -1702 -1152
1937 -1152 2624 -314 -2012 1935 593 -1927 1048 313 -1204 1152 371 -1249 1388 410 -2027 1145
1953 1145 1433 -2319 -31 1929 -1267 -774 1395 -863 -660 1011 -1416 -616 1543 -952 -963 2317
1969 2317 -304 -1516 1946 745 -1988 1243 804 -1155 918 536 -1277 934 691 -1837 656 1201
1985 1201 -2004 -487 1592 -1366 -573 1429 -957 -921 1566 -213 -560 1442 -650 -881 1579 -143
2001a43r78K516o81k358K411K65k557K134m5j928J807K67k260J726Q37k552J371
2018a68J705k641N84K358k206o68K660j502l04J456j301q74K515j566j866K933
2034A115p57j672J765k65j524J558O23k157J369P55k113J394J097k286J055J592
2050A549k380J46K353j808m44J778j545k69J846j443j072K445j112j516K105n47
2066H6j585J918L51k240J528R03k125J290Q37j762R25R15j735M15J738j859j76
2083e76J932j538n24J711j075r79K090q76j081J529k20j532J660N5j863J887K59
2100H59j510P48R55k020R87J095j819K23J747j581m50J599j193m77J497q89q05
2117a034J695o81j160J814n09j343J695N0j536J250M76j561J101M24j445O76Q64
$$ plain form
2001 -143 -1121 1395 714 -1644 767 1032 -1525 609 564 -1364 443 710 -1550 176 1013 -1539 -168
2018 -168 1537 -1104 -520 1838 -368 -1036 1624 122 -182 1274 -27 -901 1614 48 -1818 1115
2034 1115 358 -1314 451 186 -1338 220 843 -1314 55 810 -1303 91 1188 -1098 -43 1549
2050 1549 -831 -685 1668 -140 -584 1194 -351 -620 1226 -217 -1289 1156 44 -1472 633 86
2066 86 -1499 419 770 -1470 58 961 -1164 126 963 -799 126 1041 -694 -279 1459 -400 -576
2083 -576 1356 -182 -706 1005 -70 -1049 1041 165 -916 613 393 -1139 521 576 -1287 600 859
2100 859 -651 97 1052 -968 19 1114 -705 -482 1265 -316 -766 833 -360 -837 660 -229 -1034
2117 -1034 661 -20 -1180 634 125 -1218 477 527 -1009 241 717 -844 257 681 -764 -88 776
2134G76j622R17Q18j446P9J246j063n26J771j108o84J467p85o83J834q49r23J507
2152G26m27j442J589o4j291Q58Q81j329N22Q15j394M84Q43j290J63J192j236m79
2170h79J938j204p65J479n38j079J382J81r78N33J96n95O97J40j369J138P60j584
2188e47M17J117j515K44Q86q02n72J317r62Q9J014j180l43J748p03j126J561l82
2206B61j131J048J39r78J090k40o87P88L74j582R59P79j524L60J261j626J6J431
2224G38q68l23O81n13j08O71k5j017J360n37j115J893k85j383Q21N10j126P24
2242I8L78q37P10K22j200N87Q75j520M7J315j036l76J153l78o14J180m75n85P52
2261B96l30o91J247m07j231J453k1q69N97P68j391K69P29o97M7O08r80M67J019
$$ plain form
2134 776 -846 71 889 -557 -478 768 -295 -821 950 -158 -842 625 -160 -843 991 142 -781 726
2152 726 299 -1143 446 382 -909 -51 830 -499 23 838 -556 -72 771 -519 -356 836 -400 -879
2170 -879 1059 -145 -910 569 31 -1048 334 515 -463 70 266 -329 368 508 -861 277 1037 -547
2188 -547 -130 987 -528 -284 602 -200 -772 545 -417 -328 686 -494 -837 911 208 -918 643 261
2206 261 -870 178 317 -661 429 189 -498 290 664 -918 41 820 -704 -344 917 -709 -693 738
2224 738 -130 -453 228 -285 -393 278 253 -764 596 59 -1056 837 552 -831 -10 500 -626 98
2242 98 476 -361 349 571 -629 -42 833 -687 -640 675 -361 -737 416 38 -576 604 129 -456 296
2261 296 -34 -725 522 115 -1116 337 316 -553 44 812 -579 -310 419 -278 -231 377 -603 -136 883
2280H83j338%J402j056r21J827o12q81J032m30k82N88m5p94J074mj174J026O07
2299I02j458J53J343j512j08J278q64J4N44n20P2Q04j072k09J234m81j006J524
2317F38k84j235J031K94j000P10J20r03J004J52j118R56K26j376L29J195j045
2334c06m85J368n78p69J316j023o1J136p40l64R39k70j124J549M7j569R37P80
2352G83j562O96P53j148K77P66j348J243N19j816N10J320j373l32J215m82m62
2369d41O49j01p96J135n70m91J149l18j108J512P5j399P74O15j488O88P06j204
2387f13O73L37q56P78N75j469J30J410j321k50J381p68p20J281l91o86Q60m34
2405h3m74J016l21p31J312j44j609J320P58j742L92P66r05J95O78r97N13O76j307
$$ plain form
2280 883 -455 -455 947 -109 -1030 797 185 -696 336 -94 -376 212 167 -627 447 443 -731 295 902
2299 902 -556 -403 940 -572 -680 598 -266 -252 292 -228 -156 648 -424 -633 601 120 -886 638
2317 638 354 -881 150 444 -556 154 274 -629 375 527 -591 365 591 -785 -456 739 -306
2334 -306 -791 577 -1 -770 546 -477 -538 598 -142 -506 433 163 -961 588 635 -934 3 783
2352 783 -779 -83 670 -478 -201 565 -783 460 979 -837 -327 993 -380 -712 503 21 -441
2369 -441 208 107 -689 446 -124 -615 534 216 -892 620 695 -704 70 685 -803 -115 591 -613
2387 -613 60 397 -459 319 894 -575 -445 965 -356 -606 775 7 -713 568 177 -509 351 -83
2405 -83 -557 459 138 -593 719 575 -1034 286 1044 -698 -306 460 -445 -250 428 -569 -56 620 -687
2424f87K17J335j422NJ217n70j130J534j48j025J066q6o99J133o54q39J424M5
2442G16j607R29N99j381P06P20j127K15Q76j124J22R94j351L84J025j043m65J849
2460A037r30r83J454k85q09Q97m7q74Q55q2q28J041j08j102R44M90j211Q9J118
2479F66r72m11J313p92m02J266j065K4J236j010o02J596n59j237J763n20r30J165
2497E29j92n82L72Rr87J282M6j286J262M83j930N62J136j200j28J548j072j72
2515c20R00j017M05J104j287n96J637q85p76J602k80j480J240J90q63N18L11j314
2533i11P39P53j356R85M27j281L21J308j499k83J858j262j08J080j026j39J287
2550H93q83p29J347n52j246J748k45j385R56P65j510R69N97j491R27O33j574Q51
$$ plain form
2424 -687 -470 865 -557 -552 665 95 -1035 499 351 -674 392 306 -393 740 86 -753 671 716
2442 716 -891 38 637 -744 -38 682 -445 -230 646 -478 -356 638 -713 -329 696 -347 -812 1037
2460 1037 107 -876 578 293 -516 381 334 -540 315 233 -595 446 338 -764 180 670 -541 -452 666
2479 666 -306 -717 596 -196 -598 668 -397 -373 863 -147 -749 847 288 -949 814 294 -636 529
2497 529 337 -245 127 136 -851 431 477 -809 453 936 -994 -432 704 -496 -624 924 -148 -320
2515 -320 580 -437 -32 1072 -215 -811 826 -59 -835 767 487 -993 247 437 -426 92 403 -911
2533 -911 -172 581 -775 210 637 -644 -323 985 -514 -797 1061 -201 -309 771 -255 -394 893
2550 893 10 -719 628 76 -1170 578 333 -1052 -96 669 -841 128 725 -766 161 794 -780 71
2568G1R34j881Q40J203j647J45J354j269l18J280p78o49J401q68l81J436r55r58
2586a040J554j54j417J286N13j836J177Q44j599P55N30j334Q37P31j368K1J524
2603A024j382n64K032j396n68J519m91r50J230n33p05J625p85j017J520j91j388
2620a020J245M97j423O18P87j286M09J034j447M72J068j569K97J278j322m54K007
2637A191j429n74J329m72j028J718m16j183J462n10j126J332L46j524J162P14
2653I92j724R12N22j386M03J312j604K81J242j585J64J497j656n8J838j284o67
2670h01J281o41o69J723p71j047J466J6j418J169J40j295R01N14j257P44R78j993
2688i60P12J068j325L60J161j688J93J555j354m78J419q91o43J535o52p91J434
$$ plain form
2568 71 1005 -876 -36 1167 -480 -335 1019 -250 -568 712 -66 -715 686 -182 -563 873 -82 -1040
2586 -1040 514 360 -1057 229 742 -1094 83 927 -672 83 613 -721 116 847 -521 -500 1024
2603 1024 -358 -922 1110 -286 -854 665 174 -776 454 -79 -784 841 56 -961 559 368 -1020
2620 -1020 225 722 -701 -83 704 -582 -173 861 -586 -114 954 -615 -318 960 -362 -816 1191
2637 1191 -238 -812 517 45 -983 735 319 -864 598 88 -1038 294 640 -884 278 992
2653 992 -732 180 702 -684 -281 1031 -573 -292 950 -635 -471 1026 -630 -688 1150 -134 -801
2670 -801 480 -161 -830 893 122 -925 541 557 -861 308 448 -847 54 568 -689 55 1033 -960
2688 -960 -248 820 -505 -145 1016 -672 -479 1076 -278 -756 663 -228 -871 664 12 -779 655
2705F55m50j052J310L77j929J186O75j719J088N77j536R70N53j242K09J076j418
2722f70L29J427j596k42J597j080o60J438n65o71J490o97j070J702k49j174J008
2739C17K22j438J332J15j721R74J234j599M41J103j589R4J208j255OJ529j326
2756c53k95J457r57p61J720n71j020J211l32j056J583j52j538J468N5j488J209
2773A80P12j621N07J153j423K76P32q79K73R34j532L51J239j331k63J658j137
2790a71r81J639l05o60J190m07j124J481l97j055J264K0j458J074N60j479Q76
2807F7R33j530K29J075j154L24R41j438R8J031r02j65J464r40j026J905m37j338
2825h63J105N5j094J188J7j277J414o9j819J696M45j433L63J078j192j20J206
$$ plain form
2705 655 205 -847 463 840 -1089 97 772 -947 141 718 -818 152 705 -537 -328 748 -670
2722 -670 -341 1086 -510 -752 845 -235 -895 543 -22 -693 797 100 -970 732 483 -691 317
2739 317 539 -899 433 548 -1173 -199 1035 -564 -123 980 -609 -515 693 -562 -556 973 -353
2756 -353 -648 809 -148 -909 811 240 -780 431 99 -957 626 474 -1064 404 459 -1029 180
2773 180 892 -729 -222 931 -492 -216 516 -363 -90 844 -688 -337 902 -429 -692 966 -171
2790 -171 -1152 487 182 -478 712 305 -819 662 265 -790 474 494 -964 110 670 -809 67
2807 67 1000 -530 -301 774 -380 -56 885 -553 -455 576 -326 -491 973 33 -993 912 475 -863
2825 -863 242 297 -797 391 408 -869 545 476 -1343 353 798 -635 -272 806 -386 -506 700
2842G00r67k30J029r55R8J279j490q6J884j235j202J971l27j293J267r7j088J246
2860E04j05r79Q16jr40J132K71j712J001R93j438k59J729j152k60J128p82l68
2878d22R70j268J85J231o47q98J809p74j174J469O3j072O54L39j228R92J59j030
2896f42P81N68j800P89J321j332m61J546r06m98J235p03m04J233j094k19J451
2913H65q69r48J794p25j149J430J70j322N11O51q94M28K25p30P72M42j683Q36
2931a96J104j694J39J460j022l22J252o74m36R17n78l95R88n75r25J956p42j230
2949i73J511L4j523J002R05j621Q38M11j016O65K97j446J119P09j489J27J633
2966A183j381m34J469o17o80R33n09o06J088n81n52J390m94j183J514J32j748
$$ plain form
2842 700 -267 -497 532 -423 -325 954 -536 -622 1262 27 -1175 796 469 -824 443 346 -742 504
2860 504 399 -580 236 235 -705 427 698 -1014 -13 980 -458 -717 1012 -140 -400 728 -54 -422
2878 -422 548 -720 -535 696 49 -849 960 186 -988 481 544 -528 126 465 -763 229 388 -642
2896 -642 139 707 -1093 -304 1017 -315 -776 770 -136 -634 601 -102 -506 727 -367 -586 865
2913 865 -4 -952 842 117 -1032 398 568 -754 -243 408 -486 -58 167 -563 209 651 -1032 -196
2931 -196 908 -786 -647 813 -209 -531 721 47 -389 528 -50 -445 543 -32 -957 999 257 -973
2949 -973 538 572 -951 51 956 -665 173 584 -432 233 530 -916 203 912 -577 -450 1183
2966 1183 -198 -632 837 220 -460 473 -36 -642 446 -135 -687 703 209 -974 540 672 -1076
2983a076J004P85j544O62R05j225O65N10j329N29Q88j715M79J407j278l56J747
3000A058j259n41J228m95l78R74p86o04J479o05r57J536k0j651J373N71j634N74
3018a37Q74j318M86P70j246L19J020j706N96J262j202n89J740p94j281J729k76
3035B47r08J251n87n79J205m01j034J223K21j461J319K28j650O64J213j247R8
3052a98O47o32j1R82j383L46J047j051n95J759j002p42J128j48q70J289n21n93
3070e48J004l87r91J487k8j538J308L85j460L66J388j274k94J125j024K96R91
3087H06j309L56J005j450j05J849j201p96J504k65j158J107R8j091R53P1r79J109
3105E04k03j122J112L50j621N63J165r69l7J054j008k42J066j146R0J441j562
$$ plain form
2983 -1076 -72 713 -831 -169 736 -489 176 686 -643 -114 774 -941 -462 945 -333 -689 1058
3000 1058 -201 -742 486 -9 -387 587 -199 -803 676 71 -886 650 630 -1021 352 923 -711 -137
3018 -137 737 -581 -95 675 -571 -252 768 -938 -342 920 -282 -871 869 75 -1206 523 247
3035 247 -661 590 3 -576 629 228 -806 417 638 -823 496 724 -926 -262 951 -296 -198
3052 -198 449 -183 -194 788 -595 -249 798 -253 -848 911 -91 -833 295 147 -723 566 45 -548
3070 -548 456 69 -922 565 537 -1001 307 692 -768 -402 986 -288 -582 543 -481 -185 806
3087 806 -503 -147 858 -592 -697 1152 -49 -845 659 394 -764 343 441 -650 303 374 -605 504
3105 504 301 -821 291 641 -980 -417 748 -221 -258 796 -212 -454 612 -534 -444 997 -565
3122e65j33J542o66q30J273l23j270J204J85j229J285K4j210J152j39j243J301
3139C58M38j515O23O96r06k37J621j419J2Q98q87k48J753j345l19J456r77j031
3157a029J825k99j444J373j11q11Q88K88j494R60O31j667R88N73j583Q88Q77j572
3175g19M27J096j117j61J212j011k19J273r67n23J634p49q70J391k57j228J033
3192B45J1j210J070K75j065Q28N84j566Q31O01j147L02J226j596J34J200j050
3209c27l43J188q01j23J198q45n84J483q75n32J440o77r62J275j79j252J231k84
3227C1o64O55L88j116O53O51r67K85N85j095K87J028j066J42Q65p92m81J331q33
3246a13n75J208l17j042J346k6j333J345J23j210Q89L27j584J009P27j239L39
$$ plain form
3122 -565 -698 844 178 -652 621 298 -972 232 417 -812 473 497 -713 439 300 -943 358
3139 358 796 -719 -96 600 -306 -543 1078 -341 -329 569 -318 -566 1187 -158 -477 979 2 -1029
3157 -1029 796 497 -947 426 315 -496 392 680 -814 146 777 -890 98 671 -912 -24 853 -719
3175 -719 -292 804 -313 -474 738 -273 -492 781 -186 -709 925 176 -694 697 440 -788 245
3192 245 256 -954 116 391 -674 154 738 -828 3 604 -543 -241 985 -611 -477 723 -327
3209 -327 -670 518 -283 -406 792 -53 -637 846 -29 -561 879 202 -760 515 336 -916 315 31
3227 31 -633 22 410 -706 -53 598 -369 -84 501 -594 -307 721 -345 -203 662 -130 -611 720 -113
3246 -113 -688 520 203 -839 507 481 -852 493 616 -594 295 622 -962 47 774 -465 -126
3263a26R35j303L96P98j231J35J063j138J3J361j149j55J173p93l94J008p40o05
3281g52J278j60j354J348j72q94J164K6j032P94J34j087O23R24j375J88J265j261
3299c43k48J413q81j60Q91q50l26J474j127m61R88q4r60J395k05j273Q60M47j429
3318h79J205J35j296J005M43j201O18Q52j574M50Q19r39j85J108j018K33J002
3335G78r11k66Q05n89l88J052k02p49O24o6n77Q49R3j180P44M59j140J081K06
3354F23j257P35N58j190k3J179j091m4J109r55J1J187j323k81J364q68l08J052
3372D78o76k45R63j63j219J149M38j250Q00J17j114N44P82j340R30L89j115N21
3390a1P89j287J33R37o53l54J211q99k57R90p12n56J321m37o64R64jj149J018
$$ plain form
3263 -126 809 -494 -98 700 -531 -396 667 -471 -458 903 -246 -401 772 -21 -415 593 -147 -752
3281 -752 526 366 -988 360 188 -706 458 484 -548 246 380 -707 -84 840 -535 -347 918 -343
3299 -343 -591 822 -59 -219 672 -178 -504 970 -157 -618 370 286 -674 721 516 -757 103 550 -879
3318 -879 326 461 -835 170 613 -588 30 882 -692 -242 577 -362 -547 561 -457 -224 778
3335 778 -133 -399 406 -183 -571 481 279 -470 154 88 -489 360 453 -727 17 476 -664 417 623
3354 623 -634 101 659 -531 -554 625 -466 -510 599 -356 -345 842 -481 -762 602 -266 -574 478
3372 478 -198 -443 520 357 -862 287 725 -525 275 392 -722 -178 604 -736 194 583 -532 -11
3390 -11 778 -509 -376 561 -92 -446 765 -134 -391 599 -113 -669 652 215 -449 515 514 -635 383
3409C83K73j243P40K67r74P80K61j171N55O94j193M77J180j576q5J274p47p39
3427h44J354m25n07R44q28k44J193p07m74J086k34j074J358j4j305R82K15q18
3445c42L75M57r76L84O45j084K40J203j270l87J281n88m32J015n12o37R21l42
3463d9k84O69j25r22J432l04j477J444Kj105O34O30j203M69O30j014O05J83r19
3482g04M87J161j361j95J366r10k56J204q41l77J094o73n38J182o83o75R94J27
3500D02j178R49L73j274Q14N77j179L86Q04r85K02O19j033K45R33j327J51J394
3518H73j172k17J307p52r42J199j03r25J330n45q93J215L7j151J286K88j632R75
3536A78M68j332O17M76p32M18L70q61J98P54j163L95J319j531j34J231m40j013
$$ plain form
3409 383 656 -587 153 420 -554 226 487 -684 -129 565 -628 -151 1029 -547 -632 642 -105 -844
3427 -844 510 85 -422 522 -306 -550 643 -64 -538 548 314 -760 598 584 -721 261 476 -342
3445 -342 33 490 -486 -102 543 -541 -301 902 -368 -755 526 -62 -494 521 9 -628 293 -49
3463 -49 -333 336 211 -711 721 417 -1060 384 386 -719 -85 545 -658 -189 441 -573 32 215 -704
3482 -704 -217 944 -417 -612 754 -156 -412 792 -49 -426 668 -5 -543 639 -44 -719 275 402
3500 402 -776 173 546 -728 86 663 -516 -130 674 -311 -109 510 -523 -278 655 -672 -521 873
3518 873 -299 -516 791 39 -903 296 193 -732 598 53 -840 375 412 -739 547 835 -797 178
3536 178 646 -686 -69 407 -325 93 463 -398 -200 554 -609 -214 1105 -426 -560 671 231 -782
3554g82J190p5j102J135k03p77J192j34j334J190J24j367R15R51j546L75R31j190
3572e07P49J64o29O1P78p63j72J401j174p27J551r36j69R16k60r93J020J40r23
3591d73R40j81q89R61M15j577Q87M88j103M30N69q62M97K83o11j55R32p50P3R75
3611H49j135m98J501o26p05J303l84p94Q00j63r71R25N2r10R72k7r81R14M91j309
3631f96M04J080j139L1Q60o39j23R92j077k24J466j049m71J131o16q86J263J13
3649D20j409J233j03j033J055K92j051O41N8j065J131N01j304O56R39j333j29
3666e01J113p90j51J267j052l71J287q50o02J413p45r33J618m31j206J319j15
3683B70j020Q31L97j037P01L98j278P49P03j365O99N44j071L68P99j028j96R59
$$ plain form
3554 -782 408 333 -769 366 163 -614 578 444 -890 300 424 -943 -28 923 -623 -248 683 -507
3572 -507 242 406 -223 -162 616 -147 -319 1082 -92 -819 732 -204 -373 543 283 -710 310 450 -473
3591 -473 467 286 -603 358 773 -804 83 571 -532 -102 467 -395 102 385 -226 -381 551 -199 -126 849
3611 849 -286 -784 717 91 -614 689 305 -489 311 148 -823 102 154 -756 216 189 -792 122 613 -696
3631 -696 -292 788 -351 -320 540 -99 -222 770 -307 -531 935 -114 -585 546 -70 -956 307 420
3649 420 -989 244 141 -892 163 455 -596 45 103 -962 169 670 -634 22 961 -372 -501
3666 -501 612 -178 -329 938 -114 -485 802 -48 -650 763 18 -915 703 272 -934 385 270
3683 270 -750 81 478 -559 142 540 -738 11 714 -651 48 592 -479 -111 688 -340 -536 423
3701D23q75J47Q31o86l61R72l58p08Q90k83n43Q92O3j204J056L48j077Q45N05
3720H77j723P13N11q64L01Q90j167L26Q53j151k0J194q33o76J260m89n46R76n12
3739h0o88J238j63j211J059K91j081P92L17r58O39J81p90L66Q13j285L38J294
3757A072j429J26R14r58J0N17k71n64R14m03n81J217l18q57J090k32j067J436
3775F16j73j300R40L47j166N59P76r25K86O60j038K33R24j018J03O58o55k72P60
3794C15l88l16Q22k37p91J266n63q80J092N2j016Q18M42j387O31P17j327O22P85
3813F57j258M33Q06j061J9J162r20k52J293j141k81J194q20n72J081k10o88J266
3831G08l43j211J284n9r28P25K42j192R96L30r09K90O16j062L35O09o94J8P78
$$ plain form
3701 423 -452 -305 526 -160 -521 451 93 -615 275 -8 -551 341 404 -800 256 604 -473 372 877
3720 877 -846 -133 378 -486 -185 705 -462 -136 717 -434 -454 740 -93 -769 491 2 -544 432 -80
3739 -80 -768 470 307 -904 155 446 -635 157 474 -484 155 336 -454 -88 725 -560 -222 1072
3757 1072 -357 -231 683 -275 -265 252 -19 -583 331 -72 -653 564 246 -611 479 247 -820 616
3775 616 443 -857 83 430 -736 -177 599 -326 -40 620 -418 -185 739 -279 -176 482 -173 -445 315
3794 315 -73 -389 433 196 -595 671 108 -772 320 372 -644 174 616 -771 -140 577 -750 -128 657
3813 657 -601 -168 638 -423 -404 758 -162 -414 879 -262 -543 651 -169 -741 340 130 -558 708
3831 708 365 -846 438 379 -549 176 418 -774 222 552 -357 -67 549 -513 -178 431 -263 -245 533
3850E33r38J39Q98q87k03J054o66n75J302n38o98R78m84o44R93J30q20M50K18
3869B42q81O58O67j302N57Q13j282J97Q39j020q4J388p43o66J295o75n26Q54l76
3888d5n85J110m46n86J039k34q12O00N10r59N53K60r33L63N41q98L83O93r71K72
3908a45P38q69j99J112r05l41J030m53m41Q72l95n86R53m15m41N98J49r46R60
3927B76N6j092O49R94j392L36M73p24J63O20o06M9Q87p46m91J059o03k97Q55l05
3947A61n08P81k98o04P56j19q16J136j63q82R46J61j286M61R64j121L31O36o53
3966a17r8O12n98Q2O58r15N0Q82p20j15P21j40p38M61K85r55P95P4o97Q44j9q84
3988e32R80kj174O30N69j015K94P69q55k1P55n87PP62o11n85J187o12m38J185
$$ plain form
3850 533 -405 -266 632 -255 -458 596 -70 -645 657 119 -579 399 -85 -729 264 394 -426 24 242
3869 242 -639 19 686 -616 -59 754 -528 -331 508 -512 -596 792 49 -617 678 3 -523 331 -45
3888 -45 -630 480 34 -552 487 253 -559 41 551 -408 145 405 -528 -165 376 -522 -139 554 -417 -145
3908 -145 593 -276 -475 637 -268 -609 421 -32 -473 399 4 -582 371 -44 -485 113 262 -684 276
3927 276 332 -760 -111 883 -509 -173 300 -424 -261 359 -247 -198 689 -57 -548 511 -92 -389 466 161
3947 161 -347 434 136 -468 288 169 -647 489 326 -556 390 551 -735 -274 690 -431 -100 536 -117
3966 -117 -215 397 -201 -119 539 -376 -326 556 -164 -279 442 302 -436 25 310 -645 150 224 -473 371 352 -532
3988 -532 448 446 -728 -98 471 -544 -250 519 -336 -357 398 -189 -182 580 -31 -616 571 -41 -479 706
4008G06l73r82J174j66q09N26k0m09O91J85j173Q16M10j035M99K47p55K63Q70
4027F65j025k6Q71m45l59O30l50m02R94o16n10R91k94m91P17j6q45O31J79o97
4047c98L64J34o58O91J52p71M26M32p70J43J224r51m08P91n39j69O43m10q2O22
4067D66o57k85P65k39m40N93K18q72K33N49o52M65n2l57L90L07j073M50O32o82
4087b41k19J058m21n98Q59l35m53P81m09m46O21j95n08Q23J4q71P24Q0o23L57
4107bN05o72J43M95p91K93L83q17N01M64p95L9R69q97k01Q00n33k35P44k08l58
4128a73M82j52p54P65J0n49M65R8p57N70N11p44J15N12p13J66P08q35J06O77j104
4149e96K83R20p48k00R67q21k36N34j8n97Q81r3q26Q27l22m55N96M18r49N88N69
$$ plain form
4008 706 333 -649 525 359 -450 76 56 -353 338 523 -650 166 576 -459 40 287 -468 -205 665
4027 665 -360 -386 485 40 -319 311 -39 -441 553 -63 -573 418 124 -367 350 334 -511 120 299 -398
4047 -398 -34 100 -558 133 285 -486 -60 372 -398 -255 969 18 -390 401 -138 -307 336 -74 -156 466
4067 466 -191 -476 289 50 -390 203 421 -451 -218 331 -321 144 92 -265 125 432 -641 -191 441 -241
4087 -241 -460 598 177 -421 438 103 -350 431 22 -424 197 2 -506 317 331 -540 184 264 -359 -2
4107 -2 503 -169 -26 469 -322 -29 354 -463 38 502 -293 -254 715 -182 -383 417 -116 -351 393 185 -173
4128 -173 309 157 -597 168 178 -371 94 192 -565 5 516 -228 -113 399 -314 -148 560 -275 -169 508 -596
4149 -596 -313 607 -141 -341 626 -195 -431 103 85 -512 369 276 -550 277 -45 -500 96 514 -435 153 722
4170G22j163J42O22n02j20N92n89J85P08r92R5Q02o93j38O89k05k22L23N1o64
4190c57O20p0m96N79j9m64K86R6o99P11R3p92M47N55n95O0M88n45o9M11n78L5
4212c03N91n20J5O29l12l73M02m2n31M43K41n91M34J06o88O49rr29P19M33l44
4233B0m5L10p11p6J101p80j07O36m88K03L06n23p6O95n13m89Q77q3o14M60O6o38
4255d69N89J36n42J59N17p19N04L64r77K98M45m48Q9K50m79M8O74n17m7N18n26
4276a33l04P61q8o92N49m9o15R68k13m03J56L12n71K77L19o33K77L99p45K60K49
4297H1r8m3j38K53k31N55l39m32P38m23n28Q66R1o83M07K66n22L66j18m19J95
4318a56M50n17K23j24L1Q5M06p02M47L93n95J9M91m60k00L94j31j66J87j1l81
$$ plain form
4170 722 -441 -299 323 -179 -299 293 -296 -111 597 -395 -300 502 -191 -329 360 155 -67 256 307 -357
4190 -357 263 193 -303 276 257 -207 79 175 -524 187 280 -512 -65 490 -105 -45 443 -102 -171 240 -338 -303
4212 -303 288 -232 -217 412 100 -273 129 87 -444 -1 240 -351 83 189 -499 150 141 -788 -69 364 20
4233 20 -25 285 -426 -502 599 -181 -288 348 -140 63 369 -154 -230 465 -48 -537 340 257 -357 103 169 -469
4255 -469 120 256 -286 -127 390 -329 175 539 -438 -140 305 -143 -54 196 -283 -235 439 -78 -125 393 -133
4276 -133 -437 324 236 -456 93 44 -571 397 184 -219 -63 249 -322 -45 274 -359 -82 317 -428 -168 81
4297 81 -17 -60 -198 55 -176 379 40 -392 346 -77 -605 261 352 -331 76 342 -180 186 68 -351 -156
4318 -156 294 -223 0 -124 -93 -8 398 -304 143 536 -59 -40 451 -9 -209 185 54 -112 75 64 -317
4339c17O57k57k60N61j61o97K24P08q15L42K99p83L24O53n51MK87k66qL87n42
4360b11l1L59J68m28K63L3k69M7J26m47L60K4l81L43L53o14M70J28n77M27L56
4381D99n47l1J15k62L29K8M8l22L50k87l3L69k13l75L79J96m94N64Q9n38K99q0
4403H3j51J87K41l20m8K41o39K10M42m39j7M10m32J09L33k42j43M12j90o03O91
4424A35k09j09J80O1j35K24R3l70L26J41n15K27K31p34M97K42m11K44Ql02r7N52
4446B79k03k07L65k13l68M34K42p12M09l4n0K25k13j56L03m9l02K57J47k61K27
4467A20M05n96oK28l87K14J61k52J10K21k19m08P66l00l37L00l32KN43j29m53
4488c49N06r2k85L29J77o45N19K23m06l7J24j26q4M25l60j43N29l25j33K14j10
$$ plain form
4339 -317 340 83 -177 384 223 -474 -250 458 -357 -15 284 -499 -175 478 -73 -69 218 -48 -56 331 -211
4360 -211 -242 117 285 -143 120 153 -116 -69 57 -390 -30 -6 -387 -44 309 -305 165 293 -284 143 499
4381 499 -48 -79 36 -226 103 131 179 -143 207 -80 -113 256 43 -332 47 243 -251 313 402 -136 163 83
4403 83 -68 119 360 40 -8 233 -406 -196 246 -193 -210 200 -232 -123 210 -32 -175 237 47 -556 135
4424 135 -74 -183 -3 58 -77 147 240 -130 196 337 -178 49 280 -454 43 285 -126 118 126 -176 -273 279
4446 279 76 -131 234 21 -347 87 329 -383 26 -8 -58 167 -46 -202 101 52 -250 7 154 -107 120
4467 120 525 -71 -77 151 -236 -22 139 -113 -3 218 -1 -409 357 57 -280 20 -312 -310 233 104 -349
4488 -349 157 65 -220 109 286 -359 160 383 -23 -60 64 -62 -146 279 -81 -224 305 -20 -153 61 -49
4509d9j53K76j83l01M33J51l18K87J05n56L08jl66L93K6l12R6M07m06J7L34k77
4531h9M0kJ2k62K71M8p5L59j90j71K19k13j74L42j1l05J75M05m62n0K36l89L89
4554A03N3l58K35K80l70J3K64l67K33K32k59m48O19l25j83K49J83l52L48j28j73
4575a51L25p3l88M38K49m95P3K07m83K22N35o24J18K33j45l76N14j74j01K59q1
4596H2k94M3K93l93L96l93K3L17P7l56l4K60l18L08K91l20j2M29r9n43K75N6j53
4619f5N36p14M3M86n37LM73k39l97M57P6k78L99j99j18K96l49j96K38K02m14L69
4641G2j03k61L12K5k61M63j67m69L78M51n26R3L3J77n94O47m91j32O46l39M7J82
4663A83k35o7J27p8l3j41L32l15J08K50l44J59L36l71M7J36J42j81l0l06J37J53
$$ plain form
4509 -49 -202 74 -109 -410 23 174 -144 143 248 -308 0 -1 -367 26 52 -260 -164 243 -163 -146 188 -89
4531 -89 -49 -51 -39 -301 -30 18 -57 302 112 -59 160 -53 -227 115 104 -201 -26 379 -83 -133 103 -286 103
4554 103 156 -202 33 313 -57 -44 220 -147 86 318 59 -389 230 -95 -278 -29 154 -198 150 22 -151
4575 -151 174 101 -287 151 400 -95 -22 185 -298 -76 459 -165 -47 186 41 -335 179 5 -96 163 82
4596 82 -212 -169 124 -269 127 -266 -243 74 151 -205 -239 21 -297 11 302 -18 -30 399 300 -243 32 88 -65
4619 -65 471 -243 -200 286 -251 -248 225 -14 -411 46 122 -156 243 44 -74 222 -127 -323 -85 117 -297 72
4641 72 -31 -292 20 45 -216 247 80 -389 -11 440 -86 7 40 217 -377 270 -221 -353 293 -46 1 183
4663 183 -52 -119 8 -70 -103 -244 88 -227 -119 131 -213 -54 282 -89 -42 94 236 55 25 -281 -144 9
4685In2l2J01K3n16L40L00k26o2K83j44m7P6r5j01K07k41J85k3r5kL85l86j95
4709c08L51j38J7J44K23l97L56m06m09O25o8l23K41L54l51K94j34k26J86p2O1
4730B0k73M49k82J60K2N3m01O35l76Q5M6k86J65K4P4j20J85r8j88Q9k92J95K73
4753A59J33m89K32K81l30J99L8l89P4K72k19O8P3j70j20L65j30k94L48Rp0j97
4775a57J22k09K61k3J05q3N0r3k4K23k91K06J60j6m71P42p79l6M87n41N91k21
4797Cj89J17N1J21m55M84l11j68M26j26k24J47R0j66J26L64m16j08J84J68l14
4818a96L56o6k82L69o5j13J1l57L02L1j05Q2K83m50m3L23K38m20J11j8p7L36j39
4841A11k00j07K98j26o1J44k06K36J86l09j67J52L5j90L81j07l60M68q8r4o2J62
$$ plain form
4685 9 -43 -75 26 49 -467 -127 173 -53 -115 168 24 -23 53 -42 -143 64 -177 8 -15 -110 -112 273 -113 -308
4709 -308 43 -95 -78 66 289 -108 248 -158 -567 58 -10 -333 -92 262 -89 205 71 -155 31 -41 20
4730 20 -253 196 -86 74 96 149 -252 383 7 92 138 -148 17 41 115 -5 180 82 -106 -17 -309 -114 159
4753 159 292 -197 35 316 -14 185 223 -166 -92 180 -39 29 102 -68 -188 177 47 -247 101 110 40 -157
4775 -157 -35 -244 17 -6 99 16 66 -27 -51 172 -119 87 247 231 -240 502 -277 -313 174 -367 224 3
4797 3 -186 -69 -18 103 -352 132 -179 -347 79 -47 -271 -124 -34 -200 -74 290 -126 -234 -50 118 -196
4818 -196 160 94 -188 181 116 3 14 -343 -41 -10 -115 -33 250 -200 -243 80 318 -102 9 -9 -86 250 111
4841 111 -89 -196 102 -24 -85 59 -147 89 275 -34 -201 -49 -14 -204 177 70 -290 178 90 -4 -66 96
4863I6l09N89m31k45K52K46m52K60P3oo4K09k96J52K2j62n8J70j45pK65q2k73
4886a96M93k76j50J46k70j7K76m3J2p4L64m17K86o0l40L84O0l14R8J53l78Q5K46
4909F8Rj36K49q8m1J29O1j67M4r0j31L90j92k33L48k02m9R0J02o8j90K51k40m5
4933a31M18l92j66N37j99l59O99n05R8O7q2j11K23n5l97M98m5o3K83k05m18J60
4955a45L52j93J05M6l01j2N19n61k0N91l73j21L04j59m4M6O1m89M83j09j96K58
4977D2P7k70n9rK23K87l35j19K31K3m2m1K00m54p0M28k50K03K77m46m7Q7J26k68
5001b06L12n0j79K13J99l56K32q3l45J52L26j91p2K80m62K70J33k92K1M4J4j97
5023b37L73l40j33O01k25m7N2M2j82K13j25J01j82R7k08K92K34o01L25J52n40
$$ plain form
4863 96 -213 376 -55 -300 -48 198 -254 6 79 73 9 218 -78 74 96 -66 -124 46 -99 -106 159 77 -196
4886 -196 297 21 -129 17 -253 -270 6 -37 -25 -99 265 -152 134 74 -266 118 178 -136 -38 115 -263 -178 68
4909 68 77 -59 190 102 61 190 251 84 128 38 -93 297 105 -128 220 18 -31 59 161 93 -97 154 -86 -131
4933 -131 287 -105 -271 266 67 -292 407 -98 0 67 -15 -126 97 42 -355 143 98 35 318 113 -305 -145
4955 -145 207 14 119 165 -136 -148 371 -190 -210 381 8 -113 191 32 -12 34 95 -394 89 -20 -216 42
4977 42 119 -151 -210 -219 4 291 -44 -163 68 91 49 8 208 -246 -316 112 -138 65 342 -104 -151 -64 62 -206
5001 -206 106 56 -123 90 289 -67 165 82 -263 -111 215 24 -48 232 -230 40 173 -119 -98 -54 -40 -237
5023 -237 136 -204 -337 264 39 -8 44 86 -96 117 -8 93 -89 8 -200 92 326 -275 50 202 -338
5044c38L28K68o53N70K0l15n1L20L4m46K62J7l12K97j58J2L65l14j78J45J72l03
5066b58M54J55o50M17K08l57j04L77m42J82J41j01O2j32l04L4N01j77k33O89n69
5087a07j73M51q3n63P50k05m79L65J39k88J17L12m57Q2J26p6K97j71l59M63j03
5108C8l04P1L49k89j95M27p3p2K77Pk72q8K36j96K15J76o37M31j46j39K79K31
5130C26k49l09L28n14L87N11o59J8K77j83J22%k71J48P9l8M7L23l44k22M36n7
5152A56j67n5M2j7K16P5n80L57J91l87m2L82l53n2M05n62M66P9j72l9K89l83K0
5175a31L52k49l27L55K87n90M29k84l52K6N91r3j7K27j39j13J79m02J65M72k86
5196A00l07N81n12k40N58j17j90L90k69j28O22m71n79Q19N3m09L38j60k94K55
$$ plain form
5044 -338 -10 258 -395 175 195 -120 -171 149 183 -263 -1 16 -296 1 -157 -145 220 -94 -272 -127 45 -258
5066 -258 196 351 -299 118 326 -31 -135 242 -200 -18 123 22 84 -48 -352 -318 183 6 -227 462 -107
5087 -107 -280 171 88 -475 275 70 -409 -44 95 -193 -76 236 -221 -139 -13 -89 208 37 -322 141 38
5108 38 -266 -195 154 -135 -330 97 24 -48 229 236 -36 -124 112 -84 131 307 -330 101 -45 -184 95 326
5130 326 77 -232 96 -418 -31 480 -179 -161 116 -67 55 55 -216 -68 11 -27 20 343 -1 -223 213 156
5152 156 -11 -66 -24 -41 175 250 -330 27 218 -169 -211 171 -182 -234 171 -391 75 154 -18 -57 232 -151 -131
5175 -131 221 -28 -355 0 287 -303 126 -158 -510 -484 107 14 -3 224 85 -28 151 -251 -86 386 100
5196 100 -207 374 -138 -378 180 63 -127 263 -6 -134 488 17 -562 257 310 -99 239 79 -215 40
5216D0o0j69PM36k08o6L63l98j23K39k06P1N12n18j88L94q2r4L33l84l1J79o7
5239b0j67L39j99j25N31j96m25L44J22l30K39K05m47j18M78l92J42J09j16k80
5259c06M87j7o63P04o0n32L03K1J28L74l35m68K70L9n07Q26k64k78L43N8l23M47
5281B47O4m63M9K59l40j17M64k88M18L2l44l24N80lm43J98L33l52J32j05m46O17
5303A68j02l05L84o4l74L94J52k79k1L02j83k05J23j58L3K34j34K7J66j64j72
5324a78N04k67n6j4R1k26L31L0m99P10l10l62M81j24n7j73J80k68J85J42p7k32
5346a89L64l04j37L14k21N3J66J32n32M68j33k25K39K42n13K75J21j1l8J95m48
5367a82J41j87j76N65r7j11R1J44l47K28K6k45J33j18N9j15L77j66k02K32Jj61
$$ plain form
5216 40 -20 -189 -182 254 46 -20 343 -55 -178 61 -145 -74 438 -80 -268 126 44 -50 283 -101 -132 47 -20
5239 -20 -187 152 -47 -172 359 163 -262 82 204 -126 113 318 -129 -247 231 -161 -19 90 -26 -306
5259 -306 181 164 -499 205 145 -387 -84 -63 65 439 104 -364 -94 -55 -562 264 0 -278 65 123 -200 247
5281 247 311 -152 -103 156 -184 -301 163 -125 293 325 -19 -343 237 234 -209 -11 322 -30 102 -3 -449 168
5303 168 66 -239 145 81 -293 101 253 -26 -47 255 72 -133 -10 -168 -135 99 -35 -8 158 -6 -178
5324 -178 326 59 3 -11 80 -146 185 215 -284 426 116 -246 235 111 54 -119 61 -207 -22 120 43 -189
5346 -189 175 -129 -266 48 -173 -120 46 178 -354 114 -19 -244 -5 237 -276 -1 120 109 71 266 -182
5367 -182 -41 -228 -404 161 64 -47 44 188 -159 69 95 -150 -17 -135 -76 -191 186 20 -182 50 51 -110
5389a10Q4J85j64J85k59j81N16J61o16K22K39l71J12L07o04J94K45j63l92P70
5409C60k12l11N00m36k8J06J80m41K94P3l37J63L09m96J09N76m11M1Q9l58J80
5430e0L00m67J89L44m47K6J4Q3OR4M0l03N94l00m61O49l21j53L99m1m60M19K96
5453D50p02L59J88o36K72L92l67j2J10p8o4M92n63K01M10n42Q9M83o21k68O47
5474B40m50k75P78q0n15L58M22o43J79k7j82L83R3p51N46K87n69L73J60l99J87
5495A15J9j74j46N56n79j74M97p8k05L10k66J37L22o5o94M77K04p63M11M02n46
5516b40J97J32m55J23K72l89K46L40m63L67L5m54J10O23m98j50N03j48k70L12
5536A93M1m34M53J24m76M18Rm72K85K83p24J58N50o47J37N61o26j6M72l86j21
$$ plain form
5389 -110 -26 159 -5 180 -79 -260 256 417 -199 23 262 -109 3 310 -294 -100 145 -18 -410 360
5409 360 148 -163 337 -99 -127 -21 159 -282 12 85 -252 -89 220 -276 -167 409 -2 39 128 -230 -50
5430 -50 250 -217 -28 316 -131 -105 -91 -8 -2 92 132 -171 423 123 -338 311 -10 -163 236 195 -265 154 450
5453 450 -252 107 295 -341 -69 323 -44 -56 54 -24 -88 404 -159 42 452 -90 -1 482 -139 -407 240
5474 240 -210 -485 293 213 -302 56 478 -165 14 -13 -195 188 281 -470 76 363 -206 167 327 -72 115
5495 115 134 -40 -186 370 -209 -383 114 36 -169 141 -125 12 334 269 -425 52 256 -507 -96 306 -240
5516 -240 -43 89 -366 -243 29 -360 -114 226 -237 130 165 -289 -179 444 -54 -204 299 151 -119 193
5536 193 234 -200 253 377 -99 319 328 -144 141 424 -300 -142 408 -239 -102 459 -167 -183 289 -97 -218
5557b18L69l96J17M98n25j66N57k12k75L95O6o53N66L10q62M80K74m86J80M52
5577D71r88L49N28o26L12K39n45L87j20m7j57O30o79K98K06l76k56L57j21j69
5597c07M96l86k21O04j33q1j30L95m65L03K96p60K14N80m48j88N86n02L17J15
5617B85n26k32P22k62j76M80m75k01O41k65j66K39k6m60O07J6n85O35J08o06J32
5638a15O08o65J17L88m65k36N43n21J12R34q13o2Q03p88m56P58o7o17O18K1j54
5659e7L91k42l76K22L82q18O95K33p89J74N32o68m6P74p23Q6O00m67kN41l96l68
5681c22P75n19l76O35J17o59O40k16m85M91K78p65N68N5n13M09K11p06M48M6n36
5702d24J6O98n64R6M74k81l63N65k26k99R22o65j76M70k15m07O55j39j96K89N1
$$ plain form
5557 -218 151 -245 -128 370 -155 -321 236 24 -251 144 210 -443 123 433 -429 51 325 -161 19 471
5577 471 -517 -168 360 -266 46 285 -260 127 7 -40 -197 433 -246 52 258 -118 -374 -17 -138 -307
5597 -307 189 -197 -418 186 53 -28 -158 237 -228 75 371 -389 -175 405 -43 -231 355 -147 170 285
5617 285 -241 -473 249 -13 -189 291 -184 -385 256 -9 -175 64 38 -422 185 201 -384 251 359 -247 -115
5638 -115 493 -172 -55 333 -132 -368 175 -346 -234 700 -113 -175 628 -160 -616 142 75 -542 76 97 -57
5659 -57 334 92 -284 -62 320 -498 197 430 -359 -185 347 -321 -367 407 -316 -230 370 -97 -99 442 46 -322
5681 -322 453 -66 -442 193 310 -349 291 75 -410 81 359 -406 162 217 -296 113 324 -382 66 112 -424
5702 -424 -408 290 -274 -178 296 15 -348 217 -9 -308 614 -51 -227 243 28 -379 276 137 -59 230 281
5723B81o69O56l4m75N46J63q08N16K33n68k3L34j43lJ91l03n0M21l36j75N43k99
5745bl83Q29j84q52P67q0n24M90K54m20k29M63k81Q9K47l17NO81p29l6N61n26
5767a77r5L95j74k42O42k50l88P03l15m85Q51k77l05M0J09n46M54O81q82J93M98
5788D30p33K32M14n08J84L85n99l0O66l61l27P34m75n55R15m14l97O07j20m34
5808c86O16L2r17Q53Q0p22L76N51o21K3M79o57K14K86l94J44N80o73Q9N07l45
5829A15j18K63j64m36P51j66p96J044m45n10N58M46j038O23L7q01O92P5m63M78
5849A45J97o29K70N50p87k8P16p90P7R69j062r4J078n58j85O47o38l25P46k14
5869H5l4J58K03o29P15j60m54O4N85j160N26N60o75J23K83m16j03P50n68j18O67
$$ plain form
5723 281 -388 268 234 -241 305 468 -340 176 409 -159 -182 152 9 6 197 -106 -156 265 -71 -246 297 -2
5745 -2 -385 444 260 -592 175 95 -429 61 315 -105 -334 129 -152 -63 184 -133 -128 553 -176 -212 349 -177
5767 -177 -272 123 -51 -293 349 99 -289 414 99 -386 465 188 -117 -77 32 -514 -60 621 -261 -68 430
5788 430 -303 -71 343 -165 19 404 -195 -225 441 80 -247 487 12 -543 372 -42 -439 168 48 -386
5808 -386 230 262 -655 198 278 -444 -68 483 -138 -115 364 -293 -79 207 -187 -43 537 -136 -47 460 115
5829 115 -3 260 96 -340 411 245 -551 493 48 -462 96 542 -496 127 164 -637 55 130 -333 145
5849 145 342 -287 -17 533 -254 -282 434 -356 -279 690 -372 -466 612 54 -131 516 -122 -447 299 85
5869 85 51 209 412 -217 498 338 -116 -52 533 -627 -101 459 -216 -93 190 -226 -329 421 -147 -265 402
5890D02p79j9P83k79m69O62j87q34J229l67m07M78Mn67M30J12m84L48L09p41J16
5911b60O03o01K29P16q47J90K55l14k98Q25o05l07O93l07l83M94J25p04P14p4
5931A44n12K52M52r25N93M59j013R58Nj025N50M97n01k21R52p13l59P88l77l75
5951c71P32o60j77Q55k56n42N97k96j58M94K25q47L86K63o13M25L35p44M50M82
5971E80q11M89mo03J93N14m71k84P62m08j82P59m63k87N38m06l19Q79l48o58N12
5992a8L75p54M80L96r30K24L75m84L85L48p33L26N46r13K20L92j47l72O49l46
6012A9m61N78k95j08O25k08n98N62M19j034Q56k00p14O74M24q27Q0O09n65p7O49
6033D08o93J5P75o30j54O03j57m79O78m04o28R91m23k96N11J40p09O74P9p12O15
$$ plain form
5890 402 -377 -396 387 108 -361 301 114 -720 509 142 -265 213 217 -350 80 192 -292 56 365 -376 -260
5911 -260 343 -258 -29 687 -160 30 285 -29 -327 498 -107 -414 279 -28 -411 83 208 -496 218 144
5931 144 -368 -116 336 -589 4 463 -550 408 413 -612 -62 435 -66 -287 665 -48 -407 381 4 -371
5951 -371 361 -299 -476 379 123 -419 178 -118 -276 218 443 -404 -18 245 -368 57 392 -352 98 580
5971 580 -231 258 254 -349 -156 358 -113 -397 365 -43 -225 534 71 -216 322 -84 -403 476 128 -530 -18
5992 -18 357 -397 83 479 -451 -227 148 -336 49 397 -336 -10 536 -377 -157 235 88 -284 365 19
6012 19 -442 136 -159 -267 358 150 -448 114 533 -501 355 155 -559 115 539 -288 -208 401 -164 -241 408
6033 408 -285 -270 505 -125 -279 324 167 -312 366 -38 -666 325 -98 -394 117 257 -452 222 301 -411 204
6054B04np83N19N32o98L03M44q93M32L37p17j0P25n16j83P16o62j18O91k30k61
6075a73N34j68m06N81j70o16Q96l09o51N45L09q96O45L56p41J77N78p23Q7N63
6095D18n98K2O19n62l01R57o66o38J163k20k71J64j7m45P72j41p25Q31k13n31
6115c82L40M49k65k14L74n54L17K18n59J26M45n46k57Q09l65l14R14n17m08P20
6135C31m51j76L52L42p87P33k28p21P38J69p60M53L05p17N06K00m67K21N09q31
6155b79K22L47l89j85R11n73m58Q28l49m35P79k88n06O17k57k52L12L67p52L76
6175C6L58o29K48K92o33M19K73o67O22J36o79j94O78k71l68O58l38k56N74j85
6195G4k70O93n39j70M19M5m81K87J15n98O35K91p94K86K27o16K47M09n57KN70
$$ plain form
6054 204 199 -584 -65 467 -231 72 516 -377 55 392 -325 -335 390 -126 -309 407 -255 -373 318 88 -173
6075 -173 361 193 -213 368 198 -418 478 169 -482 63 372 -524 121 477 -264 -87 491 -232 -145 418
6095 418 -180 -158 461 -101 -402 555 -111 -749 414 194 -77 87 70 -375 397 256 -469 362 149 -382
6115 -382 -42 407 142 -72 302 -252 65 283 -276 -150 295 -251 -508 301 -64 -378 536 19 -389 331
6135 331 -120 -296 56 398 -389 344 116 -605 133 302 -458 -5 300 -417 89 289 -178 43 552 -279
6155 -279 -57 290 -99 -284 627 54 -404 424 75 -360 419 131 -375 242 -15 -267 45 412 -340 36
6175 36 394 -235 13 305 -328 91 364 -303 319 455 -224 -418 260 -11 -379 279 -59 -315 259 74
6195 74 -196 497 -42 -212 207 252 -229 58 173 -425 210 501 -293 -7 220 -396 -149 260 -297 -295 275
6216B75n75J74M29m62p9M12m28l0O23l67l63O40k02n01L80K89n94M77J44n55K93
6237b0K99m40P0L81l52j35M39n15O1O23n58j64M88m14KM96k78k25N81k10k75L42
6259A96l5o04M88p7l16L88K89p54N45K6k63%L43k55j85O83n99j01P32p11o8P30
6281D52n70m00R75n57j16M16k10n87N82J53l95N51k2m39K11O9m41N69K08o64n1
6302b66M37m62J86M52p31L81L09l13k74N59l77l90R40m59r0L06J08p33O68j26
6322A25l23J54M47p50K98L04k37j37N13o53J00N19n82o1N32k05k70N93k87m38
6342c58M92O3n11M87k03k52N74k38m77O39N7l68J66r1j98L69K82p17L22M18q57
6363d01M22K26n23kL92k16m22J048n67k35O03m51k53M30J19l45K50J71o71M83
$$ plain form
6216 275 -300 -126 303 -159 -238 174 -254 -284 339 -28 -391 249 47 -454 -74 215 -379 98 242 -313 -20
6237 -20 279 -161 -91 290 -62 -197 242 -273 -212 411 -147 -311 177 -237 -235 261 -17 -242 339 129 -146 196
6259 196 161 -443 45 -32 -348 40 329 -425 120 146 -117 -117 226 -29 -214 469 -130 -231 501 -210 -278 452
6281 452 -118 -518 457 -100 -216 200 -10 -597 -15 138 -257 294 272 -167 44 113 -328 241 449 -215 -266
6302 -266 171 -291 -105 347 -384 -3 306 -7 -281 278 -99 -489 451 -8 -98 208 316 -417 251 125
6322 125 -198 -44 403 -347 -49 255 18 -119 394 -259 -159 360 -222 -283 249 44 -226 367 80 -358
6342 -358 134 197 -314 173 -30 -282 292 54 -423 216 273 -95 71 -20 -218 151 433 -284 38 456 -401
6363 -401 21 247 -276 -278 114 -102 -524 524 -43 -278 325 -126 -379 51 170 -175 75 246 -425 58
6383E8J29l48L29Q7m32J01J73l11J7N11m20n0L31l69K96L92n72j47N99m60P0K03
6405A87r7k65L83K24m54K78O4o91M51R1l69M11J07p82N46M76r46M03J55l49J42
6426c5J25j78j25L54k58l8K48O1l95L21j0l36N20m79K26J8K03o19M21J04m89N36
6448A75J15p14L80K60l66J25K66m67K60K15m25K3N07n52r8M01q6j88M73j28n33
6469c57O86j27o18N62j40m30N67J04o28M10J66l96R9M44n61J76L46m52j23L54
6489H2k20J53L24m86j18M14j04j20M7J20l04L37k05j70M38J60n09R3O74p04Q8
6510a0K70m85m3N49n04M7L70n88J43L93k66j85N95l62k55O60l54k32L69J21n25
6531b92K65L22p78M86R5l24K30R9l29J95N61p48L52Q2l25K1J93k51p2M50l28l2
$$ plain form
6383 58 187 -161 168 255 -177 -76 97 -214 -197 314 -106 -156 175 -194 102 494 -78 -225 374 -86 -16 187
6405 187 90 -175 208 432 -22 256 320 -371 80 171 -198 213 320 -462 84 560 -386 17 172 -177 -35
6426 -35 90 -88 -213 141 -117 -155 93 154 -241 80 70 -266 254 -225 1 19 222 -397 24 128 -361 175
6448 175 290 -424 -44 216 -150 -25 241 -226 34 249 -176 -153 354 -198 -296 105 19 -169 304 176 -357
6469 -357 329 202 -416 146 6 -424 143 247 -381 29 195 -201 -102 342 -219 -43 303 -149 -272 82
6489 82 -138 15 339 -147 -265 149 45 -75 -28 92 -212 125 -80 -250 188 348 -161 -68 606 -98 -10
6510 -10 260 -225 -268 281 -223 -176 194 -394 -251 142 -124 -309 286 -76 -331 329 -25 -257 112 233 -292
6531 -292 -27 295 -483 3 98 -226 4 103 -226 -31 530 -218 134 216 -109 -88 105 -146 -218 232 -96 -128
6553a28O49m90l1L08j89l73L82J19n59M66J75n33M21j44l43M79m11l00M40O78
6573F16r40K51J65j99j43O67l59l31L73m59Q1O03k58l80N16j0n69M09nm37L16
6594i3M77o49L10K33p02K34K86n61L06K56n84J28P40m94l79P55k98r2K81N6n93
6615c83P07l27m04O67l66j7K51l7n65O91R5n07J83K97n73J34N72p36K91K99m40
6636a68J89J94k88J8N89p81R4M23m15j71M91n0j39K82j17k81L76j24m93M84j18
6657ek22J57L14m76J33M91p16K49M83p69K77M73o14L56J81n16k30P74k74j82L27
6678B11m93J43L46P6n24M90j92K0j90L14l54K68K69n15K12K39m38oK46k79k22
6699c79P91k87k49N37l13l37L94n6m63P09l87j28K36L7m09L20r1j99M76j14k82
$$ plain form
6553 -128 521 31 0 308 119 -254 128 247 -312 154 329 -204 217 73 -270 209 -202 -502 -62 616
6573 616 -324 -73 92 -107 -250 417 58 -273 100 -359 -278 325 67 -313 203 193 -376 33 28 -409 -93
6594 -93 384 -265 45 278 -424 -190 96 -465 -159 97 -487 -359 381 -113 -492 263 -35 -127 154 210 -383
6615 -383 324 -3 -407 260 -106 -123 128 91 -474 217 312 -195 -12 285 -288 -154 418 -318 -27 272 -168
6636 -168 21 215 -73 -55 534 -247 -153 270 -145 -316 175 125 -14 268 151 -130 246 122 -371 113 -5
6657 -5 -227 -70 244 -232 -99 392 -324 -75 408 -361 -84 389 -225 131 312 -204 -434 340 66 -116 211
6678 211 -282 -139 207 283 -241 249 57 77 -113 201 -153 115 384 -131 81 320 -118 -124 122 -157 -379
6699 -379 412 125 -124 413 100 -237 157 101 -362 347 -40 -168 68 105 -304 16 -75 -274 202 88 -194
6720a94J56J82n76L82K35l17J43L14m41j0L28l59J78O9n6l03K51J16k95K68J08
6741A79l49K70K90p04K75Q9j66J58J57n92M59J35k68k11L01J88k17L9k81J24M
6762a20J40l80M64%o19O31k53Q6rr6J0K60J45m21L86M5o27N38j24m04K98K24p08
6785e34M60L84n34J18M18k43j16J68q5l04P41o18n8K51j74j84K56L53p68M44K15
6806A90n74L6M75k16l5O19n59k91P59m76n4L25l47j70K03j5P3K47o9J11k5J9k77
6829e1qJ65m50P90q7l99M3J84m73K47R8k67k6K97l77K46L28m42n0K49j09k96N40
6852A52l18J14L17j51m75L16J32o96O31K67l38J88l2k57K89R5n84L15O1l38N9
6873b53L11j35L4L25j71m98O17n2l71M76j14l34K56q1j61K80N4k91L82j18m62
$$ plain form
6720 -194 -38 144 -432 -50 185 -132 11 325 -116 -126 202 -157 21 90 34 -269 -18 98 -197 71 179
6741 179 -170 100 390 -314 -39 50 -116 42 199 -393 66 201 -67 -278 23 211 -6 33 -248 -124 -120
6762 -120 20 -360 104 104 -515 116 -137 -51 -60 -156 -146 114 259 -162 224 269 -358 180 56 -348 -50 174 -534
6785 -534 -74 310 -224 -106 312 69 -47 121 36 -268 473 -145 -203 48 -126 -310 -54 299 -469 -25 190
6806 190 -384 -348 127 -89 -124 495 -64 -355 404 -72 -126 199 -148 -318 -115 -130 -57 190 121 232 207 226 -51
6829 -51 -59 106 -344 446 359 -40 3 187 -286 -39 59 -208 -234 63 -314 -68 260 -182 -232 17 -92 -388 152
6852 152 -166 -52 265 114 -361 -45 87 -609 22 289 -49 139 107 -150 139 234 -350 -35 26 -312 -253
6873 -253 58 -77 -43 282 111 -387 230 178 -193 283 169 -165 91 10 -151 129 183 -108 274 156 -306
6894c06L24M0k08J64J46l56L15K00m31J30N0k15L4J07K5k03K17M7m15O52l7p35
6916d55O84l16n7Q1M21n90K85J52k89J88R3n42L92K19m18L74l0l02k8L34k26P
6938b3K11j13m17M73j69j70M55k46j44J02K92o49L51J10o89P07J89m29K35L16
6958C92n96Q8L01m44J06M50n67J8N19j73j45K88l88j35M77j8m38L05k18J70K74
6979B66l34k19K84L3k97N24j20m57M03L46m53k02K24r6j53O12n37Q3L00k29q5
7000a07N3J26l51J61J00j40K54j54n5J26N1j11J15L7j81M01q0k56L51l95o8j11
7022b34N28l21J5M23p42K28K88k00J16J64m27k7J27J83k60K47k43o1L04m3k07
7043a42M21j67l80K31K67l48R4K01l58j50O74n82K23J86l15K3K15j63j74M51j43
$$ plain form
6894 -306 18 58 -150 14 160 -196 119 319 -112 18 68 -147 -113 -6 19 -184 33 80 -335 317 280 -455
6916 -455 229 -87 -144 -63 358 -232 53 205 -84 104 197 -345 47 266 -152 222 192 -110 -138 196 -30 -23
6938 -23 188 75 -342 131 -38 -208 247 1 -143 -41 251 -398 -47 63 -626 81 270 -159 76 392
6958 392 -204 -116 185 -259 -153 297 -270 -252 267 94 -51 237 -151 -286 191 173 -265 40 -178 -8 266
6979 266 -68 -287 -3 30 -267 257 137 -320 83 429 -24 -226 -2 -98 -251 361 -176 -93 207 -22 -107
7000 -107 -54 72 -279 -118 -18 -158 96 -58 -113 13 64 -47 68 105 -76 325 245 -11 340 -55 -123 -234
7022 -234 294 -27 -12 411 -331 -103 185 -15 101 265 -162 -189 -62 121 -139 108 -135 -196 108 65 -142
7043 -142 279 112 -268 -37 230 -118 -24 177 -181 -331 343 -239 -16 170 -145 -122 93 -70 -244 207 64
7064F4l57M50k41j00L12q6p3K20j49k20L24J75m94K55R7l34K79J93j76n1M85m70
7086A03l8R6p3k01K4j1j56M23J22m65J75P5k40N92m95j51J91K45o82N78R8n27
7108c17N28j41k22J6L44n88K7M81k59l1L24k03J09J38k73k77O69k86k06J77n2
7129d2j87L80J53k53k37L10o5j06L29o95K84K20k22n1M66l44l0N80p00J71K57
7150B18m73k25Q12m50R0M72m24l66N19l97N4M95n57n4M35l35P8N8L7j59J70L74
7172C72n56P9M57k54k40K66k87J20N55m93n3O9R8k77L09j21j85L57K2m03L00r
7194A26m38J90L92l66J63l06J82J58j5J46j68Pm04K16K70k43q6K56l55Q4M83N1
7216C43m81K79l44K1L32L3p19P06j49k75J17K30j19J00j01o8R4L34m60K37J44
$$ plain form
7064 64 -293 157 -84 -184 128 42 -31 189 40 -180 144 319 -175 80 177 -157 122 315 139 88 573 103
7086 103 65 161 88 -113 -89 -100 -256 167 289 -176 -1 74 -166 426 -69 -220 -29 216 -466 112 210 -317
7108 -317 211 70 -152 -136 208 -380 -353 128 -131 -162 162 -41 68 206 -67 -344 325 39 -167 10 -42
7129 -42 -229 151 304 51 -186 124 59 -47 282 -413 -129 91 -131 -182 284 -60 -90 490 -210 -39 218
7150 218 -255 -480 332 -118 -28 444 20 -346 173 -224 -170 325 -232 -286 149 -186 -108 -50 -13 -172 -2 372
7172 372 -184 -105 352 98 -142 124 -163 -43 512 19 -34 35 133 -144 165 44 -141 216 238 -165 135 126
7194 126 -312 -122 270 -96 67 -239 -57 101 86 232 64 71 -333 -117 153 -90 -176 80 -275 -191 292 343
7216 343 -138 141 -203 -182 150 183 -536 170 21 -254 -137 93 -26 74 -27 -95 -1 333 -127 110 254
7237B54m09J0K35j70l9K92l86n7J25R0j85L23N8m24M08J7k15J44J89m64L39J25
7259B60j76L4K19p89N40K03l78J30Q9j49j48M20l56j61M23l4n79P72k36m20N69
7280B33j44k63N0K13o86O06J63n43M48q0j61L32M5l40L9j3j83J57K57l15Q2K32
7302A29Ol83M54n25K72K38k5k91K23j9l25N47kn42L26K6k59J4J13o4J34K18k39
7325B6Q5m3k95j16O59l82j98N67k35k94K96m1k96K49K12k47lO7j36M05q4k60J85
7348A21J94o15K43K73n73N09J61l47J30J71l47k60M37o5Q7K0m02j35N45k08o6
7369a27K65K7m12L37O8m89N48k5m01L10J49k22j33K22j55k71N60l35J61K90p60
7390c93Q2M42k46j59L38j85j76L67J70m30N84%n87L30l7l70N37j80m25L73J58
$$ plain form
7237 254 -155 -145 90 -80 -119 173 -213 -270 -145 -55 -240 83 141 -283 125 142 -73 71 260 -204 135 260
7259 260 84 118 337 -452 88 291 -87 43 132 -17 -165 255 -101 -262 161 127 -452 320 84 -336 233
7280 233 89 -174 -124 89 -597 9 172 -371 77 -3 -164 168 213 -127 -88 -101 -284 -127 130 -185 -103 129
7302 129 135 -248 206 -319 -47 191 166 -125 98 79 -246 301 299 -243 83 109 -150 -136 -23 -87 47 265 26
7325 26 111 68 -227 -343 316 -66 -264 303 68 -226 70 29 -267 -18 194 -53 -56 11 -125 280 196 -64 121
7348 121 315 -300 -57 216 -357 152 313 -34 96 267 -80 -340 97 32 119 139 -263 -398 147 -61 -127
7369 -127 138 165 -247 90 158 -331 217 192 -209 101 250 28 -105 117 -38 -309 251 -84 77 367 -393
7390 -393 -311 131 -115 -274 64 -121 -297 70 240 -190 394 394 -193 137 100 -270 267 87 -338 35 193
7411A93m08J95j7J47j34K43n98J72L89l07j23O25o52K05J91n0k31L79l25k09L22
7432Gj5j55kL98o93O79J07m26K99j41m49J43M18o05K29K42o2k30M33n59J71O53
7454D42o85k47O45k37m4K43l73L8L09j1n17N70QJ6j71n3l83N42K84l69j36N21
7476C92n89J72J79l34K71J85j99j03K91mm95K01p8L6M03k2n32N33n0m20L30Q3
7498B50m30M72r4l53J47J30l48J66J75k40p4N39n35K13L17j57j62J8qk39L75j22
7520D0j97J38K86o43L49J45l19L52r3n04K95M47p39N13j20j42J66J72m24Q5K48
7541E5Pl84M50k66P1J76m07p6N51j90k66M24K0m67N15k00k75K92J01j44n3M38
7563C72l73p0L47k84j39M97o45J50J70r7l34N14m3l91M80m3m75M30k3k01L98J07
$$ plain form
7411 193 -215 -20 -37 110 -24 219 -379 -207 182 -125 -248 377 -275 -70 121 71 -160 219 -106 -315 7
7432 7 -8 -163 -165 233 -460 219 326 -100 199 58 -391 -248 170 -435 -206 36 -26 -256 177 -382 -211 442
7454 442 -243 -490 155 -82 -126 117 -256 -218 91 80 -437 133 141 157 -14 -67 -450 92 376 7 -129 392
7476 392 -197 -25 154 -180 91 276 77 -26 265 261 -234 -33 -111 -75 328 306 -226 307 257 -163 167 250
7498 250 -180 292 198 -155 -8 122 -226 -60 115 -125 -199 340 -195 18 335 178 16 34 26 -213 162 40
7520 40 -157 -19 267 -376 -27 118 -201 151 58 -446 -151 296 -443 70 -50 -192 -26 146 -278 -193 55
7541 55 62 -322 128 -138 -67 109 -298 -374 177 -13 -279 145 165 -302 213 13 -262 30 131 -13 -66 372
7563 372 -1 -71 276 -8 -147 350 -295 -145 25 -72 -406 108 65 -326 154 111 -364 66 43 -158 240 347
7585C47m10J37j22j31j89M99l21J5K66m01L83J43j75r0M95k88j52J07J35o5R5
7606B78j67l65L94j42j88J61J30m06L48q2k50L82J73o16K70J34q9L3J82m10P0
7627a60M65m04j44M54k36k61M15q0k05J90k16J24K21K1k59K03r1j68l1L59n06
7648c09L84j30j50J69K15r9k36N96m97k9K73j49k22K84m13M2J83J11k34L22j9
7669I2m69L28K34m30K75P8o08O42j8m16J94L60n32J90L70n40k3K83J38k40K71
7690A79k42pN2rkL14l53r5L28M8j76J1J19n01O36k98j17O4J97n46M33L68n16K38
7714A25N3j53j23K88j36j35L05k63k02L89j3l91M75j13k38M69m01n7K01K81p48
7735c87O97K5n85J87J61k19L12on22L14L40m40J5M99o96q5P49m91J4L39j61j73
$$ plain form
7585 347 -63 74 -48 -179 -368 131 -190 -175 91 -310 73 216 41 -49 446 158 6 113 248 183 278
7606 278 111 -254 140 -2 -190 -29 101 -305 43 -39 -289 93 266 -350 -80 54 -35 -2 180 -230 -160
7627 -160 305 -99 -243 211 -25 -286 129 49 -156 34 -182 -58 163 184 -75 128 37 -131 -162 197 -309
7648 -309 75 -55 -205 -36 179 80 -156 440 -57 -86 187 38 -184 100 -313 -271 -88 23 -211 111 92
7669 92 -377 -49 185 -245 30 108 -500 142 124 -292 -98 262 -270 -80 290 -250 -273 10 148 -92 179
7690 179 -63 -70 -18 -27 -29 285 -68 -163 165 213 37 48 167 -334 302 4 -113 -49 148 -398 35 403 -113 125
7714 125 178 25 -98 190 54 -81 224 -39 -241 148 135 -256 219 106 -132 337 -64 -121 80 361 -387
7735 -387 310 335 -250 -63 98 -121 191 185 -337 -23 317 -123 -108 391 -305 -390 359 -132 -118 221 60 -113
7757a13K73m7n11O18Q8n61M11J22l82n3K96j65j16K04m35J36L28n4j49K92l22
7778a40K45j31n1j35L52kl35K05P7j98K30lm43M07j82j31L09O5l10K37K50m22
7800a06j2M99n10K72J71n03r0M17p3R6o6j75l1K86m32k44N96q7j01K48m8m14M16
7823A09r1m20L53M94n22M8J84m21J48K7j31L11M7n69M58l0j62Q6M29j93l57N17
7845C15k89j52M59l96J61J1J52m89L21P9l06N5K63j42J78l0k91n1J29r3l10P77
7867C51n67j55O50m00k78N77k25k10O81l18n71O39n3n11N55M7m12L09o1j72j5
7888a39K13l32J86M40n75k4O42q13L05L84k56m13M14N0k46M69k87k90N57l17k03
7909b35M46r6l05J08O02q74K70M63o32N6L21m33J01K57k94j73P69o58J90L81k42
$$ plain form
7757 -113 160 113 -398 220 308 -253 158 280 -102 -155 141 -24 -140 64 -371 -235 93 39 -110 182 -140
7778 -140 105 -26 -77 -212 140 138 -197 8 85 -113 117 114 -329 78 -104 -235 74 139 -171 66 316 -106
7800 -106 -118 381 -129 143 314 -189 -279 138 65 161 95 -80 -111 175 -257 -501 95 8 -93 155 107 -307 109
7823 109 18 -402 -49 445 -77 -29 155 -266 -118 -91 -222 89 136 -433 25 -5 -167 -81 348 155 -202 315
7845 315 26 -126 333 -63 98 109 261 -228 93 172 -134 -79 184 42 220 190 -101 -152 -23 -116 -426 351
7867 351 -216 -371 279 -121 -399 178 -47 -257 424 106 -465 174 121 -390 165 212 -200 109 48 -124 -139
7888 -139 74 -258 -72 368 -207 -231 411 -402 -97 287 31 -382 32 82 -164 305 18 -272 285 -32 -235
7909 -235 211 115 -190 -82 520 -354 -84 379 -253 -197 124 -309 -208 49 -245 -418 351 -307 -117 264 22
7930B2k94M97l11K8J78l5l38M24J06p16N41ml29M62J86p19K19K62o04O40rm19
7952b13q6M43k04m5M97o16K56K94k44k19K95j39k44N66k33n51O01O3k50k6L11
7973B56q82P36J13n26L17N8m35J9M68m07L7M12k62J0K61l37p0M44k23l17O15m12
7995a25p3M05K2n28M72K7n66N90k15k29M17j71l66M00j9k41J34L54l25j09O07
8016D61o71J35L11l34k28N09j93j40K50ol72O79m0p38N96k16k96K22M33o13J49
8037a02N24m75J69J75n54p8O93n11M3K54l36K15K35l51J12J44k46j60N70l17n48
8058e44O29j89l11N67K6m48M43qn37L13L36o10M43J22l35L9K76l59K1N25l72j75
8080a48L37l54k18P64k36j96K38k27l90M48J40m04M63j34l89L17K70p55N04J23
$$ plain form
7930 22 -272 225 -86 -58 120 85 -253 171 277 -439 102 98 -231 231 417 -302 -83 179 -425 215 206 -213
7952 -213 -299 144 -60 -105 392 -224 32 326 82 -137 158 19 -225 341 108 -443 158 221 -29 -55 256
7973 256 -626 110 223 -303 14 72 -363 -344 124 -283 -246 166 -96 -86 175 -162 -232 212 -11 -328 287 -125
7995 -125 -198 207 229 -299 173 200 -366 224 9 -220 197 26 -340 60 41 -200 -66 288 -37 -146 461
8016 461 -210 -75 236 -98 -326 183 -10 -150 100 94 -278 401 361 -377 219 3 -293 -71 362 -251 -102
8037 -102 422 -53 116 291 -263 -341 352 -159 -116 138 -198 17 252 -99 13 157 -89 -249 321 4 -544
8058 -544 85 -104 -415 152 178 -270 173 165 -372 -59 277 -333 110 232 -103 -64 212 -147 -126 399 27 -148
8080 -148 189 -165 -383 381 145 -51 187 -40 -430 18 158 -246 217 83 -306 11 281 -474 30 153
8100A53n1q2L26k02l79O10o00J08N46n23j53N74l97l68P28k66j47K03L7m48K22
8121a09K07j58L63j04k06P8N2l19M73R5m17k63P53o94M1M41k67k64K53p0k67P00
8143C18l48l82N55j55n3K3K24o34P08j60o02M09L96p73L40K18q6M5k0l67L90K46
8165B92l33J2J06l53K75L99m70j69N36j15m33K95J40k52K09rk86J19p5k27K21
8186a18L77n61L10J12m06
$$ plain form
8100 153 102 20 346 144 -235 375 -225 -117 429 -94 -247 327 -70 -438 290 24 -123 80 117 -331 -109
8121 -109 98 -60 303 199 -7 71 123 -196 277 372 -45 -308 445 -249 -208 233 -34 -298 -45 -115 -382 318
8143 318 -30 -412 143 -12 -65 -42 182 -452 256 96 -506 -97 299 -474 -134 84 -2 43 23 -344 46 292
8165 292 -41 -29 77 -276 -1 398 -72 -241 295 180 -253 42 182 -70 139 130 -156 -37 -112 -339 -118
8186 -118 259 -302 8 120 -286
8191b86
$$ Imaginary data points
##PAGE= N=2
##DATA TABLE= (X++(I..I)), XYDATA
0@%%%%%%%%%%%%Qj6J6j6J6k4L2l4M2n0N8o7P8r3J08j25J42j62J87k13K39k70L07
35A63l47L89m34M84n40O02o68P39q18R06j001J105j218J341j476J625j792J978
53A038k183K409k668K967l309L708m181M749n449O339p510R119j1478J5260k2253
68a3442L9182j49366j35212M40259o4330k30993J59533L2902j22955J32536l715
79H4399r6586J00628l8373j06678J51502m2629j81153J52997M4947k31265P4431
90h7780J38863j11989J9793M3949r0039J37610M0461k65852J14589K61522k47002
101d5875q7209K91910r5636j70690K20790R595j82904R9162M0288j09301L5641
112E771k9813k6780J54492j03280k10372K05794J05838k33020M4874J44967j08729
$$ plain form
0 0 0 0 0 0 0 0 0 0 0 0 0 0 8 -8 8 -8 8 -16 16 -18 24 -26 32 -35 43 -50 58 -67 75 -87 100 -113 126 -144 163
35 163 -184 205 -229 255 -285 317 -351 388 -430 476 -525 580 -638 703 -773 852 -940 1038
53 1038 -1145 1264 -1404 1563 -1746 1962 -2219 2530 -2919 3420 -4090 5029 -6449 8811 -13442
68 -13442 25740 -123626 -258838 181421 117091 -113902 45631 78533 -44422 88114 84399
79 84399 -12187 88441 50068 -56610 94892 52263 -128890 24107 69054 -162211 -87780
90 -87780 51083 -60906 -41113 2836 -87203 50407 90868 -174984 -60395 201127 -45875
101 -45875 -133084 158826 63190 -107500 113290 122885 -60019 39143 79431 -29870 5771
112 5771 -24042 -50822 103670 390 -209982 -4188 101650 -131370 -86496 58471 -50258
123e0258L6124Q3377j24143O2858J03755j68509M1222J56922k04386l1903K55947
134A61006j28198j52100K36048r107k20160R0906P9173p5626K5572o5154n2688
145a10328J83340l4582j95253J58198R3406j92244P2892J26255j63177K4912J55234
156A18653j07656l3909Q1799q6380L1573Q6153j78041J1312K27351j48570j50020
167a47735K22007J2483j67449Q8343J9611j00191Q4890m545r5131J21664R623
178D3570j35013J27209M8331j85502J00500J41799j96435k5845J75987o6629o4561
189c6589N5029n7408M3126Q2932j64838j2205J97233j00935r9632J78081m5618
200C9176j38152J52335J0501j61182Q8299N4294j00749O9453J2100j02860J28516
$$ plain form
123 -50258 -14134 69243 -54900 7958 111713 -56796 -15574 141348 -63038 -94941 161006
134 161006 32808 -119292 116756 107649 -112511 -21605 57568 -18058 7514 -57640 -110328
145 -110328 73012 38430 -156823 1375 94781 -97463 -24571 101684 -61493 -36581 118653
156 118653 10997 -22912 58887 -27493 4080 90233 -87808 -76496 150855 2285 -147735
167 -147735 74272 86755 -80694 7649 27260 -72931 11959 7414 -87717 33947 43570
178 43570 -91443 35766 84097 -101405 -905 140894 -55541 -81386 94601 27972 -36589
189 -36589 18440 -38968 4158 87090 -77748 -89953 107280 6345 -93287 84794 39176
200 39176 -98976 53359 63860 -97322 -9023 45271 -55478 13975 26075 -76785 51731
211E1731M2359j98354P7749J56190j65449m7729J39487n7172l1759P7098p5628
222c1477j781J02626r2492k5604J23641r2255m4669J72773q3306j50378J72718
233D9796L6907j73757N7814O2706q1167O5452J3122j15044J06101P7930j61335
244f1475K7607J13381j18483m900J12975r8209k8717J24019n6919m8723P9994
255D0550m9529n350R4405j14882n1100J85750n6823j60031J37357M2674j38119
266g5098O8899M0660j09707Q2130O4789j25902M1432Q1129r9741L0894P0545j29710
278e9680J6211J30824j05961n5182J23041k9034m1134O4360o6089j6018J16986
289G8324q3237q2817J39131k1976j12192J09560Q542j18695J02055M8915j37733
$$ plain form
211 51731 94090 -104264 -26515 129675 -35774 -83503 55984 -1188 -32947 44151 -31477
222 -31477 -33258 69368 -23124 -48728 74913 -17342 -62011 110762 27456 -122922 49796
233 49796 86703 -87054 -29240 33466 -47701 17751 30873 -84171 21930 99860 -61475
244 -61475 -33868 79513 -38970 -43870 69105 -29104 -57821 66198 9279 -39444 40550
255 40550 -8979 -14329 80076 -34806 -85906 99844 43021 -117010 20347 63021 -75098
266 -75098 -6199 34461 -75246 6884 71673 -54229 -12797 68332 -31409 -515 70030 -59680
278 -59680 -43469 87355 -18606 -73788 49253 20219 -20915 43445 -22644 -38662 78324
289 78324 -4913 -87730 51401 29425 -82767 26793 35335 -83360 18695 67610 -70123
300g0123N1092Q7896r0731K0678N2155r2580M2214P7058j29784o848J26532p2753
312e194m7888R1482m4755k3098R5302o8420n9996J11549l3288q0955R4210j9633
324I316p9337J13987m80j30170R5052P0215j20384K8781O3990q4559L7295N8659
336F2365j12258K1112J02195r6429l0788R2237n6643j5727R2167p0951m1718J15952
348F1514m0290p8201Q4510j7588o1140Q8274k5902r0492J09294L0958j15741N6338
360A534N1807q8126M4904M2393j08174M1328Q8401j06052j5579R3594n9342j8398
372c1710P3307o7741j8882J03677n2878n8293Q9879k2385n5358P6680l3427o9699
384f6830J04072L722j05359O9536M5106p7487M5190K3531q8324N8524N1944j17929
$$ plain form
300 -70123 -19031 68865 -21866 -1188 50967 -41613 601 77659 -52125 -58973 67559 -5194
312 -5194 -53082 38400 -6355 -29453 65849 -2571 -62567 48982 15694 -65261 28949 9316
324 9316 -70021 43966 43486 -86684 8368 78583 -41801 -13020 50970 -33589 3706 62365
336 62365 -49893 -28781 73414 -23015 -53803 38434 -18209 -33936 58231 -12720 -54438 61514
348 61514 21224 -56977 27533 9945 -51195 37079 11177 -79315 29979 60937 -54804 1534
360 1534 53341 -34785 10119 52512 -55662 -14334 74067 -31985 -47564 46030 -13312 -31710
372 -31710 41597 -26144 -45026 58651 5773 -52520 37359 14974 -40384 36296 2869 -66830
384 -66830 37242 40964 -64395 5141 50247 -27240 17950 41481 -46843 11681 63625 -54304
396e4304J8810R2794q1644j2651P8506o8783j4497R5295n8641m8642Q8280k2766
408A1757m2725O5875l9560m0359J00555l2285r5807R2708L2340r0763M6617L0905
420C9258p0927N0894K9443r6654L5930O0092q8405J0390O3325p9410J2279R4192
432F0407q0803l9923J04879k3729n6523N5794j6641j9844O6745m9163n3786R8895
444D6308p984q7738O8696J9037q1795N6674L4032r1719L1807N6786p2675N007
456b3564L6274o0639L5347N5018r5929Q743J12775o4329n2524Q9620j6083m4718
468b0009N6481k6792l8813P0677k2505n5893O7238j3494o4933P8721L697j02708
480f8333O3459N9838r5804K842O0910m2925Q331K4074o1120L7160O3911q2146
$$ plain form
396 -54304 -35494 57300 -24344 -36995 41511 -27272 -41769 53526 -5115 -53757 34523 11757
408 11757 -30968 34907 -4653 -45012 55543 23258 -72549 20159 52499 -38264 8353 39258
420 39258 -31669 19225 48668 -47986 -12056 48036 -40369 -29979 33346 -46064 -33785 60407
432 60407 -20396 -60319 44560 20831 -35692 20102 3461 -16383 50362 1199 -52587 46308
444 46308 38324 -49414 19282 38319 -43476 13198 47230 -44489 -12682 44104 -28571 -23564
456 -23564 12710 -47929 -12582 42436 -53493 -44750 68025 3696 -48828 40792 24709 -20009
468 -20009 36472 9680 -29133 41544 19039 -36854 30384 16890 -48043 30678 34375 -68333
480 -68333 -4874 54964 -40840 -37998 22912 -20013 -11682 12392 -48728 -11568 52343 -29803
492b9803J87R3929n6707l4953Q4374l7661n4524P4578j1120o3741M5131j427l4814
505b6551N1576k7464n8107Q8637R210j10100N0393P2073p7517l129N2930m2259
517b0308J0329M1814n1420J2493N1506n6653P762O7353p1496k1976R9313m9262
529A9455q0453P8148J3630o5526K6817J810k6099N4946k0068o3618P6041K3659
541C8742q8744M1763N0528p7377J8671O6473o0349j1482N6825l0441m805K9956
553B9760m8063J9855O1135q5827k9725J07743l3987q5499O6241J6355n7151L7690
565a473Q471m2146M3599Q237m4694M6688M347o5478N8036L7274r4712J8893Q1949
578E8991o0275k9981N5708j6132p366K1350n0091J3094O6529o5754l6402Q4166
$$ plain form
492 -29803 -29616 64313 7606 -27347 57027 19366 -35158 39420 28300 -35441 9690 8263 -26551
505 -26551 25025 -2439 -60546 28091 37301 -72799 -22406 49667 -27850 -30979 21951 -20308
517 -20308 -9979 31835 -19585 -7092 44414 -12239 -4477 62876 -8620 -30596 68717 19455
529 19455 -60998 17150 30780 -34746 -7929 -6119 -32218 22728 2660 -60958 15083 38742
541 38742 -50002 -8239 42289 -35088 -16417 50056 -10293 -21775 35050 4609 -196 29760
553 29760 -18303 1552 62687 -23140 -52865 54878 20891 -64608 1633 17988 -39163 -1473
565 -1473 6998 -35148 8451 16688 -28006 18682 23029 -42449 15587 52861 -41851 -22958 58991
578 58991 -1284 -31265 24443 8311 945 22295 -27796 -14702 51827 -13927 -50329 33837
590C3837k9048o0170P5712L112p3400M8462L4079n0377J6685J5075k4956L8452
602B7463j0337o4908O3543L8776r9043J2149Q3094n3125k6226N3066k9519j2547
614a7614M7411l4067j7913M5549l7982j4156P0209m3423n5173Q6649O754q3515
626d7271M1637M5326m7450L426J1055k2087L8946m086o5586M6033M0318p5247
638c4986J5785O2713o4517j1888P8325l3734m4659M6938m033j7510K6067l4089
650a5588p608O3607m1595n3043Q1858R967p8407L4196L5252m6826J7190K0566
662A9569m1647J9794J8579m1135L0566K0717o6473L1439O5532p3929k1469Q3320
674D4863k5834m9754M2502r59k1273K4443k8891j2423N9176k8189m8057O3456
$$ plain form
590 33837 4789 -55381 20331 23443 -49957 -1495 32584 -17793 -1108 13967 -10989 27463
602 27463 17126 -47782 15761 54537 -44506 -32357 50737 -2388 -28614 24452 -5067 -17614
614 -17614 29797 -4270 -22183 23366 -14616 -28772 41437 -1986 -57159 29490 36244 -47271
626 -47271 -5634 39692 -7758 -4332 6723 -15364 23582 19496 -46090 -57 40261 -34986
638 -34986 -19201 43512 -21005 -32893 45432 11698 -32961 13977 9944 -7566 18501 -15588
650 -15588 -23196 40411 -1184 -54227 27631 37598 -40809 -6613 28639 -18187 -997 19569
662 19569 -22078 -2284 16295 -24840 5726 26443 -40030 -8591 56941 -16988 -38457 44863
674 44863 19029 -30725 11777 10818 -10455 13988 -14903 -27326 31850 3661 -44396 19060
686A9060J177o0725N2272K4518p1233K0435M6502l9996l71J9435k7433K6414J7063
699B7118o1031K6893O1532o6407k4026P2340k2887m2480M1218q782k6932L5123
711A1679j2169k4231L7122j6533k3360N9394j6377o3963O1653L2681p6098J2632
723a7570N0907l7472n676K2814k6924J8669K4283n1356R244M9551m7605j2010
735b3145N5329l7232l1735N9125j1224m4253L4686M564j9186K8874k0159k3934
747b8290O1444r618o6578N2140L4051o9018J0766M4444m0886j36L4942l3773k319
760a2831L1174k6760M023K7282m4720K349N6868m3805l5570O1839l286m2944L0480
773D099K924k1217L4068j1858l4800M7766L543n4891L6333K2993n7297K0792M1056
$$ plain form
686 19060 20237 -40488 11784 36302 -34931 -14496 32006 -7990 -8361 11074 -16359 10055 27118
699 27118 -33913 -7020 54512 -11895 -35921 36419 13532 -28948 12270 3488 -23444 11679
711 11679 -490 -24721 12401 -4132 -27492 31902 15525 -48438 13215 45896 -30202 -17570
723 -17570 33337 -4135 -9811 13003 -13921 4748 29031 -22325 -13081 36470 -11135 -23145
735 -23145 32184 -5048 -36783 22342 11118 -33135 1551 6115 -13071 15803 -4356 -28290
747 -28290 33154 23536 -43042 9098 43149 -25869 -15103 29341 -11545 -11681 23261 -10512 -12831
760 -12831 18343 -8417 -4394 22888 -21832 -19483 37385 -6420 -41990 19849 16563 -26381 4099
773 4099 7023 -14194 19874 8016 -26784 20982 24525 -30366 5967 28960 -28337 -7545 33511
786C3511n3111m483M8864k3367j4751K2316j8724Q265K5732m4428k348N5947l3847
799d24l4112N1946o850l4326M0009k725l7471L6793O273l8045K8217N635l9565
812b4645L4759J3951n9704K4159M7633n0013j0502M3294k0174q625K5074k5830
824a0623J544L3976l3845j2147M4090k5193k1477M8528j7612l8136M9080N547
836B3732m6306K6045J3772l1018K1402L156l8811L2883K0716n3746J3667M0469
848B5961l8281k611L6002k8898o342L6562k5310j3389L3893j8646j1963L3918
860B0896k5677j9119N0937j3745m3055M1747J0155m1385K2201R784l2658K4949
872E030J0690m3041K1483K6134m0023J0559L0452l7348N259L9225l5960j1594
$$ plain form
786 33511 -19600 -24083 24781 1414 -13337 8979 -9745 -1480 24252 -20176 -22524 33423 -424
799 -424 -34536 17410 10560 -23766 16243 13518 -23953 12840 19113 -18932 9285 14920 -24645
812 -24645 10114 24065 -35639 -11480 36153 -13860 -24362 18932 -1242 -9867 15207 -10623
824 -10623 -9079 24897 -8948 -21095 22995 -2198 -23675 24853 7241 -30895 18185 23732
836 23732 -22574 3471 17243 -13775 7627 10783 -28028 4855 25571 -28175 -14508 25961
848 25961 -12320 -14931 21071 -7827 -14169 22393 -2917 -16306 17587 -1059 -13022 20896
860 20896 -4781 -23900 27037 13292 -29763 11984 22139 -19246 2955 12739 -19919 5030
872 5030 15720 -27321 -5838 20296 -19727 -9168 21284 -16064 -10805 28420 -7540 -19134
884a9134M2647j8757j8623K9051j7516j0645L7010k2536k7341M5060m225l8318
896b3327L1160M973l4462K7839P733m1558K3625K2459l7082J1045K2775l1905
908a6725J3437K8572l9199J821M2057k9610j6410L4274j6785j2541L1400k1210
920i19k0098L9012r817l0636L1231m62k7978K8960p50l6655L0533J5712m0612
933b2479J5853K2197l1193J4258K2403l6072R417L5445l3883q767L4937k1312
945H04j0887K9601k4658j4037L9330j7117k7677L4278k896k6322K7551k723k8645
958b3398L1759N934l7660K2021J6511l0787J7318J6362l4911J6253K9398l8570
970i770j812L6414k3981j1003K6094k1810q224L1891k1483j8890L5167r627k3843
$$ plain form
884 -19134 23513 4756 -13867 15184 -2332 -12977 24033 1497 -25844 19216 14991 -23327
896 -23327 7833 12806 -21656 6183 13916 -27642 -4017 18442 -18640 -7595 15180 -16725
908 -16725 -3288 25284 -13915 -12094 29963 353 -16057 18217 1432 -11109 20291 -919
920 -919 -21017 17995 8178 -22458 8773 8311 -19667 9293 8543 -28112 2421 18133 -22479
933 -22479 -6626 15571 -15622 -1364 21039 -15033 -5616 29829 -4054 -12821 22116 804
945 804 -10083 19518 -5140 -19177 20153 3036 -24641 9637 6741 -19581 7970 5247 -23398
958 -23398 8361 14295 -23365 -1344 15167 -15620 1698 18060 -16851 -598 28800 -9770
970 -9770 -11582 24832 851 -10152 15942 -5868 -14092 17799 -3684 -22574 12593 2966 -20877
983b0877K9799m628k5503L1960K553l4964K2859J4658k8319J4738R739k7778K1330
996E567J6739l9159J0826L3323l3234o410L0490k2790q772K9789k0796j5609L1288
1009A1252j1477j6914K7716j0931j7519L4345p807l2709L1937J1443l4088J4608
1021a44J2899k4304J5450R312k9492J7324J9656l4598P104K6874l0643j286L3027
1034B1179k7080j4653L5159j1740k0173K4109n473j1721K4057j3455j8611L4801
1046A6399l296l3518K5518J0685l0791J5145J3288k7174J2177J6023k5887Q237
1058c194J7068k5431R468K1700l3951O6L7944k5400k0013L4117n722j9880K0357
1071G129n779j2078K4732r545k1663K8029j532k7829K5340O353l3351J9308J9311
$$ plain form
983 -20877 8922 4294 -21209 10751 13304 -21660 1199 15857 -12462 2276 12015 -15763 5567
996 5567 22306 -16853 -6027 27296 -5938 -12348 18142 -4648 -13420 16369 -4427 -20036 11252
1009 11252 -225 -17139 10577 -354 -17873 16472 8665 -24044 7893 19336 -14752 -144
1021 -144 12755 -11549 3901 13213 -16279 1045 20701 -13897 -6793 20081 -10562 -11848 21179
1034 21179 -5901 -20554 14605 2865 -17308 6801 1328 -10393 13664 209 -18402 16399
1046 16399 13103 -20415 5103 15788 -15003 142 13430 -13744 -1567 14456 -11431 -3194
1058 -3194 13874 -11557 -2089 19611 -14340 -14274 23670 -1730 -21743 12374 6652 -13228 7129
1071 7129 1350 -10728 14004 4459 -17204 10825 9293 -18536 6804 13157 -20194 -886 18425
1084A8425l1336M372K1489j7510L807J1480k3123J1160K2729l3452l131L6536
1096B1446k1638j9090L1046p486j9474K4432l070k0185J9793l24j6471J9745n123
1109C601k3250K8511P135l6991J6218K5486k7381j108J9349j5152K835J3077k1153
1122h823M838K0536k5099l403K8925k1553j3208L3911j1872k5994K7683N632k2367
1135a0794J2637J366j2739J9392m403k4256K5962R800l3873J3434K2355k6620
1147g739J724K1209j9654k452J8248j5114j958J5091j9220K245K5544k5846j2950
1160b0872L7920q326k8684K4706O853k1744J3007L917j5821J5386J073k1752J8548
1173D211Q545k6335J3807J7022k9502L091K7105j9720j0416J8619p826k563J1196
$$ plain form
1084 18425 -12911 -8539 12950 -4560 -753 10727 -12396 -1236 21493 -11959 -15090 21446
1096 21446 -192 -19282 11764 4278 -15196 9236 6166 -14019 5774 5450 -11021 8724 3601
1109 3601 -19649 8862 15997 -20994 -4776 20710 -6671 -7779 11570 -3582 -747 12330 -8823
1122 -8823 -3985 16551 -8548 -11951 16974 -4579 -17787 16124 4252 -21742 5941 11573 -10794
1135 -10794 1843 3209 -9530 9862 5459 -18797 7165 16965 -16908 -3474 18881 -7739
1147 -7739 -6015 15194 -4460 -6912 11336 -3778 -5736 9355 -9865 -7620 17924 -7922 -20872
1160 -20872 17048 8722 -19962 4744 11597 -10147 2860 6777 -9044 6342 7415 -14337 4211
1173 4211 12756 -13579 228 17250 -12252 -9161 17944 -1776 -12192 6427 -1399 -3962 7234
1186G234j7337J476K5648k0591j3903L2398p275k5103K5024N140k4469J4214Q422
1199A0878j9784R020O928j4899J2431K685k3477J7221J7648l0814L97K7342j7283
1212a707r934J9245r226m716J4504j2872k957K1087j4663j1364K7019r403k1576
1225a6563K6958K716k8797J4183J4624j8524K808N587j1400J2382M576k2462J2489
1238a423J6131k5225J594K3757j7759q292K0895r546r119J6787o603o976J4843
1251I064j0398p003K3253j1592k1230K6446N750k8503J0612J3776j7084M290Q316
1264E697j2883P002P479j6968Q360J2945k0802L847K0284k0355p018K5854r130
1277D312j5228J5577j649o966J2662r714q506K1247p124j9996K0750M529k3679
$$ plain form
1186 7234 -10103 -8627 17021 -3570 -17473 14925 7650 -17453 7571 12711 -11758 2456 10878
1199 10878 -8906 114 7042 -7857 4574 7259 -16218 1003 18651 -12163 -11766 15576 -1707
1212 -1707 -11641 7604 -1622 -6338 8166 -4706 -7663 13424 -1239 -12603 14416 5013 -16563
1225 -16563 10395 13111 -15686 -1503 13121 -5403 -2595 2992 -8408 3974 8550 -13912 -1423
1238 -1423 14708 -10517 -8923 14834 -2925 -11217 9678 132 -8987 7800 1197 -5779 9064
1251 9064 -1334 -8337 14916 3324 -17906 8540 14290 -14213 -3601 10175 -6909 -2619 5697
1264 5697 -7186 -184 7295 -9673 -1313 11632 -9170 -5323 14961 -5394 -12412 13442 4312
1277 4312 -10916 4661 3012 -3954 8708 -1006 -9512 11735 4611 -15385 5365 9894 -13785
1290a3785J2189J2134k0112M634J3490j3905J828R613j1061O046Q122j9279O157
1303c929K0954k0009r174K3277o567j3261J5068l454r694J3586m815j0880J4893
1316E995l044j5345J7128J598k1407J4587J2359k1495K962J6226j1355r48P964
1329E225r797N906R166j7512K478J7838j5356o830K0159r521j2166J7602k951
1342D241j4144J2867Q71j1496J0425k523j1167J6217J316k0708J3442J2715j9153
1355g097K702J3957j1593M94J0062j1537J171J0815j2600M82J3039j3865m199
1368h169J9219j0799j2881J8330n66j5434J0733K487r717R514q32j1705J3025
1381C205M268j6637R526J0152j6195M321J2254j4090m63J2848r857l317R884r124
$$ plain form
1290 -13785 -1596 10538 -9574 -4940 8550 -5355 -3527 6086 -4975 1071 9193 -10086 -3929
1303 -3929 17025 -2984 -12158 11119 4552 -8709 6359 2905 -6789 6797 1982 -8898 5995
1316 5995 2951 -12394 4734 6332 -15075 -488 11871 -9624 -6662 9564 -1791 -2739 5225
1329 5225 -4572 1334 10500 -7012 -4534 13304 -2052 -8882 11277 1756 -10410 7192 4241
1342 4241 -9903 2964 3835 -7661 2764 241 -10926 5291 6607 -14101 -659 12056 -7097
1355 -7097 -4395 9562 -2031 -1537 8525 -3012 -1841 8974 -3626 -3144 9895 -3970 -8169
1368 -8169 11050 251 -12630 5700 5134 -10300 433 2920 -6797 2717 1885 -9820 3205
1381 3205 7473 -9164 362 10514 -5681 -1360 10894 -3196 -3659 9189 -668 -3985 5899 -3225
1395c225o60J1916j2454m905J8387q076j3312J6275N44j3162J0399K070j0677
1408f880R176K635j1601R306M045j2814Q224O915j5775N252J3007j5052k351J3193
1422G280q395l733R963q473k370J2843r468o448J5687n026j0670J3579j459j1701
1436h391J1711K504j2652P968M857j0687O608L378j1496Q159O784j5893L862J2163
1450H875j2322k080J1705q545l322J1411p377n141J2602m756p458J1423l587q403
1464f975J2400j450j2450J0641L953j1670N725M753r652O348M145j2121N383Q653
1478G683j2393J339J0403j0566q11J1316r365l766J2809o027o842J0236l038o106
1492e128J0318l535r142J1104O89j1100P899L236r489O598L403j0866O066O913
$$ plain form
1395 -3225 -3885 8031 -4423 -9328 9059 983 -12329 3946 4490 -8672 1727 3797 -6880
1408 -6880 2296 4931 -6670 2636 6681 -6133 2091 9006 -6769 -1517 11490 -3562 -5913 7280
1422 7280 -1115 -4848 5115 -3358 -5728 7115 -2353 -8801 6886 1860 -8810 4769 3310 -8391
1436 -8391 3320 5824 -6828 1140 5997 -4690 1918 5296 -6200 1959 8743 -7150 -3288 8875
1450 8875 -3447 -5527 6178 -2367 -5689 5722 -1655 -6796 5806 1050 -6408 5015 1428 -6975
1464 -6975 5425 3975 -8475 2166 6119 -5551 174 4927 -4725 1623 5768 -6353 -970 7683
1478 7683 -4710 -3371 7032 -3534 -4345 6971 -2394 -6160 6649 622 -6220 4016 978 -5128
1492 -5128 5190 1655 -7487 3617 4306 -6794 1105 4341 -5148 1450 4853 -6013 53 6966
1506F966j1312K642Q007r683J011Q662r619j322J1184p271n371J0922m305n968
1520e457R762l681p306J0547p58r656Q180K067q618O260K175q870O733M716j0639
1535d545L823P218r653J674P558r093l39R625q464l160R596m782m517Q925m542
1550f76n218J0514k768q940J0009J067r254O879K178q084O283K804r299M926N001
1565E422q821L125O152r837J663Q557r494k060J0369n857m292P990l959l110Q643
1580D491m349n930R907j576p974Q213J350q808O664K744q804M108M895p528K179
1595d18L933p409L285N402r334P47R434q035l042R119l476m408P521l099m072
1610c852P617k669n076P543j271o761Q028M92r433O356M359q886K019N145o062
$$ plain form
1506 6966 -4346 -1704 6303 -3380 -2369 6293 -3326 -4648 6536 -735 -6106 4816 511 -5457
1520 -5457 4305 624 -6682 3865 3107 -6549 1631 3698 -4920 1340 3515 -5355 1378 6094 -4545
1535 -4545 -722 6496 -3157 -1483 6075 -3018 -3357 6268 -2196 -5356 4240 -542 -5059 3866 -676
1550 -676 -5894 4620 1852 -7088 2921 3988 -5266 1613 3791 -4293 1990 4794 -4505 421 5422
1565 5422 -3399 -274 5878 -3959 -2296 6261 -3233 -5293 5076 -781 -5073 2917 -1042 -4152 4491
1580 4491 142 -5788 4119 2543 -5431 2782 4132 -4676 1988 4732 -4072 36 4931 -2597 -418
1595 -418 3515 -3894 -609 4793 -4541 -3794 5640 -2395 -5437 3682 206 -4202 3319 220 -3852
1610 -3852 3765 1096 -3980 3563 2292 -4469 3559 4051 -5382 974 5333 -3553 -1534 3611 -2451
$$ [...]
8191b97
##END NTUPLES=NMR FID
##END=
