##TITLE=1H_Pr 4895
 CDCl3, 8 sc, 
 7.2.2019
##JCAMPDX= 6.0         $$ Bruker NMR JCAMP-DX V2.0
##DATA TYPE= NMR FID
##DATA CLASS= NTUPLES
##ORIGIN= UXNMR, Bruker Analytische Messtechnik GmbH
##OWNER= root
$$ XWIN-NMR		Version 3.5
$$ Thu Feb  7 16:12:00 2019 Russian Standard Time (UT+4h)  she@DPX200
##.OBSERVE FREQUENCY= 200.1313
##.OBSERVE NUCLEUS= ^1H
##.DELAY= (6, 6)
##.ACQUISITION MODE= SIMULTANEOUS
##.ACQUISITION SCHEME= undefined
##.AVERAGES= 8
##.DIGITISER RES= 18
##SPECTROMETER/DATA SYSTEM= spect
##.PULSE SEQUENCE= zg30
##.SOLVENT NAME= CDCl3
##.SHIFT REFERENCE= (INTERNAL, CDCl3, 0, 15.7039)
##AUDIT TRAIL= $$ (NUMBER, WHEN, WHO, WHERE, WHAT)
$$ ##TITLE= Audit trail, XWIN-NMR		Version 3.5
$$ ##JCAMPDX= 5.01
$$ ##ORIGIN= Bruker BioSpin GmbH
$$ ##OWNER= she
$$ F:/spectra/data/she/nmr/H-F/1/audita.txt
$$ ##AUDIT TRAIL=  $$ (NUMBER, WHEN, WHO, WHERE, WHAT)
(   1,<2019-02-07 16:10:31.09 +0400>,<she>,<DPX200>,
      <created by zg, POWCHK disabled, PULCHK disabled
       configuration hash MD5:
       00 E9 B6 7A A2 85 ED C7 34 08 36 98 17 FE 4E 26
       data hash MD5: 16K
       BB F2 F0 4F B6 7A B8 8C 6B 58 E4 87 2F B0 79 4D>)
$$ ##END=
$$ 
$$ hash MD5
$$ 22 84 76 F5 6A CB 0D 0B CA 2A 65 46 5B 29 14 6E
##$RELAX= 
##$RELAX= 
##$RELAX= 
##$RELAX= 
##$RELAX= 
##$RELAX= 
$$ Bruker specific parameters
$$ --------------------------
##$DU= <F:/spectra>
##$EXPNO= 1
##$NAME= <H-F>
##$PROCNO= 1
##$TYPE= <nmr>
##$USER= <she>
##$AMP= (0..31)
100 100 100 100 100 100 100 100 100 100 100 100 100 100 100 100 100 100 
100 100 100 100 100 100 100 100 100 100 100 100 100 100 
##$AQSEQ= 0
##$AQ_mod= 1
##$AUNM= <au_zg>
##$AUTOPOS= <>
##$BF1= 200.13
##$BF2= 200.13
##$BF3= 200.13
##$BF4= 200.13
##$BF5= 200.13
##$BF6= 200.13
##$BF7= 200.13
##$BF8= 200.13
##$BYTORDA= 1
##$CFDGTYP= 0
##$CFRGTYP= 5
##$CHEMSTR= <none>
##$CNST= (0..31)
1 1 145 1 1 1 1 1 1 1 1 1 1 1 1 1 1 1 1 1 1 1 1 1 1 1 1 1 1 1 1 1 
##$CPDPRG= <>
##$CPDPRG1= <>
##$CPDPRG2= <>
##$CPDPRG3= <>
##$CPDPRG4= <mlev>
##$CPDPRG5= <mlev>
##$CPDPRG6= <mlev>
##$CPDPRG7= <mlev>
##$CPDPRG8= <mlev>
##$CPDPRGB= <>
##$CPDPRGT= <>
##$D= (0..31)
0 1.2 0 0 0 0 0 0 0 0 0 0.03 0 0 0 0 0 0 0 0 0 0 0 0 0 0 0 0 0 0 0 0 
##$DATE= 1549541430
##$DBL= (0..7)
120 120 120 120 120 120 120 120 
##$DBP= (0..7)
150 150 150 150 150 150 150 150 
##$DBP07= 0
##$DBPNAM0= <>
##$DBPNAM1= <>
##$DBPNAM2= <>
##$DBPNAM3= <>
##$DBPNAM4= <>
##$DBPNAM5= <>
##$DBPNAM6= <>
##$DBPNAM7= <>
##$DBPOAL= (0..7)
0.5 0.5 0.5 0.5 0.5 0.5 0.5 0.5 
##$DBPOFFS= (0..7)
0 0 0 0 0 0 0 0 
##$DE= 6
##$DECBNUC= <off>
##$DECIM= 32
##$DECNUC= <off>
##$DECSTAT= 4
##$DIGMOD= 1
##$DIGTYP= 9
##$DL= (0..7)
0 120 120 120 120 120 120 120 
##$DP= (0..7)
150 150 150 150 150 150 150 150 
##$DP07= 0
##$DPNAME0= <>
##$DPNAME1= <>
##$DPNAME2= <>
##$DPNAME3= <>
##$DPNAME4= <>
##$DPNAME5= <>
##$DPNAME6= <>
##$DPNAME7= <>
##$DPOAL= (0..7)
0.5 0.5 0.5 0.5 0.5 0.5 0.5 0.5 
##$DPOFFS= (0..7)
0 0 0 0 0 0 0 0 
##$DQDMODE= 0
##$DR= 18
##$DS= 0
##$DSLIST= <SSSSSSSSSSSSSSS>
##$DSPFIRM= 0
$$ [...]
##$SUBNAM2= <"">
##$SUBNAM3= <"">
##$SUBNAM4= <"">
##$SUBNAM5= <"">
##$SUBNAM6= <"">
##$SUBNAM7= <"">
##$SUBNAM8= <"">
##$SUBNAM9= <"">
##$SW= 20.0189088683792
##$SWIBOX= (0..15)
0 0 2 0 0 0 0 0 0 0 0 0 0 0 0 0 
##$SW_h= 4006.41025641026
##$TD= 16384
##$TD0= 1
##$TE= 0
##$TE2= 300
##$TE3= 300
##$TEG= 300
##$TL= (0..7)
0 120 120 120 120 120 120 120 
##$TP= (0..7)
150 150 150 150 150 150 150 150 
##$TP07= 0
##$TPNAME0= <>
##$TPNAME1= <>
##$TPNAME2= <>
##$TPNAME3= <>
##$TPNAME4= <>
##$TPNAME5= <>
##$TPNAME6= <>
##$TPNAME7= <>
##$TPOAL= (0..7)
0.5 0.5 0.5 0.5 0.5 0.5 0.5 0.5 
##$TPOFFS= (0..7)
0 0 0 0 0 0 0 0 
##$TUNHIN= 0
##$TUNHOUT= 0
##$TUNXOUT= 0
##$USERA1= <user>
##$USERA2= <user>
##$USERA3= <user>
##$USERA4= <user>
##$USERA5= <user>
##$V9= 5
##$VALIST= <valist>
##$VCLIST= <CCCCCCCCCCCCCCC>
##$VD= 0
##$VDLIST= <DDDDDDDDDDDDDDD>
##$VPLIST= <PPPPPPPPPPPPPPP>
##$VTLIST= <TTTTTTTTTTTTTTT>
##$WBST= 1024
##$WBSW= 4
##$XGAIN= (0..3)
0 0 0 0 
##$XL= 0
##$YL= 0
##$YMAX_a= 110944
##$YMIN_a= -106283
##$ZGOPTNS= <>
##$ZL1= 120
##$ZL2= 120
##$ZL3= 120
##$ZL4= 120
##$ABSF1= 10
##$ABSF2= 0
##$ABSG= 5
##$ABSL= 3
##$ALPHA= 0
##$AQORDER= 0
##$ASSFAC= 0
##$ASSFACI= 0
##$ASSFACX= 0
##$ASSWID= 0
##$AUNMP= <proc_1d>
##$AZFE= 0.1
##$AZFW= 0.1
##$BCFW= 1
##$BC_mod= 2
##$BYTORDP= 1
##$COROFFS= 0
##$CY= 11.3945322036743
##$DATMOD= 1
##$DC= 2
##$DFILT= <>
##$DTYPP= 0
##$F1P= 18.9103706918063
##$F2P= -1.10871071338519
##$FCOR= 0.5
##$FTSIZE= 0
##$FT_mod= 4
##$GAMMA= 1
##$GB= 0.15
##$INTBC= 1
##$INTSCL= 1
##$ISEN= 128
##$LB= 0.24
##$LEV0= 0
##$LPBIN= 0
##$MAXI= 10000
##$MC2= 0
##$MEAN= 0
##$ME_mod= 0
##$MI= 1.114404
##$NCOEF= 0
##$NC_proc= 0
##$NLEV= 6
##$NOISF1= 3.799351
##$NOISF2= 2.8
##$NSP= 1
##$NTH_PI= 0
##$NZP= 0
##$OFFSET= 15.70392
##$PC= 1
##$PHC0= -8678.173
##$PHC1= 13.80019
##$PH_mod= 1
##$PKNL= yes
##$PPARMOD= 0
##$PSCAL= 0
##$PSIGN= 0
##$REVERSE= no
##$SF= 200.130013532006
##$SI= 16384
##$SIGF1= 3
##$SIGF2= 2
##$SINO= 400
##$SIOLD= 16384
##$SREGLST= <1H.CDCl3>
##$SSB= 0
##$STSI= 0
##$STSR= 0
##$SW_p= 3612.71676300578
##$SYMM= 0
##$S_DEV= 0
##$TDeff= 0
##$TDoff= 0
##$TI= <>
##$TILT= no
##$TM1= 0
##$TM2= 0
##$TOPLEV= 0
##$USERP1= <user>
##$USERP2= <user>
##$USERP3= <user>
##$USERP4= <user>
##$USERP5= <user>
##$WDW= 1
##$XDIM= 8192
##$YMAX_p= 0
##$YMIN_p= 0
$$ End of Bruker specific parameters
$$ ---------------------------------
##NTUPLES= NMR FID
##VAR_NAME=  TIME,          FID/REAL,        FID/IMAG
##SYMBOL=    X,             R,               I
##VAR_TYPE=  INDEPENDENT,   DEPENDENT,       DEPENDENT
##VAR_FORM=  AFFN,          ASDF,            ASDF
##VAR_DIM=   8192,          8192,            8192
##UNITS=     SECONDS,       ARBITRARY UNITS, ARBITRARY UNITS
##FACTOR=    0.0002496,     1,               1
##FIRST=     0,             0,               0
##LAST=      2.0444736,     0,               0
##MIN=       0,             -106283,         0
##MAX=       2.0444736,     110944,          0
$$ Real data points
##PAGE= N=1
##DATA TABLE= (X++(R..R)), XYDATA
0 0 0 0 0 0 0 0 0 0 0 0 0 0 0 8 -8 8 -8 9 -16 16 -17 24 -25 33 -38 43 -51 59 -68 78 -90 102 -115 132 -148
35 -148 167 -189 211 -236 262 -294 327 -361 401 -443 490 -541 596 -658 724 -797 878 -969
53 -969 1068 -1181 1305 -1448 1613 -1800 2022 -2288 2610 -3015 3538 -4239 5243 -6795 9549
68 9549 -15933 66359 -19575 -42659 110944 -21574 -34818 65990 -34800 -74466 64097
79 64097 -15607 -82332 30119 8792 -47145 38400 -14735 -59911 61919 27699 -62581 52249
91 52249 37043 -66850 41169 46718 -85720 23364 76022 -82689 -18194 97686 -30476
102 -30476 -27352 64273 -46753 -45587 74531 -27954 -78446 42159 1601 -42597 41911 -15748
114 -15748 -49638 69159 13232 -69353 50381 41346 -45188 53445 38011 -70801 40103
125 40103 61792 -85742 -14282 56451 -68568 -27044 55032 -55167 -28729 66602 -44637
136 -44637 -47448 73864 -3256 -37497 60769 -533 -25016 84305 6495 -69569 47502 19432
148 19432 -68324 20861 5223 -70729 37862 35963 -81949 9180 61243 -45628 2262 44113
160 44113 -54075 7491 73958 -49149 -28220 67980 -29080 -38437 54114 -25572 -36612 72720
172 72720 -5835 -54586 66209 23356 -58102 28375 5679 -63345 28126 11348 -78293 17280
184 17280 45032 -48052 10958 39166 -39910 30634 62425 -54551 -1480 77714 -31928 -25900
196 -25900 47856 -46418 -38783 58978 -40894 -70645 57390 9058 -50578 47587 17388 -40534
208 -40534 49539 20109 -59559 30916 34739 -52013 11052 25181 -46458 22818 35614 -63437
220 -63437 5066 59389 -45507 -12881 54534 -35083 -12436 60350 -43839 -48412 62484 -9084
232 -9084 -55963 38820 3324 -34715 52620 11459 -50928 41088 29454 -48933 15080 17814
244 17814 -42565 25956 23545 -61227 13354 46650 -50343 -7233 43106 -40172 -2355 55506
256 55506 -42649 -23125 69021 -18152 -44755 44687 -7524 -35583 46592 -5456 -47297 49131
268 49131 19905 -50801 20804 14799 -41551 25395 12741 -56992 23643 42797 -45736 5177
280 5177 39897 -36979 6099 42810 -48034 -11398 59670 -30089 -33871 43991 -17116 -28929
292 -28929 43600 -17875 -40571 51225 9153 -43805 34653 18696 -33334 28996 6773 -52021
304 -52021 24217 26729 -51799 4797 31745 -34438 10411 33065 -43651 2588 52350 -34737
316 -34737 -21590 45574 -18238 -18209 41340 -25749 -32067 50315 -6464 -45807 35578 11000 -31473
329 -31473 33040 6226 -42338 33029 20578 -52566 7614 24473 -37512 10328 24878 -41496
341 -41496 12408 45643 -38063 -10854 44637 -21125 -10327 38347 -28012 -19498 49890 -16864
353 -16864 -41035 35381 -983 -33838 28996 -2754 -36458 37877 14765 -45974 17920 23005
365 23005 -32965 13831 17745 -37579 18683 37541 -37231 -518 40683 -23823 -7458 28768
377 28768 -33969 -13832 41524 -26346 -32665 37182 -6670 -27610 31188 -5740 -26899 42455
389 42455 8906 -38407 28339 20822 -31699 16163 10413 -39537 16548 22242 -44039 2773 34786
402 34786 -26579 -289 29774 -29287 -2181 39235 -29907 -23220 37207 -13272 -23600 30302
414 30302 -11529 -22015 40198 -1858 -33767 34768 16126 -28133 21942 8928 -34287 19827
426 19827 11769 -47452 3648 23545 -34223 -1384 23902 -24951 8604 38745 -25128 -6998
438 -6998 42485 -12077 -15676 28389 -15134 -17829 32104 -16327 -35218 29769 2017 -32719 20136
451 20136 4671 -26174 28678 13283 -37027 17537 25358 -31834 2519 19549 -27276 8194
463 8194 27274 -31039 -3023 37773 -17094 -11604 27113 -16669 -10582 31235 -20119 -26439 33160
476 33160 -4141 -30661 20865 -1815 -25452 28448 5791 -33501 25008 24089 -27447 11248
488 11248 19533 -24414 11109 20345 -33709 -778 29504 -24013 -11144 21357 -21040 -7984
500 -7984 26595 -22506 -17517 35071 -5788 -21465 27811 1089 -16688 30407 530 -30189
512 -30189 24617 13058 -31965 9584 12049 -26849 10087 12271 -33296 5715 26245 -24132
524 -24132 -2402 24843 -16568 1097 27312 -22361 -10679 32777 -14031 -22366 24842 -6259
536 -6259 -17158 27564 -4897 -24866 28648 8647 -29018 14986 9727 -25004 12647 7133 -32474
549 -32474 10400 19906 -29005 -292 22497 -16976 5815 26762 -19564 -147 34865 -15199
561 -15199 -17552 23438 -11481 -18888 18560 -14850 -25354 24948 1041 -26286 18735 10550 -16598
574 -16598 20062 8924 -23432 19076 18129 -28206 2405 16938 -23058 745 15995 -26706
586 -26706 -800 29296 -18369 -11139 27166 -8409 -11259 21759 -13065 -17179 26478 -4826 -25320
599 -25320 18463 3766 -18193 18791 4005 -21187 23016 14052 -27033 10066 17542 -22161
611 -22161 4276 12448 -28443 257 21990 -24937 -9765 25015 -10795 -6923 22735 -11247
623 -11247 -8001 29289 -6744 -19375 21884 749 -17561 16840 -2763 -22034 20025 4859
635 4859 -29115 10945 14086 -21664 7204 12279 -22832 8129 21562 -22445 -3278 23904 -12447
648 -12447 -4492 18924 -13950 -5134 24860 -12983 -17485 21572 -4571 -16838 17228 -5423 -18756
661 -18756 22330 2370 -26082 15963 12515 -20865 9063 10166 -21320 10535 17048 -23602 1177
674 1177 20989 -14988 -2467 17118 -15313 -1226 22144 -16468 -12556 22707 -8492 -15717 16728
687 16728 -8787 -16740 22668 -1437 -22744 20131 11380 -18503 12704 10410 -17615 12715 12368
700 12368 -24010 2612 15659 -19129 -3052 12380 -17210 605 18732 -17883 -5510 24888
712 24888 -8353 -10257 20088 -7661 -11918 21652 -6166 -21682 19477 4737 -20996 11911
724 11911 6954 -16417 14065 9066 -22116 7829 14909 -18564 346 11235 -17241 2591 14681
737 14681 -20342 -2758 23191 -11374 -7551 20351 -8354 -7176 22641 -8900 -17092 20821 -364
750 -364 -21454 11864 2067 -17193 14086 4077 -21072 12189 13739 -18105 4450 11634 -15515
763 -15515 6010 13177 -20199 250 20498 -14258 -6458 17465 -10359 -5134 19830 -11202 -13158
776 -13158 20996 -3091 -17757 13541 -142 -14812 14313 458 -19188 14487 10299 -17788
788 -17788 7478 10621 -15007 7618 10969 -19687 2862 17491 -16941 -4958 15786 -11643
800 -11643 -3228 17275 -12433 -8367 21634 -5655 -13873 15582 -2343 -12773 14644 -3288 -17784
813 -17784 16186 5377 -18933 9714 8978 -14771 9992 9597 -18463 6265 15229 -18155 -2640
826 -2640 14507 -12695 -2506 14058 -14147 -5045 19696 -8273 -10283 17049 -3075 -9451 15012
839 15012 -5052 -13803 16805 708 -18684 11101 5733 -14672 10213 6543 -16604 9943 13356
852 13356 -17214 1607 14069 -12725 -768 11486 -14744 -2404 16921 -11674 -8784 15846
864 15846 -5150 -7226 14784 -6440 -9708 18219 -1839 -16451 13005 3516 -14046 10639 2861
877 2861 -16648 11211 9326 -18632 4278 12637 -13496 1553 10498 -14317 756 15691 -13251
890 -13251 -5900 15832 -6526 -5364 13945 -7467 -7379 17207 -4880 -14034 14006 1020 -13285
903 -13285 10749 228 -14665 12238 6094 -17232 6881 10563 -13638 3236 9210 -13805 3246
916 3246 13389 -14300 -3149 14911 -8290 -4140 13127 -7472 -4445 16382 -7012 -11381 14442
929 14442 -1734 -12354 10225 -2496 -13281 12115 1980 -16295 9760 8804 -12599 6721
941 6721 8814 -12073 6763 11839 -14948 -598 13382 -11026 -4179 10678 -10474 -3963 14064
954 14064 -8911 -8256 15537 -2759 -9572 11725 -2241 -9762 13386 -690 -15119 10825 5676
967 5676 -13722 6847 6263 -11782 7774 9086 -14449 2586 12455 -11140 -2514 9310 -10663
980 -10663 -2763 11506 -10531 -6287 13952 -4676 -7124 11976 -2328 -5942 14151 -1670 -11618
993 -11618 12338 2966 -12893 7320 3052 -12513 7104 5115 -15204 4444 10358 -11960 185
1006 185 9883 -9459 502 11086 -10557 -3338 13773 -6498 -6540 11278 -4572 -5358 12495 -4467
1020 -4467 -9783 12657 -28 -12149 8586 1330 -11473 8226 2911 -13731 6520 8558 -12345
1033 -12345 1963 8772 -8894 2429 9657 -10526 -720 12552 -7483 -4572 10714 -5238 -4110
1046 -4110 10845 -6493 -8040 11990 -1904 -10754 8667 -211 -9491 8611 1343 -11799 8591
1059 8591 6735 -11595 4269 7763 -8864 3797 7836 -10903 649 10299 -9478 -3634 8897
1072 8897 -7193 -3452 9668 -6891 -5332 12372 -3164 -8106 10014 -538 -7745 9452 -485
1085 -485 -10498 9008 3564 -11944 5143 5845 -9333 4375 6552 -10393 2728 9005 -9871
1098 -9871 -1578 8836 -7670 -2701 7981 -7755 -3456 11251 -4905 -6732 10524 -1129 -5981
1111 -5981 9486 -1096 -8054 9580 1527 -10890 5741 3582 -9704 4390 3664 -10254 4333
1124 4333 7443 -9707 1114 8890 -7127 -359 8011 -7378 -1622 10244 -6617 -5955 9283
1137 9283 -2866 -5549 8184 -2786 -6287 9707 -338 -9692 7227 2558 -8647 5121 2052
1150 2052 -9295 5600 5341 -10260 2333 7598 -7687 1125 7536 -7666 -288 9433 -7091
1163 -7091 -3827 9062 -3999 -4683 7452 -3817 -5385 9374 -1663 -7805 7696 1275 -7264
1176 -7264 5483 1055 -7835 6468 3345 -9946 3474 6327 -7449 1667 6218 -7377 1281
1189 1281 7960 -7644 -2478 8540 -4648 -3972 7218 -4306 -4004 8536 -2865 -6435 7946
1202 7946 -216 -6584 6231 128 -6899 6571 1907 -9360 4695 4844 -7910 2805 5167 -7599
1216 -7599 2598 6803 -7875 -361 8259 -5661 -2877 6598 -4999 -2734 7666 -4225 -4836 8021
1230 8021 -1235 -5552 6310 -417 -5542 7185 571 -7544 5743 3044 -7620 3520 3475 -7179
1244 -7179 3126 4833 -7845 1085 7306 -5929 -1180 6153 -4834 -1489 6483 -4801 -3720 7554
1258 7554 -2484 -4873 6244 -1066 -4337 6447 -965 -6586 6572 2034 -6876 4084 2161 -6569
1272 -6569 4448 3334 -8184 2318 5838 -6600 184 5847 -5056 -128 6589 -5325 -2187
1285 -2187 6832 -3281 -3453 6522 -2321 -3279 6420 -2216 -5317 6385 268 -6666 4677 867 -6088
1300 -6088 4165 1857 -7083 3403 4365 -6509 1252 5346 -4803 955 5291 -5517 -781 6436
1314 6436 -3789 -2668 5285 -3080 -2956 5618 -2799 -3983 6595 -818 -5385 5147 220 -5256
1328 -5256 4526 1100 -6470 3933 3216 -6510 2081 4164 -4984 1408 4188 -5196 480 5550 -4614
1343 -4614 -1846 4955 -3305 -2122 4839 -3820 -3141 5745 -2159 -4621 5265 -217 -3995 4900 260
1358 260 -5488 4809 2233 -6216 2690 3006 -5578 1477 3164 -5858 901 4714 -4949 -602 5130
1373 5130 -3550 -971 4696 -3682 -1990 5474 -2819 -3563 5183 -754 -3923 4177 -390 -4420 4965
1388 4965 1061 -5373 3168 2108 -4800 2126 1959 -5346 1784 3681 -5252 38 4288 -3886 -253
1403 -253 4553 -3577 -689 5258 -3096 -2408 5017 -1429 -2868 4248 -1218 -3185 5042 -372 -4737
1418 -4737 3698 1301 -4560 2899 1247 -4754 2870 2619 -4968 1457 4062 -3918 375 3935 -3888
1433 -3888 -318 4699 -3656 -1762 4919 -2112 -2821 3724 -1836 -2790 4563 -773 -3859 3730 153
1448 153 -3770 3001 842 -4027 2987 1605 -4784 1886 3078 -3950 696 3106 -3473 412 4289
1463 4289 -3625 -1114 4326 -2389 -1892 3347 -2141 -2142 3894 -1646 -3347 4081 -99 -3257 3637 245
1479 245 -3202 3231 808 -4286 2691 2004 -4071 1366 2281 -3849 1180 3209 -3834 -11 3835 -2769
1495 -2769 -894 3250 -2239 -1101 3691 -2242 -2384 3610 -1196 -2744 3121 -419 -2778 3231 359
1510 359 -3488 2784 1501 -3686 2138 1768 -3347 1454 2499 -3758 637 3105 -2966 -397 3258
1525 3258 -2460 -346 3189 -2528 -1627 3610 -1343 -2169 2838 -884 -2163 3174 -358 -2957 3026
1540 3026 904 -3230 1934 1475 -2789 1805 1498 -3338 1331 2362 -3028 319 2526 -2557 -47
1555 -47 3022 -2478 -1011 3386 -1717 -1686 2807 -1050 -1678 3203 -704 -2696 3087 109 -2861 2113
1571 2113 561 -2534 1811 1007 -3068 1541 1845 -2908 112 2177 -2451 220 1996 -2762 -57
1586 -57 2593 -2148 -1059 2653 -1382 -1627 2334 -1235 -2072 2722 -88 -2392 2492 162 -2548 1970
1602 1970 594 -2611 1542 1276 -2888 975 1674 -2298 537 1961 -2677 306 2328 -2134 -455
1617 -455 2363 -1405 -795 2138 -1533 -1405 2348 -918 -1849 2174 -260 -1796 1959 130 -1931 1890
1633 1890 723 -2427 1361 1226 -1810 1079 1189 -2502 408 1611 -2167 -16 2169 -1365 -356
1648 -356 1979 -1513 -745 2263 -865 -1268 2037 -275 -1398 1937 -287 -1537 2187 305 -1855 1359
1664 1359 979 -1803 1299 778 -2201 962 1466 -2137 361 1662 -1661 51 1593 -1525 -54 1991
1680 1991 -1266 -823 1920 -800 -1190 1548 -516 -904 1829 -453 -1522 1509 446 -1621 1090 720
1696 720 -1761 1037 1119 -1840 601 1282 -1446 30 1445 -1527 215 1653 -1292 -385 1799 -1032
1712 -1032 -773 1418 -576 -895 1467 -549 -1454 1517 186 -1270 1354 38 -1427 1060 406 -1780
1728 -1780 809 1004 -1527 556 1032 -1224 396 1356 -1465 34 1413 -1149 -433 1085 -1075 -380
1744 -380 1335 -637 -943 1512 -247 -1112 1364 -103 -1172 1203 34 -1296 969 535 -1370 504
1760 504 541 -1098 410 981 -1408 159 1217 -1104 -339 1012 -779 -40 1198 -915 -175 1209 -615
1777 -615 -639 859 -321 -580 1182 -57 -1038 887 242 -1271 720 429 -1277 834 454 -977 613
1794 613 741 -1059 60 653 -809 19 882 -820 -171 788 -536 -776 1082 -270 -639 1108 -466
1811 -466 -449 989 -92 -968 625 217 -1027 615 169 -1134 783 449 -611 312 526 -932 433
1828 433 878 -641 -140 768 -673 -101 731 -433 -217 731 -707 -392 890 -335 -640 932 -68
1845 -68 -629 851 161 -734 577 145 -943 443 164 -763 92 147 -573 97 633 -713 133 713 -627
1864 -627 154 612 -499 -100 524 -236 -41 529 1 -273 389 -483 -260 766 213 -792 519 173 -723
1883 -723 453 341 -547 225 164 -379 495 354 -720 252 238 -686 42 545 -480 52 593 -530 130
1902 130 648 -473 -111 509 -460 -346 706 68 -224 495 172 -558 748 52 -380 579 -90 -671 303
1921 303 133 -413 582 223 -446 284 339 -454 346 478 -693 32 513 -463 41 387 -74 -120 479 -150
1941 -150 -153 637 -178 -294 416 -281 -231 472 -96 -343 731 76 -534 404 316 -632 256 143 -739 404 344
1962 344 -453 394 215 -584 146 569 -409 -161 414 -592 -106 581 -463 -194 487 -277 -499 581 -41
1981 -41 -83 438 13 -346 614 48 -578 559 203 -631 612 263 -470 403 183 -470 -120 360 -548 -54
2001 -54 716 -498 -84 304 -600 -220 522 -436 -263 288 1 -377 621 -216 -473 517 -279 -561 427 -87
2021 -87 -524 397 187 -656 374 245 -673 280 481 -457 287 657 -735 -172 403 -523 -47 489 -466 -355
2041 -355 598 -532 -287 846 -156 -522 451 -312 -484 412 65 -781 392 164 -594 374 433 -406 217
2060 217 280 -493 282 757 -756 -53 477 -451 -68 375 -495 -385 704 -422 -567 774 -209 -491 951
2079 951 35 -451 606 -171 -540 643 82 -785 544 297 -724 5 254 -619 401 311 -592 54 681
2098 681 -716 -136 734 -425 -266 613 -476 -277 758 -275 -506 732 -312 -770 598 -35 -687
2115 -687 545 85 -789 491 89 -738 553 480 -901 141 603 -454 167 616 -811 -125 793 -777
2133 -777 -213 869 -575 -190 936 -187 -334 887 -139 -828 682 -186 -797 472 129 -564 467
2150 467 328 -1090 599 380 -783 61 535 -877 454 961 -852 -163 803 -475 -356 1102 -797
2167 -797 -437 954 -380 -399 849 -347 -673 713 -73 -803 844 -72 -892 739 329 -752 557
2184 557 545 -1092 590 550 -744 117 778 -700 125 899 -773 -84 1100 -510 -419 1016 -379 -493
2202 -493 752 -295 -869 920 -41 -911 724 109 -939 662 246 -912 514 208 -996 386 671
2219 671 -720 88 624 -807 29 817 -766 -93 955 -723 -619 948 -321 -422 893 -227 -878
2236 -878 897 -5 -755 954 359 -766 500 -142 -667 405 437 -1130 392 606 -698 -29 437 -663
2254 -663 -34 969 -815 -246 902 -306 -333 1037 -276 -468 1048 -247 -788 762 -43 -1098 918
2271 918 -13 -970 847 441 -1125 529 557 -992 340 538 -860 266 1001 -842 -131 796 -725
2288 -725 -171 980 -677 -434 1097 -690 -711 949 -429 -1020 1088 -162 -892 837 74 -922 338
2305 338 339 -1129 474 539 -935 -39 874 -1197 57 729 -659 -158 951 -831 -155 1143 -787 -328
2323 -328 983 -502 -631 1196 -421 -676 1065 60 -1202 653 221 -774 635 203 -1292 491
2339 491 454 -1119 342 597 -1027 26 762 -812 -73 796 -769 -369 1149 -542 -375 972 -452
2356 -452 -587 1079 -125 -781 953 63 -840 698 335 -924 1148 309 -1054 497 582 -921 234
2373 234 952 -771 -5 959 -955 -290 1252 -524 -389 1073 -742 -494 1322 -233 -703 929 -329
2390 -329 -763 680 -271 -1079 919 430 -1064 596 268 -1342 472 365 -1040 514 663 -1233 214
2407 214 921 -685 -16 989 -745 -460 1235 -396 -547 1025 -335 -897 887 -2 -862 989 -87
2424 -87 -911 745 -78 -988 774 650 -1029 494 526 -1159 291 818 -907 -179 810 -859 -270 921
2442 921 -868 -385 1217 -500 -861 1246 -379 -647 1007 -252 -808 1392 56 -797 899 165 -915
2459 -915 694 460 -953 429 863 -878 172 799 -993 164 901 -951 -329 1062 -678 -609 847
2476 847 -483 -563 1089 -72 -711 1028 11 -1034 825 -44 -744 951 533 -1182 746 345 -799
2493 -799 515 496 -1045 314 798 -1039 233 955 -1102 -116 965 -707 -379 1021 -544 -625 944
2510 944 -614 -881 1108 33 -942 1057 -29 -883 724 432 -1223 686 446 -936 613 736 -1067
2527 -1067 -120 1001 -800 -143 873 -807 -223 1085 -866 -422 752 -514 -558 914 -241 -913 999
2544 999 -94 -980 1056 89 -910 809 190 -1077 531 571 -799 311 614 -836 147 773 -1050
2561 -1050 -74 1003 -778 -307 1225 -536 -473 1055 -531 -431 1047 -222 -614 943 11 -889 984
2578 984 126 -883 920 534 -1131 384 790 -1068 263 397 -801 292 1026 -771 -221 948 -698
2595 -698 -395 917 -582 -594 886 -574 -619 900 -514 -739 1054 -52 -663 897 84 -1108 758
2612 758 438 -995 297 505 -1063 274 655 -1229 102 1032 -987 -272 838 -876 -394 691 -616
2629 -616 -656 1118 -426 -550 983 -210 -676 871 176 -921 1033 233 -1125 586 151 -1108 602
2646 602 344 -1157 390 613 -850 253 821 -893 -160 794 -718 -165 1127 -518 -593 1111 -181
2663 -181 -768 1014 -282 -800 925 -70 -1108 866 171 -1204 520 637 -976 319 573 -738 277
2680 277 687 -1017 50 1019 -808 -126 963 -502 -524 1082 -557 -660 1190 -532 -813 1179 -199
2697 -199 -878 852 138 -855 459 140 -726 755 589 -989 511 500 -1025 238 998 -927 85
2714 85 920 -810 -45 762 -367 -230 1093 -529 -536 817 -460 -654 804 -224 -617 679 52 -961
2732 -961 981 277 -1020 643 563 -950 323 754 -968 343 731 -754 -3 896 -773 -306 956
2749 956 -674 -465 858 -362 -217 921 -577 -818 1002 -59 -814 1051 -300 -692 718 116 -1037
2766 -1037 637 371 -697 416 435 -811 19 667 -822 43 783 -664 -470 965 -581 -421 950
2783 950 -302 -761 825 -496 -565 895 -60 -598 536 128 -894 637 314 -923 396 376 -1073
2800 -1073 95 723 -990 193 846 -556 -26 936 -353 -330 620 -421 -586 904 -370 -582 896
2817 896 -249 -611 662 -90 -978 793 340 -639 658 230 -1000 200 644 -739 153 711 -495
2834 -495 243 538 -773 6 548 -595 -446 760 -309 -348 854 -414 -529 835 61 -605 690 -207
2852 -207 -749 438 372 -687 553 530 -746 498 266 -908 287 750 -808 327 800 -400 -10
2869 -10 593 -622 -298 739 -355 -334 830 -413 -367 857 -146 -559 797 145 -663 485 421 -685
2887 -685 235 328 -496 615 358 -725 172 544 -566 77 874 -668 -296 614 -322 -339 712 -333 -385
2906 -385 960 -43 -366 641 75 -721 761 262 -653 525 500 -742 441 298 -922 92 273
2923 273 -628 24 304 -340 52 587 -431 -210 509 -422 -375 734 -342 -597 712 -62 -548 689 85
2942 85 -625 415 -138 -643 225 103 -573 372 278 -330 120 488 -530 35 486 -462 -247 621 -751 -115
2962 -115 446 -379 -235 629 -484 -214 706 -365 -250 747 -112 -295 486 -67 -881 239 59 -750 381
2981 381 266 -451 236 255 -659 33 414 -593 -81 716 -748 -247 416 -258 -249 785 -316 -124 615 -367
3001 -367 -292 637 212 -497 391 40 -593 512 57 -417 261 379 -551 373 565 -436 216 341 -583 -180
3021 -180 604 -280 -222 607 -289 -245 575 -202 -193 561 -87 -487 232 266 -226 346 191 -809 197 140 -478
3042 -478 161 227 -373 257 336 -573 -133 227 -260 45 392 -302 -137 595 -314 -46 730 -298 -266 390 -260
3063 -260 -234 359 -58 -539 396 -27 -581 270 161 -519 131 329 -455 176 231 -509 11 475 -671 -157
3083 -157 505 -334 -97 473 -367 -89 667 -131 -413 732 -53 -359 249 -169 -629 362 114 -333 516 101
3103 101 -560 234 359 -614 327 353 -405 -85 303 -589 -137 334 -282 -158 333 -322 -234 509 -250 -224 411
3124 411 -27 -269 506 -182 -347 299 119 -447 361 105 -535 344 310 -466 52 164 -440 40 373 -520
3144 -520 298 313 -245 -83 377 -305 -225 312 -65 -169 224 -272 -292 533 -336 -367 351 134 -191 229 272 -524
3166 -524 465 219 -633 39 174 -426 182 35 -374 -114 350 -712 -273 597 -445 -408 471 -12 -83 613
3186 613 -192 -352 285 81 -235 425 121 -419 369 -23 -420 425 8 -344 114 19 -587 -97 112 -303
3206 -303 36 496 -472 25 574 -622 -413 209 -64 -261 298 -226 -175 503 191 -225 167 380 -424 213
3226 213 108 -303 248 221 -309 74 492 -309 69 302 -87 -82 339 -569 -220 537 -132 -209 510 -311 -275 479
3248 479 -81 -320 228 -120 -399 461 -112 -622 225 142 -249 -91 459 -281 150 468 -532 -42 171 -276
3268 -276 73 129 -324 -93 18 -247 -275 294 -113 -315 320 -236 -212 452 81 -186 531 211 -474 184 257
3289 257 -443 -25 217 -483 200 126 -187 -87 324 -198 -416 202 -42 -77 408 -487 -361 415 -268 -385 364
3310 364 -263 173 449 211 -226 142 137 -327 478 112 -369 25 395 -602 155 458 -182 216 389 -412 -8
3331 -8 702 -448 -179 259 -38 -318 295 -227 -331 562 -395 -259 351 -268 -504 277 -54 -359 452 204
3351 204 -438 315 196 -216 228 76 -429 283 282 -377 -80 114 -264 38 488 -388 6 585 -164 -265 314
3372 314 -92 -279 234 68 -470 342 -119 -346 231 114 -322 336 33 -236 404 72 -318 -18 337 -229
3392 -229 -42 341 -413 -318 334 -318 -312 303 84 -131 421 -57 -315 359 -13 -267 251 -32 -341 139 231
3413 231 -389 121 279 -269 -119 218 -333 234 227 -531 -10 310 -436 -48 560 -170 -101 560 -263 -187 281
3434 281 -67 -297 416 227 -123 138 19 -242 359 -35 -268 180 185 -241 19 170 -515 -193 41 -258 -32
3455 -32 367 -483 75 564 -298 -139 416 -345 -354 282 -79 -386 75 -77 -356 154 59 -389 204 -21 -441
3476 -441 174 -115 -370 78 -30 -425 177 384 -255 54 160 -118 193 399 -306 -246 229 -292 91 568
3496 568 -308 -169 269 -242 -333 148 110 -52 104 -3 -194 659 219 -268 227 352 -486 248 271 -398 69
3517 69 469 -173 29 345 -29 -192 327 -87 -537 188 -37 -364 156 -17 -347 421 -74 -497 250 247 -356
3538 -356 13 304 -332 272 216 -392 -43 112 -427 158 318 -336 -6 192 -390 -240 -51 -114 -236 336 -119
3559 -119 -308 120 -96 -165 312 2 -467 113 72 57 338 99 -526 -39 405 -433 223 169 -232 314 303 -463
3581 -463 -58 638 -337 -172 242 -435 -3 282 -197 -395 215 -193 -152 356 -76 -369 215 -182 -200 137 100
3602 100 -446 -83 -14 -601 134 189 -322 -47 92 -223 135 331 -191 169 184 -164 -364 238 -129 -413 168
3623 168 -292 -225 300 -264 -448 322 98 -370 345 -22 -355 252 370 -379 268 277 -219 90 144 -129 89
3644 89 391 -276 -151 280 -387 -200 512 -130 -336 158 5 -316 274 117 -258 188 -99 -329 275 105
3664 105 -252 401 152 -500 -94 339 -308 87 183 -240 -56 258 -252 -168 425 -381 -13 344 6 -256 458
3685 458 -208 -191 360 -474 -210 239 343 -46 176 99 -302 -192 57 -380 68 385 -372 -28 304 -330 173
3706 173 493 -201 63 257 82 -183 360 -251 -77 246 81 -128 117 -85 -262 36 -49 -341 371 290 -125
3727 -125 86 -4 -187 326 319 -414 -205 325 -161 -228 342 -174 -292 299 12 -125 151 10 168 212 -132 -173
3749 -173 121 -117 -313 220 229 -434 354 -2 -221 388 311 -420 57 101 -488 70 533 -344 28 252 -221
3770 -221 -57 302 -97 17 317 -1 -145 168 -179 -349 450 0 -256 308 -25 -320 67 123 -423 131
3790 131 205 -421 194 186 -556 -224 241 -58 72 342 33 75 453 -47 -44 -90 -55 -209 406 -301 -220 -39 234
3813 234 -243 66 -59 -283 127 178 -440 -258 101 -316 84 402 -151 -207 212 -78 -46 251 -1 -415 441
3834 441 -30 5 124 106 -109 11 297 -38 326 284 -291 215 162 -276 -9 243 -209 222 204 -215 -108 198
3856 198 -406 216 120 -287 -157 297 44 -7 200 -90 -32 353 -8 -200 361 27 -293 220 275 -196 179
3877 179 73 -177 270 228 -119 77 132 -166 4 286 -323 198 145 -315 -142 208 33 -133 248 -165 -253
3898 -253 362 -262 -390 184 26 -144 79 348 -302 223 232 -312 64 58 -112 204 6 -193 265 413 -178
3919 -178 140 274 -315 8 394 -102 -258 439 -269 137 450 250 -120 -212 -35 -344 198 -228 -334 85
3939 85 131 40 128 124 -300 -57 234 -267 -32 108 -279 -39 125 -246 -178 182 -267 -164 199 -51 -319 126
3961 126 96 -198 59 7 -140 199 11 51 250 365 -322 56 325 -430 104 216 -245 87 455 -312 -23
3982 -23 169 -211 -113 224 -49 -397 257 11 -117 242 7 -429 196 -110 -452 354 60 -214 68 238 -300
4003 -300 431 357 -254 -69 508 -289 64 135 -204 73 370 68 -295 409 -80 -38 76 -250 -424 235 0
4024 0 -207 194 138 -112 138 60 -318 43 231 -225 52 -45 41 50 382 -182 -269 355 -246 126 214 -194 -33
4047 -33 476 -132 -259 101 85 -322 268 -26 -275 51 11 -536 293 159 -140 123 151 -345 -25 234 -300
4068 -300 293 153 -197 -235 360 -228 -112 93 -414 55 353 20 -51 48 31 -150 87 85 -470 3 -106 -481
4090 -481 179 269 -182 119 399 -390 43 400 -96 -440 54 -123 -124 202 -82 67 454 -233 -168 199 108 -209
4112 -209 149 -100 -408 328 73 -149 261 271 -107 -145 97 -247 -54 250 -221 85 228 -336 22 307 -133
4133 -133 -52 422 -55 -389 324 -117 -196 254 264 -190 435 -7 -155 91 83 -27 177 134 -176 -26 222 -210
4155 -210 183 64 -193 -95 42 -191 22 650 59 -287 358 -130 -83 62 82 -87 -30 225 -240 -30 189
4176 189 -38 226 333 -197 343 270 -319 151 155 -271 -219 18 -195 -121 482 -141 -16 310 -122 -29 242 -25
4198 -25 -33 119 -217 -51 263 -16 -46 26 -36 -513 10 -89 -233 -76 354 -262 238 18 -37 102 585 -57 -77
4221 -77 401 -31 -20 213 -246 -218 219 -157 -180 201 -32 -261 -109 266 -328 224 -16 -314 109 238 -300
4242 -300 37 209 30 -10 20 -124 -166 -34 11 2 207 -204 44 76 93 -170 41 -87 -294 -144 -119 -223 135
4265 135 11 -359 84 -280 -140 211 53 -290 218 122 -200 -46 225 55 -148 256 -350 27 123 -118 144
4286 144 112 -194 -465 173 -148 -178 205 -333 -301 224 -69 -210 -49 314 -208 161 24 -428 10 -25 -117 -207
4308 -207 65 -131 40 162 180 -98 25 56 -31 141 -155 -219 183 -275 -116 -144 249 -192 -42 -132 -15 353
4330 353 78 -25 64 87 -297 227 86 -95 -17 75 109 -10 61 -278 122 332 -85 61 -96 -41 -70 110 -76
4353 -76 -281 60 278 -139 193 141 -187 -279 184 -219 -140 227 -290 92 171 -241 61 23 43 212 238 -226 -72
4376 -72 75 -230 -21 98 59 92 112 33 -87 244 217 -198 121 123 -141 52 301 -247 86 -138 -96 1 434
4399 434 73 -30 31 -28 1 -64 -75 -333 128 -117 -147 -15 -49 68 -9 28 -177 153 103 -449 61 63 -4 -24 37
4424 37 -156 177 109 -54 120 126 245 -205 -59 145 -104 81 -53 -127 207 -1 -242 128 36 -70 -55 304
4446 304 -293 -5 252 12 195 249 -157 -71 37 -172 -17 31 -125 8 86 130 -280 135 79 -233 393 -190
4468 -190 -265 73 157 26 154 284 -93 74 153 -186 161 -19 -61 273 106 -105 -45 64 -120 -172 -49 -140
4490 -140 -43 -11 -62 -23 198 -34 -183 115 174 -320 194 22 -361 23 112 -85 147 -74 -121 -80 -15 -358 197
4513 197 61 -116 41 217 -47 -151 267 68 20 -82 -124 -382 23 69 23 248 -48 -284 209 -78 -44 28
4535 28 30 -130 0 63 28 143 293 -61 159 189 169 63 115 -178 -149 -106 155 78 140 128 -50 56 -65 -110 92
4560 92 72 139 2 152 132 23 65 -125 56 171 -206 19 22 103 119 245 -46 130 -72 208 -68 119 -360
4583 -360 -190 9 55 -58 526 113 -127 129 -34 -120 253 -105 -232 -125 10 102 82 174 101 -112 -30 -98 -171
4606 -171 -53 -189 -273 263 11 -145 164 71 -182 146 65 -82 -157 214 30 135 106 -28 -27 31 -12 -56 461
4629 461 79 283 -223 -33 -10 -54 -6 -61 217 -87 106 333 -270 -109 84 110 151 83 -101 -331 98 183 18
4652 18 38 -107 -110 16 345 -12 -45 79 150 -63 78 -152 -15 225 -98 -58 74 -11 -25 17 -157 -138 87 -69
4676 -69 -254 75 -49 73 -95 153 -213 35 -24 -44 -89 25 -25 15 94 -128 -295 60 30 -143 117 245 -61
4699 -61 60 243 131 223 38 2 71 229 -278 204 41 -102 -102 184 76 -188 91 -1 37 18 -290 -45 72
4722 72 20 -233 235 94 -344 -25 -110 303 274 156 162 203 327 95 26 -150 85 155 234 -96 -114 -251 -71 35
4746 35 197 138 -202 86 -203 -265 -56 235 -196 -177 -292 -272 -107 206 -384 53 15 -209 87 -10 -106 100 -15
4769 -15 13 -142 163 -60 -50 383 43 -112 344 38 -216 -2 116 179 -14 -60 -139 167 -159 -96 0 162 -102
4792 -102 268 131 -170 -11 216 6 317 49 -39 -262 278 -72 -125 201 -38 -133 320 141 -1 181 69
4813 69 42 378 80 -98 228 236 117 150 -153 -139 -95 147 -183 54 85 -109 189 233 75 50 130 -50 -148 74
4837 74 208 60 286 -67 -171 -176 37 -24 -180 5 -45 188 101 -306 -70 140 -206 -202 23 -285 -359 175 97
4860 97 90 182 29 108 367 -261 -177 251 -118 -136 -137 107 -176 253 0 -144 255 212 -175 -290 276 -26 -167
4883 -167 -108 -113 45 91 -78 -54 269 -338 -82 47 68 -174 -138 -144 84 462 -137 154 165 146 -131 -12 -77 -25
4907 -25 139 0 -163 149 141 -123 46 -417 146 -210 374 -156 -59 331 -26 42 268 114 -208 290 221 -504
4929 -504 437 56 -132 289 -66 -178 -256 137 -433 121 313 127 104 271 216 53 104 -430 -210 261 -153
4950 -153 -124 72 -89 -151 -48 10 -180 69 -115 -237 299 168 -165 -14 14 2 23 447 -118 -175 172 400
4972 400 -12 288 -280 -6 185 -326 34 473 -250 72 138 -37 -53 66 188 -390 83 -93 -160 -18 -143
4993 -143 35 -2 -147 -225 -2 -135 10 -78 182 -217 14 415 13 -70 112 -362 -127 491 -30 -164 167
5014 167 122 -208 57 111 -41 174 140 9 -218 -114 -131 188 -61 -279 -54 43 -165 30 263 -107 -301 102
5036 102 27 -183 274 124 3 17 -14 -196 -101 20 15 30 -31 -308 46 39 -233 126 119 -278 14 17 -176 195 139
5061 139 46 11 109 -204 -56 343 -204 -225 193 19 -372 143 21 170 160 72 -338 14 -92 -134 102 140 -55
5084 -55 -43 190 -76 -483 177 -143 -36 324 -99 94 -126 -119 -159 -101 -247 -164 238 -58 -321 -47 263 -151
5106 -151 24 72 -144 49 358 -59 1 46 -326 -65 278 -111 -180 67 -263 195 217 -296 -157 6 -473 -178
5128 -178 162 -141 -143 -48 -135 -381 306 136 -216 133 -147 -139 -125 175 -124 116 319 -357 -156 35 -120 -86 48
5151 48 -26 -51 130 -123 -143 283 190 -80 346 -190 -177 160 -14 -175 79 124 -344 214 -58 -319 88 21 -277
5174 -277 173 310 -240 10 390 -231 -227 235 114 -24 234 25 -239 274 -198 -282 -35 170 -87 166 -168
5195 -168 -252 0 261 -182 -3 -44 -321 142 -75 -252 194 50 -138 72 -28 -99 200 271 -123 -64 312 -62
5217 -62 -188 -240 -356 -284 224 -2 72 -115 -218 -264 -63 264 -248 23 7 -164 237 80 -38 -99 198 -374
5239 -374 -133 286 -324 -200 155 141 32 158 135 165 372 63 -106 184 -137 -15 75 131 -125 122 233 -229
5261 -229 81 3 -280 125 150 -161 117 83 -147 86 178 -209 13 491 -139 -66 453 -274 23 147 -40 -229
5283 -229 57 -151 -58 349 -152 -162 -236 -30 -198 218 48 -21 25 144 -167 -14 409 -217 -87 191 -192 85
5305 85 174 -250 32 437 -77 -226 424 192 -166 211 206 8 92 -138 -331 201 50 -121 28 75 -304 40
5327 40 251 -439 -148 -76 -349 266 2 -112 -254 47 -78 14 280 216 -40 337 278 -175 -49 -24 -77 280
5349 280 112 -488 266 56 -123 184 116 -264 106 93 -175 -3 86 -144 -364 267 -196 -55 73 -126 -304
5370 -304 239 -56 -388 213 -99 -454 -170 183 -125 14 209 -143 56 -24 -262 16 186 -77 -61 166 -63
5391 -63 -177 363 -17 -121 200 -86 -204 85 -33 -219 53 67 -470 226 365 -290 109 119 -192 9 125
5412 125 -133 80 209 -194 170 112 25 -127 105 -650 -108 361 -209 -32 24 53 -292 188 -256 -179 172 -175
5434 -175 -217 157 290 -42 144 84 -189 81 226 -199 16 242 -145 52 119 57 -330 246 106 -54 183
5455 183 -308 -310 392 -180 -132 345 -17 -133 166 222 -425 208 77 85 30 61 -1 10 211 11 52 287 -380 258
5479 258 350 -90 49 423 -23 -43 285 32 -329 190 -102 -155 364 -13 -345 -47 57 -233 88 61 -151
5500 -151 283 279 -247 47 226 -295 76 21 -32 -50 302 -416 -83 485 35 -146 123 11 -103 275 -19 -149
5522 -149 296 44 -62 430 91 -231 211 -116 -216 318 320 -537 95 178 -99 -270 360 -231 -217 454 -291
5543 -291 161 462 -170 -129 165 -100 -274 63 -164 -194 328 24 -481 99 48 -224 259 54 -13 -265 -1
5564 -1 -321 -90 191 -238 -300 399 -249 -186 524 128 -75 184 -48 -238 397 -208 -275 170 60 -378 251 126
5586 126 -325 10 227 -92 98 267 -227 -87 45 -321 46 77 -65 140 233 -169 -150 205 -211 343 231
5607 231 -219 -417 -28 -100 -580 192 -18 -196 -48 -61 -355 344 186 -87 66 142 -280 -153 469 -326 2
5628 2 301 -174 31 328 -163 -344 158 -206 20 149 62 -457 134 -33 -124 330 -79 -69 253 72 -109 77
5650 77 30 -317 139 140 -363 88 243 -10 -120 397 -91 -270 128 -259 -96 138 -6 -94 -83 0 -37 331 89
5673 89 -214 223 309 -194 134 160 -467 154 273 -357 -104 116 -241 -48 284 -282 -143 171 -260 4 84
5694 84 -50 -101 173 -42 -284 122 -66 -84 287 -107 -504 427 296 -338 155 280 -301 287 -10 -68 -44 -23
5716 -23 -216 -42 151 -214 -138 319 -201 62 388 -302 46 211 -376 -312 148 -16 -162 274 74 -232 131
5737 131 140 -179 148 208 -189 126 -44 -108 -14 422 -302 -137 21 -418 -141 170 -43 -162 460 -102 -384 60
5759 60 -91 -253 290 96 -236 302 67 -216 21 -8 -81 177 23 -365 41 253 19 -192 58 -275 68
5780 68 175 -202 39 611 -340 -74 246 -87 -213 214 -11 -282 110 276 -449 450 276 105 314 107
5800 107 -369 90 255 -197 52 235 -207 21 -27 -202 -162 215 -1 1 325 -282 -150 65 113 -39 191 175
5822 175 -185 346 62 -247 174 -154 -60 212 329 -281 -127 202 -559 -34 413 170 80 255 -299 89 402
5843 402 -180 -86 561 -188 -327 532 -149 -242 90 -63 -313 184 -100 -420 86 97 -260 -122 -19 -56 42 306
5865 306 -302 36 187 -238 133 559 -207 -288 193 -261 -196 281 -63 -122 324 -66 -191 76 101 -417 93
5886 93 289 -156 153 153 181 -191 440 -272 -215 376 -291 -49 151 -246 -16 81 -92 -29 253 -13 -491 27
5908 27 -15 -238 235 20 -317 -5 48 -439 205 279 -267 304 653 -171 -49 563 -288 -142 121 3 -127
5929 -127 193 -185 -48 538 -170 -339 127 -44 -509 313 -101 -77 -46 -127 -250 387 111 -368 197 116 -400
5950 -400 -173 160 -150 19 151 -23 68 198 -31 12 245 -336 -100 152 -161 -111 342 36 -132 -32 230
5971 230 -196 225 164 -132 251 320 -215 18 265 -438 489 259 -48 98 400 33 -201 144 -155 -169 264
5992 264 -156 -201 235 -62 -116 289 -193 -261 157 -34 -295 241 -135 -250 163 -103 -204 251 179 -120 21
6013 21 359 -321 -73 261 -279 -134 226 -169 -125 340 2 -58 275 -116 115 453 140 -83 176 111 -341
6034 -341 -66 -200 -211 275 18 -38 -125 257 -90 -107 298 131 469 269 -497 107 211 94 -181 246 -7
6055 -7 -39 137 252 -45 164 -40 -161 246 76 -315 44 120 -34 151 324 -148 -18 221 -142 95 -137
6076 -137 -45 217 301 -219 -133 266 2 8 114 33 -189 52 -23 -446 201 138 -78 127 221 -68 257 73 -240
6099 -240 317 16 -180 99 192 -171 -1 167 -260 -194 75 -156 -38 431 -261 -56 514 -32 -223 121 -401
6120 -401 -169 51 108 -164 39 -60 -157 103 101 -109 -90 55 -295 19 140 -186 111 187 20 -10 129 -263 -111
6143 -111 -34 -282 -158 193 5 37 110 -247 -167 86 -52 -159 8 187 -133 -138 132 -404 72 -161 -64 -136 278
6166 278 -216 -113 427 -143 -173 418 -45 -290 -59 8 26 67 -50 -102 35 -26 22 132 -183 -390 72 313
6188 313 -656 173 112 -29 38 340 -131 -281 324 -194 -166 230 -242 -150 -53 -30 -225 505 -36 -293 327 281
6210 281 -213 377 -58 -81 253 -71 -258 -43 263 -269 -220 270 -169 35 409 -258 5 46 -106 -45 191
6231 191 -217 -109 145 -42 -116 -103 -57 -216 108 -71 -159 84 -51 -235 130 198 -326 -124 -40 -242 123 54
6253 54 -96 -30 31 -362 -136 147 22 -60 253 -246 3 181 47 -71 206 -48 -390 418 -215 -98 92
6274 92 56 -350 41 339 -278 207 184 -153 66 237 -128 -43 110 -338 5 242 -225 -330 154 -54 -188
6295 -188 307 127 -16 408 -208 83 112 -2 -105 -40 231 -165 -69 132 -321 81 39 -315 -22 509 -171
6316 -171 107 365 -67 -203 27 -311 -292 182 -170 -198 200 58 -333 213 59 -234 -80 212 -61 -193 29
6337 29 -354 -185 395 -206 100 131 -51 -55 53 -176 -233 -10 161 -263 183 -192 -147 192 22 -63 103 52 -216
6360 -216 100 -247 -173 119 261 37 318 540 -297 237 394 -462 154 439 313 -9 79 27 -109 72 -337
6381 -337 59 203 -15 -274 259 13 0 220 24 -136 -31 74 -188 -86 33 -137 43 106 -229 62 219
6402 219 -167 -42 -5 -19 93 174 -203 -418 338 -26 -126 400 74 -132 -26 -65 -245 -15 45 -15 96 -51
6424 -51 -291 200 161 -139 256 440 -203 -192 418 -357 38 151 158 51 -9 253 55 63 -197 24 157 144 -15
6447 -15 40 28 -187 137 268 -239 120 -28 -26 265 15 -276 33 122 -100 20 146 -111 -37 166 83 35 466
6470 466 98 -310 220 177 29 206 -24 -162 145 -117 -38 191 -29 -197 28 359 -165 -94 -79 -209 -282 220
6492 220 -220 97 452 -135 -155 215 -38 -411 58 -39 -73 352 149 -102 133 116 -20 149 120 -256 210 350
6514 350 29 89 59 -141 -149 409 -200 39 177 -304 11 328 -409 -20 334 155 -122 -14 -16 -110 61 -240
6536 -240 74 -85 66 -227 -87 53 -292 -10 198 -6 238 92 -187 -47 208 -270 20 73 -168 -87 64
6557 64 -287 -132 35 -34 42 350 19 -338 456 -19 -194 136 -75 -448 130 2 -176 -140 176 -368 11
6578 11 243 -173 -19 151 -446 -187 -39 -29 -210 246 112 -169 192 -43 -111 324 73 -80 276 23 -382
6599 -382 86 221 -225 -20 14 -219 187 280 -223 -57 274 -95 0 497 -185 -235 189 -41 -187 156 86 -334
6621 -334 48 -194 -124 -93 2 -512 108 138 -326 109 96 -83 104 330 -139 -95 267 -134 -214 -13 -330 -85
6643 -85 288 -228 -3 281 -146 -67 96 130 -175 341 101 -383 46 92 -398 367 -66 -204 307 106 -270
6664 -270 126 -33 -273 45 83 -336 371 186 -232 49 311 -2 -186 428 80 30 37 21 -330 314 192 -2
6686 -2 135 -22 -205 295 -111 -368 92 -62 -362 -91 188 23 -6 419 -190 14 -6 -248 -6 24 98 -21
6708 -21 9 -32 -324 160 80 -194 260 82 -21 317 -31 -482 284 87 -628 -106 150 -190 -62 171 -459
6729 -459 -11 474 -66 55 12 156 124 187 -29 -262 342 -44 142 221 253 -106 -110 0 -179 163 -27 -199
6751 -199 288 213 -320 333 387 -570 72 -126 -292 57 151 -179 71 -33 161 -46 99 -62 -212 458 -102
6772 -102 -129 263 214 -61 23 45 47 156 114 -209 361 316 -155 83 -1 -134 43 188 -123 77 274 -488 -177
6795 -177 437 -5 -181 439 21 -199 116 -297 -133 391 -43 45 441 155 -380 116 -106 -30 119 443 -143
6816 -143 -96 275 -80 -32 316 -438 -29 406 -166 -81 329 32 204 226 184 33 276 27 -324 326 -99 78
6838 78 96 -324 -226 -135 145 -37 33 143 -316 -105 229 -134 -45 380 -105 -243 447 -179 -112 120 -94 61
6860 61 347 145 -129 296 -136 -27 314 -10 -240 113 50 -169 -67 55 -434 -40 238 -216 269 353 -289
6881 -289 64 128 -226 -173 198 51 -207 225 -30 -431 183 -26 -164 245 56 -301 205 169 -296 127 -126
6902 -126 -218 -73 282 -108 -96 133 -267 183 7 -425 -41 509 -330 -72 515 -287 -314 225 -128 -55 -40 -108
6924 -108 -91 323 200 -319 196 -25 -199 -110 79 -289 224 104 -187 -26 486 15 -113 267 -371 -112 320
6945 320 -432 -227 393 16 -95 372 162 -4 -63 -9 -59 50 72 39 -133 -18 -243 62 107 -115 211 -19
6967 -19 -315 -82 312 -47 152 296 -62 262 319 -24 -90 221 -238 -180 152 -108 -258 121 -97 -340 177
6988 177 171 -367 213 -83 -371 36 207 -466 -76 324 -323 -152 357 -269 -13 341 -246 69 426 -124 -61
7009 -61 288 -206 -70 118 -59 -22 98 -67 -295 230 174 40 69 -10 73 100 103 -79 137 250 -147 -131 406
7032 406 -159 137 153 -75 -265 486 54 -288 353 267 -263 292 -5 5 153 167 -119 57 233 -553 116
7053 116 92 -140 -152 359 -218 253 271 -332 81 433 -162 74 150 -6 -196 233 -177 -166 392 -425 -291 413
7075 413 8 -243 170 91 -79 322 342 -80 59 200 -673 -101 134 -467 74 161 -258 -148 660 -473 6
7096 6 345 -135 -339 284 -115 -315 335 6 -349 349 197 -64 55 243 -457 179 186 -201 185 148 -290 -230
7118 -230 53 -416 12 199 -200 236 271 -183 -212 370 -300 -65 416 51 -156 5 228 -78 -33 -206 -44
7139 -44 239 313 -527 197 329 -489 188 243 -347 161 310 -189 -204 250 -148 -65 254 -275 13 258 -31 -390
7161 -390 314 -62 -130 206 94 -239 381 20 -224 323 132 -302 294 133 -302 142 -37 -207 406 213
7181 213 -216 -26 341 58 -160 192 -238 -12 -57 -40 -252 336 117 -341 317 -52 -30 85 22 -210 -19
7202 -19 225 -230 -94 164 -227 -14 314 11 -86 191 -152 -85 97 -1 -54 304 -2 -164 492 98 -188 -98
7224 -98 -371 -61 295 113 -359 270 138 -200 15 213 -269 -43 -30 -273 53 17 -127 -132 199 -306 -71 344
7246 344 -233 -24 310 -272 -102 132 -106 -299 279 138 -221 105 -263 -206 240 25 -350 381 1 -268
7266 -268 -10 299 -299 92 324 -245 -93 168 -64 -133 353 -274 -141 271 -83 -194 345 -233 -266 271 132
7287 132 107 216 73 -253 -37 33 -61 -95 131 -314 31 334 -169 -104 256 -368 67 177 -129 58 389 -147
7309 -147 -119 35 -175 -331 328 123 -69 284 395 -376 348 27 -648 -119 4 -137 196 -13 -83 -166 321
7330 321 -104 12 -56 -14 -189 282 -131 -187 285 -141 55 158 100 -241 157 72 -39 278 72 -378 28 53
7352 53 -126 -220 94 -359 91 156 -259 60 212 -54 335 468 -150 -73 146 -22 37 348 -10 -163 -78 249
7374 249 -184 243 -54 -143 277 19 -367 365 282 -307 221 136 -163 -112 151 -263 -163 262 -139 41 253
7395 253 -39 51 144 -239 -235 204 222 -215 199 -196 -234 406 25 -375 261 -19 -216 331 218 -225 42 275
7417 275 -369 135 169 -130 -102 215 -26 -76 194 -60 10 -30 -14 -291 272 -72 -488 91 -34 -148 334 -87
7439 -87 -315 277 -17 -192 271 269 -274 150 225 -305 53 204 35 -24 444 -96 -152 327 -260 105 -113 67
7461 67 12 211 88 -210 179 141 -302 335 -84 -300 398 128 -240 359 191 -478 49 62 -355 40 120 -308
7483 -308 -55 334 -150 68 393 -257 -236 333 36 -88 240 269 -302 168 -162 -390 196 -149 -271 97 353
7504 353 -359 -86 -11 -464 81 -35 -207 102 7 -188 173 273 67 168 116 -511 -129 -60 132 -165 255
7525 255 -109 -202 176 3 -107 214 159 -468 4 204 -352 200 70 -107 18 327 4 -124 219 -11 143
7546 143 232 -208 62 113 -177 -148 533 86 -91 292 -116 -378 236 -76 -270 314 202 -273 38 123 7
7567 7 105 135 43 -42 315 -181 -196 163 -16 28 268 -224 -202 463 -75 -76 56 160 -450 314 153 -215 295 -29
7591 -29 -282 65 -10 -125 11 171 162 338 377 -93 -32 301 12 -169 281 -213 153 337 -76 -271 288 -276
7613 -276 -287 173 19 -334 414 16 -5 90 -4 -725 381 164 -316 55 51 -32 18 164 -266 232 39 -294
7635 -294 -153 124 -38 -68 -33 -96 -65 -5 -336 -37 404 -173 0 212 231 -243 200 28 -320 393 0 115
7657 115 147 215 -483 330 304 -401 249 102 -273 -21 246 -128 101 252 -114 -236 563 57 43 445 67
7678 67 -108 72 18 -484 -113 261 -179 123 270 -212 12 357 -191 85 -5 -4 67 176 -144 -33 168 -202
7700 -202 34 368 48 -374 211 -108 -216 279 -180 -216 310 172 -369 126 -26 -480 11 156 -253 42
7720 42 157 -382 -198 269 -146 -31 90 -141 -154 77 -119 -117 316 -169 -86 115 -29 -267 63 -82 -340 9
7742 9 52 -419 157 249 -278 375 42 -96 -49 102 -3 25 98 53 9 464 -409 -189 316 0 -86 312 -210
7765 -210 -258 245 90 45 261 193 -128 311 -10 -146 266 150 -222 99 51 -242 94 27 -169 91 176 -153
7787 -153 -11 259 -209 51 190 -34 -49 24 -228 14 92 80 -209 -120 -6 -343 259 116 -355 94 354 -241
7809 -241 -26 319 -356 235 178 -78 -140 199 -70 -212 527 -24 -110 84 -1 53 136 -299 -222 340 -209 166
7831 166 148 8 -80 132 312 -211 129 84 -237 -36 -192 -182 246 16 -315 -102 101 -288 42 68 -158 -244
7853 -244 201 -158 -185 204 5 -57 -3 -284 -271 288 -51 13 330 -144 -144 -95 -61 -83 141 31 -245 114 454
7876 454 -158 -76 358 -156 -48 376 -66 49 276 -9 -441 159 189 -254 256 -204 -136 302 -36 -471 -192
7897 -192 324 -329 61 346 -170 -92 348 -84 90 190 -177 -7 295 -16 16 154 -90 -274 22 -148 -455
7918 -455 157 -197 -178 230 -5 -235 129 143 -168 -67 54 -151 271 305 -11 75 124 -61 0 150 -211 447
7940 447 116 -209 58 234 -274 -207 165 264 65 234 -156 -114 100 270 -91 -43 130 -310 -31 -10 -312 -26
7962 -26 125 -548 258 491 -123 -192 141 -295 -47 311 -113 62 122 12 -62 274 74 -244 176 33 -343
7983 -343 103 -34 -152 216 110 -133 211 167 -237 189 126 -154 355 363 -119 -12 100 -260 -129 268 -96
8004 -96 -119 152 -131 -153 300 -26 -284 139 -57 -178 222 26 -209 -63 177 -129 107 238 13 -50 136
8025 136 -313 -55 234 -192 120 131 -118 -289 258 -82 14 330 7 19 157 -182 -292 139 94 -145 242
8046 242 144 -282 203 -100 -24 113 233 -9 282 199 27 31 132 -263 -148 353 -470 -238 160 -315 -323 433
8068 433 -98 52 -38 3 79 61 -307 -141 -44 294 -163 12 118 -67 516 157 -244 280 109 -335 179 293
8090 293 -34 -56 112 -145 -198 55 -71 -48 353 -161 186 195 42 -43 184 -58 -160 68 88 -60 91 -100
8112 -100 -168 278 18 -314 -3 55 -288 88 64 -228 -257 156 -249 -76 0 -236 123 128 -128 -139 277 -261 -191
8135 -191 107 -132 -64 155 192 -306 54 222 -213 47 2 -162 268 448 -355 -27 255 -310 159 352 -111
8156 -111 188 -8 -221 -87 79 89 116 340 -88 -231 183 259 -283 23 -142 -286 31 21 -190 231 15
8177 15 -101 228 130 -146 81 317 -196 -36 302 -234 -93 151 -167 -45
8191d5
$$ Imaginary data points
##PAGE= N=2
##DATA TABLE= (X++(I..I)), XYDATA
0 0 0 0 0 0 0 0 0 0 0 0 0 0 0 0 0 -3 8 -8 8 -8 9 -13 16 -17 21 -24 27 -33 37 -43 50 -55 63 -71 80 -92 102
37 102 -113 128 -140 156 -173 191 -214 234 -258 285 -316 347 -382 421 -464 511 -564 624 -693 771
57 771 -864 969 -1095 1250 -1442 1689 -2018 2482 -3175 4333 -6584 12503 -59647 -106283 98010
72 98010 26490 -54793 66775 23263 -53453 83443 49541 -72386 23937 46012 -47200 18402
84 18402 12315 -75439 10997 19935 -90209 5678 56687 -61098 7042 73305 -55007 3240
96 3240 101103 -55211 -59378 86751 -15184 -65783 62165 -1482 -54620 71095 14067 -76039
108 -76039 47434 45421 -52803 16087 8953 -57060 41305 26396 -94283 -3607 38016 -68235
120 -68235 3486 54496 -54025 19725 99049 -37957 -10575 102040 -18884 -47026 58866
131 58866 -29962 -60593 53194 -25918 -82752 45639 6583 -72838 31769 19409 -46445
142 -46445 54601 34127 -62615 46398 67768 -54312 2740 36861 -59150 9814 52505
153 52505 -71965 -19210 77278 -28889 -28162 53297 -34014 -28269 63083 -36249 -58472 64485
165 64485 -1192 -60533 45059 5496 -51716 54618 18347 -67941 45418 53023 -54184
176 -54184 20322 48297 -45922 10701 35226 -69486 -9123 54678 -50028 -29411 42389 -32029
188 -32029 -6686 57779 -46154 -35286 75020 -10484 -45438 58748 2219 -37359 66080
199 66080 3420 -71605 48336 32312 -72115 10693 28152 -54636 16622 34301 -60816 5363
211 5363 51428 -45984 -9949 47367 -28402 3571 53164 -40545 -12994 68137 -31540 -45616
223 -45616 48732 -17587 -40046 53795 -13251 -55686 62484 24302 -63502 26102 27600 -47791
235 -47791 21938 22387 -58851 17119 44861 -49760 -6838 37929 -32376 6179 41390 -43106
247 -43106 -131 66090 -29268 -26257 51067 -24372 -34593 42963 -31043 -50075 58031 2579
259 2579 -59248 40389 25944 -39100 34792 19267 -51330 30764 37505 -54339 2503 36303
271 36303 -38197 1627 26499 -50757 1245 52681 -38059 -17612 52703 -17812 -13557 48233
283 48233 -28919 -32276 55164 -14334 -54528 39888 8420 -39650 36060 8285 -46651 37386
295 37386 25625 -54215 13684 34274 -37227 8312 25617 -43246 9582 43209 -43483 -13212
307 -13212 45599 -22797 -10816 40933 -26897 -16037 52919 -22593 -44636 39566 -3297 -38018
319 -38018 32822 -2538 -37864 45419 18129 -49694 25193 30674 -39070 11573 21030 -41913
331 -41913 15144 35611 -46667 -6989 41310 -27959 -9307 33844 -29217 -7254 49422 -26074
343 -26074 -29885 45324 -7982 -33877 30078 -11930 -33751 44150 5162 -44482 35335 26933
355 26933 -34718 19246 17231 -39008 18609 24336 -50348 -1956 34246 -32777 -8140 26108
367 26108 -30862 -923 42791 -27111 -15085 49816 -6448 -20342 34546 -12885 -25029 38979
379 38979 -10968 -45713 30316 10794 -38115 20388 11731 -33245 25983 19113 -45210 10977
391 10977 33203 -32257 39 26419 -29387 4482 35177 -33594 -11018 43327 -16707 -18033
403 -18033 33824 -13955 -16292 38750 -16070 -36529 33639 517 -37821 21436 4416 -30837
415 -30837 27936 12168 -39459 21785 28839 -32802 6840 24828 -27025 10291 30043 -33678
427 -33678 -3207 37883 -24664 -18499 26934 -19392 -14362 30940 -21564 -26549 36602 -2443 -30340
440 -30340 25579 3696 -21856 31365 6814 -31587 29364 22575 -34376 8273 16661 -31661
452 -31661 7523 17305 -39927 99 33438 -26804 -10410 30683 -15502 -5167 31465 -20578
464 -20578 -16208 38528 -7334 -26590 24970 -3502 -21945 26847 -4466 -30808 31391 14596
476 14596 -32423 16525 16766 -27401 13875 13100 -40049 4170 26002 -32735 -8504 26454 -17407
489 -17407 -318 30727 -18383 -5467 40383 -8507 -18630 27110 -6101 -19197 22525 -13689
501 -13689 -32069 24178 -190 -35707 16523 12763 -22180 21129 15770 -27550 18394 27571 -28675
514 -28675 -287 23875 -22033 -2847 19800 -26200 -5672 31333 -18025 -16653 27080 -8049
526 -8049 -12941 25788 -11653 -20422 30269 -3154 -31650 19385 6382 -25049 18065 7994 -26962
539 -26962 21669 22506 -27970 7169 23797 -21128 1416 17097 -27039 -1946 25243 -25557
551 -25557 -14958 24817 -12818 -11711 23784 -13101 -12757 33320 -3558 -23574 26579 7526 -20743
564 -20743 18324 2245 -26406 19147 11700 -32047 6316 16910 -22923 3172 13045 -24643
576 -24643 5282 24080 -23832 -5285 28455 -11598 -6210 23846 -14582 -10139 29806 -10906
588 -10906 -23458 23873 15 -21976 17005 -876 -21985 21539 7185 -28632 12990 15754
600 15754 -21183 8249 12161 -22961 9229 18615 -27700 -1904 25543 -15699 -4437 22573
612 22573 -15312 -4439 29254 -13650 -18311 24949 -4826 -21737 15187 -6224 -20346 20198
624 20198 14 -26435 17734 13633 -18595 13477 12794 -17701 15749 17314 -26559 2152 21142
637 21142 -21588 -8092 14648 -20138 -4569 23446 -16925 -12529 27252 -3481 -13615 19775
649 19775 -3628 -12452 22146 -4276 -23715 18506 6384 -22098 11816 6475 -19875 15761
661 15761 12683 -25238 8502 21560 -20967 -2126 15720 -19649 -2588 18942 -20543 -9823
673 -9823 24698 -8112 -11088 20593 -4375 -7910 23817 -6021 -18143 22538 2251 -22221 12533
686 12533 1236 -21702 14461 5946 -26999 10635 17963 -21228 2217 17814 -15242 3382
698 3382 18792 -18742 -4243 22734 -11726 -10183 17684 -8138 -7367 19423 -10616 -14630 22315
711 22315 -2457 -20243 15291 883 -18139 16305 3355 -23762 14388 14597 -21685 4998
723 4998 15837 -15071 5067 15273 -19145 -254 20635 -14930 -8282 16132 -10911 -5678 17419
736 17419 -13206 -10556 23367 -5694 -17536 17001 -997 -15587 17468 -40 -21347 17173
748 17173 10242 -22275 8189 13809 -15480 7075 11966 -19568 3568 18312 -17807 -6228 14751
761 14751 -12898 -4148 15083 -14558 -7074 23250 -7139 -13429 18893 -965 -11893 17295 -3203
774 -3203 -18725 17150 4957 -21847 8970 8797 -16758 7926 8688 -18794 7662 16461 -17720
787 -17720 -1032 15815 -12898 -1713 14489 -15416 -4970 20375 -10919 -12128 18841 -3351
799 -3351 -10079 16958 -4447 -14114 18523 1503 -19973 11440 5816 -16537 9267 5316 -17982
812 -17982 10301 12614 -19101 2986 15700 -13453 1036 14121 -15532 -1916 18654 -13811
824 -13811 -9414 18135 -5827 -9153 15518 -6127 -10653 18669 -1901 -16805 13611 2779 -15633
837 -15633 9838 2479 -16295 12299 8359 -19410 5940 13819 -14198 2691 12119 -15340 1506
850 1506 16427 -15511 -6503 17422 -8297 -8153 14068 -7232 -7223 18339 -4561 -13399 15294 1321
864 1321 -13659 10640 -181 -15372 12514 3634 -19803 8406 11435 -14636 5212 11101 -13757
877 -13757 5664 15295 -15610 -2521 16773 -10523 -6910 12186 -10076 -6681 15959 -8069 -12023
890 -12023 16224 -286 -11116 12456 -302 -11662 13713 1498 -17470 10196 7754 -15396
902 -15396 5595 7622 -13945 6965 12175 -15450 1205 15590 -11403 -4160 12257 -10514 -4758
915 -4758 13964 -10926 -10031 15415 -3248 -10633 12793 -1207 -8971 14891 401 -13625 12854
928 12854 5859 -14414 6343 5173 -13854 6626 7497 -17169 3108 12927 -12945 -1557 11874
941 11874 -10244 -1061 13622 -10985 -5821 16553 -4983 -9116 12846 -3396 -7947 13729 -2922
954 -2922 -12397 13053 2513 -14348 7588 3415 -12578 8228 4692 -16062 5827 10776 -13413
967 -13413 930 11515 -10128 1002 12109 -11550 -3063 15752 -7112 -7365 12264 -4520 -6545
980 -6545 12296 -4451 -10539 12664 -91 -13143 8451 1906 -11271 8333 2322 -14011 8401
993 8401 9189 -12564 3974 10612 -9671 3209 10783 -12208 -825 13473 -10267 -7143 11070
1006 11070 -6829 -6490 10774 -6389 -8277 13292 -1501 -10205 10865 1827 -8605 10139 1086
1019 1086 -12328 9514 5525 -13911 4661 7554 -11206 4039 8381 -12043 2192 12338 -10588
1032 -10588 -3989 11067 -7166 -4585 9605 -8122 -6619 12417 -3661 -8676 11074 567 -7020
1045 -7020 10430 147 -9442 10810 3349 -12712 5392 4739 -11679 3486 4843 -12441 3127
1058 3127 9984 -11254 -1330 10959 -6868 -1718 10124 -7252 -3533 12190 -5409 -7553 10491
1071 10491 -2197 -7065 8962 -2163 -8485 10618 933 -11606 7323 4001 -10238 5622 4028
1084 4028 -11566 4997 7798 -11639 1365 10010 -7869 -144 9154 -8094 -1469 11454 -6644
1097 -6644 -5652 10277 -3634 -6508 8579 -3500 -7341 10138 -1025 -10338 8078 2932 -9408
1110 -9408 6172 2984 -9665 6267 5983 -10732 2828 8532 -8337 526 7449 -7973 153
1123 153 9411 -7965 -3941 9711 -5101 -5474 8405 -3987 -5203 9848 -2387 -8566 9260
1136 9260 1750 -8347 6696 1774 -8350 6733 3252 -10699 4228 6632 -8882 1491 5809
1149 5809 -8180 2237 8432 -8663 -1332 9681 -5906 -3735 7952 -5221 -4473 9367 -3947
1162 -3947 -7184 9323 70 -7418 7321 1015 -7086 7328 1969 -9588 4857 4592 -8792 2091
1176 2091 4562 -7964 2636 6558 -8501 -288 8790 -6019 -1930 7870 -4874 -2384 8792
1189 8792 -4970 -6013 9176 -1423 -6836 6432 -428 -6121 7711 962 -8249 5964 3385
1202 3385 -8395 3316 3562 -7551 3001 4821 -8578 1720 7387 -7202 -770 7482 -5669
1215 -5669 -1169 8000 -5511 -3520 8918 -2946 -6123 7006 -1305 -5243 6880 -799 -7333 6694
1229 6694 2042 -7540 4318 2614 -7155 4016 3102 -8214 2603 5858 -7183 351 6655 -5502
1243 -5502 207 7317 -5782 -1983 8454 -4191 -4728 6944 -2475 -4798 6291 -1913 -6104 6757
1257 6757 291 -6894 5061 2049 -5783 4322 2089 -7330 4292 4759 -7570 1220 5286 -5769
1271 -5769 1172 6025 -6428 -619 7823 -4805 -3469 6601 -3240 -3507 6158 -3104 -5081 6457
1285 6457 -789 -6108 5315 901 -5164 5181 1291 -5979 5341 3024 -7352 2679 4277 -6229
1299 -6229 1504 4410 -6694 339 6415 -5900 -2229 6558 -3225 -2556 5826 -3079 -3204 6841 -1764
1314 -1764 -5012 5197 -142 -4563 5103 260 -5371 5096 1832 -6332 3243 3029 -5920 2482 3442
1329 3442 -6500 1355 5150 -5851 -705 5734 -3924 -1524 5383 -3286 -2078 6231 -2507 -3647 5525
1344 5525 -811 -3800 5050 -874 -4563 5333 511 -6121 3757 2230 -5639 2891 2421 -5794 2600
1359 2600 3975 -5765 643 4977 -4113 -172 4993 -3981 -958 5498 -3551 -3158 5229 -1965 -3643
1374 -3643 4346 -1484 -3833 4856 -404 -5421 4580 1765 -4612 3350 1628 -5009 2802 2838 -5584
1389 -5584 1215 4120 -4646 161 3936 -3912 -88 5101 -4054 -1892 5361 -2423 -2701 4364 -2133
1404 -2133 -3080 4722 -1146 -4280 4610 833 -3976 3407 1465 -4040 3192 1901 -5015 2056 2912
1419 2912 -4874 579 3238 -4563 580 3738 -4254 -801 5059 -2533 -2122 4551 -2055 -2292 4856
1434 4856 -1680 -3456 4349 -337 -4022 3504 544 -3591 3555 955 -4348 2547 2506 -4096 1770
1449 1770 2579 -4045 1052 3196 -4657 -10 4489 -3313 -1102 3876 -2369 -1360 4362 -2138 -2414
1464 -2414 4442 -746 -3233 3451 -325 -3099 3301 107 -3991 3147 1569 -4018 1955 2156 -3447
1479 -3447 1873 2656 -4311 891 3602 -3349 -158 3615 -2564 -658 3708 -2696 -1789 4095 -1287
1494 -1287 -2801 3544 -450 -2673 3541 -394 -3415 3371 813 -3580 2287 1296 -3504 2085 1613
1509 1613 -3804 1214 2849 -3692 231 3082 -2793 -108 3142 -2758 -840 3937 -1788 -1932 3173
1524 3173 -1136 -2190 2965 -985 -2775 3214 94 -3498 2605 807 -2983 1965 908 -3323 1833
1539 1833 1907 -3426 452 2551 -2800 545 2456 -2796 -392 3547 -2430 -1160 3489 -1438 -1572 3055
1555 3055 -1368 -2119 3536 -454 -3161 2457 251 -2724 2282 704 -2838 2158 1478 -3379 1118
1570 1118 1862 -2601 596 2045 -2872 161 2751 -2770 -781 2851 -1624 -1008 2651 -1634 -1641 2998
1586 2998 -836 -2276 2669 -312 -2465 2401 36 -2395 1980 1047 -2884 1485 1440 -2708 759 1428
1602 1428 -2468 619 2083 -2498 -174 2391 -1728 -588 2460 -1729 -761 2779 -1405 -1393 2529 -304
1618 -304 -1906 2378 -393 -2135 2071 246 -2583 1597 914 -2364 928 1125 -2285 1208 1642 -2414
1634 -2414 293 2026 -1638 -87 1871 -1654 -212 2366 -1449 -1287 2644 -1000 -1368 1956 -642
1649 -642 -1639 2084 -495 -1982 1579 702 -2092 1263 782 -1823 1315 1048 -2226 798 1535 -1683
1665 -1683 169 1408 -1600 203 1950 -1698 -331 1991 -907 -785 1828 -686 -1105 1668 -697
1680 -697 -1838 1774 -48 -1754 1408 378 -1501 1306 624 -1904 927 1019 -1764 519 1109 -1497
1696 -1497 264 1584 -1504 -506 1659 -1053 -690 1581 -1187 -506 1753 -697 -965 1748 -345 -1460
1712 -1460 1336 -203 -1336 1206 90 -1628 1103 403 -1613 635 723 -1369 592 906 -1343 114
1728 114 1576 -1379 -169 1322 -1059 -362 1282 -919 -786 1543 -475 -916 1188 -104 -787 1392
1744 1392 -65 -1305 1228 315 -1422 688 335 -1237 536 502 -1474 416 847 -1442 55 1307
1760 1307 -1182 -82 1158 -669 -267 1354 -513 -690 1344 -363 -665 1119 -296 -971 983 160
1776 160 -1116 908 226 -988 995 587 -1205 461 746 -1023 50 761 -972 211 641 -642
1792 -642 130 965 -784 -82 1083 -404 -374 1032 -187 -754 949 -199 -664 906 85 -907 908
1809 908 15 -744 975 455 -736 577 706 -781 160 517 -1005 454 881 -839 8 1058 -792
1826 -792 -38 764 -522 -449 1100 -454 -635 567 -304 -518 822 -114 -889 968 -90 -723 719 79
1844 79 -656 501 185 -965 206 260 -566 3 458 -850 120 575 -633 -248 637 -811 -305 508 -581
1863 -581 -148 673 -290 -336 697 6 -325 770 -84 -470 398 27 -700 496 142 -583 284 188 -664 351
1883 351 477 -631 79 264 -588 64 441 -493 -147 491 -396 -306 562 -379 -178 514 -384 -296 524 -144
1903 -144 -201 412 -192 -465 494 -125 -576 142 142 -571 471 310 -571 270 470 -635 68 222 -538 309
1923 309 563 -500 -126 371 -252 -316 636 -367 -156 500 -443 -420 620 28 -480 513 -346 -503 294 -47
1943 -47 -405 679 -241 -549 282 15 -437 382 140 -518 327 365 -318 -299 391 -504 199 368 -608 37 449
1964 449 -329 -159 377 -607 -239 598 -252 -500 603 73 -533 430 245 -656 334 38 -457 490 223 -817
1984 -817 177 247 -474 44 375 -520 168 622 -384 -247 363 -458 -307 427 -525 -8 610 -183 -168 668
2004 668 -71 -90 603 71 -335 358 172 -518 478 87 -645 584 108 -507 548 292 -364 365 521 -287
2024 -287 -24 357 -569 -100 624 -657 -154 975 -396 -285 559 -418 -466 725 -14 -345 490 20 -416
2043 -416 680 62 -765 486 299 -786 563 366 -619 427 435 -577 379 572 -837 -86 702 -465
2061 -465 -233 783 -413 -250 609 -206 -313 712 1 -457 562 -49 -332 519 -74 -716 554 53
2079 53 -629 652 328 -633 556 492 -778 32 660 -547 0 671 -704 -105 622 -612 -295 707
2097 707 -230 -655 917 -507 -452 749 -173 -347 660 -122 -840 638 249 -826 410 118 -1089 393
2115 393 577 -658 192 718 -572 250 483 -841 -213 1046 -569 -268 934 -558 -290 701 -331
2132 -331 -633 716 -42 -703 772 -24 -950 536 300 -662 724 607 -919 189 578 -840 204
2149 204 788 -952 190 666 -542 -102 737 -272 -338 1005 -535 -547 1054 -450 -331 767 -411
2166 -411 -682 804 -25 -888 819 89 -822 549 312 -742 571 573 -1002 190 933 -860 4 689
2184 689 -746 -75 580 -740 8 861 -500 -405 933 -265 -558 938 -84 -932 930 316 -751
2201 -751 712 185 -630 937 412 -998 396 860 -991 265 484 -797 -2 895 -713 -201 1108
2218 1108 -889 -178 957 -324 -345 1059 -589 -680 967 -373 -826 995 37 -937 666 103 -1023
2235 -1023 885 380 -1125 565 650 -803 98 635 -907 90 739 -903 -207 1072 -737 -532 1019
2252 1019 -618 -411 948 -663 -731 773 -318 -737 1091 -158 -695 1004 116 -846 731 249 -1191
2269 -1191 441 369 -836 557 690 -956 -106 877 -876 -35 821 -937 -234 1148 -403 -472 814
2286 814 -522 -385 1073 -330 -806 1061 199 -793 978 325 -983 631 377 -1196 485 315 -994
2303 -994 466 825 -968 -127 777 -897 23 887 -782 -312 815 -548 -576 971 -350 -808 898
2320 898 -285 -684 727 38 -801 1026 -58 -1240 778 356 -1157 389 512 -712 112 673 -1141
2337 -1141 175 1166 -1092 -24 892 -540 -409 768 -359 -345 916 -270 -815 1091 -19 -1167
2353 -1167 806 151 -957 880 66 -897 767 424 -1062 221 474 -948 405 799 -997 342
2369 342 881 -684 141 1096 -526 -138 868 -366 -570 1152 -105 -664 891 31 -992 1057 -127
2386 -127 -1039 858 412 -1117 742 353 -829 705 467 -613 260 816 -1165 -66 866 -758 -303
2403 -303 1013 -901 -639 999 -397 -763 1166 -320 -809 1196 85 -792 900 44 -831 861 271
2420 271 -954 435 502 -1031 179 682 -932 338 718 -775 69 866 -877 -248 1075 -456 -202
2437 -202 1183 -373 -538 1030 -149 -877 1108 2 -861 998 -41 -682 850 352 -991 449
2453 449 698 -863 410 607 -743 57 1194 -893 80 828 -631 -259 886 -738 -516 1120 -459
2470 -459 -480 1191 -609 -829 875 -265 -839 747 118 -973 982 515 -780 741 551 -1085 199
2487 199 653 -950 208 1013 -899 110 848 -907 -249 999 -489 -350 842 -647 -675 950 -156
2504 -156 -776 811 -141 -742 927 102 -1158 851 335 -1134 587 371 -1194 550 796 -1241 246
2521 246 571 -976 -118 992 -741 -425 954 -632 -444 1081 -359 -565 851 -385 -803 733 -27
2538 -27 -1113 945 170 -762 592 538 -989 479 502 -1144 407 905 -1034 -102 900 -954 -1 859
2556 859 -1138 -91 1038 -658 -771 1019 -253 -504 1227 -388 -769 965 -301 -1096 645 315
2572 315 -1090 815 338 -1095 215 471 -1394 207 743 -1062 174 614 -988 -77 961 -839
2588 -839 -266 1086 -285 -335 1027 -611 -873 894 -161 -959 857 -130 -1098 818 251 -1025 677
2605 677 462 -1045 678 632 -1035 81 908 -1065 157 554 -1027 32 1143 -906 -516 920 -679
2622 -679 -470 886 -333 -583 1018 -40 -691 741 165 -958 703 258 -1067 742 672 -1021 425
2639 425 639 -1028 91 794 -835 172 817 -991 -436 1063 -823 -302 1046 -515 -470 1103 -457
2656 -457 -598 814 -399 -650 823 1 -896 957 160 -1012 783 323 -1095 559 717 -1152 263
2673 263 647 -1057 60 1043 -929 -529 1283 -423 -449 976 -532 -505 1238 -202 -813 1296 -182
2690 -182 -914 1034 157 -999 697 306 -850 647 271 -962 418 899 -1102 258 801 -824 -47
2707 -47 983 -1048 -290 813 -518 -214 930 -492 -526 890 -105 -657 1051 -222 -807 882 26
2724 26 -870 937 391 -862 438 234 -1175 227 597 -723 -86 689 -732 -20 989 -801 -194
2741 -194 1087 -440 -528 846 -396 -458 881 -87 -841 1106 -50 -868 499 -121 -948 390 390 -750
2759 -750 636 436 -1059 514 870 -965 78 733 -725 -47 904 -605 -61 996 -650 -169 903
2776 903 -419 -736 357 -465 -682 783 51 -869 559 229 -924 562 242 -788 510 561 -747
2793 -747 231 461 -677 200 806 -1116 -141 930 -585 -570 982 -518 -391 767 -633 -520 906
2810 906 -31 -788 789 -140 -749 678 179 -812 976 345 -751 291 469 -839 106 590 -1023 55
2828 55 648 -759 39 795 -744 -408 783 -366 -456 1005 -333 -622 954 -128 -624 919 12 -814
2846 -814 807 369 -833 381 390 -944 406 257 -681 241 731 -680 137 609 -801 -174 592 -679
2864 -679 -265 812 -335 -612 1022 -418 -631 850 -219 -717 644 -248 -508 674 226 -671 534
2881 534 453 -735 432 444 -843 329 646 -655 91 943 -692 -189 759 -634 -522 794 -102 -167
2899 -167 761 -472 -284 697 -103 -702 709 191 -635 305 130 -944 366 421 -810 452 125 -345
2917 -345 181 773 -573 39 586 -617 -223 601 -584 -289 575 -352 -419 631 -18 -519 761 11 -318
2936 -318 454 101 -689 455 261 -685 461 544 -728 278 197 -563 106 370 -328 157 418 -323 -96
2955 -96 393 -367 -366 580 -161 -393 587 17 -272 495 -73 -561 607 37 -545 362 332 -519 244 389 -587
2976 -587 274 580 -804 128 489 -710 -79 437 -306 -389 757 -704 -197 424 -249 -549 686 -396
2994 -396 -330 524 -98 -383 533 227 -449 579 152 -612 264 210 -614 207 484 -485 242 471 -492 242
3014 242 751 -226 -506 511 -288 -268 678 -258 -251 522 -322 -391 323 -100 -452 467 85 -796 516 383 -675
3035 -675 128 361 -503 234 614 -473 271 438 -587 79 425 -356 -19 438 -275 -251 695 -491 -341
3054 -341 570 76 -482 555 185 -583 345 189 -450 437 86 -685 28 217 -394 90 579 -426 95
3073 95 548 -572 167 288 -276 -220 466 -517 -233 413 -317 -214 484 -230 -350 524 -129 -393 326 78
3093 78 -417 368 254 -380 349 277 -759 105 174 -617 -121 224 -421 37 553 -466 -280 711 -139 -322
3113 -322 431 -270 9 313 -246 -683 448 -143 -152 373 111 -534 397 133 -288 81 287 -446 19 440
3133 440 -446 -94 511 -537 -66 693 -271 66 450 -92 -169 458 -297 -418 237 21 -191 670 135 -440
3153 -440 586 78 -429 353 36 -642 27 113 -679 136 246 -582 89 319 -523 84 482 -123 72 409
3173 409 -354 -412 626 -364 -318 418 -191 -577 107 -49 -546 400 105 -417 401 -183 -679 173 129 -526 135
3194 135 343 -598 124 466 -525 106 635 -201 -144 423 -285 -123 398 -430 -215 488 -240 -280 259 107 -357
3215 -357 430 289 -478 388 344 -472 285 83 -455 310 39 -402 -267 265 -575 -188 306 -272 -287 238 -98
3236 -98 -347 151 13 -114 223 -318 -440 290 -63 -172 251 15 -331 129 67 -588 225 477 -413 46 467
3257 467 -289 -70 242 -374 -132 309 -319 -253 685 -100 -241 522 -151 -287 393 -264 -257 297 -75 -212 352
3278 352 100 -292 278 -60 -391 331 228 -594 200 433 -346 212 515 -749 -51 510 -274 -11 546 -245
3298 -245 -171 501 -216 -388 621 23 -171 387 -3 -268 311 121 -312 272 300 -425 193 209 -402 -82 539
3319 539 -117 83 354 -315 128 212 -82 -76 671 -356 -217 453 -68 -242 409 -104 -159 358 -80 -29 314
3340 314 23 -163 181 197 -286 450 153 -372 -47 153 -285 -227 191 -475 -144 524 -211 -369 443 -155 -306
3361 -306 364 -262 -418 552 -40 72 319 -109 -429 516 54 -385 297 193 -330 405 264 -512 53 123
3381 123 -492 119 209 -461 85 454 -262 -185 179 -116 -291 549 -269 -327 120 -285 -396 279 105 -152 579
3402 579 37 -523 142 307 -445 285 308 -376 243 293 -235 -79 188 -292 -273 565 -224 -16 545 31 -139
3423 -139 500 -165 -278 216 -76 -541 450 248 -327 257 136 -359 297 -222 -333 -8 124 -251 64 177
3443 177 -323 -233 314 -266 347 404 -431 -20 507 -409 126 452 -440 -207 160 -79 -442 380 -13 -112 368
3464 368 47 -178 350 327 -216 122 177 -405 127 384 -436 341 88 -89 -26 314 -277 -177 361 -52 -172
3485 -172 555 -298 -175 554 -57 -195 144 -70 -386 368 152 -251 191 94 -410 126 22 -208 317 242 -274
3506 -274 188 118 -174 -29 554 -251 -178 -33 -376 -192 161 -146 -372 227 -17 -264 479 -180 -297 421 80
3527 80 -385 290 196 -494 282 -52 -760 157 423 -401 110 197 -223 -85 401 -625 -9 629 -168 -104 287
3548 287 -470 -147 313 -209 -290 443 137 -429 169 133 -261 254 264 -413 333 -66 -386 254 307 -418 137
3569 137 208 -269 -122 486 -490 140 64 -394 -203 238 -122 -296 396 2 -112 146 46 -98 270 -42 -385
3590 -385 315 60 -232 152 199 -438 -52 429 -390 147 120 -501 -214 264 -294 94 140 -4 -110 130 -311
3611 -311 -112 299 8 -95 201 85 -129 427 142 -160 217 98 -305 156 79 -256 105 235 -378 291
3631 291 451 -361 109 304 -350 -20 372 -301 -175 343 -527 -182 320 -196 -375 182 -12 -8 177 119 -329
3652 -329 619 48 -450 458 123 -311 226 404 -342 196 286 -195 106 400 -349 -203 210 -223 -54 381
3672 381 -6 -234 112 -117 -73 410 -160 -340 434 192 -342 111 34 -222 44 -92 -125 -30 320 -399 -131
3693 -131 131 -158 1 246 -341 -193 237 -308 -137 543 -243 -80 392 -30 51 154 -89 -182 269 285 -277
3714 -277 70 25 -324 358 359 -580 101 483 51 156 -32 -425 72 141 -41 -14 340 -136 -11 77 -271 208
3736 208 297 78 -147 249 -96 -405 238 -254 -229 147 -153 -276 -24 316 -111 -48 211 -196 -5 547 -480
3757 -480 63 257 -203 -133 522 -341 29 342 -223 -171 -15 -12 -335 373 14 -178 -24 189 -155 127 23
3778 23 -177 305 107 -459 127 69 -641 105 322 -440 -115 285 -86 -52 434 195 -170 369 -272 -296 145
3799 145 96 -215 61 -161 -336 181 248 -134 -20 12 -131 31 159 -81 65 185 -147 81 392 -126 -42
3820 -42 131 -213 91 486 -286 -174 113 -88 -129 128 -245 -106 263 88 -231 62 -24 -404 299 136 -292
3841 -292 226 307 -489 32 67 -216 184 79 -331 31 136 -247 -127 348 54 -203 488 -153 -396 437 202
3862 202 -217 643 -160 -322 189 166 -399 273 230 -267 -107 272 -432 -161 222 -296 -71 246 -345 -358 543
3883 543 -202 -274 297 -131 -226 373 -125 -209 35 70 -77 30 -72 -378 357 -12 -467 24 313 -307 284
3904 284 137 -350 -282 270 -251 -147 129 -141 -131 357 -226 -208 371 -173 -328 435 5 -397 356 169 -127
3925 -127 -10 -247 -362 197 28 -220 270 -98 -169 400 324 -327 -139 210 -279 10 247 -115 21 225 -207
3946 -207 -226 121 -242 -270 118 52 -398 244 -51 -66 -82 157 -336 363 127 -432 -47 340 -336 188 311 -277
3968 -277 -124 108 -252 137 418 -252 -192 293 -83 -141 197 -226 -73 301 129 -322 446 146 -213 131 19
3989 19 -351 281 157 -245 253 250 -221 140 159 -386 -6 295 -252 -169 321 -75 -210 390 -262 -461 328 -342
4011 -342 -288 428 -168 7 396 200 -182 367 309 -318 170 82 -104 8 372 -258 114 9 -231 105 277
4032 277 -168 -195 33 -450 -320 292 -105 -272 468 -233 -217 335 -4 -525 358 -123 -271 143 245 -213 -9
4053 -9 310 -229 -33 293 -183 175 -152 -292 -365 312 -336 -35 471 -99 -69 89 -38 -361 491 363 -181
4074 -181 185 -27 -133 275 66 -264 115 288 -226 70 113 -44 76 206 -279 290 319 -265 -128 257 -374
4095 -374 -2 226 119 -110 331 -112 -194 211 72 -272 128 73 -293 163 38 -165 189 -154 -394 255 230
4116 230 -221 173 248 -217 -84 18 -336 20 267 82 119 270 -23 -324 497 -79 -200 285 -211 -383 131
4137 131 76 -160 295 -27 -575 240 187 -388 255 52 -341 -234 163 -198 46 65 -24 120 248 -375 -24
4158 -24 153 111 -192 146 -88 -197 373 -70 -135 293 69 -21 152 3 -228 194 369 -165 362 53 -113
4179 -113 -21 458 49 8 54 -41 114 122 90 180 504 45 -305 -5 35 -37 82 71 -342 142 198 -173 67 58 -227
4204 -227 136 53 -201 73 334 -251 18 150 -64 -83 223 -188 -32 138 -486 -86 121 98 131 430 196
4225 196 -55 195 52 -66 108 254 -132 -164 148 -144 407 164 -34 72 157 -309 -151 221 -375 17 34
4246 34 145 -210 183 -77 53 307 -120 -233 -76 156 -122 209 -126 -16 -100 368 -34 -2 449 -188 135
4267 135 455 -552 -47 9 -191 -31 87 -194 -120 213 -219 -184 178 -154 -122 162 -154 -275 402 12 -92
4288 -92 338 66 -69 -44 84 -149 125 107 81 22 139 -6 121 165 -156 82 86 58 -9 183 -49 35 232 -18
4312 -18 -51 -35 -36 -308 -59 -250 -279 216 105 -252 173 160 -444 16 85 -202 44 261 -157 46 100 -125 37
4335 37 18 -25 -123 29 144 -200 107 -36 -212 37 -286 -155 101 -106 -189 57 71 -23 -8 303 -66 17 122
4358 122 -287 190 127 -360 121 275 -148 14 -169 -117 57 240 -50 -164 232 104 -201 295 182 -175 69
4379 69 282 -140 78 298 49 117 253 -182 -16 174 -67 -20 215 -81 -285 114 -245 -376 86 -117 139
4400 139 153 -225 -100 0 83 -163 10 223 -5 -13 -12 -147 269 181 43 14 148 -74 147 171 -128 -70 145
4423 145 -73 -123 147 74 -129 -5 410 -59 -6 -32 100 227 171 -71 214 -67 -31 65 -9 -32 16 -75 -38 -192
4447 -192 378 -166 -177 123 -286 -63 190 15 7 172 39 -400 11 68 -206 87 -71 211 281 136 48 382
4469 382 13 -193 99 -32 -206 33 303 20 -116 82 -186 -148 292 -240 66 356 68 172 115 -312 -283
4490 -283 237 117 -342 -107 100 -102 76 50 -219 10 -9 108 49 267 -146 -43 -27 -226 12 -198 -7
4511 -7 125 12 -336 -166 22 3 -108 -65 -244 37 33 -293 13 222 -22 -154 -56 -50 -62 -28 45 -49 170 158 86
4536 86 -98 75 -304 5 279 -184 -26 41 16 37 -127 71 -90 210 -149 -232 33 116 148 -94 259 50
4558 50 -152 83 51 119 58 151 129 -232 -142 -176 170 -87 53 298 -4 96 -116 -25 -116 21 -79 -32 125 -9
4582 -9 67 -8 57 -244 -125 68 -204 -50 -53 110 -19 203 -65 -110 287 -106 -148 284 -107 74 168 45 -47 34
4606 34 219 -101 204 -34 -306 -66 44 -113 -11 126 -91 139 295 -217 85 44 -246 119 344 2 18
4627 18 126 18 54 9 17 192 -130 -132 -77 287 -116 -285 191 -25 74 11 -156 -148 153 230 5 262 -141 -17
4651 -17 -193 -69 -67 -218 425 -199 -120 355 65 -83 -48 -42 -342 1 179 -147 33 313 77 -88 215 -264
4673 -264 -253 59 -159 14 -77 -95 90 -183 -82 -88 68 -67 -57 26 -109 147 73 -166 -156 197 65 -67 42
4696 42 75 45 8 143 -67 -153 -62 -281 52 170 -61 -441 209 -46 -121 334 -212 -89 -162 -59 -250 148 183
4719 183 -199 129 -51 -361 162 -69 -14 -49 -113 -13 105 90 -27 420 -151 -175 70 -59 -286 -14 -1 -147
4741 -147 -161 145 -22 253 71 -54 -160 2 25 108 47 28 35 167 146 -246 219 39 -216 -108 111 -32 -146
4764 -146 -8 -17 -386 73 -249 -42 51 219 -161 -152 278 -177 52 218 -311 -5 -62 35 12 172 -212 134 -63
4787 -63 -169 -181 32 -218 348 71 -40 -67 75 -82 -241 104 161 -353 69 -9 7 250 -38 4 35 268 71
4810 71 153 -5 -285 -59 301 -348 6 -11 -69 -299 147 -43 -190 362 -13 33 264 231 21 -14 -249 -105
4832 -105 178 -102 -303 269 -308 -151 -142 -33 -137 119 122 -150 77 96 83 65 127 21 -31 173 -38 142 42
4855 42 39 -253 4 63 -65 196 -98 41 -152 170 41 209 -70 -250 112 180 43 35 137 168 -87 63 -133
4878 -133 -16 363 -39 -89 39 29 64 395 146 -96 -42 -44 -206 274 -35 -179 280 39 -87 147 254 120
4900 120 76 62 -232 -36 353 -220 131 173 -411 -15 36 -118 104 -74 221 -29 395 -181 -198 185 -187 -222
4922 -222 182 -41 -339 -88 -263 44 -59 307 -254 244 85 -282 81 93 -14 61 -61 -108 144 146 -85 -269
4944 -269 336 -189 47 277 -15 -146 160 150 72 100 -21 128 150 -226 -95 24 228 -192 -57 -82 -281 191
4966 191 121 -249 23 167 -61 -119 80 -53 -243 129 -36 -148 374 124 -183 179 23 -236 10 54 -171
4987 -171 10 202 22 116 -70 -265 -188 344 -297 -89 289 -166 -16 232 49 -88 259 -212 -16 205 64
5008 64 -101 -4 262 -110 -86 -13 -295 194 97 -401 351 271 -108 208 276 -17 122 510 -81 65 207 -43
5030 -43 -31 266 151 -137 172 194 -449 195 81 -152 118 -154 -103 131 -41 -446 14 138 -320 131 260
5051 260 -252 62 267 -160 -226 168 109 123 248 47 -301 -27 193 -103 169 -61 -57 5 78 -65 -5 -19 -177
5074 -177 117 181 -366 62 -18 -139 32 71 -74 70 232 -43 -75 60 -238 -177 291 55 -15 89 25 -240
5096 -240 61 -264 -274 281 108 -81 238 -42 -141 358 115 -257 -38 89 -128 29 195 -140 -160 103 -243
5117 -243 18 207 -164 -386 246 100 9 152 126 -23 -157 21 -385 471 246 -353 20 -71 -86 34 -23 -216
5139 -216 145 206 -217 -160 190 -221 136 275 142 -155 380 -78 140 386 -170 -59 -64 93 -235 -9 40 -110
5161 -110 138 -74 -65 102 -11 -65 -201 24 -215 178 31 -283 -72 200 -307 -3 245 -77 -179 -10 31
5182 31 -195 112 139 -116 256 -89 -212 72 -87 -161 315 62 -435 84 -96 -183 3 372 -248 80 111 -181
5204 -181 -126 152 -227 -95 41 46 -183 465 -228 -175 7 19 -170 119 101 -98 211 0 -438 134 68 -211
5226 -211 75 -138 -74 75 187 -325 46 139 -59 -427 605 -255 -170 190 20 -80 181 144 -91 269 -41
5247 -41 -315 245 175 -263 -77 9 -220 -57 -26 -7 96 350 -25 -121 283 -165 180 132 -23 -110 191 -144 20
5270 20 19 -52 -252 28 -32 -103 335 -27 -157 71 29 -222 294 332 -375 168 129 -166 16 307 -183 40 258
5293 258 -89 251 83 -189 -113 333 125 48 147 -176 -118 192 398 -1 -125 61 -124 -161 -188 -176 147 57 -167
5316 -167 -8 287 -527 -281 287 39 -84 189 -262 -125 136 -328 153 532 -52 -343 155 -309 -249 182
5336 182 -68 -265 16 -12 -91 36 -222 -118 151 -172 -453 123 2 -91 96 379 -270 -181 254 -197 -153 238
5358 238 -149 -284 320 -366 -176 93 -390 -34 181 128 -351 120 21 -176 69 165 -123 -44 277 -266 81
5379 81 156 4 -216 377 33 -192 -62 -278 -277 226 32 -149 414 -2 -183 48 15 -286 122 -74 -185 269
5401 269 5 -315 244 300 19 -192 209 -395 -202 249 -164 -116 -156 -169 -64 94 -142 -251 373 -131 -150 252
5423 252 -42 -108 -90 164 -295 29 275 -89 105 369 -121 383 387 -209 -150 110 -28 -104 -47 -254 -83 23
5445 23 -69 109 207 -199 -9 260 -43 -330 330 24 -246 109 -4 -279 183 37 -103 179 42 0 295
5466 295 286 -22 24 233 63 52 225 -347 -105 336 -554 -150 232 65 -124 140 38 -276 355 108 -157
5487 -157 30 -49 -119 239 309 -369 184 82 -499 51 -161 -110 -39 103 -61 -29 104 10 -158 239 -100 -258
5509 -258 249 -89 -89 57 -3 -276 149 36 -279 353 23 109 -28 366 -196 39 447 -130 95 105 -188 -229
5531 -229 390 -137 -117 179 -152 -245 151 -130 -571 456 -153 -161 277 4 -128 47 -59 -249 96 96 -136 -115
5553 -115 184 -538 301 39 -199 -167 172 -225 -211 227 -416 203 -175 -1 32 537 54 69 338 -107 -202 276
5575 276 237 -273 267 -180 -303 243 101 -336 160 -158 -270 68 95 -244 -13 321 -304 140 351 -236 60
5596 60 116 205 -162 63 -95 -326 293 10 -447 83 81 -254 77 96 -151 202 131 -561 -16 159 -390 -162
5618 -162 147 -394 65 263 -22 -11 156 -55 -138 586 -174 -57 137 113 -218 47 128 -569 -19 179 -253
5639 -253 174 297 -318 155 -69 -184 205 319 -57 300 250 -290 49 372 -77 81 235 -171 -201 181 41
5660 41 -255 530 38 -430 105 233 -156 110 -104 -179 287 276 -44 153 -26 -303 49 180 -394 251 258 -19
5682 -19 12 205 -180 -149 584 -278 -250 570 -136 -125 102 163 118 375 1 -106 -45 155 -188 196 322 -273 79
5705 79 -177 -220 127 474 -167 -148 125 -122 41 545 -11 -248 188 -271 -298 314 13 -325 -31 233 -255
5726 -255 450 72 -75 200 -77 -455 80 19 -337 85 229 -369 100 118 -328 0 36 -476 -311 166 -306
5747 -306 -182 373 -87 -14 158 -46 -386 265 61 -122 258 260 -4 136 -187 -340 113 269 -354 149 233
5768 233 -91 39 127 -108 -104 249 -50 -143 290 -279 -127 262 -219 -15 131 -2 -316 156 -23 -360 234
5789 234 40 -55 -28 -13 -20 66 415 -402 -69 211 34 186 311 -407 7 369 -344 34 151 -92 -163 553
5811 553 -79 -277 224 -38 -322 85 172 -123 4 10 -236 193 66 -482 185 243 -414 -66 483 -106 -82 440
5833 440 -286 -70 240 -269 -180 206 120 -64 172 -21 -137 319 -181 -265 200 61 -84 279 179 -319 -72
5854 -72 116 -179 -3 430 -307 -11 286 -336 -38 135 -371 24 362 -195 -249 192 -243 -329 161 -11 -179
5875 -179 278 169 -156 239 113 -264 16 126 -397 78 98 -513 -175 247 92 145 221 -125 -68 308 -258
5896 -258 -174 19 -333 -47 254 -39 -353 100 52 -212 96 -20 -420 316 283 -219 283 -44 -279 193 178
5917 178 -139 121 227 -251 258 403 -233 -154 382 97 116 341 -210 -91 230 21 -154 128 308 -267 393
5938 393 44 21 70 175 -107 264 286 -301 175 109 -206 -287 264 -80 -27 321 -35 -214 140 -159 -105 128
5960 128 27 -220 144 -50 -225 292 130 -198 98 243 -214 34 76 -429 -124 -132 -103 -55 129 -87 -104 317
5982 317 -189 -112 25 -279 -73 208 -288 -234 338 -276 -285 96 4 -18 275 28 -183 162 154 -196 170 405 -164
6005 -164 -142 164 -277 -243 200 -129 -129 191 35 -156 304 -83 -94 22 -85 -216 308 78 -29 245 143 -240
6027 -240 5 126 -330 144 226 -392 169 269 -319 172 165 -79 -229 303 -58 -29 28 -133 -1 245 -54 3
6049 3 330 -26 -364 309 -88 -37 322 128 -90 10 123 -121 278 -76 13 -26 99 -254 -50 308 -78 -116
6071 -116 101 -321 -108 196 -98 -196 328 78 -85 359 -83 -154 384 -17 -72 497 -72 -321 -77 -79 -276 292
6093 292 132 -180 51 83 -390 218 215 -257 -112 -26 -8 -136 150 -209 -76 103 -11 -80 246 -257 -108 124
6115 124 56 -343 155 40 -170 271 45 -109 219 88 -116 51 -204 -249 51 204 116 -175 108 52 -4 164
6137 164 120 -49 97 68 -402 166 -164 -65 69 68 -395 -36 179 -254 138 249 -237 44 140 -349 128 58
6159 58 -178 -183 322 137 5 221 20 -6 -38 -142 -202 26 79 -571 -23 52 -286 107 -4 -152 304 22 -170
6182 -170 69 211 -90 -6 -87 -171 35 207 28 -248 11 -177 118 242 -149 -184 218 -46 -58 197 22 -314
6204 -314 116 24 -299 135 46 -342 120 222 9 279 209 -90 -83 159 -347 43 214 -211 -134 82 -181 -103
6226 -103 293 38 -177 199 -72 -390 149 103 -320 41 254 -202 -6 -31 1 0 31 -252 305 356 -305 -89
6248 -89 288 99 89 478 52 -192 136 31 -171 352 -24 -205 411 17 -308 66 150 124 42 286 -243 5
6270 5 263 -131 139 -204 -290 10 87 -473 93 277 -291 7 118 -20 -121 233 -282 -310 194 -28 -447 315
6292 315 -36 -148 314 226 -203 -13 360 -7 53 202 -292 -5 387 -81 50 189 22 -328 22 -141 148
6313 148 -7 33 -17 118 -164 -1 274 -72 -324 94 -25 -192 -109 43 -135 97 198 -65 -16 168 15
6334 15 -54 272 -7 31 -49 -146 -289 390 -138 -179 283 -87 -365 274 -105 -284 236 97 -194 264 -131 -343
6356 -343 -102 103 151 238 284 -127 64 152 -38 -103 281 -21 -282 94 -224 125 211 -256 22 85 184 -98 16
6379 16 289 -297 273 -80 -6 224 4 -246 -204 44 -314 76 325 -236 -110 75 -259 -225 112 -97 162
6400 162 216 -161 -219 341 -86 -137 239 65 -80 145 -105 -376 -48 107 -70 170 -72 -117 180 304 -149
6421 -149 185 416 -5 92 46 -34 -29 213 -114 107 -42 -212 10 156 -61 -56 169 89 -142 127 144 165 307
6444 307 29 -329 177 223 -314 -242 211 -87 234 51 -174 -1 65 -185 32 551 -151 -220 345 40 -15 189
6466 189 73 -131 30 55 -152 133 -40 -227 55 333 -408 116 125 -251 80 -40 -199 -46 357 -44 76
6487 76 202 -62 74 258 -64 -62 76 -10 -260 194 -158 -232 104 37 -21 263 215 -258 -1 -28 -217 149 200
6510 200 -149 102 113 -132 246 146 -167 99 360 177 -236 214 58 -187 196 39 -268 77 67 -344 208
6531 208 461 -170 199 5 -386 33 168 -100 188 27 -112 53 121 -220 171 200 -291 -88 159 -50 -86
6552 -86 162 -57 -19 154 -194 -171 203 21 -165 -2 238 -314 161 -10 -118 -43 116 255 -43 345 -338
6573 -338 148 376 2 -226 303 5 33 293 86 -170 133 -207 -204 107 -21 -464 70 317 -178 101 282
6594 282 -232 -83 154 -422 -38 175 -179 -60 168 -184 -138 103 -230 -27 88 -60 89 195 15 -287
6614 -287 437 -71 -40 251 148 -132 192 68 -362 551 189 -421 63 252 -112 -131 172 -124 -297 276 -261
6635 -261 -65 368 -218 -92 71 50 -123 183 23 -209 202 43 -297 134 -23 -115 210 81 -227 -65 231
6656 231 -132 -29 180 73 143 118 -266 -18 -20 -129 -45 271 47 -94 298 -273 -362 466 -357 89 140 31
6678 31 -248 -81 100 -328 354 78 -152 178 165 -177 -33 293 -2 -253 250 -390 -82 565 -10 -97 36
6699 36 -240 -145 311 -24 -138 193 -83 -144 336 73 -297 268 -253 -214 46 302 -145 32 313 -27 -5 131
6721 131 -33 -109 360 38 -146 331 -161 -79 301 -75 -222 252 -78 -307 140 -171 -154 150 -119 -132 382
6742 382 47 -202 219 52 -305 -125 394 62 285 -11 9 136 239 -321 -130 111 -184 79 327 31
6762 31 -79 294 -113 -523 -17 -161 -442 147 97 -216 -2 199 -304 182 94 -338 -124 186 150 -62 248
6783 248 -153 -146 323 -135 -179 28 -243 -286 227 88 -82 -31 38 -380 377 19 -218 457 64 -70 13 116
6805 116 -256 11 -31 -123 -213 345 -148 -84 58 -236 180 181 -87 48 162 -137 -185 115 -91 -248 65 -7 -394
6828 -394 122 -179 -358 94 -121 -323 29 -119 -398 -183 236 -279 57 203 -164 84 266 -262 -47 272
6848 272 -160 64 168 -86 -382 252 -66 -182 309 -20 -353 -195 76 -144 285 161 -415 -63 -61 -246 -237
6869 -237 229 -226 -75 288 -151 -52 15 -40 -180 350 -22 0 163 169 14 417 -96 113 365 -93 -208 471
6891 471 -149 -118 265 73 -151 50 230 -105 102 36 -250 41 176 -53 -35 341 -104 56 465 -136 -60
6912 -60 118 130 -123 477 -232 -517 277 309 -382 105 88 -122 -61 187 -193 91 0 -361 -320 86 -134 159
6934 159 207 -107 -46 295 -51 -375 68 -276 -163 149 -206 -106 165 209 -340 273 -33 -233 118 -6 -204
6955 -204 102 259 -445 80 530 -205 259 205 -332 114 257 19 -231 345 204 -274 197 -189 -195 423 68
6976 68 -260 174 49 95 -44 203 -291 101 63 -407 53 66 -21 74 252 -132 42 135 -306 14 427 -41
6998 -41 -303 310 12 -175 137 -151 -314 349 102 -147 223 15 -166 484 -62 -230 -50 250 -338 165
7018 165 -207 -324 30 90 -352 -285 332 -331 -81 440 -125 -366 387 13 -111 323 202 -290 189 163 -22
7039 -22 114 -11 -498 107 -321 -306 152 62 -368 69 135 -235 23 124 -338 -15 302 -111 111 174 -113 -56
7061 -56 252 135 -23 162 -182 -272 153 1 -394 63 231 -247 293 49 -226 208 7 -173 277 114 -233
7082 -233 -141 38 -310 -131 112 17 -75 230 -286 -51 278 -31 -579 298 90 -324 223 -48 -245 55 168
7103 168 -139 149 213 -67 270 293 -304 4 224 -190 11 316 -16 48 216 -187 -115 539 -52 -144 361 41
7125 41 -147 309 -348 -382 355 173 -210 82 -66 -116 88 164 -318 27 354 -187 184 -25 -302 -97 105
7146 105 -339 -133 389 -185 -157 431 -27 -27 279 -21 -443 216 108 -109 347 -208 -198 267 179 -306 49 49
7168 49 -288 -56 192 -224 -320 47 -290 -55 101 -370 102 45 -128 -395 141 -100 -464 228 -108 -51 120
7189 120 281 -113 68 144 -107 332 -56 -182 155 185 -345 141 181 -331 -115 524 -206 5 49 6 -25 168
7211 168 -176 -141 320 -121 -184 5 22 -232 300 51 -373 83 19 -138 120 9 -282 86 483 -211 228
7232 228 45 -485 113 23 202 -77 355 -107 69 281 42 35 170 78 -282 378 -119 -121 236 28 -498 206
7254 206 251 -149 93 -102 -138 237 292 -185 -12 -65 -224 -129 265 -229 31 85 -140 -8 281 59 -204 409
7276 409 -175 -344 383 -62 -213 154 7 -297 177 194 -243 68 105 -398 158 254 -296 36 60 19 34 365
7298 365 -308 65 -30 110 73 431 23 -393 271 -63 -12 434 494 -243 76 202 -334 381 246 -208 62
7319 62 130 -317 -319 111 -416 56 266 -214 -254 354 -200 -161 499 -93 193 369 -81 -169 255 -114 -252 259
7341 259 120 -334 -47 266 -238 14 -93 -74 144 278 -140 -67 180 -211 -154 303 -263 -176 467 -455 -17
7362 -17 255 31 -115 161 -187 -33 249 -32 -117 506 -1 -62 -10 208 -443 222 487 -151 187 96 -116 -128
7384 -128 167 -60 -11 319 66 33 215 -123 -171 -96 -158 -374 474 -165 -90 417 -75 7 121 -224 -275 388 64
7407 64 -351 87 199 -326 61 319 -277 246 169 -25 54 387 -52 75 195 200 -173 239 -52 -29 241 -25
7429 -25 -236 310 90 -173 233 179 -359 7 111 -423 -159 109 -321 -104 239 -30 100 181 -7 133 264
7450 264 -124 -56 273 -136 -174 148 -69 -353 236 -37 -347 256 -96 -96 464 288 -232 89 286 -182 158
7471 158 107 -244 54 134 -140 154 431 -242 -147 504 -4 -242 320 -202 91 404 -46 -340 154 -275 -455
7492 -455 350 -46 -443 -100 58 -286 -55 110 -195 -40 50 -76 -67 96 -429 -246 153 -282 -224 148 28
7513 28 -195 226 -319 -375 179 432 -135 270 46 -286 157 -6 -506 148 192 -487 74 165 46 86 172 -262
7535 -262 70 128 -512 -3 479 -31 35 453 -205 -285 323 102 -302 156 -337 -265 317 13 -28 288 -83 -175
7557 -175 192 160 -145 -19 -9 -233 167 295 -146 42 -96 -62 36 204 -151 -152 -99 5 -145 -91 -298 -356 300
7580 300 14 -140 79 333 -233 94 340 -219 189 74 -286 -88 279 -138 -48 587 -173 -37 108 -251
7600 -251 -162 147 -194 -68 221 -38 -146 272 -120 -171 -12 -42 -73 67 114 -145 68 150 -487 239 -112 -217
7622 -217 221 104 -402 -122 182 -97 -51 148 -32 86 597 -100 -150 345 44 51 157 -55 -353 13 -109
7643 -109 -236 102 148 -82 126 12 83 -127 151 -284 75 85 -298 -18 260 -170 43 295 -264 -251 326
7664 326 43 -201 -123 55 -407 312 -30 -93 221 22 -141 137 178 -130 26 -12 -197 139 363 -438 31
7685 31 134 74 -380 184 -107 355 8 -74 53 368 36 -190 -10 -90 -222 79 -90 -414 273 -130 -327
7706 -327 88 -225 -73 119 184 -62 35 100 -190 44 374 -191 -20 236 -375 -214 223 -305 -87 282 -96
7727 -96 -244 334 -67 -166 387 -126 203 351 -23 -200 119 -72 -177 -94 272 -71 26 51 -274 23 274 -442
7749 -442 -86 391 22 -93 348 -142 -98 229 -76 -133 132 -117 -197 -13 -311 -202 -25 108 16 216 96
7770 96 -272 -5 90 -106 -62 239 -40 -66 82 -345 34 195 131 -144 472 -20 -71 303 -101 -220 314 -43
7792 -43 -268 304 -11 -39 -11 101 -367 -62 279 134 127 119 -57 299 70 -2 208 413 -34 2 259 -128 -134 201
7816 201 -85 -278 383 -41 -276 241 -112 -161 149 -45 -11 130 338 -259 102 276 -193 -288 117 39 56 490
7838 490 -303 103 353 -306 -210 25 -390 -12 310 -28 -59 97 77 -239 347 32 -73 37 -120 -40 199
7859 199 -164 1 14 83 -455 197 232 -194 -204 -104 -32 15 186 -402 -145 217 -173 50 231 -97 -347 237
7881 237 28 143 196 30 -36 124 -3 -221 132 -13 -91 84 113 -376 115 264 150 -182 82 -345 -106
7902 -106 256 -290 -7 301 -224 -126 75 -239 -72 349 -165 -356 214 -192 -127 347 -8 -106 142 96 -203
7923 -203 -3 42 -158 161 138 -155 142 272 -192 123 232 -228 -184 375 -44 72 -81 -157 -114 79 78 -240
7945 -240 245 119 -307 238 -35 -160 217 144 -73 -56 311 -257 390 -71 -441 -149 123 -260 -139 153 -278
7966 -278 -178 339 -29 -116 210 1 44 246 -19 -223 260 93 -149 87 54 96 29 137 -155 74 6 -154
7988 -154 106 25 -215 -48 -19 -288 -47 135 144 -98 106 -48 -252 346 -262 -190 259 -129 -196 156 -62 -289
8010 -289 69 106 -32 65 7 -331 -39 -75 -222 115 8 -398 111 350 -90 111 283 97 -260 230 -43
8031 -43 -270 324 -52 -78 462 -2 -218 141 194 -541 252 146 -75 -112 76 -159 7 -14 -165 -132 429 63
8053 63 -98 272 15 -148 238 -257 -60 376 64 -193 42 -119 -371 393 -98 -173 211 -80 -200 408 285
8074 285 170 -88 -83 63 60 114 -151 -34 134 -185 19 404 -152 -99 203 13 -112 21 -129 -147 222 -86
8096 -86 -36 200 -151 -21 277 85 -309 229 84 -547 227 355 -162 -79 316 -60 66 270 -338 -78 107
8117 107 73 232 171 -266 -54 334 -246 -126 317 -21 -345 140 -316 22 -103 167 -174 96 -36 -250 347
8138 347 211 120 23 234 -363 142 312 -161 -53 207 9 -241 210 -172 -305 187 230 -264 58 -85 -261
8159 -261 343 -18 -259 -16 -35 -38 -44 98 -114 17 35 -255 47 343 -231 49 190 -313 166 388 -108 132
8181 132 -11 -108 -265 105 -116 -202 226 -284 -271 302
8191C02
##END NTUPLES=NMR FID
##END=
