##TITLE=1H_Pr 4894
 CDCl3, 8 sc, 
 8.2.2019
##JCAMPDX= 6.0         $$ Bruker NMR JCAMP-DX V2.0
##DATA TYPE= NMR FID
##DATA CLASS= NTUPLES
##ORIGIN= UXNMR, Bruker Analytische Messtechnik GmbH
##OWNER= root
$$ XWIN-NMR		Version 3.5
$$ Fri Feb  8 16:14:38 2019 Russian Standard Time (UT+4h)  she@DPX200
##.OBSERVE FREQUENCY= 200.1313
##.OBSERVE NUCLEUS= ^1H
##.DELAY= (6, 6)
##.ACQUISITION MODE= SIMULTANEOUS
##.ACQUISITION SCHEME= undefined
##.AVERAGES= 8
##.DIGITISER RES= 18
##SPECTROMETER/DATA SYSTEM= spect
##.PULSE SEQUENCE= zg30
##.SOLVENT NAME= CDCl3
##.SHIFT REFERENCE= (INTERNAL, CDCl3, 0, 15.7039)
##AUDIT TRAIL= $$ (NUMBER, WHEN, WHO, WHERE, WHAT)
$$ ##TITLE= Audit trail, XWIN-NMR		Version 3.5
$$ ##JCAMPDX= 5.01
$$ ##ORIGIN= Bruker BioSpin GmbH
$$ ##OWNER= she
$$ F:/spectra/data/she/nmr/H-F/1/audita.txt
$$ ##AUDIT TRAIL=  $$ (NUMBER, WHEN, WHO, WHERE, WHAT)
(   1,<2019-02-08 16:13:35.96 +0400>,<she>,<DPX200>,
      <created by zg, POWCHK disabled, PULCHK disabled
       configuration hash MD5:
       00 E9 B6 7A A2 85 ED C7 34 08 36 98 17 FE 4E 26
       data hash MD5: 16K
       A1 48 0A 3F 8A 0C 29 8D C3 5B ED 6D FA 67 67 78>)
$$ ##END=
$$ 
$$ hash MD5
$$ 16 5B 01 E2 19 34 31 6C B9 BD 0B D0 B7 61 D8 A2
##$RELAX= 
##$RELAX= 
##$RELAX= 
##$RELAX= 
##$RELAX= 
##$RELAX= 
$$ Bruker specific parameters
$$ --------------------------
##$DU= <F:/spectra>
##$EXPNO= 1
##$NAME= <H-F>
##$PROCNO= 1
##$TYPE= <nmr>
##$USER= <she>
##$AMP= (0..31)
100 100 100 100 100 100 100 100 100 100 100 100 100 100 100 100 100 100 
100 100 100 100 100 100 100 100 100 100 100 100 100 100 
##$AQSEQ= 0
##$AQ_mod= 1
##$AUNM= <au_zg>
##$AUTOPOS= <>
##$BF1= 200.13
##$BF2= 200.13
##$BF3= 200.13
##$BF4= 200.13
##$BF5= 200.13
##$BF6= 200.13
##$BF7= 200.13
##$BF8= 200.13
##$BYTORDA= 1
##$CFDGTYP= 0
##$CFRGTYP= 5
##$CHEMSTR= <none>
##$CNST= (0..31)
1 1 145 1 1 1 1 1 1 1 1 1 1 1 1 1 1 1 1 1 1 1 1 1 1 1 1 1 1 1 1 1 
##$CPDPRG= <>
##$CPDPRG1= <>
##$CPDPRG2= <>
##$CPDPRG3= <>
##$CPDPRG4= <mlev>
##$CPDPRG5= <mlev>
##$CPDPRG6= <mlev>
##$CPDPRG7= <mlev>
##$CPDPRG8= <mlev>
##$CPDPRGB= <>
##$CPDPRGT= <>
##$D= (0..31)
0 1.2 0 0 0 0 0 0 0 0 0 0.03 0 0 0 0 0 0 0 0 0 0 0 0 0 0 0 0 0 0 0 0 
##$DATE= 1549628015
##$DBL= (0..7)
120 120 120 120 120 120 120 120 
##$DBP= (0..7)
150 150 150 150 150 150 150 150 
##$DBP07= 0
##$DBPNAM0= <>
##$DBPNAM1= <>
##$DBPNAM2= <>
##$DBPNAM3= <>
##$DBPNAM4= <>
##$DBPNAM5= <>
##$DBPNAM6= <>
##$DBPNAM7= <>
##$DBPOAL= (0..7)
0.5 0.5 0.5 0.5 0.5 0.5 0.5 0.5 
##$DBPOFFS= (0..7)
0 0 0 0 0 0 0 0 
##$DE= 6
##$DECBNUC= <off>
##$DECIM= 32
##$DECNUC= <off>
##$DECSTAT= 4
##$DIGMOD= 1
##$DIGTYP= 9
##$DL= (0..7)
0 120 120 120 120 120 120 120 
##$DP= (0..7)
150 150 150 150 150 150 150 150 
##$DP07= 0
##$DPNAME0= <>
##$DPNAME1= <>
##$DPNAME2= <>
##$DPNAME3= <>
##$DPNAME4= <>
##$DPNAME5= <>
##$DPNAME6= <>
##$DPNAME7= <>
##$DPOAL= (0..7)
0.5 0.5 0.5 0.5 0.5 0.5 0.5 0.5 
##$DPOFFS= (0..7)
0 0 0 0 0 0 0 0 
##$DQDMODE= 0
##$DR= 18
##$DS= 0
##$DSLIST= <SSSSSSSSSSSSSSS>
##$DSPFIRM= 0
$$ [...]
##$SUBNAM2= <"">
##$SUBNAM3= <"">
##$SUBNAM4= <"">
##$SUBNAM5= <"">
##$SUBNAM6= <"">
##$SUBNAM7= <"">
##$SUBNAM8= <"">
##$SUBNAM9= <"">
##$SW= 20.0189088683792
##$SWIBOX= (0..15)
0 0 2 0 0 0 0 0 0 0 0 0 0 0 0 0 
##$SW_h= 4006.41025641026
##$TD= 16384
##$TD0= 1
##$TE= 0
##$TE2= 300
##$TE3= 300
##$TEG= 300
##$TL= (0..7)
0 120 120 120 120 120 120 120 
##$TP= (0..7)
150 150 150 150 150 150 150 150 
##$TP07= 0
##$TPNAME0= <>
##$TPNAME1= <>
##$TPNAME2= <>
##$TPNAME3= <>
##$TPNAME4= <>
##$TPNAME5= <>
##$TPNAME6= <>
##$TPNAME7= <>
##$TPOAL= (0..7)
0.5 0.5 0.5 0.5 0.5 0.5 0.5 0.5 
##$TPOFFS= (0..7)
0 0 0 0 0 0 0 0 
##$TUNHIN= 0
##$TUNHOUT= 0
##$TUNXOUT= 0
##$USERA1= <user>
##$USERA2= <user>
##$USERA3= <user>
##$USERA4= <user>
##$USERA5= <user>
##$V9= 5
##$VALIST= <valist>
##$VCLIST= <CCCCCCCCCCCCCCC>
##$VD= 0
##$VDLIST= <DDDDDDDDDDDDDDD>
##$VPLIST= <PPPPPPPPPPPPPPP>
##$VTLIST= <TTTTTTTTTTTTTTT>
##$WBST= 1024
##$WBSW= 4
##$XGAIN= (0..3)
0 0 0 0 
##$XL= 0
##$YL= 0
##$YMAX_a= 165857
##$YMIN_a= -151806
##$ZGOPTNS= <>
##$ZL1= 120
##$ZL2= 120
##$ZL3= 120
##$ZL4= 120
##$ABSF1= 10
##$ABSF2= 0
##$ABSG= 5
##$ABSL= 3
##$ALPHA= 0
##$AQORDER= 0
##$ASSFAC= 0
##$ASSFACI= 0
##$ASSFACX= 0
##$ASSWID= 0
##$AUNMP= <proc_1d>
##$AZFE= 0.1
##$AZFW= 0.1
##$BCFW= 1
##$BC_mod= 2
##$BYTORDP= 1
##$COROFFS= 0
##$CY= 11.3945322036743
##$DATMOD= 1
##$DC= 2
##$DFILT= <>
##$DTYPP= 0
##$F1P= 18.9103706918063
##$F2P= -1.10871071338519
##$FCOR= 0.5
##$FTSIZE= 0
##$FT_mod= 4
##$GAMMA= 1
##$GB= 0.15
##$INTBC= 1
##$INTSCL= 1
##$ISEN= 128
##$LB= 0.24
##$LEV0= 0
##$LPBIN= 0
##$MAXI= 10000
##$MC2= 0
##$MEAN= 0
##$ME_mod= 0
##$MI= 1.114404
##$NCOEF= 0
##$NC_proc= 0
##$NLEV= 6
##$NOISF1= 3.799351
##$NOISF2= 2.8
##$NSP= 1
##$NTH_PI= 0
##$NZP= 0
##$OFFSET= 15.70392
##$PC= 1
##$PHC0= -8679.793
##$PHC1= 13.00019
##$PH_mod= 1
##$PKNL= yes
##$PPARMOD= 0
##$PSCAL= 0
##$PSIGN= 0
##$REVERSE= no
##$SF= 200.130013532006
##$SI= 16384
##$SIGF1= 3
##$SIGF2= 2
##$SINO= 400
##$SIOLD= 16384
##$SREGLST= <1H.CDCl3>
##$SSB= 0
##$STSI= 0
##$STSR= 0
##$SW_p= 3612.71676300578
##$SYMM= 0
##$S_DEV= 0
##$TDeff= 0
##$TDoff= 0
##$TI= <>
##$TILT= no
##$TM1= 0
##$TM2= 0
##$TOPLEV= 0
##$USERP1= <user>
##$USERP2= <user>
##$USERP3= <user>
##$USERP4= <user>
##$USERP5= <user>
##$WDW= 1
##$XDIM= 8192
##$YMAX_p= 0
##$YMIN_p= 0
$$ End of Bruker specific parameters
$$ ---------------------------------
##NTUPLES= NMR FID
##VAR_NAME=  TIME,          FID/REAL,        FID/IMAG
##SYMBOL=    X,             R,               I
##VAR_TYPE=  INDEPENDENT,   DEPENDENT,       DEPENDENT
##VAR_FORM=  AFFN,          ASDF,            ASDF
##VAR_DIM=   8192,          8192,            8192
##UNITS=     SECONDS,       ARBITRARY UNITS, ARBITRARY UNITS
##FACTOR=    0.0002496,     1,               1
##FIRST=     0,             0,               0
##LAST=      2.0444736,     0,               0
##MIN=       0,             -151806,         0
##MAX=       2.0444736,     165857,          0
$$ Real data points
##PAGE= N=1
##DATA TABLE= (X++(R..R)), XYDATA
$$ plain form
0 0 0 0 0 0 0 0 0 0 0 0 0 0 -8 8 -8 8 -9 16 -16 24 -25 32 -36 42 -50 59 -69 80 -92 106 -122 139 -158 177
34 177 -200 227 -257 287 -320 357 -399 442 -491 545 -601 666 -735 811 -893 984 -1083 1193
52 1193 -1316 1450 -1601 1772 -1965 2186 -2443 2744 -3102 3540 -4085 4790 -5735 7081 -9157
67 -9157 12817 -21190 84549 -38706 -53768 165857 -31021 -36411 112722 -40821 -78952
78 -78952 130382 -7578 -113060 54080 8530 -78552 48890 -41223 -122239 49507 -3743
89 -3743 -126881 54829 42863 -98956 58789 65214 -107275 64348 124588 -102101 7487
100 7487 147862 -57900 -28974 114113 -55804 -50016 110870 -54038 -99616 91979 1325
111 1325 -78664 61365 -18543 -80176 78584 -7864 -117447 59779 30442 -97561 59192
$$ packed form
0@%%%%%%%%%%%%qJ6j6J6j7K5l2M0m9N7o8P8r2J09j28J49j72J98k28K61k97L35
34A77l77M27m84N44o07O77p56Q41r33J036j146J267j401J546j704J877k067K276
52A193k509K766l051L373l737M151m629N187n846O642p625Q875j0525J2816j6238
67i157K1974l4007J05739j23255j5062K19625j96878n390J49133j53543l8131
78g8952K09334j37960j05482J67140m5550q7082J27442r0113q1016J71746n3250
89c743j23138J81710j1966j41819J57745O425j72489J71623O0240k26689J09588
100G487J40375k05762K8926J43087j69917N788J60886j64908m5578J91595r0654
111A325p9989J40029p9908o1633J58760q6448j09583J77226k9337j28003J56753
$$ plain form
122 59192 53002 -87055 70210 82946 -111965 20019 101892 -100518 -26498 96409 -72477
133 -72477 -31069 95796 -71515 -52664 119452 -29594 -81440 86041 -1227 -53141 91658
144 91658 -13056 -86408 98548 30151 -108015 43537 35281 -79299 58483 39939 -110654
155 -110654 38829 80396 -104575 -19149 58799 -87496 -11129 74209 -85012 -18303 117088
166 117088 -43445 -41315 107708 -17501 -44511 96791 -23655 -67755 104687 6825 -95744
177 -95744 73592 34560 -88266 41584 18645 -98974 44615 48347 -110448 3139 61697
188 61697 -79072 -4533 49493 -82276 9873 94931 -69010 -18008 112844 -27773 -23813
199 -23813 97464 -39876 -50497 102099 -30206 -94067 86746 15157 -89761 58256 21722
$$ packed form
122E9192o190j40057J57265J2736j94911J31984Q1873k02410P4020J22907j68886
133g2477M1408J26865j67311J8851J72116j49046n1846J67481q7268n1914J44799
144I1658j04714p3352J84956o8397j38166J51552q256j14580J37782j8544j50593
155a10654J49483M1567j84971Q5426P7948j46295P6367Q5338j59221O6709J35391
166A17088j60533K130J49023j25209k7010J41302j20446m4100J72442r7862j02569
177i5744J69336l9032j22826J29850k2939j17619J43589L732j58795J13587N8558
188F1697j40769P4539N4026j31769R2149Q5058j63941N1002J30852j40617L960
199b3813J21277j37340j0621J52596j32305o3861J80813p1589j04918J48017l6534
$$ plain form
210 21722 -85403 51969 27387 -108210 26161 58155 -83385 2380 50957 -61773 23682
221 23682 66375 -77916 2685 99023 -49267 -24358 78889 -43284 -21512 91391 -54808
232 -54808 -72411 92974 -11197 -87811 62388 10390 -66871 69568 18282 -93347 49659
243 49659 48598 -87823 12381 46656 -62341 24906 52884 -71016 20196 83481 -62583
254 -62583 -17416 69413 -51728 -19733 67924 -64382 -40971 95584 -32934 -72433 75437
265 75437 -1972 -60563 69810 315 -73925 74973 33823 -88866 33027 42560 -68943
276 -68943 24378 36460 -72892 29074 65606 -70535 -835 69564 -51688 -11620 54874
287 54874 -65597 -22131 77848 -51030 -46451 85097 -12845 -48023 69125 -12904 -56630
$$ packed form
210B1722j07125J37372k4582j35597J34371L1994j41540Q5765M8577j12730Q5455
221B3682M2693j44291Q0601R6338j48290K4909J03247j22173K1772J12903j46199
232e4808j7603J65385j04171p6614J50199n1998p7261J36439n1286j11629J43006
243D9659j061j36421J00204L4275j08997Q7247K7978j23900R1212O3285j46064
254f2583M5167Q6829j21141L1995Q7657j32306K3411J36555j28518l9499J47870
265G5437p7409n8591J30373o9495p4240J48898m1150j22689J21893R533j11503
276f8943R3321J2082j09352J01966L6532j36141O9700P0399j21252M0068O6494
287E4874j20471M3466R9979j28878M579J31548r7942l5178J17148q2029m3726
$$ plain form
298 -56630 74235 2550 -82288 53927 31690 -72280 30669 30204 -65240 35856 44672 -76505
310 -76505 14281 65354 -57016 -6596 53188 -52855 -5669 61274 -61329 -29312 79485
321 79485 -28976 -40411 68972 -14142 -36580 70111 -20273 -69468 65463 9851 -78034
332 -78034 38802 23693 -58778 43683 29118 -72444 36776 58613 -68759 -521 51449
343 51449 -50483 3127 50833 -61875 -9009 74764 -44996 -37932 62719 -21751 -27412 61440
355 61440 -30923 -47947 72723 -6904 -71227 46648 13128 -53594 46229 15468 -61696 51150
367 51150 45575 -68823 14855 47554 -53389 4875 37077 -61927 2434 62022 -52140 -21210
379 -21210 62785 -29438 -24096 51345 -36545 -31412 66767 -23166 -54985 58223 2805 -50287
$$ packed form
298e6630J30865p1685q4838J36215k2237j03970J02949m65r5444J01096Q816j21177
310g6505R0786N1073j22370N0420N9784j06043M7186O6943j22603L2017J08797
321G9485j08461j1435J09383q3114k2438J06691r0384m9195J34931n5612q7885
332g8034J16836j5109q2471J02461j4565j01562J09220K1837j27372O8238N1970
343E1449j01932N3610M7706j12708N2866Q3773j19760P064J00651q4470n661Q8852
355F1440r2363j7024J20670p9627o4323J17875l3520o6722R9823l0761p7164J12846
367E1150n575j14398Q3678L2699j00943N8264L2202r9004O4361N9588j14162L0930
379b1210Q3995r2223N342P5441q7890N133R8179q9933l1819J13208n5418n3092
$$ plain form
391 -50287 48511 7243 -49998 56300 23689 -66473 35744 42201 -58534 12829 33009 -59381
403 -59381 10608 43214 -63564 -5203 63151 -39403 -19010 52150 -34076 -18683 56354 -37880
415 -37880 -40782 64130 -9999 -48259 49961 2497 -38145 54954 4439 -59154 47268 28405
427 28405 -61858 18970 28299 -50213 21590 31654 -61939 10927 55877 -48195 -11222 50438
439 50438 -32608 -7904 49469 -43357 -27705 59867 -24364 -44016 48299 -7024 -34403 49745
451 49745 -5950 -46295 53113 13457 -59025 28830 20554 -50590 25725 23898 -53130 27425
463 27425 46390 -52615 5479 52064 -38695 -3975 44837 -43344 -13151 54631 -38943 -36128
475 -36128 51739 -17451 -37201 42873 -14054 -36356 51413 -4065 -52975 41850 15704 -48984
$$ packed form
391e0287R8798m1268n7241J06298l2611r0162J02217O457j00735P1363K0180r2390
403e9381O9989L2606j06778N8361O8354j02554K0393P1160q6226J5393P5037r4234
415c7880k902J04912p4129l8260R8220m7464m0642R3099n0515o3593J06422j8863
427B8405r0263Q0828R329p8512P1803J0064r3593P2866M4950j04072L6973O1660
439E0438q3046K4704N7373r2826J5652Q7572q4231j9652R2315n5323k7379Q4148
451D9745n5695m0345R9408l9656p2482Q7855q276p1144P6315j827p7028Q0555
463B7425J8965r9005N8094M6585r0759L4720M8812q8181L0193O7782r3574K815
475c6128Q7867o9190j9750Q0074n6927k2302Q7769n5478m8910R4825k6146o4688
$$ plain form
487 -48984 27593 15348 -44173 36306 30795 -52732 23944 51690 -41140 1446 38613 -41215
499 -41215 -371 44349 -48972 -23271 53948 -24784 -34222 38953 -17454 -25334 46461 -19191
511 -19191 -46810 45663 5738 -46770 28826 8824 -36995 39081 15860 -51067 33720 43028
523 43028 -42907 12099 36896 -38652 9502 37730 -51065 -9549 51061 -34176 -25310 42045
535 42045 -21530 -19935 43740 -25357 -34753 47605 -9031 -46259 33012 925 -37525 37224
547 37224 6194 -44468 39742 27290 -48185 20158 34535 -38327 13964 32196 -44842 5993
559 5993 44892 -40283 -12800 45615 -23924 -15034 38349 -26660 -20879 45734 -21558 -40025 37610
572 37610 -6486 -39080 31017 -3463 -36943 41725 12254 -47579 28970 29006 -40397 15104 24659
$$ packed form
487d8984P6577j2245n9521Q0479n511q3527P6676K7746r2830M2586L7167p9828
499d1215M0844M4720r3321K5701P7219p8732r438P3175n6407p880P1795o5652
511a9191k7619R2473l9925n2508P5596k0002m5819P6076k3221o6927Q4787R308
523D3028q5935N5006K4797p5548M8154K8228q8795M1516O0610q5237Q866O7355
535D2045o3575J595O3675o9097r396Q2358n6636l7228P9271l2087l8450P4749
547C7224l1030n0662Q4210j2452p5475O8343J4377p2862N2291J8232p7038N0835
559E993L8899q5175K7483N8415o9539Q890N3383o5009N781O6613o7292j8467P7635
572C7610m4096l2594P0097l4480l3480P8668k9471n9833P6549L6o9403N5501R555
$$ plain form
585 24659 -39589 15839 35575 -42920 547 46503 -26860 -8719 37260 -25749 -9053 42373
597 42373 -30509 -29578 42569 -14410 -36219 32349 -10054 -33283 39032 -1996 -44767 36525
609 36525 19453 -43008 19599 20177 -38326 19498 25003 -43102 12691 41236 -33481 -1037 37907
622 37907 -25115 -1008 36820 -33689 -16157 43651 -23390 -31033 35704 -11291 -26903 36504
634 36504 -10213 -36316 40011 7226 -44032 23756 15643 -35726 19460 14067 -40195 19604
646 19604 30616 -38215 5917 36060 -26003 3287 31547 -32411 -3042 42114 -30331 -22918
658 -22918 38985 -15429 -23874 34782 -13106 -26138 41788 -3317 -40903 29179 9557 -35692
670 -35692 20088 7032 -36724 24312 18833 -41821 14074 31793 -30627 6693 27542 -32499
$$ packed form
585B4659o4248N5428J9736p8495M3467M5956p3363J8141M5979o3009J6696N1426
597D2373p2882R31P2147n6979k1809O8568m2403k3229P2315m1028m2771Q1292
609C6525j7072o2461O2607N78n8503N7824N505o8105N5793K8545p4717L2444L8944
622C7907o3022K4107L7828p0509J7532N9808o7041p643O6737m6995j5612O3407
634C6504m6717k6103P6327l2785n1258O7788q113n1369N5186n393n4262N9799
646A9604J1012o8831M4132L0143o2063K9290K8260o3958K9369M5156p2445P413
658b2918O1903n4414q445N8656m7888j3032O7926m5105l7586P0082j9622m5249
670c5692N5780j3056m3756O1036n479o0654N5895J7719o2420L7320K0849o0041
$$ plain form
682 -32499 5613 36952 -35424 -11904 42471 -20445 -20216 34760 -15144 -18975 39813 -11353 -32802
695 -32802 34825 2926 -35598 20063 2214 -30928 24650 7196 -38820 22454 24320 -33723
707 -33723 10911 23827 -29944 11815 28246 -38167 -1773 39574 -26600 -14465 35133 -17031
719 -17031 -13491 36087 -17252 -24794 37628 -4129 -32635 23892 -556 -28714 24007 109
731 109 -33582 26938 14904 -34907 17416 20782 -29477 15117 21974 -36689 8234 33607 -34001
744 -34001 -7428 35392 -21886 -10474 33336 -20885 -16603 36934 -14248 -29066 29670 -3898
756 -3898 -27061 24412 -2808 -26858 29553 6762 -32323 23890 17961 -29037 15553 16042 -31942
769 -31942 14303 23846 -36918 1004 32647 -26439 -8234 28392 -21669 -7220 33523 -21745
$$ packed form
682c2499L8112L1339p2376K3520N4375o2916K29N4976m9904l831N8788n1166k1449
695c2802O7627l1899l8524N5661j7849l3142N5578j7454m6016O1274J866n8043
707c3723M4634J2916n3771M1759J6431o6413L6394M1347o6174J2135M9598n2164
719a7031L540M9578n3339p542O2422m1757k8506N6527k4448k8158N2721k3898
731A09l3691O0520j2034m9811N2323L366n0259M4594O857n8663M4923K5373o7608
744c4001K6573M2820n7278J1412M3810n4221M282N3537n1182j4818N8736l3568
756c898k3163N1473k7220k4050N6411k2791l9085N6213n929m6998M4590M89m7984
769c1942M6245R543o0764L7922L1643n9086J8205L6626n0061J4449M0743n5268
$$ plain form
781 -21745 -21560 33225 -8328 -25304 24294 -5139 -20462 30755 -947 -29858 29167 14467
793 14467 -28509 17140 12072 -28446 17611 15682 -37852 7638 27446 -29871 -3408 24992
805 24992 -24112 -1682 29201 -26732 -12536 35210 -14813 -20625 27513 -8830 -16772 31365
817 31365 -6138 -24662 32792 6705 -29319 20908 8760 -27262 18108 8694 -35447 12756
829 12756 19641 -32512 2691 23103 -24066 2358 24199 -26136 -2784 32100 -20486 -13432
841 -13432 30498 -11471 -14196 28349 -9874 -17636 32946 -2651 -27572 25102 5234 -27798
853 -27798 16989 4198 -30452 16505 12260 -34200 8186 21354 -25214 4068 20624 -23361
865 -23361 5182 27732 -24973 -7217 30787 -14974 -11312 26538 -13639 -12138 31462 -10650
$$ packed form
781b1745J85N4785m1553j6976M9598k9433j5323N1217l1702k8911N9025j4700
793A4467m2976M5649n068m0518M6057j929n3534M5490J9808n7317K6463K8400
805B4992m9104K2430L0883n5933J4196M7746n0023n812M8138l6343p942M8137
817C1365l7503j8524N7454k6087l6024N0227j2148l6022M5370r414m4141M8203
829A2756O885n2153L5203K0412m7169K6424K1841n0335K3352L4884n2586P054
841a3432M3930m1969k725M2545l8223p762N0582l5597k4921N2674j9868l3032
853b7798M4787j2791l4650M6957m245m6460M2386J3168m6568K9282J6556m3985
865b3361K8543K2550n2705J7756L8004m5761L662L7850m0177J501M3600m2112
$$ plain form
877 -10650 -24187 28714 235 -26926 18898 21 -27200 20470 6659 -32176 15495 18314
889 18314 -26307 8208 18706 -22637 8913 22335 -26378 -643 27282 -20520 -9032 24388
901 24388 -16222 -8803 27095 -15588 -16868 29760 -6226 -23181 22460 -1110 -22594 21516
913 21516 1576 -26492 21420 12806 -26792 13012 17145 -22071 9707 16244 -26200 5090 22685
926 22685 -25755 -5730 22475 -18876 -7258 21965 -18422 -9517 29259 -12546 -19095 26064
938 26064 -2823 -18526 22912 -2428 -20890 25916 6157 -26892 18517 14820 -22391 11629
950 11629 11083 -26287 9305 16974 -29915 -1931 20413 -21249 -5063 18689 -20044 -4069 26687
963 26687 -16716 -13594 27309 -6400 -15006 22992 -5373 -16059 27094 693 -23315 21948
$$ packed form
877a0650j3537N2901k8479k7161M5824j8877k7221M7670j3811l8835M7671K819
889A8314m4621L4515J0498m1343L1550J3422m8713K5735K7925m7802J1488L3420
901B4388m0610P419L5898m2683j280M6628l5986j6955M5641k3570k1484M4110
913B1516j9940k8068M7912q614l9598L9804M133l9216L1778O537m2444L1290J7595
926B2685m8440K0025K8205m1351J1618K9223m0387Q905L8776m1805o549M5159
938B6064k8887j5703M1438k5340j8462M6806j9759l3049M5409l697l7211L4020
950A1629n46l7370L5592P669m6889K7984K2344m1662J6186K3752l8733J5975L0756
963B6687m3403L122M0903l3709q606L7998k8365j0686M3153k6401k4008M5263
$$ plain form
975 21948 9856 -22604 14102 8826 -23426 12083 11746 -29565 2934 17539 -23628 -2421 17495
988 17495 -19288 -1301 22129 -19169 -7441 26798 -10976 -12353 22617 -7521 -12646 24586
1000 24586 -5402 -18736 25436 3390 -22589 17218 6246 -21885 14712 7672 -27109 10104
1012 10104 15233 -25490 2523 17460 -19348 1717 18735 -20232 -1644 23999 -16144 -9806
1024 -9806 21850 -10776 -10602 21510 -10267 -14173 24841 -3526 -19991 20986 3457 -19576 16670
1037 16670 4035 -22886 15631 10875 -25240 7964 16269 -20134 4022 15726 -19020 2351
1049 2351 19866 -19499 -6114 20261 -13832 -9113 18317 -12482 -9724 22382 -9390 -16323 22802
1062 22802 -461 -17735 18059 1312 -18842 18330 5684 -23728 13585 13736 -21169 6687
$$ packed form
975B1948j2092l2460L6706n276l2252L5509l37m1311L2499J4605m1167K1207J9916
988A7495l6783J7987K3430m1298J1728L4239l7774j377L4970l0138n125L7232
1000B4586k9988j3334M4172k2046k5979L9807j0972k8131L6597p040l4781L7213
1012A0104N129m0723K8013J4937l6808K1065J7018l8967J8588K5643m0143O338
1024i806L1656l2626J74L2112l1777l906L9014k8367j6465M0977j7529k3033L6246
1037A6670j2635k6921L8517m756l6115L3204Q305l6403K4156J1704l4746K1371
1049B351J7515l9365J3385K6375l4093M719K7430l0799K758L2106l1772o933L9125
1062B2802k3263j7274L5794j6747k0154L7172j2646k9412L7313J51l4905K7856
$$ plain form
1074 6687 13874 -19043 5914 15911 -21594 -882 20134 -16841 -7203 16815 -14165 -6396 20213
1087 20213 -12987 -11815 23562 -4992 -15907 18763 -1648 -15681 19326 470 -21571 16894
1099 16894 8822 -21479 10381 11405 -17984 8813 12691 -21042 3853 17539 -18476 -3429
1111 -3429 16746 -14259 -4027 17185 -14219 -7013 22116 -9093 -13342 19106 -4329 -13532 17689
1124 17689 -3757 -17411 18716 3197 -20819 13300 8725 -17491 10631 9482 -19274 8793
1136 8793 14238 -20666 1397 16549 -15691 -1653 15671 -15478 -3086 19753 -13819 -9761
1148 -9761 20050 -7026 -11972 17016 -6372 -13740 19244 -1793 -18270 16795 5769 -16804
1160 -16804 12392 6411 -17028 12472 10408 -20468 5708 14207 -17613 791 13473 -16248
$$ packed form
1074F687P187l2917K4957R997l7505K0712K1016l6975R638K4018l0980P769K6609
1087B0213l3200J172L5377k8554j0915L4670k0411j4033L5007j8856k2041L8465
1099A6894q072l0301L1860J024k9389K6797L878l3733K4895J3686l6015J5047
1111c429K0175l1005J0232K1212l1404P206K9129l1209m249L2448k3435r203L1221
1124A7689k1446j3654L6127j5519k4016L4119m575k6216K8122j149k8756K8067
1136H793N445l4904K2063J5152l2240J4038J7324l1149J2392K2839l3572M058
1148i761K9811k7076m946K8988k3388p368L2984k1037j6477L5065j1026k2573
1160a6804K9196n981k3439K9500k064l0876K6176Q499l1820J8404J2682k9721
$$ plain form
1172 -16248 -138 16878 -15660 -6053 19089 -10135 -9575 16766 -7269 -10543 17841 -4807 -14416
1185 -14416 18075 1787 -15495 14175 4711 -14946 12876 5683 -18990 9476 10500 -18965
1197 -18965 2946 11354 -16428 1668 13364 -16624 -1294 18038 -13261 -7315 17300 -8328
1209 -8328 -7641 17324 -6839 -10165 18912 -2181 -13886 16042 2451 -13896 12737 1936 -16478
1222 -16478 12028 5792 -19877 6785 9884 -16659 3638 10236 -16457 3462 15848 -15892
1234 -15892 -3175 17457 -9776 -5247 15280 -9155 -6719 18425 -5973 -12459 16078 -532
1246 -532 -12395 12726 -973 -14320 13302 2444 -18189 8812 7277 -15931 6365 8468 -15212
1259 -15212 6135 12588 -16080 1502 15594 -12125 -3121 14117 -10386 -4516 16039 -9476
$$ packed form
1172a6248J6110J7016l2538R607K5142k9224N60K6341k4035l274K8384k2648r609
1185a4416L2491j6288j7282K9670r464j9657K7822p193k4673K8466J024k9465
1197a8965K1911Q408k7782J8096J1696k9988J5330J9332l1299N946K4615k5628
1209h328O87K4965k4163l326K9077k1093j1705K9928j3591j6347K6633j0801j8414
1222a6478K8506o236k5669K6662L099k6543K0297O598k6693J9919J2386l1740
1234a5892J2717K0632k7233M529K0527k4435K436K5144k4398o486K8537j6610
1246e32j1863K5121j3699j3347K7622j0858k0633K7001j535k3208K2296K103k3680
1259a5212K1347O453k8668J7582J4092k7719R004J7238k4503N870K0555k5515
$$ plain form
1271 -9476 -9237 16600 -4086 -11614 12775 -2662 -11816 13477 -538 -15263 11957 4386 -15162
1284 -15162 9202 6948 -13649 8545 9532 -15696 5277 13398 -14334 -669 13419 -12132 -2542
1297 -2542 13496 -11516 -6240 15412 -7692 -9771 14068 -3358 -9785 12706 -3270 -11836 13664
1310 13664 1836 -14101 10539 4890 -12478 9050 5912 -14409 7687 10245 -15288 1521
1322 1521 11540 -12757 -575 11968 -12148 -2974 14470 -9538 -7008 14180 -4979 -7468 12783
1335 12783 -4121 -9199 13340 -1892 -12227 11436 2322 -12005 9732 3330 -13212 9107
1347 9107 5717 -15243 4851 9881 -13490 1709 10049 -12038 608 12806 -11018 -3126 15223
1360 15223 -6996 -5988 12585 -5305 -6783 12908 -4487 -10224 12222 -704 -11808 9381
$$ packed form
1271i476K39K5837k0686p528K4389j5437r154K5293j4015j4725K7220p571j9548
1284a5162K4364k254k0597K2194R87k5228K0973Q121k7732J3665J4088k5551R590
1297b542J6038k5012N276K1652k3104k079K3839j7426o427K2491j5976q566K5500
1310A3664j1828j5937K4640n649j7368K1528l138k0321K2096K558k5533J6809
1322A521J0019k4297J2182J2543k4116R174J7444k4008K530K1188j9159k489K0251
1335A2783j6904n078K2539j5232j0335K3663r114j4327K1737o402j6542K2319
1347I107l390k0960K0094N030k3371J5199Q340k2087J2646J2198k3824P892J8349
1360A5223k2219J008J8573j7890j478J9691j7395n737K2446j2926j1104K1189
$$ plain form
1372 9381 900 -11340 9104 2162 -13857 7487 7303 -13645 3647 8734 -11182 2906 10381
1385 10381 -11527 463 13636 -8498 -3763 12449 -5802 -4412 11658 -6165 -7590 12317
1397 12317 -2811 -10687 9721 -384 -10092 9110 441 -12144 8869 4345 -12880 5314 6430
1410 6430 -10960 4474 7741 -11368 3101 11436 -10088 -985 11759 -7467 -2686 10965 -7621
1423 -7621 -5283 12336 -5260 -8420 11371 -1684 -8541 9641 -1129 -9968 9511 1716 -12010
1436 -12010 6761 4372 -11232 4597 5054 -10852 4541 7836 -11127 1315 9997 -8798 -1314
1449 -1314 9815 -7672 -2219 11409 -6670 -5688 11885 -2940 -6606 10028 -1820 -7778 9768
1462 9768 -617 -10548 7887 2223 -10705 5300 3103 -10317 4503 4769 -10668 3000 7708
$$ packed form
1372I381q481j2240K0444o942j6019K1344j84k0948J7292N087j9916J4088P475
1385A0381k1908J1990J3173k2134M735J6212j8251J390J6070j7823j425J9907
1397A2317j5128p876K0408j0105r708J9202q669j2585K1013m524j7225J8194J116
1410F430j7390J5434L267j9109J4469Q335k1524R103J2744j9226M781J3651j8586
1423g621K338J7619j7596l160J9791j3055o857J8182j0770q839J9479p795j3726
1436a2010J8771k389j5604J5829M57j5906J5393L295j8963J2442Q682j8795P484
1449a314J1129j7487N453J3628j8079R82J7573j4825l666J6634j1848n958J7546
1462I768j0385r931J8435n664j2928J6005k197j3420J4820K66j5437J3668M708
$$ plain form
1475 7708 -9637 372 8448 -8282 -179 10068 -7384 -2161 11678 -4905 -4916 10625 -2442
1488 -2442 -5885 9783 -2264 -8120 8985 54 -10233 6373 2248 -9508 4790 2662 -9907
1501 -9907 4820 5826 -9879 2219 7206 -7972 1124 7929 -7442 -33 9806 -6524 -2770
1514 -2770 10197 -3710 -4568 8717 -3238 -5889 9026 -2118 -8773 7106 926 -8513 5421
1527 5421 1660 -8179 5786 3565 -9614 3585 6174 -7817 1810 5869 -7418 1467 8145 -7314
1541 -7314 -1703 9118 -4866 -2876 7901 -4416 -4162 8875 -3557 -6833 7890 -1012 -7350
1554 -7350 6595 588 -7271 6570 2072 -8558 5213 4523 -8184 2948 5205 -7422 2175
1567 2175 5875 -7651 187 7696 -6312 -2095 7181 -4873 -2402 7545 -4573 -4579 8142 -2084
$$ packed form
1475G708j7345J0009Q076j6730Q103J0247j7452N223J3839j6583j1J5541j3067
1488b442l443J5668j2047n856J7105q931j0287J6606m125j1756J4298k128j2569
1501i907J4727J006j5705J2098M987j5178R096O805j5371P409R839j6330L754
1514b770J2967j3907q58J3285j1955k651J4915j1144o655J5879o180r439J3934
1527E421l761r839J3965k221j3179J3199K589j3991R627M059j3287Q885O678j5459
1541g314N611J0821j3984J990J0777j2317K54J3037j2432l276J4723q902o338
1554g350J3945o007p859J3841m498j0630J3771o90j2707J1132K257j2627R597
1567B175L700j3526P838P509j4008M217R276j2054K471R947j2118oJ2721j0226
$$ plain form
1581 -2084 -5848 7032 -353 -5755 6473 474 -7054 6263 2867 -7719 3591 3782 -7201 2702
1595 2702 4348 -7649 1525 6160 -6774 -877 6550 -5107 -1265 6640 -5013 -2372 7400 -3551
1609 -3551 -4518 7053 -1365 -4895 6782 -878 -6105 6317 795 -7249 4549 2289 -6919 3365
1623 3365 3125 -7330 2300 4551 -6895 726 5908 -5497 -356 5963 -4938 -1069 6913 -4196
1637 -4196 -2793 6860 -2600 -3902 6292 -1298 -4337 6134 -932 -6391 5206 954 -6193 3746
1651 3746 2071 -6158 3087 2671 -6525 2318 4867 -5738 688 5169 -4769 14 5874 -4518 -1457
1666 -1457 6549 -3279 -2837 5980 -2167 -3383 5572 -1705 -4801 5443 -372 -5888 3895 754 -5514
1681 -5514 3656 1490 -6071 3362 3354 -5985 1744 4536 -4789 969 4731 -4703 108 5762 -3992 -1580
$$ packed form
1581b084l764J2880p385n402J2228n999p528J3317l396j0586J1310J91j0983R903
1595B702J646j1997R174M635j2934N897P427j1657L842P905j1653K641R772j0951
1609c551r67J1571q418l530J1677p660n227J2422n522q044J1798k260r208J0284
1623C365k40j0455R630K251j1446P621N182j1405N141O319j0901L869P982j1109
1637d196J403R653r460j302J0194p590l039J0471p066n459J1597m252p147R939
1651C746j675q229R245m16r196Q843K549j0605O426M481r938M783N860j0392L061
1666a457Q006r828M42Q817q147j216Q955p277l096J0244n815n516R783l141o268
1681e514R170k166p561R433qr339P729K792r325N758L762r434M811N654r754K412
$$ plain form
1697 -1580 5605 -2506 -2205 5024 -2509 -3885 5615 -1545 -4723 4413 -193 -4586 3550 397 -5248
1712 -5248 3662 2057 -5476 2421 3336 -5011 1498 3761 -4580 973 4412 -4546 -702 4939 -3521
1727 -3521 -1700 4649 -2682 -2134 4634 -2225 -3676 4752 -650 -4068 3540 -115 -4019 3663 1277
1742 1277 -4850 3054 2447 -4527 2082 2670 -4333 1322 3324 -4295 96 4179 -3676 -823 4034
1757 4034 -3327 -1181 4248 -2870 -2449 4615 -1335 -3314 4018 -422 -3590 3960 256 -3992 3589
1772 3589 1507 -4117 2305 1927 -4175 1692 2199 -4401 1108 3202 -4295 26 3566 -3207 -724
1787 -724 3681 -3186 -1382 4353 -1907 -2451 4168 -1134 -2698 3768 -398 -2871 3309 300 -3841
1802 -3841 2831 1306 -3705 2052 1556 -3635 1806 2194 -4149 678 3133 -3202 9 3047 -3135
$$ packed form
1697a580P185q111L01P229p533j376R500p160l178R136m606m393Q136l153n645
1712e248Q910j605p533P897R15q347O509K263q341N553L439q958L844N641q460
1727c521J821O349p331N48O768o859j451Q428n402l418P608l655l904P682k386
1742A277o127P904o07o974O609N88p003N655K002p619M391M083p855K853M857
1757D034p361K146N429p118M21P064n950j979P332m440l168P550l704m248P581
1772C589k082n624O422l78o102N867N07o600N509K094p497M321L540o773K483
1787g24M405o867J804N735o260n44O619n302j564O466m166k473O180l009m141
1802c841O672j525n011N757m96n191N441L88o343M827K455o335L211L038o182
$$ plain form
1817 -3135 -584 3924 -2648 -1593 4171 -1804 -1885 3482 -968 -2361 3638 -441 -3330 3017 568
1832 568 -3544 2162 745 -3597 1901 1628 -3603 1321 2399 -3080 332 2979 -2968 214 3031
1847 3031 -2518 -651 3442 -2070 -1660 3085 -1442 -1467 3146 -1006 -2803 2909 -249 -3093 2402 298
1863 298 -2807 2173 942 -2784 1796 2062 -3146 1073 2145 -2690 703 2621 -2591 132 3172
1878 3172 -2164 -1067 2779 -1798 -1239 2666 -1479 -2024 2521 -776 -2634 2241 -38 -2389 2259
1893 2259 292 -2581 2213 1080 -2617 1412 2050 -2461 851 2003 -2344 758 2626 -2455 -530
1908 -530 2649 -1941 -1063 2146 -1756 -1283 2629 -1374 -1920 2040 -612 -1858 1974 -7 -2315 1893
1924 1893 605 -2266 1772 1231 -2177 1327 1807 -2209 775 1937 -2263 486 2165 -1695 -252
$$ packed form
1817c135K551M508o572J055N764n975q1N367m450j393N999m079k889O347k449
1832E68m112N706j417m342N498k73n231M924J078n479L412K647n947L182K817
1847C031n549J867M093n512M10M745m527k5M613m152j797N712l158k844N495k104
1863B98l105M980j231l726M580K66n208M219J072m835L393J918n212K723L040
1878C172n336J097L846m577N59L905m145n45M545l297j858M875k279k351M648
1893B259j967k873M794j133l697M029O38m511L312J152m347L102J868n081J925
1908e30L179m590Q78L209l902M73L912m003n46L960k652j246L832j981k308M208
1924A893j288k871M038n41l408L504M80m016K984J162m200K749J679l860J443
$$ plain form
1939 -252 2092 -1775 -678 2157 -1490 -1139 2155 -752 -1533 1896 -382 -1549 2062 -190 -2139 1664
1955 1664 419 -1995 963 1022 -2033 1010 1358 -2149 733 1686 -2105 36 1721 -1537 -371 1917
1971 1917 -1499 -640 2060 -1169 -1201 2174 -739 -1505 1933 -358 -1595 1639 -159 -1892 1050 649
1987 649 -1827 948 554 -1633 788 1247 -1763 228 1475 -1544 249 1671 -1450 -229 2122 -1072
2003 -1072 -820 1674 -597 -1323 1368 -511 -1145 1366 -108 -1481 1591 467 -1849 1062 198 -1550
2019 -1550 913 768 -1902 511 1316 -1514 145 1547 -1306 49 1460 -1111 -332 1368 -967 -610
2035 -610 1439 -588 -913 1431 -465 -1227 1263 -19 -1404 1014 89 -1458 895 680 -1395 804
2051 804 865 -1325 318 1005 -1013 147 1353 -1228 -137 1293 -850 -235 1087 -700 -501 1076
$$ packed form
1939b52K344l867J097K835l647L51L294k907p81L429k278j167L611k252j949L803
1955A664j245k414K958N9l055L043L48l507K882R53l791K141J685l258J166K288
1971A917l416Q59K700l229l2L375k913p66L438k291j237L234j798j733K942m01
1987F49k476K775l94k187K421M59l010J991J247l019J793J422l121J221K351l194
2003a072K52K494k271p26K691j879o34K511j474j373L072j124k316K911q64j748
2019a550K463j45k670K413Q05k830J659J402k853J355J411k571P79J700k335L57
2035f10K049k027l25K344j896p62K490j282j385K418r25j547K353k15k075K199
2051H04O1k190J643O87k018J160J206k581J091J430k143O15J322j787J99J577
$$ plain form
2067 1076 -505 -928 1064 -249 -1205 1167 -35 -1113 1093 261 -1378 632 537 -923 510 907
2083 907 -1342 327 713 -1122 200 860 -939 -241 1158 -882 -348 783 -623 -404 997 -366
2099 -366 -932 966 -230 -736 710 128 -1053 690 315 -1114 734 483 -1092 514 689 -1003 153
2116 153 524 -828 -70 1042 -819 -128 840 -440 -559 558 -480 -393 701 -225 -587 1053 -91
2133 -91 -677 726 132 -483 571 358 -781 308 497 -722 245 599 -678 286 587 -528 -68 602
2151 602 -250 49 604 -364 -209 757 -414 -366 392 -203 -407 544 84 -463 586 92 -336 657 204 -360
2171 -360 124 209 -602 198 614 -402 -122 558 -489 -8 635 -361 -286 525 -154 -489 606 3 -335 258
2191 258 -114 -399 382 -38 -624 161 340 -546 429 400 -642 173 122 -601 -190 501 -473 113 552 -177
$$ packed form
2067A076j581m23J992j313r56K372j202j078K206q32j639K010r5j460J433L97
2083I07k249J669L86j835J322O60j799O98J399k040N34J131j406K19J401j363
2099c66n66J898j196n06J446n82j181J743l75j429J848k51j575J606J75j692J156
2116A53L71j352P58J112j861O91R68j280j19J117j038Q7J094r26l62J640j144
2133i1n86J403n94o15J054k13j139J089J89j219R67L54j277R64L01j115M60O70
2151F02q52K99N55r68J55R66j171M8P58n95k04R51m60n47J049m94m28R93m53n64
2171c60M84Q5q11Q00M16j016K80O80j047M81O43r96P5Q11o79l35J095o03l38N93
2191B58l72k85P81m20n86P85J79q86R75k9j042Q15n1p23M11O91r74N86M39p29
$$ plain form
2211 -177 2 409 -71 -195 397 -105 -222 167 161 -172 382 3 -664 298 109 -506 43 183 -217 109 359
2232 359 -351 -140 462 -30 -177 284 9 -112 277 -81 -36 250 -116 -62 319 260 -408 236 288 -167 0
2253 0 -113 -388 -35 112 -200 -57 288 -166 89 69 -247 -58 225 -13 -288 424 -304 -128 87 -95 19
2274 19 160 153 -199 125 133 -36 -37 279 -171 -93 389 -238 -239 368 -25 -63 222 -121 -224 233 24 -321 172 61
2298 61 -106 303 68 -182 161 174 -200 19 152 -330 -30 278 -29 148 174 -8 -305 258 -182 12 241
2319 241 -36 -28 295 270 -185 164 74 -161 -276 -56 -105 73 8 -275 -266 46 -378 -282 180 172 -241 204 97 -309
2343 -309 222 28 -557 403 55 -247 358 182 -335 -6 113 -336 226 220 -313 -16 408 -288 246 231 -619
2364 -619 10 343 -343 -330 480 -415 -449 678 211 -262 458 -127 -418 409 167 -667 16 97 -199 213 379
$$ packed form
2211a77J79M07m80j24N92n02j17L89ol33N54l79o67R62j89o15N49J40m00L26K50
2232C59p10K11O02m92j47M61k75j21L89l58M5K86l66N4L81n9o68O44N2m55J67
2253@j13k75L53J47l12J43L45m54K55k0l16J89K83k38k75P12p28J76K15j82J14
2274A9J41pl52L24Qj69jL16m50P8M82o27jO07l93l8K85l43j03M57k09l45M93j11
2298F1j67M09k35k50L43J3l74K19J33m82L00L08l07J77K6j82k97N63m40J94K29
2319B41k77QL23k5m55L49r0k35j15K20m9J78o5k83RL12m24R6M62qm13M45j07m06
2343c09N31j94n85R60l48l02O05j76n17L29J19m49N62on33K97M24o96N34j5q50
2364f19O29L33o86J3Q10q95l4J127m67m73P20n85k91Q27k42q34O83Q1k96M12J66
$$ plain form
2385 379 -514 319 577 -261 -161 370 -405 -27 319 -308 45 607 -44 -298 633 -161 -444 527 45 -447
2405 -447 497 38 -609 366 238 -413 121 72 -527 314 292 -621 115 446 -400 1 280 -450 -309 784
2425 784 -387 -267 663 -241 -421 510 -423 -518 468 -352 -395 432 90 -590 455 148 -558 586 461 -571
2445 -571 91 518 -627 196 138 -456 -252 651 -322 -479 576 -594 -211 959 -354 -302 729 -86 -633
2464 -633 551 -172 -577 693 114 -560 341 238 -654 252 404 -927 -37 454 -733 63 461 -554
2482 -554 -204 594 -615 -100 761 -98 -305 873 -291 -697 791 -7 -869 771 -79 -891 559 -16
2500 -16 -857 630 490 -1043 409 452 -932 241 760 -798 3 652 -655 -46 844 -358 -136 954
2518 954 -439 -398 840 -340 -586 694 -140 -622 685 23 -732 718 193 -1012 564 116 -756 429
$$ packed form
2385C79q93Q33K58q38J00N31p75L78L46o27L53N62o51k54R31p94k83R71m82m92
2405d47R44m59o47R75j28o51N34m9n99Q41k2r13P36L31q46M01K79p30J41J093
2425G84j171J20R30r04j80R31r33r5R86q20m3Q27l42o80J045l07p06J144j25j032
2445e71O62M27j145Q23n8n94K04R03r73j57J055j170L83J170j313N2J031q15n47
2464f33J184p23m05J270n79o74R01j03q92R06J52j331Q90M91j187P96L98j015
2482e54L50P98j209N15Q61q59k07J178j164m06J488p98q62J640q50q12J450n75
2500a6q41J487j40j533J452M3j384J173N19j558Q01O49j307O09Q90j202K22J090
2518I54j393M1J238j180k46J280q34m82J307o62p55J450n25j205J576m48q72J185
$$ plain form
2536 429 493 -779 118 526 -809 -162 967 -484 -96 978 -494 -211 1023 -367 -462 936 -388
2553 -388 -773 994 166 -577 549 62 -879 367 351 -676 225 197 -793 427 486 -951 6 752 -532
2572 -532 -70 823 -780 -280 956 -625 -410 954 -320 -757 1115 -265 -813 999 104 -526 769
2589 769 442 -881 363 237 -941 304 592 -966 154 697 -811 -215 694 -852 -184 814 -751
2606 -751 -260 904 -485 -275 1025 -269 -570 904 -80 -972 918 -117 -802 687 57 -1021 925
2623 925 658 -1193 556 688 -1140 -27 826 -1025 210 606 -530 -270 919 -665 -355 1301 -333
2640 -333 -609 881 -361 -882 1133 -223 -589 1061 -34 -1075 860 146 -947 337 456 -953
2656 -953 438 790 -1085 446 570 -631 6 861 -813 -339 953 -664 -446 1140 -490 -533 746
$$ packed form
2536D29O4j272Q97M08j335O47J129j451L88J074j472K83J234j390r5J398j324
2553c88l85J767q28p43J126m87r41J246j6j027R01k8r90J220N9j437R57P46j284
2572e32M62Q93j603N00J236j581K15J364j274m37J872j380n48J812q95o30J295
2589G69l27j323J244j26j178J245K88j558J120N43j508N96R09j546O68R98j565
2606g51M91J164j389K10J300j294l01J474r84q92J890j035o85J489o30j078J946
2623I25k67j851J749J32j828J113Q53j851J235L96j136K60J189j584L10J656j634
2640c33k76J490j242n21K015j356l66J650j095j041J935p14j093J284J19j409
2656i53J391L52j875J531J24j201O37Q55j674M74J292j617K18J586j630m3J279
$$ plain form
2673 746 -275 -579 863 101 -868 966 205 -1022 537 465 -944 707 871 -973 472 660 -1143
2690 -1143 334 734 -1095 -5 867 -880 -22 1207 -562 -509 1054 -521 -548 989 -425 -749 935
2707 935 -108 -829 923 131 -853 802 283 -862 588 660 -898 359 864 -962 131 867 -1178
2724 -1178 -15 994 -838 -281 1002 -590 -360 1250 -610 -478 1271 -119 -636 916 177 -866
2740 -866 1011 176 -970 953 147 -1271 704 533 -1271 239 613 -1133 141 1021 -856 -260 1006
2757 1006 -971 -284 1243 -677 -456 1090 -403 -819 1406 -198 -732 1062 -135 -866 1003 118
2773 118 -825 855 381 -1092 645 565 -910 473 833 -1222 -80 764 -787 -145 1035 -707 -60
2790 -60 975 -488 -384 1496 -372 -472 1027 -126 -848 1038 -242 -998 1008 -60 -1014 659 543
$$ packed form
2673G46j021l04J442p62r69J834p61j227J559p2j409J651J64j844J445J88j803
2690a143J477M00j829J090Q72j747Q58J229j769N3J563j575k7J537j414l24J684
2707I35j043p21J752p92r84J655n19j145J450P2j558J257N05j826J093P36k045
2724a178J163J009j832N57J283j592K30J610j860J32J749j390n17J552p39j043
2740h66J877q35j146J923q06j418J975j71j804J510L74j746J274Q80j877N96J266
2757A006j977O87J527j920K21J546j493m16K225j604n34J794j197p31J869q85
2773A18r43J680m74j473J737q0j475J383L60k055J142Q44j551O42J180j742O47
2790f0J035j463J04J880j868j00J499j153p22J886j280p56K006j068r54J673j16
$$ plain form
2807 543 -1201 224 615 -938 603 810 -1073 425 959 -1060 158 1211 -757 -311 1211 -453
2823 -453 -544 1041 -496 -706 1196 -408 -856 963 -363 -1113 895 -68 -1153 583 456 -1221 379
2840 379 607 -1116 297 885 -821 334 796 -920 -406 1104 -882 -332 708 -530 -334 968 -380
2857 -380 -602 1067 -317 -596 1021 69 -867 731 199 -896 735 366 -1036 669 454 -984 356
2874 356 557 -986 177 1007 -1214 -241 953 -533 -108 1172 -730 -604 949 -595 -821 1070 -336
2891 -336 -933 911 34 -863 1022 40 -1099 707 343 -1037 634 693 -1299 347 670 -1131 380
2908 380 1027 -962 -170 809 -681 -309 1104 -898 -455 1068 -518 -649 912 -396 -714 1244 -40
2925 -40 -945 901 94 -996 638 317 -1400 658 387 -1030 316 879 -787 252 810 -817 118
$$ packed form
2807E43j744J425L91j553J541K07j883J498N34k019J218J053j968M46J522j664
2823d53r1J585j537k10J902j604m48J819j326p50K008r63j085J736j27j677J600
2840C79K28j723J413N88j706J155M62j716N14J510j986N50J040j238J96J302j348
2857c80k22J669j384k79J617r52r36J598n32j095J631l69j402J705k15j438J340
2874C56K01j543J163Q30k221R73J194j486M25J280j902J26J553j544k26J891j406
2891c36n97J844q77q97J885r82j139J806l64j380J671N9j992J646L23j801J511
2908C80O47j989P92R79j490L72J413k002M43J523j586j31J561j308l18J958j284
2925d0r05J846q07j090J634l21j717K058k71j417J346N63j666J039N58j627R35
$$ plain form
2942 118 985 -494 -156 867 -357 -527 909 -566 -775 1005 -370 -910 980 -228 -900 1026 125
2959 125 -952 584 341 -843 579 734 -1163 412 758 -859 275 651 -743 69 937 -923 -270
2976 -270 906 -639 -452 1201 -479 -540 993 -177 -754 983 -96 -904 924 131 -972 672 520
2993 520 -913 797 592 -688 408 954 -943 121 481 -1030 -102 827 -749 -112 1208 -697 -402
3010 -402 1026 -606 -569 717 -519 -804 1267 70 -1035 787 342 -940 708 454 -1015 297
3026 297 760 -821 550 572 -960 -64 745 -898 -46 1093 -736 -72 1086 -549 -814 1254 -224
3043 -224 -585 1042 -136 -643 856 -176 -860 845 320 -921 827 734 -1045 468 572 -960 439
3060 439 700 -880 187 823 -792 143 1128 -498 -267 926 -496 -626 958 -417 -483 1115 -151
$$ packed form
2942A18Q67j479L38J023j224j70J436j475k09J780j375n40J890j208o72J926r01
2959A25j077J536k43j184J422J55j897J575L46j617J134L76j394Q12Q68j860O53
2976b70J176j545J87J653j680o1J533j170n77J737j079q08J828p93j103J644j52
2993E20j433J710k05j280J096N46j897J064L60j511R28R29j576O37J320j905K95
3010d02J428j632L7J286j236k85K071j197j105J822m45j282J648k54j469J312
3026B97M63j581J371K2j532Q96Q09j643Q52J139j829O64J158j635k65K068j478
3043b24l61J627j178n07J499j032o84J705n25j241J748r3j779J513J04j532J399
3060D39K61j580J067O36j615R35R85j626K31J193j422j30J584j375o6J598j266
$$ plain form
3077 -151 -715 858 -18 -1032 815 144 -1002 1040 486 -837 512 664 -975 474 862 -962 473
3094 473 589 -733 -50 983 -789 -464 1031 -726 -303 1013 -423 -796 939 -188 -783 1273 -47
3111 -47 -1015 780 -38 -1080 653 271 -923 510 669 -1016 146 930 -929 210 754 -902 -295
3128 -295 902 -940 -225 995 -719 -473 857 -649 -846 724 -278 -574 991 -55 -921 687
3144 687 195 -836 305 432 -1124 584 635 -1028 335 692 -1071 -59 778 -698 -83 983 -580
3161 -580 -420 1028 -540 -317 1255 -441 -534 987 -349 -825 1058 -139 -1014 765 103 -1003 543
3178 543 506 -891 360 336 -1127 140 668 -856 331 804 -768 -85 1089 -636 -145 860 -601
3195 -601 -430 953 -232 -685 1050 -181 -970 1280 77 -604 746 155 -892 555 456 -585 513
$$ packed form
3077a51n64J573q76j014J847o71j146K042n54j323J349J52j639J449L88j824J435
3094D73J16j322O83J033j772L25J495j757M23J316j436l73J735j127n95K056j320
3111d7r68J795q18j042J733l82j194J433J59j685J162P84j859J139N44j656O07
3128b95J197j842P15J220j714K46J330j506j97J570j002k96J565j046q66J608
3144F87m92j031J141J27j556J708N1j663J363L57j763J012Q37j476O15J066j563
3161e80J60J448j568K23J572j696r3J521j336m76J883j197q75J779o62j106J546
3178E43l7j397J251k4j463J267N28j524J187M73j572O83J174j725M91J005j461
3195f01J71J383j185m53J735j231p89K250j203o81J350n91j047J447r9j041J098
$$ plain form
3212 513 464 -614 168 805 -953 242 853 -692 -175 1067 -867 -351 974 -715 -402 1219 -514
3229 -514 -1059 1049 -294 -979 948 319 -1031 902 35 -1080 733 444 -1067 444 596 -885 388
3246 388 874 -827 -33 1069 -736 -76 916 -710 -106 1127 -703 -293 727 -440 -654 1036 41
3263 41 -601 1003 85 -854 840 282 -910 517 656 -1304 359 572 -899 -1 748 -860 -58 938
3281 938 -1013 8 788 -677 -182 1026 -359 -344 1006 -406 -732 1036 -409 -859 1120 -166 -905
3298 -905 705 399 -901 536 331 -1070 298 328 -1062 366 634 -725 113 645 -916 -91 878
3315 878 -479 -241 1064 -453 -570 782 -331 -545 820 -184 -742 556 196 -836 916 370 -734
3332 -734 681 512 -869 246 290 -956 420 543 -849 61 771 -1041 -34 1290 -635 -314 1074
$$ packed form
3212E13m9j078P82O37j758J195O11j545N17J242j934N16J325j689L13J621j733
3229e14n45K108j343o85J927o29j350J933q67j115J813k89j511J511J52j481J273
3246C88M86j701P94J102j805O60R92j626O04J233j830M10J020j167k14J690r95
3263D1o42J604r18r39J694n58j192J427J39j960J663K13j471Q98P49j608Q02R96
3281I38j951J021P80j465M95J208j385J5J350j412l26J768j445m50J979j286p39
3298i05J610l06j300J437k05j401J368L0j390J428K68j359Q38N32j561Q25R69
3315H78j357K38J305j517j17J352j113k14J365j004n58J298l60j032J752n46j104
3332g34J415j69j381J115M4j246J376J23j392R10P10j812J007J324j925L21J388
$$ plain form
3349 1074 -306 -633 794 -408 -860 786 47 -626 721 -39 -755 791 269 -981 487 501 -903
3366 -903 494 304 -1044 196 926 -947 170 986 -864 -127 771 -640 -353 866 -530 -576 1034
3383 1034 -120 -572 771 -63 -812 893 35 -807 703 -121 -876 617 135 -1004 444 304 -856
3400 -856 143 570 -724 169 674 -645 -222 803 -661 -489 835 -467 -320 732 -343 -531 703
3417 703 -560 -643 595 -12 -735 634 308 -938 745 229 -828 420 575 -851 215 636 -689
3434 -689 88 648 -661 -169 806 -660 -334 618 -464 -242 972 -293 -440 667 -288 -790 536 55
3452 55 -615 578 142 -978 261 296 -856 502 559 -699 11 846 -624 276 480 -550 -127 1014
3470 1014 -488 -406 740 -346 -306 636 -229 -683 431 -45 -534 597 -41 -721 871 236 -718 648
$$ packed form
3349A074j380l27J427j202m52J646p39o73J347p60p16J546n22j250J468J4j404
3366i03J397j90j348J240P30j873J117Q16j850P37Q98j411K87J219j396m6J610
3383A034j154m52J343q34p49J705q58q42J510q24p55J493m82j139J448j40j160
3400h56R99M27j294Q93N05j319M23J025j464J72J324j302J47J052j075j88J234
3417G03j263q3J238o07p23J369l26j246J683n16j057J248J55j426J066M21j325
3434f89P77N60j309M92R75j466L26R52j082K22J214j265j47J107r55n02J326m81
3452E5o70J193m36j120J239L5j152J358N7j258P10Q35j470R00K04j030M23J141
3470A014j502Q2J146j086M0R42q65m54J114m76m89J131o38o80J592o35r54J366
$$ plain form
3488 648 240 -497 260 358 -488 137 549 -566 175 426 -706 -108 534 -686 -186 735 -598 -303 702
3507 702 -235 -688 848 -85 -611 454 -12 -600 362 95 -672 402 247 -720 159 389 -1124 154
3525 154 554 -799 10 505 -715 -68 633 -516 -140 873 -228 -499 748 -266 -457 749 -38
3542 -38 -350 537 45 -953 693 136 -810 428 231 -545 364 262 -761 109 652 -510 -49 739 -634
3561 -634 -425 590 -652 -243 910 -296 -273 663 -263 -449 450 -165 -494 601 196 -656 541 198
3579 198 -645 373 107 -532 133 365 -559 167 545 -654 101 369 -734 183 791 -524 -338 795
3597 795 -391 -351 679 -166 -595 512 164 -584 628 62 -406 243 155 -443 574 193 -561 301 562
3616 562 -528 434 439 -421 -7 290 -845 118 364 -460 -316 489 -722 -370 387 -352 -533 653 -326
$$ packed form
3488F48m08p37P57R8q46O25M12j115P41K51j132N98O42j220N00R21j333K95J005
3507G02r37m53J536r33n26J065m66n88R62k67p67J074j55r67Q79K30j513J278
3525A54M00j353Q09M95j220O47P01j149L76J013j101k71J247j014j91J206p87
3542c8l12Q87m92r98J646n57r46J238j97p76R09j02j023Q70N43j162M61P88j373
3561f34K09J015j242M09J153j206K3R36r26j86Q99o15l29J095m05q52J197l43
3579A98q43J018k66o39O65K32r24P26L78j199P55K68j103R17O08j315J86J133
3597G95j186M0J030q45m29J107l48p48J212n66m68O49q8n98J017l81p54Q62K61
3616E62j090R62Nq60M14K97j135R63K46q24J44Q05j211L52P57p39j81J186r79
$$ plain form
3635 -326 -394 537 -177 -241 232 80 -637 397 344 -431 247 282 -290 68 14 -791 216 435 -607 88 431
3656 431 -610 -156 741 -413 -200 696 -154 -452 794 -216 -253 569 -161 -471 278 -108 -541 531 73
3675 73 -512 172 156 -542 -66 421 -667 149 316 -532 129 652 -384 -55 452 -397 -238 704 -320 -195
3695 -195 319 -147 -526 470 -429 -481 513 70 -511 359 250 -562 87 209 -506 277 500 -677 121 361
3715 361 -350 57 399 -532 -41 616 -407 -461 364 -227 -381 450 -471 -359 520 -135 -171 505 -41 -510
3735 -510 441 123 -414 250 376 -364 195 416 -374 -80 334 -361 -15 300 -207 -127 624 -309 -165 312
3755 312 -173 -331 509 -10 -306 299 35 -296 322 -118 -448 422 227 -513 103 275 -259 350 341 -501 201
3776 201 451 -268 -241 173 -157 -128 524 -184 -206 694 -281 -93 542 -10 -58 455 253 -317 405 -20 -383
$$ packed form
3635c26o8R31p14o4M73j52p17J034n3p75O78L5n72L58n4q05J007K19j042O95L43
3656D31j041M54Q97j154K13Q96q50k98J246j010l7Q22p30l10P49l86m33J072m58
3675G3n85O84j6o98M76M87j088Q16J67q48O61N23j036L29N07q49J59R42j024J25
3695a95N14m66l79R96q99n2R94m43n81Q70j09q12O49J22p15P83K23j177P98K40
3715C61p11M07L42r31M91O57j023n4Q25n91j54Q31r21J12Q79o55l6O76n46m69
3735e10R51l18n37O64J26p40N59K21p90K94M14o95L46L15n07Q0P51r33J44M77
3755C12m85j58Q40n19k96O05k64l31O18m40l30Q70j95p40O16J72n34O09rq42P02
3776B01K50p19K7M14l30K9O52p08k2R00r75J88O35n52m8N13k02n70P22m25l63
$$ plain form
3797 -383 438 -57 -429 431 229 -193 192 239 -454 195 355 -370 -244 529 -389 -12 437 -539 -274 461
3817 461 -283 -357 305 -245 -324 418 75 -285 832 119 -233 95 33 -209 514 146 -484 252 67 -384 245
3838 245 304 -441 -62 121 -200 217 345 -72 -135 240 -282 84 298 -199 -412 385 22 -333 290 -289 -454
3859 -454 369 114 -326 320 311 -341 141 172 -304 190 261 -174 -73 482 -364 1 388 -342 -253 360 -319 -210
3881 -210 361 -317 -225 252 -124 -84 603 104 -326 352 122 -459 442 15 -286 168 -157 -552 -94 287 -365
3902 -365 -74 409 -686 268 76 -146 -6 314 -109 -38 295 -83 -142 474 -214 -267 261 80 -258 49 92
3923 92 -474 390 86 -275 439 121 -168 123 273 -72 88 369 -285 -168 308 -193 -146 425 -311 -45 113
3944 113 -111 -14 284 -36 -214 349 -16 -461 -163 -320 -352 222 115 -150 142 -73 -158 172 95 -279 87
$$ packed form
3797c83Q21m95l72Q60k02m22L85M7o93O49J60p25J26P73r18L77M49r76K65P35
3817D61p44p4O62n50p9P42l43l60J117p13l52L28o2k42P23l68o30P36j85m51O29
3838B45N9p45L79J83l21M17J28m17o3L75n22L66K14m97k13P97l63l55O23n79j65
3859d54Q23k55m40O46ro52M82L1m76M94P1m35J01N55q46L65L87p30Q9O13o79J09
3881b10N71o78R2M77l76M0O87m99m30O78k30n81R01m27l01M54l25l95M58L81o52
3902c65K91M83j095R54j92k22J40L20m23P1L33l78n9O16o88n3N28j81l38L07M3
3923I2n66Q64l04l61P14l18k89K91J50l45J60K81o54J17M76n01M7N71p36K66J58
3944A13k24R7K98l20j78N63l65m45K98j57l2N74j07k65K92k15q5L30p7l74L66
$$ plain form
3965 87 322 -136 22 440 -206 -70 199 -167 -163 482 -165 -268 184 2 -62 128 -171 -138 334 127 -150 465
3987 465 89 -460 95 41 -81 182 297 -192 137 73 -341 242 105 -48 302 322 -142 -21 316 -205 -117
4008 -117 120 141 -116 6 -43 -158 246 -68 -167 130 -132 -285 323 15 -113 144 70 -2 189 175 -406 62
4030 62 -40 -17 115 158 -243 -144 199 -91 -135 252 -159 -349 68 -203 50 272 -240 -26 194 -20 -261 233
4052 233 -23 -262 313 246 4 125 -79 -403 247 27 -428 -23 29 -299 122 326 -179 -50 73 91 -12
4073 -12 65 1 16 385 -36 180 380 -91 107 72 265 29 164 -10 -89 186 101 -45 235 59 24 66 -44
4096 -44 -66 258 301 -210 -134 62 -222 -52 170 -123 71 277 -17 -277 311 -46 -130 249 -354 -198 251 58
4118 58 -253 270 -118 -306 369 -14 -212 255 -67 -116 -333 162 -59 -165 228 -18 10 213 -160 -144 287
$$ packed form
3965H7K35m58J58M18o46J36K69l66MO45o47j03M52j82o4J90k99L3M72k07k77O15
3987D65l76n49N55n4j22K63J15m89L29o4m14N83j37j53L50K0m64J21L37n21Q8
4008a17K37K1k57J22m9j15M04l14r9K97k62j53O08l08j28K57p4p2J91j4n81M68
4030F2j02K3J32M3m01R9L43k90m4L87m11j90M17k71K53K22n12K14K20k14k41M94
4052B33k56k39N75o7k42J21k04l24O50k20m55M05N2l28M21K04n05J29J23J8j03
4073a2P7o4J5L69m21K16K00m71J98l5J93k36J35j74p9K75q5j46K80j76l5M2j10
4096d4k2L24M3n11P6J96k84J70K22k93J94K06k94k60N88l57q4L79o03J56M49j93
4118E8l11N23l88j88O75l83j98M67l22m9k17M95k21j06L93k46K8K03l73J6M31
$$ plain form
4139 287 -315 -149 211 -224 -49 144 -122 -64 194 -143 -397 -1 43 -387 109 188 -28 219 194 -52 177
4160 177 -79 -127 -35 195 -249 -33 132 -14 19 214 -327 185 319 -5 -61 254 -65 -250 70 -130 -121 62
4182 62 8 -356 206 -5 -46 294 404 -475 -10 -131 -43 61 113 -68 61 321 -141 -116 316 -353 -106 395
4204 395 -138 -143 97 -253 65 693 -345 -136 185 102 -4 69 337 -370 253 -101 -81 292 59 -159 19
4225 19 -140 -475 -42 288 -71 -34 199 -176 185 335 -203 -182 235 -70 -227 428 -58 -115 256 -144 -323
4246 -323 424 160 -245 254 -101 -376 151 24 -436 280 235 -141 51 497 -134 90 384 -57 272 76
4266 76 -391 -66 229 60 -128 454 228 -359 150 -92 100 121 -213 -162 166 -113 -404 261 -166 -403 110
4287 110 191 -484 -38 -47 -186 -51 320 -436 -272 241 -379 -251 540 -94 46 415 -163 -259 91 35 -494 326
$$ packed form
4139B87o02J66L60m35J75J93k66N8K58l37k54L96M4m30M96P9k16K47k5k46K29
4160A77k56m8R2K30m44K16J65j46L3J95n41N12J34l24n6L15l19j85L20k00RJ83
4182F2n4l64N62k11m1L40J10q79M65j21Q8J04N2j81J29K60m62K5M32o69K47N01
4204C95n33nK40l50L18O28j038K09L21q3j06P3K68p07O23l54K0L73k33k18J78
4225A9j59l35M33L30l59L7K33l75L61J50n38K1M17l05j57O55m86n7L71m00j79
4246c23P47k64m05M99l55k75N27j27m60P16m5l76J92M46o31K24K94m41L29j96
4266G6m67L25K95j69j88N82k26n87N09k42J92K1l34N1L28k79k91O65m27k37N13
4287A10Q1o75M46rj39J35L71p56J64N13o20J28P91o34J40L69n78r6L50n6n29Q20
$$ plain form
4309 326 92 -419 214 -97 -372 243 225 -106 351 336 -367 -92 343 -319 220 112 -243 21 201 -324 23
4330 23 329 -172 -251 204 -234 -186 587 131 -425 165 153 -338 418 347 -295 157 347 -350 305 153 -46 -14
4352 -14 264 -316 -69 170 -166 -129 185 23 106 204 -141 -93 357 -185 -138 300 -78 -309 307 -223 -148 120
4374 120 95 -405 128 22 -332 278 119 -246 -72 260 -248 154 307 -208 -304 303 -91 -320 188 -175 -413
4395 -413 298 -128 -267 315 -266 -309 348 11 -38 307 211 -363 144 -46 -275 218 253 -411 304 356 -88 -17
4417 -17 135 -451 41 456 -363 -91 632 -183 -32 314 -240 -296 324 -187 -465 310 64 -45 107 301 -536
4438 -536 409 -44 -234 110 234 -306 167 358 -134 97 347 -110 -69 115 -320 -196 392 116 -1 267
4458 267 170 -301 338 91 -421 247 -49 -129 332 114 -486 166 45 -330 190 361 -325 120 288 -364 73
$$ packed form
4309C26k34n11O33l11k75O15j8l31M57j5p03K75M35o62N39j08l55K64J80n25L47
4330B3L06n01p9M55m38M8P73m56n56N90j2m91P56p1o42M52J90o97O55j52j99L2
4352a4K78n80K47K39l36L7L14j62Q3R8l45M8M50n42M7M38l78k31O16n30P5K68
4374A20k5n00N33j06l54O10j59l65J74L32n08M02J53n15r6O07l94k29N08l63k38
4395d13P11m26j39N82n81m3O57l37m9L45r6n74N07j90k29M93L5o64P15N2m44P1
4417a7J52n86M92M15q19K72P23q15J51L46n54n6O20n11k78P75k46j09J52J94q37
4438e36R45m53j90L44J24n40M73J91m92K31K50m57M1J84m35J24N88k76j17K68
4458B67r7m71O39k47n12O68k96q0M61k18o00O52j21l75N20J71o86M45J68o52M37
$$ plain form
4479 73 218 -309 -48 346 25 -177 510 -161 -102 334 -325 -475 405 -2 -319 282 -22 -579 499 25
4499 25 -199 168 334 -375 70 109 -354 -130 216 -168 -68 374 -456 -251 178 -25 -325 443 -14 -359 220
4520 220 -59 -402 354 173 -307 357 -56 -461 434 103 -193 54 204 -305 70 156 -122 -14 293 -187
4540 -187 87 260 -346 -24 464 -38 -174 468 -139 -24 190 -95 -272 244 -27 -75 443 34 -417 448
4560 448 287 -570 431 225 -512 337 209 -485 189 291 -252 -100 276 -197 -108 337 -347 -246 652 -195
4580 -195 -76 225 80 -476 349 8 -391 289 -98 -550 280 -286 -83 166 164 -268 193 159 -628 23 362
4601 362 -319 19 114 -333 -163 218 -91 -269 316 69 -152 341 -324 -413 599 115 -343 559 165 -251
4621 -251 43 80 -598 -38 -12 -340 536 319 -105 32 242 -190 -48 143 -352 -99 537 -73 97 524 -92
$$ packed form
4479G3J45n27K61L94l21k02O87o71N9M36o59j50Q80m07l17O01l04n57J078m74
4499B5k24L67J66p09M45L9m63K24L46l84J00M42q30K05M29k03l00P68m57l45N79
4520B20k79l43P56j81m80O64m13m05Q95l31k96K47J50n09L75Q6k78J08L07m80
4540a87K74J73o06L22M88n02j36O42o07J15K14k85j77N16k71m8N18m09m51Q65
4560D48j61q57J001k06p37Q49j28o94O74J02n43J52L76m73Q9M45o84J01Q98q47
4580a95J19L01j45n56Q25l41l99O80l87m52Q30n66K03K49km32M61l4p87O51L39
4601C62o81L38R5m47J70L81l09j78N85k47k21M93o65q9J012m84m58R02l94m16
4621b51K94L7o78N60K6l28Q76k17m24J37K10m32J42J91m95K53O36o10J70M27o16
$$ plain form
4642 -92 -312 450 153 -231 196 -189 -372 405 -101 -394 121 82 -428 100 330 -289 36 224 -597 46 379
4663 379 -315 155 206 -181 121 332 -122 -72 454 -248 -161 294 119 -114 352 -21 -77 324 -113 -293 203
4684 203 341 -536 168 235 -515 263 251 -441 184 586 -70 -169 445 -169 -16 268 -279 -270 383 0 -535 293
4706 293 281 -531 89 14 -528 139 168 -286 -32 43 -228 50 271 -276 -51 403 -388 24 415 -434 -84
4727 -84 339 -344 -23 546 -249 -83 457 -8 -99 268 -152 -440 416 67 -464 190 -129 -409 318 60 -235
4748 -235 0 177 -430 55 183 -531 327 479 -313 -135 534 -165 -46 589 -329 -184 821 -157 -147 706
4768 706 -2 -361 283 -148 -576 303 170 -439 151 148 -536 195 90 -398 220 565 -499 228 269 -412 8
4789 8 615 -107 -35 377 -84 21 631 -177 -197 390 32 -499 522 265 -256 170 486 -333 247 460 -357
$$ packed form
4642i2k20P62k97l84M27l85j83P77n06k93N15l9n10N28K30o19L25J88q21O43L33
4663C79o94M70N1l87L02K11m54N0N26p02Q7M55j75k33M66l73n6M01m37j80M96
4684B03J38q77P04O7p50P78j2o92O25M02o56r9O14o14J53K84n47RO53l83n35Q28
4706B93j2q12O20p5n42O67K9m54K54P5k71K78K21n47K25M54p91M12L91q49L50
4727h4M23o83L21N69p95J66N40m65r1L67m20k88Q56l49n31O54l19k80P27k58k95
4748b35K35J77o07M85J28p14Q58J52p92J78O69o99J19O35r18J45J005r78J0Q53
4768G06p08l59O44m31m28Q79j33o09N90lo84P31j05m88O18L45j064P27M1o81M20
4789HO07p22P2M12m61J05O10q08k0N87l58n31J021k57n21M26L16q19N80K13q17
$$ plain form
4810 -357 371 419 -546 11 342 -499 -120 500 -356 83 551 -96 -416 308 -261 -132 587 -58 -312 525
4830 525 -177 -498 337 240 -538 239 18 -399 253 109 -474 154 289 -610 173 380 -322 -283 653 -168 -196
4851 -196 410 -167 -92 229 -171 -149 395 58 -419 529 8 -206 605 59 -434 -57 138 -586 143 464 -473
4872 -473 259 158 -341 -122 376 -389 -175 510 -454 162 559 -46 -333 265 -343 -120 244 -56 -217 388
4892 388 -52 -440 -2 167 -243 299 305 -282 132 171 -412 -128 273 -469 140 590 -222 -45 599 -331 -51
4913 -51 431 -391 -197 257 -375 -234 411 -274 -262 446 -74 -270 314 167 -376 77 140 -441 58 279 -270
4934 -270 223 182 -380 -7 379 -333 -383 458 -58 -281 243 -149 -398 507 -154 -231 245 -103 -605 171 193
4955 193 -456 503 124 -428 293 354 -442 159 386 -673 -86 300 -479 -46 491 -347 -445 311 -389 -101
$$ packed form
4810c57P28M8r65N57L31q41L79O20q56M39M68o47l20P24n69J29P19o45k54Q37
4830E25p02l21Q35r7p78P77k21m17O52j44n83O28J35q99P83K07p02L9R36q21k8
4851a96O06n77P5L21m00K2N44l37m77R48n21k14Q11n46m93L77J95p24P29L21r37
4872d73P32j01m99K19M98p65K14O85r64O16L97o05k87N98o08K23L64l00j61O05
4892C88m40l88M38J69m10N42On87M14L9n83K84M01p42O09M50q12J77O44r30K80
4913e1M82q22J94M54o32J41O45o85J2P08n20j96N84j47n43M53O3n81M99K21n49
4934b70M93m1n62L73L86p12n0Q41n16k23N24l92k49R05o61p7M76l48n02P76K2
4955A93o49R59l79n52P21O1p96O01K27j059N87L86p79M33N37q38r8P56p00K88
$$ plain form
4975 -101 607 -158 -315 496 -113 -567 444 41 -336 240 197 -328 84 249 -464 124 194 -476 227 328
4995 328 -399 27 382 -233 98 419 -581 -367 359 -140 -84 744 -391 -195 898 -9 -366 382 -154
5014 -154 -288 83 143 -578 105 625 -528 262 452 -245 54 271 -117 -309 218 -502 -90 583 -200 -109
5034 -109 330 -277 -248 399 -244 -77 330 -178 -425 511 281 -471 324 154 -340 421 116 -373 171 382
5054 382 -561 233 307 -429 -159 268 -464 104 686 -274 39 494 -209 -132 354 -128 -226 168 5 -428 334
5075 334 -206 -420 210 -126 -422 278 -108 -434 182 276 -95 319 284 -366 92 520 -99 -30 582 -214 -320
5096 -320 430 -160 -285 727 -253 -490 349 -36 -231 322 -8 -492 480 217 -456 137 322 -404 157 240
5116 240 -337 65 499 -457 -277 241 -264 -108 132 -475 -29 403 -88 -326 537 99 -327 540 331 -346
$$ packed form
4975a01P08p65j57Q11o09m54J011m03l77N76m3n25M12J65p13N88P0o70P03J01
4995C28p27M26L55o15L31L21j000K14P26m99N6Q28j135J96J093r07l57P48n36
5014a54j34L71O0p21O83N20j153P90J90o97K99K17l88j92N27p20M12O73p83R1
5034a09M39o07K9O47o43J67M07n08k47R36k30p52P95j70m94P61l05m89N44K11
5054C82r43P94P4p36K70M27p32N68N82r60L13M55p03P7M86m82r8L94j63m33P62
5075C34n40k14O30l36k96P00l86l26O16R4l71M14l5o50M58M28o19O9O12p96j06
5096c20P50n90j25J012r80k37Q39l85j95N53l30m84R72k63o73N93J85p26N61Q3
5116B40n77M02M34r56J80N18n05J56K40o07M46M32m91k38Q63m38m26Q67k09o77
$$ plain form
5136 -346 352 16 -319 177 121 -390 79 164 -429 183 397 -440 11 288 -621 153 208 -307 -160 487 -170
5157 -170 -72 702 -137 -272 426 -9 -622 393 62 -297 505 126 -280 43 -68 -228 331 261 -491 283
5177 283 199 -364 40 324 -170 -256 443 -471 -71 529 -208 93 484 -128 -179 364 -141 -288 647 33 -284
5198 -284 288 -270 -262 388 222 -507 329 368 -258 342 493 -223 -24 459 -177 10 458 -246 -217 399 -204
5219 -204 -251 466 0 -443 295 -183 -360 386 399 -262 185 106 -336 503 32 -257 332 499 -505 -20 40
5240 40 -284 40 600 -403 73 291 -16 -146 270 -118 -221 365 138 245 314 -121 -352 280 1 -406
5260 -406 392 234 -235 394 316 -535 250 249 -498 56 236 -449 -103 596 -242 35 539 -203 -123 424 -353
5281 -353 -361 471 -128 -192 226 -177 -502 264 253 -203 109 109 -283 156 373 -393 46 -3 -499 22 87 -476 -62
$$ packed form
5136c46O98l36l35M96n6n11M69Q5n93O12K14q37M51K77r09P74N5n15J47O47o57
5157a70R8P74q39j35O98m35o13J015l31l59Q02l79m06L23j11j60N59p0p52P74
5177B83q4n63M04K84m94q6O99r14M00O00p37L01L91o12n1N43n05j47R35o14l17
5198b84N72n58QO50j66p29Q36L9o26O00J51p16J99M83o36J87M48p04K9O16o03
5219b04m7P17m66m43P38m78j77P46J3o61M47p9m42Q39m71k89N89J67j004M85O0
5240D0l24L24N60j003M76K18l07j30M16l88j03N86k27J07O9m35k31O32k79m07
5260d06P98j58m69O29p8q51P85jp47N54J80o85L46O99q38K77N04p42Q0N47p77
5281c53qQ32n99o4M18m03l25P66j1m56L12%l92M39K17p66M39m9m96N21O5n63M14
$$ plain form
5304 -62 386 -395 -216 283 -42 11 379 -459 -123 299 187 -478 555 -30 -244 433 40 -380 355 255
5324 255 -214 465 107 -343 17 245 -307 -103 556 -382 -170 457 -407 47 408 -406 -135 445 -371 -295
5344 -295 156 -89 -407 310 -278 -460 361 74 -493 233 507 -374 440 187 -347 209 531 -303 -116 44
5364 44 -338 -6 374 -100 -333 248 -339 -48 372 32 -278 541 -85 -137 460 -28 -487 211 116 -212 253
5385 253 108 -468 240 484 -471 174 121 -546 140 386 -283 -7 214 -72 -264 318 -125 -72 392 -205 -346
5406 -346 380 -177 -433 288 -48 -397 271 325 -594 161 99 -510 388 509 -457 22 459 -491 -227 386 -284
5427 -284 -15 620 -264 -299 466 48 -249 321 -140 -560 320 12 -444 213 -114 -423 420 332 -413 502 380
5448 380 -312 52 147 -433 177 75 -440 -53 474 -330 -71 574 -381 -206 414 -63 -293 235 -84 -320
$$ packed form
5304f2M48p81J79M99l25N3L68q38L36M22j12o65J033n85k14O77l93m20P35j00
5324B55m69O79l58m50L60K28n52K04O59r38K12O27q64M54L61q14K71N80q16P6
5344b95M51k45l18P17n88j82Q21k87n67P26K74q81Q14k53n34N56L22q34J87J60
5364D4l82L32L80m74k33N81n87K91M20l40l10Q19o26n2N97m88m59O98r5l28M65
5385B53j45n76P08K44r55O45n3o67O86K46o69K76K21k86j92N82m43N3M64n97j41
5406c46P26n57k56P21l36l49O68N4r19P55o2o09Q98J21r66M79M37r50K64O13o70
5427b84K69O35q84l5P65m18k97N70m61m20Q80l08m56O57l27l09Q43q8p45R15j22
5448C80o92L64R5n80O10j02n15L87N27q04K59O45r55J75O20m77k30N28l19k36
$$ plain form
5468 -320 275 118 -404 381 131 -328 178 174 -456 199 161 -361 -106 273 -406 -35 452 -315 29 199 -271
5489 -271 -44 380 -146 -367 246 -128 -356 306 -110 -118 372 -4 -405 354 174 -238 320 139 -575 411 385
5510 385 -626 193 299 -305 -74 334 -452 14 576 -410 148 434 -348 -265 701 -58 -124 694 25 -457
5530 -457 301 -17 -483 494 47 -205 170 184 -341 68 204 -702 32 563 -464 255 281 -474 -19 310
5550 310 -334 -316 383 -378 -321 400 -281 -192 642 -125 -265 318 101 -367 348 65 -230 241 105 -596 17
5571 17 420 -519 360 366 -401 -51 450 -307 90 209 -305 -187 564 -95 -229 339 -114 -120 319 -3 -405 204
5593 204 31 -346 172 187 -293 249 316 -332 280 401 -392 -12 113 -308 -197 499 -453 49 628 -355 -230
5614 -230 436 -335 -411 277 -371 -445 474 24 -416 446 13 -619 439 193 -442 11 118 -410 -78 305
$$ packed form
5468c20N95j57n22P85k50m59N06mo30O55l8n22K55L79o79L71M87p67L44J70m70
5489b71K27M24n26k21O13l74k28O62m16qM90l76m01P59j80m12N58j81p14R86k6
5510C85j011Q19J06o04K31M08p86M66N62r86N58K86p82Q3R66p59o6Q18o69m82
5530d57P58l18m66R77m47k52L75J4n25M09J36r06P34N31j027P19K6p55M55L29
5550C10o44J8O99p61N7P21o81Q9Q34p67j40N83k17m68P15k83k95M71j36p01O13
5571A7M03r39Q79Op67L50N01p57L97J19n14J18P51o59j34N68m53oM39l22m02O09
5593B04j73l77N18J5m80N42O7o48O12J21p93L80J25m21J11O96r52N02N79r83J25
5614b30O66p71p6O88o48p4R19m50m40Q62m33o32J058k46o35M53J07n28L32L83
$$ plain form
5634 305 -342 -115 665 -348 27 613 -346 -128 319 -336 -45 658 -220 -172 377 23 -272 345 34 -359
5654 -359 454 153 -492 322 141 -561 357 315 -479 31 190 -439 161 280 -420 232 458 -266 -137 295
5674 295 -298 -121 508 -197 -211 362 -288 -175 531 -235 -568 299 127 -306 221 -30 -588 221 279 -478 -237
5695 -237 -38 -483 156 395 -182 -36 502 -304 15 434 -306 -136 288 -98 -503 593 -157 -390 150 -77
5715 -77 -187 303 238 -487 227 121 -574 86 300 -411 46 351 -368 54 299 -278 38 483 -418 -214 525
5736 525 -155 -24 551 -169 -144 407 -268 -378 318 12 -388 361 133 -473 265 279 -585 304 12 -462 106
5757 106 348 -418 16 438 -377 -109 223 -510 78 562 -94 -194 500 -226 -219 313 -198 -292 154 -138 -393
5778 -393 99 83 -394 378 80 -591 380 -1 -625 367 395 -682 185 555 -473 -32 494 -237 -182 448
$$ packed form
5634C05o47K27P80j013L75N86r59K18M47o55K91P03q78M8N49l54k95O17l11l93
5654c59Q13l01o45Q14j81p02R18m2p94N10J59o29O00J19p00O52K26p24J29M32
5674B95n93J77O29p05j4N73o50J13P06p66l33Q67j72m33N27k51n58Q09N8p57K41
5695b37J99m45O39K39n77J46N38q06L19M19p40J70M24l86m05J096p50k33N40k27
5715g7j10M90o5p25P14j06o95O60K14p11M57L05p19M22K45n77L16M45r01K04P39
5736E25o80J31N75p20K5N51o75j10O96l06m00P49k28o06P38J4q64Q89k92m74N68
5757A06K42p66M34M22q15K68L32p33N88M84o56j00O94p26PN32n11r4M46k92k55
5778c93M92j6m77P72k98o71R71l81o24R92K8j077Q67L70j028M41N26p31N5O30
$$ plain form
5798 448 -201 -513 397 -123 -482 603 -130 -371 441 -46 -538 248 213 -237 330 218 -633 251 176 -494
5818 -494 97 320 -404 34 439 -453 -285 481 -53 -282 642 -66 -346 613 -214 -440 436 -292 -259 584
5838 584 11 -544 434 348 -590 609 355 -596 217 273 -459 86 500 -392 -16 315 -432 71 373 -482
5858 -482 -183 369 -365 -259 709 -267 -243 797 106 -597 447 -26 -675 376 -131 -604 248 -35 -649
5877 -649 334 293 -482 -58 392 -481 169 538 -470 136 538 -496 6 468 -254 -43 451 -144 -368 430
5897 430 -132 -389 562 18 -332 374 129 -514 354 26 -461 96 233 -649 149 600 -364 -62 348 -252
5917 -252 -217 563 -735 -193 320 -332 -31 540 -117 -333 466 -261 -509 641 -16 -405 401 299 -698 158
5937 158 296 -503 89 450 -398 106 555 -598 209 515 -439 -183 548 -330 -111 613 -370 -258 398 -131
$$ packed form
5798D48o49l12R10n20l59J085p33k41Q12m87m92P86l5m50N67j12q51Q84p5o70
5818d94N91K23p24M38M05q92J68P66n34k29R24p08k80R59q27k26Q76p28L3Q43
5838E84n73n55R78q6r38J199k54r51Q13N6p32N45M14q92L76L31p47N03L02q55
5858d82K99N52p34J06R68r76K4J040o91p03J044m73o49J051n07m73Q52k83o14
5877f49R83m1p75M24M50q73O50L69j008O06M02j034N02M62p22K11M94n95k24P98
5897D30n62k57R51n44l50P06k45o43Q68l28m87N57J37q82P98M51r64L02M10o00
5917b52L5P80j298N42N13o52L01N71o57k16P99p27k48J150o57l89Q06j02r97Q56
5937A58J38p99N92L61q48N04M49j153Q07L06r54K56P31q78K19P24r83J12O56n29
$$ plain form
5957 -131 -338 530 -314 -429 465 139 -701 665 144 -620 146 454 -440 345 333 -670 166 414 -557 194
5977 194 588 -620 161 615 -492 -229 599 -451 -150 577 -353 -305 537 -108 -399 447 46 -525 328
5996 328 460 -431 218 134 -538 186 416 -357 131 537 -440 75 495 -432 -129 459 -82 -348 545 -335
6016 -335 -500 561 -103 -243 202 -78 -392 602 49 -509 540 232 -642 366 73 -445 58 376 -620
6035 -620 275 638 -823 82 548 -240 -134 759 -516 -364 468 -282 -122 627 -203 -484 244 -126 -556
6054 -556 529 -159 -750 307 136 -602 354 293 -851 -100 409 -613 92 575 -757 12 523 -471 153
6073 153 483 -513 -220 432 -92 -213 438 -136 -513 617 28 -408 499 91 -554 352 73 -588 514
6092 514 299 -784 234 599 -384 268 587 -503 -41 667 -681 -75 294 -373 -225 410 -245 -318 423
$$ packed form
5957a31k07Q68q44j15Q94l26q40J366n21p64P66L08q94P85j2j003Q36K48r71P51
5977A94L94j208P81M54j107K63Q28j050L01P27r30M8Q42o45k91Q46m01n71Q53
5996C28J32q91O49q4o72P24K30p73M88M06r77N15M20r27L03N88n41k66Q93q80
6016c35j65J061o64j40M45k80l14R94n53n58J049l08q74J008k93n18N03L18r96
6035f20Q95L63j461R05M66p88J06Q93j275J52Q32p50J60P49q30k81P28l70m30
6054e56J085o88n91J057j71p38R56o1j144P51N09j022P05M83j332P69N11r94O24
6073A53L30r96K93O52n24j21O51n74l77J130n89m36R07m08o45R06k79o61J102
6092E14k15j083J018L65r83O52L19j090M62P08j348O06L69o67J48O35o55p3P41
$$ plain form
6111 423 -86 -688 720 -3 -597 462 98 -446 108 75 -444 340 231 -632 186 512 -688 178 413
6130 413 -770 134 308 -396 -363 489 -386 -313 492 -587 -183 785 -302 -399 657 -184 -373 497 37 -648
6150 -648 357 187 -748 292 372 -480 116 522 -387 368 475 -609 -31 506 -570 -102 772 -118 -280
6169 -280 637 -387 -426 706 -245 -441 296 -52 -446 721 -8 -574 441 446 -778 134 327 -354 67
6188 67 602 -410 265 478 -524 61 368 -227 -68 540 -434 -263 695 -246 -283 514 -141 -432 539 -188
6208 -188 -529 483 -123 -431 247 305 -664 -21 253 -520 389 432 -495 253 448 -379 246 543 -239 122
6228 122 442 -454 -308 420 -337 -164 881 -51 -288 702 -125 -430 381 154 -406 516 -144 -639 428
6247 428 351 -445 292 582 -573 352 565 -585 66 491 -445 -311 837 -409 -260 419 -506 -340 626
$$ packed form
6111D23n09o02J408p23n94J059l64n44N54l3n19P84j09q63Q18L26j200Q66K35
6130D13j183R04J74p04L3Q52q75P3Q05j079M04R68j087r7J056q41j89Q70m60o85
6150f48J005j70r35J040Q0q52N96M06r09P55J07j084N78N37j076M68Q74q90j62
6169b80R17j024l9J132r51j96P37l48l94J167p29n66J015Nj224R12J93o81M21
6188F7N35j012O75K13j002N85L07n95J59O08r74J71R58r41l7P97o55k91R71p27
6208a88l41J012o06l08O78N8r69O43K74p73R09M3r27P48J95q27O25K97p82L61
6228A22L20q96J46P28p57J73J045r32k37R90q27l05Q11k27n60R22o60m95J067
6247D28p7p96P37K90j155R25K13j150O51M25r36J34J148j246J49O79r25J66R66
$$ plain form
6266 626 -42 -468 444 14 -702 444 124 -497 441 448 -484 56 475 -681 108 510 -637 -29 615 -553
6286 -553 -128 457 -536 -87 896 -338 -384 667 -462 -132 661 -192 -456 435 -87 -640 570 129 -690
6305 -690 306 167 -326 222 219 -352 459 203 -661 50 486 -528 159 595 -407 -99 404 -229 -346 540
6325 540 -350 -153 570 70 -560 643 -123 -617 411 -147 -509 460 120 -628 366 318 -562 78 494 -708
6345 -708 39 353 -587 -56 422 -224 -264 367 -296 -188 517 -319 -418 468 63 -620 551 -133 -296 698
6365 698 147 -509 225 183 -562 490 176 -464 176 219 -619 75 450 -340 77 879 -488 -383 556 -286
6385 -286 -145 583 -388 -255 617 -373 -414 665 193 -456 350 87 -511 430 211 -522 238 624 -476 217
6405 217 261 -654 174 246 -611 171 604 -533 133 609 -634 -185 663 -133 -364 760 3 -366 620 15
$$ packed form
6266F26o68m26R12m30p16J146l20o21R38Pr32N40M19j156P89M02j147O08O44j168
6286e53M25N85r93M49R83j234m6J051j129L30P93q53k64Q91n22n53J210m41q19
6305f90R96j39m93N48ln71Q11k56q64P11M36j014O87M36j002L08N03o33j17Q86
6325E40q90J97P23n00o30J203p66m94J028n58l62R69l40p48R94m8q80O40M16j202
6345g08P47L14r40N31M78o46m0O31o63J08P05q36r9Q86m05o83J171o84j63R94
6365F98n51o56P34m2p45J052l14o40O40M3q38O94L75p90M17Q02j367J05R39q42
6385b86J41P28r71J33Q72r90m1J079m72o49Q06k63n98R41k19p33P60L86j100O93
6405B17M4r15Q28P2q57P82M33j137O66M76j243M49Q48p96k31J124p57l69R86o05
$$ plain form
6425 15 -479 437 499 -468 584 51 -560 322 421 -542 304 147 -369 355 703 -558 50 404 -611 -144
6445 -144 661 -343 -280 596 -230 -365 511 -62 -441 541 -15 -508 534 -16 -675 209 484 -617 404
6464 404 325 -419 205 597 -692 16 522 -688 -127 516 -715 -139 759 -460 -191 725 -347 -619 464
6483 464 -368 -302 490 287 -814 578 132 -883 526 362 -548 497 223 -865 498 511 -247 190
6501 190 503 -634 -90 678 -660 -188 798 -316 -514 503 -472 -322 450 -5 -385 595 -39 -483 530
6520 530 156 -706 40 459 -455 334 22 -423 373 241 -467 -231 545 -447 -183 555 -338 44 458 -459
6540 -459 -120 507 -404 -173 434 -196 -769 530 -94 -531 553 263 -506 337 298 -671 380 188 -796
6559 -796 251 347 -669 534 427 -681 -141 538 -403 -152 617 -195 -379 604 -432 -353 650 180 -824
$$ packed form
6425A5m94R16O2r67J052n33o11Q82R9r63Q46j57n16P24L48j261O08L54j015M67
6445a44Q05j004O3Q76q26j35Q76n73l79R82n56m93J042n50o59Q84K75j101J021
6464D04p9p44O24L92j289P08N06j210N61O43j231N76Q98j219K69R16j072k72J083
6483D64q32O6P92k03j101J392m46j015J409j64r10J045k74j088J363J3p58M37
6501A90L13j137N44P68j338M72R86j114j98J017r75J50P72m55l80R80o34m44J013
6520E30l74q62P46M19r14P89l12m45P96j32p08K36P76r92K64P38q93L82M14r17
6540d59L39O27r11K31O07o30n73J299o24m37J084k90p69Q43l9r69J051j92r84
6559g96J047R6j016J203j07j108N40O79r41K51P69q12j84R83j036P9J003m70j004
$$ plain form
6578 -824 612 78 -462 353 -56 -476 684 350 -750 416 479 -378 102 394 -517 -90 603 -554 -268
6597 -268 821 -343 41 695 -245 -290 620 -174 -614 599 -76 -667 599 181 -819 525 124 -704
6615 -704 210 50 -577 175 255 -724 110 246 -651 130 461 -532 -175 755 -603 -109 619 -157 -276 641
6635 641 -350 -475 547 105 -390 613 -89 -508 312 402 -680 54 487 -581 513 290 -562 145 507
6654 507 -811 96 635 -569 -26 702 -494 -383 783 -152 -112 677 -16 -732 455 78 -767 734
6672 734 19 -349 654 -18 -651 340 579 -700 457 364 -589 8 245 -621 -79 388 -590 -280 383
6691 383 -377 -300 595 -195 -367 519 -386 -453 894 -298 -464 314 -34 -767 409 155 -823 265 431
6710 431 -425 138 536 -724 34 533 -387 245 358 -775 -168 391 -459 -337 726 -409 -365 625 -197
$$ packed form
6578h24J436n34n40Q15m09m20J160l34j100J166O3q57M80K92r11M27O93j157K86
6597b68J089j164L84O54r40m5R10p94m40J213o75n91J266m18j000J344m01q28
6615g04R14j60o27P52Q0r79Q34J36q97P81L31r93L57R30j358M94P28p76j19R17
6635F41r91j25J022m42m95J003p02m19Q20R0j082P34M33j068J094k23q52P07L62
6654E07j318R07N39j204N43P28j196J11J166r35M0P89o93p16J187l77q45J501
6672G34p15l68J003o72o33R91K39j279J157r3r53N97K37q66N42M67r78L10O63
6691C83p60P7Q95p90j72Q86r05o7J347j192j66P78l48p33J176k54r78J088J66
6710D31q56N63L98j260P58M99r20O32J13j133O07N59q50J22J063j135M4R90q22
$$ plain form
6729 -197 -483 656 -57 -588 277 61 -417 448 81 -300 185 281 -669 185 303 -349 160 465 -563 66
6749 66 573 -528 -233 776 -334 -185 461 -148 -417 566 -179 -509 476 -194 -496 582 49 -573 568
6768 568 278 -793 430 137 -810 460 284 -403 -15 765 -645 -86 539 -734 -229 412 -413 -152
6786 -152 705 -371 -390 422 -275 -310 377 33 -610 517 -87 -647 408 108 -626 513 374 -619 442
6805 442 398 -673 241 464 -473 57 573 -608 -344 147 -518 -181 549 -433 -279 572 -129 -273 717 3
6825 3 -546 548 -18 -562 483 211 -438 256 249 -943 365 201 -639 118 471 -245 -48 642 -351 -150
6845 -150 436 -550 -226 624 -108 3 903 -124 -400 723 -149 -594 569 -233 -581 458 162 -405 366
6864 366 248 -407 317 312 -750 -7 498 -588 15 586 -551 15 737 -343 -199 688 -408 -416 710
$$ packed form
6729a97k86J139p13n31Q65k16m78Q65l67l81M85R6r50Q54J18o52N09L05j028O29
6749F6N07j101K95J009j110J49O46o09k69R83p45l30R85o70l02J078n33o22J141
6768E68k90j071J223k93r47J270j76o87L88P80j410N59O25j273N05O41q25K61
6786a52Q57j076j9Q12o97l5O87l44o43J127o04n60J055l00p34J139j39r93J061
6805D42m4j071R14K23r37N30N16j181K64M91o65L37P30r82J54Q51p01j44R90p14
6825Cn49J094n66n44J045k72o49O94pj192J308j64q40P57L53p16J97O90r93K01
6845a50N86r86L24Q50p32J11R00j027k76J123q72m45J163q02l48J039k96n67P71
6864C66j18o55P24nj062P43N05j086O03N71j137N66P22j080J44Q87j096qJ126
$$ plain form
6883 710 -224 -445 651 -125 -671 461 -134 -621 502 272 -524 213 275 -687 589 349 -158 157 446
6902 446 -449 34 725 -373 -51 566 -475 -273 618 -474 -573 663 -115 -480 608 -116 -579 561
6920 561 47 -398 296 18 -376 533 232 -608 337 391 -516 -77 331 -543 34 599 -423 -133 577 -475
6940 -475 -323 438 -264 -389 464 -161 -437 777 -29 -487 584 254 -372 387 228 -642 377 162 -764
6959 -764 192 324 -781 -104 319 -511 214 261 -675 -257 613 -186 -97 542 -400 -284 565 -308 -352 596 -143
6980 -143 -446 538 -165 -775 207 327 -737 505 449 -753 185 455 -522 191 171 -691 26 406 -380 -128
7000 -128 794 -470 -142 594 -425 -493 681 -322 -375 517 -153 -415 543 -75 -667 482 162 -563 336
7019 336 311 -790 149 630 -505 82 514 -431 232 578 -594 -197 600 -628 -247 319 -187 -194 560 -134
$$ packed form
6883G10r34k21J096p76n46J132n95m87J123k30p96P37O2r62J276k40n07L15K89
6902D46q95M83O91j098L22O17j041K02Q91j092r9J236p78l65J088p24m63J140
6920E61n14m45O94k78l94R09l01q40R45N4r07M39M08q74N77N65j022K90P10j052
6940d75J52P61p02j25Q53o25k76J214q06m58J071l30o26P59j59q70J019k15r26
6959g64R56J32j105O77M23q30P25M7r36M18Q70p99Q9O39r42J16Q49q73m4R48p39
6980a43l03R84p03o10R82J20j064J242n6j202R38K70r77P13k0q62P17L80p86K52
7000a28R22j264L28P36j019o8J174j003n3Q92o70k62R58o18n92J149l20p25Q99
7019C36k5j101R39M81j135N87M32r45O63L46j172L97P97j228L81N66n06pP54o94
$$ plain form
7039 -134 -416 631 -25 -551 887 50 -676 603 369 -254 354 65 -854 355 539 -709 165 539
7057 539 -743 147 586 -399 -31 546 -600 -21 836 -550 -190 704 -228 -253 580 -272 -628 499 5
7076 5 -435 558 169 -468 334 99 -658 154 330 -753 17 322 -618 -51 344 -719 -62 506 -348 -183
7096 -183 682 -179 -390 853 41 -696 704 -51 -569 542 -20 -599 429 254 -660 504 225 -783
7114 -783 140 252 -792 221 589 -371 -2 746 -607 -256 327 -477 -285 604 -403 -549 877 -70
7132 -70 -447 483 -84 -655 740 54 -554 586 416 -715 196 364 -740 417 643 -645 38 621
7150 621 -359 145 361 -335 -119 602 -312 -309 566 -476 -211 775 -455 -529 424 110 -591 383 188 -663
7170 -663 595 160 -646 508 448 -460 416 526 -657 151 797 -335 -99 590 -736 -82 690 -344
$$ packed form
7039a34k82J047o56n26J438q37p26J279k34o23O08k89r19J209J84j248Q74L74
7057E39j282Q90M39r85L68N77j146N79Q57j386L60Q94r32k5Q33q52l56J127m94
7076Em40R93l89o37Q02k35p57Q12J76j083P70L05r40N67L95j063O57N68q54J65
7096a83Q65q61k11J243q12p37J400p55n18J111n62n79J028j75r14J164k79j008
7114g83R23J12j044J013L68r60L69P48j353L51N83q04J92Q89j007j46J426r47
7132g0l77R30n67n71J395o86o08J140j70j131R11J68j104J157K26j288O83N83
7150F21r80N04K16o96K16P21r14LQ75j042K65R86j230p4R53l14p01R74j95q51
7170f63J258m35q06J154o0r08Q76J10j183Q08O46j132K36O89j326O54P72j034
$$ plain form
7188 -344 -174 378 -547 -491 824 -61 -462 618 -339 -500 577 -9 -530 556 242 -557 371 396 -585
7207 -585 209 183 -684 214 750 -458 66 784 -438 -202 578 -446 -256 728 -283 -165 694 -71 -348
7226 -348 778 144 -662 519 180 -576 657 169 -629 465 424 -287 309 286 -331 158 528 -585 305
7245 305 445 -435 41 552 -369 -95 805 -484 -167 596 -375 -305 645 141 -601 494 100 -489 482 10
7265 10 -524 346 150 -605 407 377 -858 177 502 -619 -45 542 -774 -159 782 -446 -73 625 -502
7284 -502 -240 638 -406 -432 410 -53 -467 540 207 -340 611 192 -726 421 488 -338 338 487 -615
7303 -615 157 563 -747 348 611 -504 -192 625 -627 -446 375 -474 -87 501 -264 -168 589 -152 -387
7322 -387 582 147 -624 332 203 -692 522 306 -600 212 270 -343 -69 505 -598 50 771 -698 -59
$$ packed form
7188c44J70N52r25N6J315q85m01J080r57j61J077n86n21J086l14p99R28K5r81
7207e85P94k6q67Q98N36j208N24P18j222K36P80j024J90R84j011J18Q59p65k77
7226c48J126o34q06J181l39p56J233m88p98J094m1p11N96k3o17M89L70j113Q90
7245C05J40q80M76N11r21K74R00j289L17P63r71P0R50n04p42J095l94n89R71m72
7265A0n34Q70j96p55J012l0j235J035L25j121N74N87j316O15R41j228L73O98j127
7284e02K62Q78j044k6Q42m63m14J007l33n47R51m19r18J147O7q26O76J49j102
7303f15P72M06j310J095K63j115L12Q17j252J81Q21q49L87N88p65R6P57p41k35
7322c87R69m35p71R56j29q95J214k16r06Q12N8o13K74N74j103O48P21j469O39
$$ plain form
7341 -59 620 -612 -338 770 -135 -219 413 -140 -282 496 -20 -642 278 1 -647 658 148 -417 518 206
7361 206 -530 325 419 -317 98 430 -639 157 543 -518 -36 347 -525 -260 496 -387 -188 501 41 -254
7381 -254 499 -118 -589 423 0 -971 490 254 -829 352 414 -904 348 313 -624 251 538 -605
7399 -605 30 561 -528 -158 611 -395 -129 586 -111 -377 525 -198 -98 519 74 -203 144 173 -308 712
7419 712 193 -479 163 466 -363 296 451 -324 259 374 -701 130 313 -568 -93 715 -585 -54 393
7438 393 -555 -268 590 -401 -408 478 -47 -290 161 148 -634 348 219 -447 381 341 -582 368 231 -402 167
7459 167 619 -578 147 378 -592 -197 355 -355 -252 701 -578 -263 471 -41 -243 543 -4 -715 428
7478 428 17 -615 448 91 -260 256 229 -604 212 432 -766 358 398 -464 -170 404 -204 66 557 -408
$$ packed form
7341e9O79j232K74J108r05q4O32n53j42P78n16o22R20k77o48J305n10n65R35l12
7361B06p36Q55R4p36M15L32j069P96L86j061M82L83q72K65P56q83J99O89m60k95
7381b54P53o17m71J012m23r71J461k36j083J181O2j318J252l5r37Q75K87j143
7399f05O35N31j089L70P69j006K66P15o97k66R02p23J00O17m45k77L47K9m81J020
7419G12n19o72O42L03q29O59J55p75N83J15j075Q31J83q81M75Q08j300N31M47
7438C93r48K87Q58r91pQ86n25k43M51j3p82R82j29o66Q28m0r23R50j37o33N69
7459A67M52j197P25K31r70L95N52p10J03R53j279L15P34n12k02P86n47p11J143
7478D28m11o32J063l57l51N16k7q33Q16K20j198J124M0q62K94N74o08K70M91r65
$$ plain form
7498 -408 -77 495 -270 -182 859 -57 -430 593 -327 -532 529 31 -690 498 517 -477 171 51 -577
7517 -577 158 197 -377 36 336 -810 208 385 -251 -52 243 -560 -372 528 -136 -351 416 -326 -232 353
7537 353 -236 -367 621 3 -472 452 172 -563 263 164 -395 381 168 -389 302 262 -582 -35 425 -560 63
7558 63 626 -491 -107 382 -408 -380 711 -249 -291 267 -67 -331 403 379 -500 343 42 -468 377 294 -460
7579 -460 529 521 -536 129 281 -201 180 127 -595 -110 300 -509 -233 470 -417 -442 380 -211 -279 545 -223
7600 -223 -404 117 219 -208 111 135 -662 218 275 -130 268 498 -304 185 591 -542 3 447 -511 38
7620 38 125 -587 -80 381 -176 -84 365 -319 -339 264 -92 -546 544 -145 -415 425 -106 -454 457 213 -548
7641 -548 304 130 -498 199 203 -430 -124 482 -317 -276 483 -213 -30 607 -206 -231 348 -262 -282 416 -212 -268
$$ packed form
7498d08L31N72p65Q8J041r16l73J023r20k05J061m98p21J188J9r94O48j20o28
7517e77P35L9n74M13L00j146J018J77o36J99K95q03J88R00o64k15P67p42R4N85
7537C53n89j31R88o18m75R24k80p35Q26r9n59P76k13n57O91m0q44N47M60r85O23
7558F3N63j117L84M89p90K8J091r60m2N58l34k64P34k4q79Q43l01n10Q45q3p54
7579d60R89qj057O65J52m82L81n3p22M85M10q09K76P03q87k5Q22n91o8Q24p68
7600b23j81N21J02m27L19K4p97Q80N7m05L98K30q02M89M06j133N45M44r58N49
7620C8Q7p12N07M61n57R2M49o84k0O03l56m54J090o89k70Q40n31l48R11k44p61
7641e48Q52j74o28O97Mo33L06O06p99M1P59o96J83O37q13k5N79o10k0O98o28n6
$$ plain form
7663 -268 334 -207 -598 303 211 -282 339 47 -526 218 465 -303 63 213 -489 154 405 -292 55 360
7683 360 -502 -173 212 -517 -382 380 -191 -443 316 -241 -357 694 -81 -451 467 -136 -316 135 255 -519
7703 -519 160 479 -314 148 471 -321 102 646 -305 -115 335 -533 -89 545 -138 -318 427 -204 -269 539
7723 539 -169 -136 467 26 -445 255 90 -493 275 -65 -319 149 115 -456 337 307 -284 -6 635 -208 67
7744 67 186 -282 100 400 -218 -237 560 -28 -295 659 -172 -216 387 152 -344 228 -219 -529 391 128 -246
7765 -246 457 276 -487 -30 377 -320 -15 128 -157 63 227 -430 101 438 -89 -49 713 -333 -129 294
7785 294 -298 -237 363 -54 -70 396 158 -494 450 144 -79 293 106 -357 108 329 -529 -16 -24 -497 -34
7806 -34 265 -477 49 401 -378 -254 298 -202 -217 528 -4 -185 256 28 -349 361 -98 -528 28 35 -266
$$ packed form
7663b68O02n41l91R01r2m93O21k92n73P44K47p68L66J50p02O43K51o97L47L05
7683C60q62L29L85p29J35P62n71k52P59n57j16J051p75l70R18o03j80M51J20p74
7703e19O79L19p93M62L23p92M23N44r51J90M50q68M44O34o83j80P45o31o5Q08
7723E39p08L3O03m41m71P00j65n83P68l40k54M68l4n71P93l0n91K78O41q43K75
7744F7J19m68L82L00o18j9P97n88k67R54q31m4O03k35m96N72m47l10R20k63l74
7765b46P03j81p63M57M07o97L05J43k85K20J64o57N31L37n27M0P62j046K04M23
7785B94n92O1O00m17j6M66k38o52R44l06k23L72j87m63M65K21q58N13qm73M63
7806c4K99p42N26L52p79J24N52n00j5P45n32j81M41k28l77P10m59m30N56Pl01
$$ plain form
7827 -266 233 349 -94 -372 144 -178 65 46 -335 153 125 -490 -156 340 -108 -139 582 -124 -18 503 -363
7848 -363 -263 145 -4 -265 521 215 -18 220 -144 -339 288 426 -409 139 243 -192 -56 -4 -172 -70
7868 -70 280 -421 26 280 -416 -225 184 -375 -70 405 -143 -163 514 242 -440 373 211 -498 29 -134 -489
7889 -489 75 62 -584 -125 226 -489 138 135 -267 -229 474 -235 -43 460 -232 -480 485 -307 -438 394 -183
7910 -183 -243 440 -320 -317 74 -118 -147 161 120 -583 17 170 -445 82 388 -191 -5 246 -57 -57 580 -528
7932 -528 -92 357 -265 -277 214 -307 -325 351 116 -281 188 58 -357 522 -169 -315 255 283 -271 87 188
7953 188 -586 47 250 -316 296 215 -347 208 269 -451 -228 319 -319 -110 331 -47 -42 342 -178 -213 423 111
7975 111 -420 249 -66 -262 220 211 -253 230 179 -323 276 163 -497 221 202 -186 36 250 -408 -29 275
$$ packed form
7827b66M99J16m43k78N16l22K43j9l81M88k8o15L34M96m48l1P21p06J06N21q66
7848c63J00M08j49k61P86l06k33K38l64j95O27J38q35N48J04m35J36N2j68J02
7868g0L50p01M47K54o96J91M09n59L05M75n48k0O77k72o82Q13j62p09N27j63l55
7889d89N64j3o46M59L51p15O27lm02L8P03p09J92N03o92k48R65p92j31Q32n77
7910a83o0O83p60LL91j92k9L08m1p03O00J53o15N27L06n79J86K51l03%O37j108
7932e28M36M49o22j2M91n21j8O76k35l97M69j30m15Q79o91j46N70K8n54L58J01
7953A88p74O33K03n66O12q1n62N55O1p20K23N47o38K09M41l78NL84n20l5O36l12
7975A11n31O69l15j96M82rm64M83n1n02N99j13o60P18j9l88K22K14o58L79L04
$$ plain form
7996 275 -201 -152 363 -156 -345 293 -76 -326 369 -111 -438 329 -94 -315 537 141 -462 61 40 -219 63
8017 63 323 -400 103 314 -365 -15 312 -357 -17 439 -296 -156 480 -97 11 228 -316 -435 327 16
8037 16 -275 368 -27 -425 434 123 -315 222 114 -355 22 203 -379 39 226 -450 -90 415 -289 -93
8057 -93 306 -271 -77 250 -134 -165 378 -31 -305 469 -63 -171 493 -169 -206 394 126 -177 385 205 -212
8078 -212 245 207 -364 121 156 -270 50 -8 -326 65 275 -355 -222 470 -318 -97 359 24 -405 348 -97
8099 -97 -274 433 -97 -204 205 281 -522 388 40 -341 92 328 -490 87 139 -412 130 218 -266 -234 120 -319
8121 -319 81 661 -55 -298 319 -216 -98 160 64 -182 367 -68 -396 193 117 -758 533 439 -518 430 89
8142 89 -230 203 247 -310 383 270 -293 67 179 -154 -177 130 -101 -300 235 -51 -300 475 138 -322 314
$$ packed form
7996B75m76M9N15n19j89O38l69k50O95m80l27P67m23k21Q52l96o03N23k1k59K82
8017F3K60p23N03K11o79L50L27o69L40M56p35J40O36n77J08K17n44j19P62l11
8037A6k91O43l95l98Q59l11m38N37j08m69L77J81n82M18J87o76L60N05p04J96
8057i3L99n77J94L27l84l1N43m09k74P74n32j08O64o62l7O00k68l03N62j80m17
8078b12M57l8n71M85L5m26L20n8l18L91K10o30J33O92p88K21M56l35m29P53m45
8099i7j77P07n30j07M09P6q03R10l48l81M33K36q18N77N2n51N42Q8m84L2L54m39
8121c19M00N80p16k43O17n35J18K58r6k46N49m35l28N89p6q75J291r4r57R48l41
8142H9l19M33M4n57O93j13n63L60J12l33k3L07k31j99N35k86k49P75l37m60O36
$$ plain form
8163 314 -135 -132 288 51 -339 132 19 -448 112 176 -292 84 182 -182 -87 228 -208 -123 367 -220 9 277
8185 277 40 -88 325 -357 -350 557
$$ packed form
8163C14m49LM20k37l90M71j13m67N60O4m68L76R8l64R5L15m36Q5M90n87K29K68
8185B77k37j28M13o82PR07
8191E57
$$ Imaginary data points
##PAGE= N=2
##DATA TABLE= (X++(I..I)), XYDATA
$$ plain form
0 0 0 0 0 0 0 0 0 0 0 0 0 0 0 -6 8 -8 8 -8 10 -16 16 -18 24 -26 32 -35 42 -49 55 -64 72 -80 92 -105 118 -132
36 -132 148 -164 183 -206 230 -253 282 -311 343 -380 416 -460 506 -559 614 -678 749 -825 914
55 914 -1012 1127 -1259 1414 -1599 1823 -2101 2462 -2942 3614 -4624 6300 -9557 18090 -84841
70 -84841 -151806 137874 22304 -85895 95821 19694 -82928 132219 76993 -91739 69897
81 69897 94011 -54792 49057 43443 -84564 42990 43486 -134811 -5675 62231 -109571
92 -109571 -11028 75994 -109720 -22766 107154 -106056 -74809 131284 -39595 -94516 105984
103 105984 5591 -59864 127769 28079 -93779 93747 58598 -94159 37013 35656 -78980
114 -78980 53042 37380 -117274 26721 71367 -99470 2751 71613 -91232 5269 98523
$$ packed form
0@%%%%%%%%%%%%%oJ4j6J6j6J8k6L2l4M2n0N8o7P7r1J04j19J36j52J72j97K23k50
36a32K80l12L47l89M36m83N35n93O54p23P96q76R66j065J173j292J427j574J739
55I14j926K139k386K673l013L422l924M563n404O556q238J0924j5857K7647j02931
70h4841o6965K89680j15570j08199J81716p6127j02622K15147n5226j68732J61636
81F9897K4114j48803J03849n614j28007J27554M96j78297J29136O7906j71802
92a09571R8543Q7022j85714Q6954J29920k13210L1247K06093j70879n4921K00500
103A05984j00393o5455J87633r9690j21858J87526l5149j52757J31172j357j14636
114g8980J32022j5662j54654J43995M4646j70837J02221O8862j62845R6501R3254
$$ plain form
125 98523 -91908 -26599 123530 -65313 -73332 103006 -32166 -72474 97355 -16893 -77410
136 -77410 110030 14987 -111166 59927 31810 -92807 40166 15239 -101428 65878 76187
147 76187 -98217 24417 91811 -60936 20168 74375 -88239 2533 109362 -75006 -50254
158 -50254 90918 -44997 -49501 76496 -58337 -71975 93249 -27294 -95164 80069 9086
169 9086 -87955 61609 10779 -92092 72668 48868 -96577 56741 93966 -66489 27796
180 27796 78762 -67171 17528 78068 -93883 -33793 85436 -56697 -45226 65120 -52481
191 -52481 -35029 84341 -58613 -77732 87731 -15216 -80704 71572 -1514 -72748 89301
202 89301 23112 -97199 74917 70142 -86874 36621 73783 -69423 25395 66768 -90426
$$ packed form
125I8523j90431O5309J50129j88843q019J76338j35172m0308J69829j14248o0517
136g7410J87440r5043j26153J71093k8117j24617J32973k4927j16667J67306J0309
147G6187j74404J22634O7394j52747Q1104N4207j62614R0772J06829j84368K4752
158e0254J41172j35915m504J25997j34833j3638J65224j20543o7870J75233p0983
169I086r7041J49564n0830j02871J64760k3800j45445J53318L7225j60455R4285
180B7796N0966j45933Q4699O0540j71951O0090J19229j42133J1471J10346j17601
191e2481J7452J19370j42954j9119J65463j02947o5488J52276p3086p1234J62049
202H9301o6189j20311J72116m775j57016J23495L7162j43206R4818M1373j57194
$$ plain form
213 -90426 -7584 79848 -76045 -45096 61998 -47022 -21360 70591 -55955 -36759 96368
224 96368 -31405 -71785 67975 -12266 -55030 81131 -7543 -79878 91863 43404 -92271
235 -92271 44780 52946 -75520 30050 44758 -93005 14746 76171 -78503 -22353 69045
246 69045 -49639 -17260 62781 -53547 -17333 89964 -39581 -49857 77217 -19372 -51895
257 -51895 64723 -25918 -62891 88126 8156 -86718 65759 41538 -75549 38273 29672
268 29672 -87132 33089 53189 -93324 897 74892 -53994 -4875 63874 -52284 -4802
279 -4802 76410 -55876 -35908 79027 -27659 -43610 62048 -29245 -45872 75944 -18802
290 -18802 -71335 73790 17620 -72482 49151 22532 -68924 47534 30679 -89683 25273
$$ packed form
213i0426Q2842Q7432j55893L0949J07094j09020K5662R1951j26546J9196J33127
224I6368j27773m0380J39760q0241m2764J36161q8674p2335J71741m8459j35675
235i2271J37051Q166j28466J05570J4708j37763J07751O1425j54674N6150R1398
246F9045j18684L2379Q0041j16328L6214J07297j29545j0276J27074r6589l2523
257e1895J16618r0641l6973J51017p9970r4874J52477k4221j17087J13822q601
268B9672j16804J20221K0100j46513R4221P3995j28886M9119O8749j16158M7482
279d802Q1212j32286J9968J14935j06686j5951J05658r1293j6627J21816r4746
290a8802n2533J45125n6170r0102J21633k6619r1456J16458j6855j20362J14956
$$ plain form
301 25273 60073 -70545 2909 61999 -48350 8024 64240 -61803 -18973 74178 -45367
312 -45367 -44213 58611 -27386 -32160 66331 -27313 -48102 79060 265 -66743 54055 14166
324 14166 -58597 48288 11441 -76138 47290 43090 -80351 14524 53440 -56630 11608
335 11608 51002 -62637 5328 73486 -59131 -34680 62804 -32916 -29693 56789 -34318 -30588
347 -30588 80776 -13771 -56731 63183 8190 -52225 44542 -4866 -65015 54131 21767
358 21767 -79012 30626 45824 -57442 17131 37057 -62614 16964 58456 -64958 -14410
369 -14410 66230 -36680 -20918 53506 -35875 -18596 70370 -27000 -41906 67257 -3230 -47413
381 -47413 45103 -9224 -52183 50174 -1255 -72235 41770 29599 -60538 27748 34661 -53580
$$ packed form
301B5273L4800j30618P3454N9090j10349N6374N6216j26043M2830R3151j19545
312d5367J154J02824q5997m774R8491r3644k0789J27162p8795o7008J20798l9889
324A4166p2763J06885l6847q7579J23428m200j23441R4875L8916j10070O8238
335A1608L9394j13639O7965O8158j32617K4451R7484r5720L223Q6482r1107L730
347c0588J11364r4547m2960J19914n4993o0415R6767m9408o0149J19146l2364
358B1767j00779J09638J5198j03266P4573J9926r9671P9578M1492j23414N0548
369a4410Q0640j02910J5762P4424q9381J7279Q8966r7370j4906J09163p0487m4183
381d7413R2516n4327m2959J02357n1429p0980J14005j2171r0137Q8286O913q8241
$$ plain form
393 -53580 27272 40387 -68712 6229 59960 -51351 -12517 55535 -35683 -8463 60765 -38050
405 -38050 -25577 70583 -20334 -46468 50009 -10291 -42294 48349 -13345 -58053 52809 12894
417 12894 -65067 32717 27907 -48148 31454 26246 -61312 24411 47617 -61979 -6059 49409
429 49409 -38647 -1513 49424 -42892 -8362 67729 -31442 -36968 53401 -14953 -35083 44672
441 44672 -19714 -43129 58062 3628 -55908 41547 20178 -46773 31080 15429 -54955 30709
453 30709 31918 -63516 6561 40773 -47753 557 40018 -44953 1868 57092 -40941 -19107
465 -19107 60395 -22613 -29055 48331 -20750 -31729 56258 -10588 -45761 54175 13069 -46713
477 -46713 35570 12040 -47873 31330 12635 -63135 20157 32310 -55223 3534 33484 -43025
$$ packed form
393e3580Q0852J3115j09099P4941N3731j11311L8834O8052r1218K7220O9228r8815
405c8050J2473R6160r0917k6134R6477o0300l2003R0643o1694m4708J10862l9915
417A2894p7961R7784m810p6055P9602n208q7558Q5723K3206j09596N5920N5468
429D9409q8056L7134N0937r2316L4530P6091r9171n526R0369o8354k0130P9755
441D4672o4386k3415J01191n4434n9536R7455k1369o6951P7853j5651p0384Q5664
453C0709J209r5434P0077L4212q8526M8310L9461q4971M6821N5224r8033K1834
465a9107P9502q3008o442P7386o9081j0979Q7987o6846l5173R9936m1106n9782
477d6713Q2283k3530n9913P9203j8695p5770Q3292J2153q7533N8757K9950p6509
$$ plain form
489 -43025 8471 40768 -49097 -3055 59431 -33347 -23351 49288 -19441 -17318 52627 -21798
501 -21798 -33214 60685 2287 -45196 38904 10704 -36679 33204 -306 -57209 28914 21432
513 21432 -58079 7703 26704 -40440 14813 29019 -50325 9341 51873 -42303 -15828 45945
525 45945 -26273 -11646 47205 -27994 -21092 61436 -9167 -38120 45604 3842 -33453 37227
537 37227 -2921 -45529 37748 10748 -56116 18877 21542 -43781 17095 22586 -47270 16539
549 16539 38898 -49568 -4985 44499 -34076 -11725 39640 -31593 -12137 53330 -20600 -26563
561 -26563 52432 -3155 -30695 37338 -5126 -33106 40484 202 -47152 32672 17321 -43390
573 -43390 20406 18129 -41002 21543 24833 -51830 6346 38845 -41961 -9991 33760 -32462
$$ packed form
489d3025N1496L2297q9865M6042O2486r2778R996P2639o8729K123O9945p4425
501b1798j1416R3899n8398m7483Q4100k8200m7383O9883l3510n6903Q6123p482
513B1432p9511O5782J9001o7144N5253J4206p9344N9666M2532r4176K6475O1773
525D5945p2218J4627N8851p5199O902Q2528p0603k8953Q3724m1762l7295P0680
537C7227m0148m2608Q3277k7000o6864P4993K665o5323O0876N491o9856O3809
549A6539K2359q8466M4583M9484p8575K2351N1365p1233J9456O5467p3930n963
561b6563P8995n5587k7540O8033m2464k7980P3590m0282m7354P9824j5351o0711
573d3390O3796k277n9131O2545L290p6663N8176L2499q0806L1970M3751o6222
$$ plain form
585 -32462 -6412 41552 -31386 -17177 52499 -11808 -25996 40776 -6230 -23808 39902 -9917
597 -9917 -38710 41372 9311 -42168 27830 15628 -36873 26314 16134 -48842 18090 30866
609 30866 -48555 -3394 31384 -35379 -2229 33782 -35763 -7158 46618 -24918 -21997 41782
621 41782 -11446 -19256 37474 -15395 -27600 44539 -2387 -39548 34685 12714 -32987 28109
633 28109 10320 -40436 26681 22186 -48998 6188 29268 -36612 -81 26017 -34712 2237
645 2237 39444 -31890 -13307 41029 -18202 -18110 32538 -19689 -19270 42215 -13273 -34459 39968
658 39968 5748 -32647 30286 7579 -32464 31211 13327 -45467 17604 26685 -37910 4918
670 4918 22548 -33389 7858 30187 -36717 -2720 40032 -26164 -14532 31324 -23635 -14118
$$ packed form
585c2462K6050M7964p2938J4209O9676o4307j4188O6772m7006j7578O3710m9819
597i917k8793Q0082l2061n1479O9998j2202n2501O3187j0180o4976O6932J2776
609C0866p9421M5161L4778o6763L3150L6011o9545K8605N3776p1536K921O3779
621D1782n3228p810N6730n2869j2205P2139m6926l7161P4233k1971m5701O1096
633B8109j7789n0756O7117m495p1184N5186K3080o5880L6531K6098o0729L6949
645B237L7207p1334J8583N4336n9231R2N0648n2227M19O1485n5488k1186P4427
658C9968l4220l8395O2933k2707m0043O3675j7884n8794O3071R081o4595M2828
670D918J7630n5937M1247K2329o6904L3997M2752o6196J1632M5856n4959R517
$$ plain form
682 -14118 37452 -22432 -26558 43674 -3557 -32299 33388 4679 -28489 31962 5628 -39216
694 -39216 26047 19423 -38970 10282 21008 -29464 12057 21326 -35542 7147 33537 -32208
706 -32208 -8561 30640 -24823 -8948 30958 -28676 -17779 42636 -12928 -28184 36414 742
718 742 -24746 31749 -82 -32280 31219 11628 -38887 15991 17462 -29891 13512 16411 -32474
731 -32474 14007 25942 -35523 -109 29208 -27910 -4649 27767 -29369 -8165 38908 -22389
743 -22389 -21014 40001 -6555 -23147 32976 -4419 -26535 32878 1732 -36555 23696 12549
755 12549 -32237 15040 12849 -29818 17005 18410 -35042 8698 27081 -31125 -2220 24591
767 24591 -26961 -1013 32256 -26525 -10617 40337 -13411 -20222 32439 -6457 -20020 30601
$$ packed form
682a4118N1570n9884m126P0232m7231k8742O5687k8709l3168O0451k6334m4844
694c9216O5263o624n8393M9252J0726n0472M1521R269n6868M2689K6390o5745
706c2208K3647L9201n5463J5875L9906n9634J0897O0415n5564j5256O4598l5672
718G42k5488N6495l1831l2198O3499j9591n0515N4878J471m7353M3403K899m8885
731c2474M6481J1935o1465L5414K9317n7118K3261L2416n7136K1204M7073o1297
743b2389J375O1015m6556j6592N6123l7395k2116N9413l1146l8287O0251j1147
755A2549m4786M7277k191m2667M6823J405n3452M3740J8383n8206K8905K6811
767B4591n1552K5948L3269n8781J5908N0954n3748o811N2661l8896j3563N0621
$$ plain form
779 30601 -8333 -32009 28904 5612 -34073 17047 9676 -26616 18866 10884 -33766 16416
791 16416 24460 -31748 2436 23133 -24860 3986 25920 -28957 -2584 37898 -19536 -14951
803 -14951 32036 -11888 -15387 28920 -15189 -25417 31702 -3454 -32661 21881 4904 -25885
815 -25885 22429 6511 -30427 22263 18071 -33286 9410 22663 -25456 6684 21517 -28319
827 -28319 3465 31586 -24413 -8683 30921 -16537 -13048 25179 -18082 -18074 29305 -12209 -27084
840 -27084 26450 -174 -25043 23546 3959 -23982 25904 10984 -31174 17337 20037 -27930
852 -27930 7645 18416 -25890 7368 23686 -28648 -2677 29552 -20819 -11622 23240 -18320
864 -18320 -11393 26067 -18304 -20713 30496 -4363 -22497 24983 563 -19596 27475 3566
$$ packed form
779C0601l8934k3676O0913k3292l9685N1120p371l6292M5482p982m4650N0182
791A6416Q044n6208L4184K0697m7993K8846K1934n4877K6373M0482n7434M585
803a4951M6987m3924l499M4307m4109j0228N7119l5156k9207N4542j6977l0789
815b5885M8314j5918l6938N2690m192n1357M2696J3253m8119L2140J4833m9836
827b8319L1784K8121n5999J5730L9604m7458L489L8227m3261QM7379m1514j4875
840b7084N3534k6624k4869M8589j9587k7941M9886j4920m2158M8511K700m7967
852b7930L5575J0771m4306L3258J6318n2334K5971L2229n0371R197L4862m1560
864a8320O927L7460m4371k409N1209l4859j8134M7480k4420k0159M7071k3909
$$ plain form
876 3566 -28457 23715 14838 -29807 11123 14766 -26445 10721 18190 -30173 3830 26402 -24669
889 -24669 -6786 23634 -18813 -6967 24377 -20051 -13237 30253 -10083 -18451 27149 -2290
901 -2290 -16722 25899 -2266 -23968 25118 5671 -29845 15133 10719 -27005 11219 12523 -27879
914 -27879 9925 21495 -26675 754 25038 -19072 -3419 22301 -18805 -5109 28358 -15719
926 -15719 -14423 28086 -6601 -15937 23261 -6195 -18641 24789 -3764 -29323 19095 6315
938 6315 -26909 12710 7834 -24970 15371 15696 -28198 8395 24888 -20669 661 21068 -19090
951 -19090 925 25672 -19934 -9072 28777 -10703 -14089 21896 -9648 -14757 23545 -9569
963 -9569 -25406 21205 784 -25902 14493 3952 -22213 17640 10045 -26309 13915 20432 -22219
$$ packed form
876C566l2023N2172q877m4645M0930L643m1211L7166P469m8363L4003K2572n1071
889b4669J7883L0420m2447J1846L1344m4428O814M3490m0336q368M5600k9439
901b290j4432M2621k8165k1702M9086j9447l5516M4978m414l7724L8224J304m0402
914b7879L7804J1570m8170K7429K4284m4110J5653K5720m1106J3696L3467m4077
926a5719J296M2509l4687r336L9198k9456j2446M3430k8553k5559M8418j2780
938F315l3224L9619m876l2804M0341L25m3894L6593J6493m5557K1330K0407m0158
951a9090K0015K4747m5606J0862L7849l9480l386L5985l1544n109L8302l3114
963i569j5837M6611k0421k6686M0395j0541k6165L9853p595l6354M0224O517m2651
$$ plain form
976 -22219 5254 19789 -18661 4020 21678 -21532 -3627 26437 -14517 -11134 22224 -10699
988 -10699 -12025 21158 -11990 -18500 22807 -4375 -23858 17192 984 -20601 18224 4838
1000 4838 -23143 18237 13812 -24733 9275 17401 -20620 6175 17535 -22428 1899 23508
1012 23508 -19469 -6864 23841 -12614 -9072 21016 -13001 -12515 23221 -9286 -19291 20601
1024 20601 -1508 -18643 18044 186 -19869 19754 6451 -24633 13778 12977 -22903 6978
1036 6978 12919 -22519 6222 18857 -21685 -1010 23455 -15150 -6087 20900 -12085 -7039 22145
1049 22145 -11875 -14491 22013 -4570 -16852 17786 -2110 -16046 18854 45 -22333 16696
1061 16696 7787 -23585 9538 9751 -21611 8855 13387 -22998 5174 21371 -18390 -2606 20759
$$ packed form
976b2219K7473J4535l8450K2681J7658m3210J7905L0064m0954L383L3358l2923
988a0699j326L3183l3148o510M1307k7182j9483M1050j6208k1585L8825j3386
1000D838k7981M1380m425l8545L4008Q126l8021K6795J1360l9963K4327K1609
1012B3508m2977J2605L0705l6455L542L0088l4017M86L5736l2507j0005L9892
1024B0601k2109j7135L6687j7858k0055L9623j3303l1084L8411q01l5880K9881
1036F978N941l5438K8741J2635m0542K0675K4465l8605R063K6987l2985N046K9184
1049B2145l4020k616L6504k6583j2282L4638j9896j3936L4900j8809k2378L9029
1061A6696q909l1372L3123K13l1362L0466M532l6385K8172J6197l9761J5784K3365
$$ plain form
1074 20759 -13088 -3187 20239 -14459 -8830 23461 -8355 -14974 18826 -3956 -13190 18703 -4068
1087 -4068 -18391 19201 2749 -22871 12295 6585 -20332 11136 8551 -22733 9260 16982 -20711
1100 -20711 1981 19149 -15008 -858 17779 -16300 -4737 21887 -12488 -11591 19837 -6651
1112 -6651 -11540 17994 -5693 -13733 20234 -1427 -20052 15274 4170 -19002 11744 5059 -20109
1125 -20109 12276 11583 -21805 5810 16201 -17400 1307 15362 -16258 -392 18795 -15965
1137 -15965 -6704 20909 -9090 -9372 18171 -7325 -10105 19758 -5584 -16612 18587 810 -18824
1150 -18824 12386 2395 -17783 13548 5749 -21140 10079 13205 -18764 3962 13360 -16672 3594
1163 3594 15597 -17677 -2116 19998 -11967 -6542 18156 -8784 -7310 18758 -8445 -13128 18830
$$ packed form
1074B0759l3847R901K3426l4698N629L2291l1816o619L3800k2782r234L1893k2771
1087d068j4323L7592j6452k5620L5166n710k6917L1468k585l1284L1993P722l7693
1100b0711K2692J7168l4157J4150J8637l4079J1563K6624l4375Q97L1428k6488
1112f651m889K9534k3687q040L3967k1661j8625L5326j1104k3172L0746o685k5168
1125b0109L2385o93l3388K7615J0391l3601J8707J4055l1620J5866J9187l4760
1137a5965R261K7613k9999k82K7543k5496k780K9863k5342j1028L5199j7777j9634
1150a8824L1210r991k0178L1331p799k6889L1219L126l1969K2726R398l0032K0266
1163C594J2003l3274J5561K2114l1965N425K4698k6940J474K6068k7203m683L1958
$$ plain form
1176 18830 -3099 -16941 14005 -372 -16481 13055 2248 -18476 12427 8550 -18447 7266
1188 7266 11788 -15479 5388 12468 -16667 3217 17498 -14881 -2969 17926 -10615 -5350 17006
1201 17006 -10571 -8777 18081 -7600 -15438 15433 -2448 -15155 13539 -435 -15851 14032
1213 14032 4546 -18001 11332 9923 -15850 6899 10068 -15652 6401 13469 -16849 975 17070
1226 17070 -12873 -3597 14915 -11546 -4719 16765 -11538 -11762 16975 -5235 -13735 13447 -2651
1239 -2651 -12630 15737 1036 -16296 13251 7587 -15222 8340 7142 -14484 8408 9412 -17240
1252 -17240 3729 13552 -13909 -615 13120 -12744 -2252 14901 -12730 -6894 17548 -7779
1264 -7779 -10490 14729 -4162 -10012 15559 -1663 -13282 15162 3316 -15353 9896 5097 -14205
$$ packed form
1176A8830k1929j3842L0946j4377j6109K9536j0807k0724L0903l877k6997K5713
1188G266M522k7267K0867P080k9135J9884J4281l2379J1912K0895k8541N265K2356
1201A7006k7577J794K6858k5681p838L0871j7881j2707K8694j3974j5416K9883
1213A4032r486k2547K9333j409k5773K2749L169k5720K2053P068l0318J7824J6095
1226A7070k9943R276J8512k6461O827K1484k8303k24K8737k2210q500K7182j6098
1239b651r979K8367j4701j7332K9547n664k2809K3562j198k1626K2892J004k6652
1252a7240K0969R823k7461J3294J3735k5864J0492J7153k7631N836K4442k5327
1264g779k711K5219j8891n850K5571j7222j1619K8444j1846j8669K5249m799j9302
$$ plain form
1277 -14205 8772 5607 -16657 6372 10144 -15791 2119 11637 -12942 778 13191 -13072
1289 -13072 -2356 16609 -10410 -7272 16128 -5815 -8442 15221 -4047 -10427 15321 -463
1301 -463 -14098 11788 2945 -13838 8230 2866 -14435 8457 6970 -15810 4710 10586 -12842
1314 -12842 2476 10668 -12504 1349 14185 -12305 -4237 15219 -7561 -6020 13928 -6161
1326 -6161 -8312 14886 -3788 -11970 12909 551 -12387 9743 1797 -12518 9634 4185 -13963
1339 -13963 7691 8173 -12960 4321 8932 -11945 3625 10655 -13586 -736 13504 -11008 -4717
1352 -4717 12798 -8188 -5797 13551 -6870 -9030 14036 -2131 -11523 11143 707 -10618 10824
1365 10824 1868 -12282 10027 6171 -12397 6539 8003 -11169 4397 7647 -13277 2250 10750
$$ packed form
1277a4205K2977l165k2264K3029L772k5935J7910R518k4579J3720J2413k6263
1289a3072J0716J8965k7019L138K3400k1943k627K3663j9268o380K5748j5784
1301d63j3635K5886q843j6783K2068n364j7301K2892j487k2780K0520N876k3428
1314a2842J5318Q192k3172J3853J2836k6490Q068J9456k2780J541J9948k0089
1326f161k151K3198j8674q182K4879j2358j2938K2130p946j4315K2152n449j8148
1339a3963K1654M82k1133J7281M611k0877J5570P030k4241J2850J4240k4512O291
1352d717J7515k0986K391J9348k0421k160K3066j6167r392K2666j0436j1325K1442
1365A0824q956j4150K2309l856j8568J8936J464j9172J5566L250k0924J5527Q500
$$ plain form
1378 10750 -12525 -2564 11279 -9341 -4169 11626 -8311 -5888 13721 -5053 -9573 12060 -1008
1391 -1008 -8934 10757 80 -9984 11459 3493 -11677 7964 6312 -10572 5333 5672 -12101
1404 -12101 4226 8352 -12743 -220 9951 -9907 -1685 10212 -9424 -2894 12333 -7885
1416 -7885 -7026 12263 -3534 -7588 10482 -2046 -8567 11265 388 -10865 9616 3901 -10734
1429 -10734 6564 4481 -10506 6132 6443 -12240 2873 8719 -10155 3 9006 -8774 -656
$$ packed form
1378A0750k3275R961J3843k0620N172J5795j9937K423J9609j8774m520K1633j3068
1391a008p926J9691j0677j0064K1443p966j5170J9641j652j6884J5905L39j7773
1404a2101J6327M126k1095J2523J0171j9858Q222J1897j9636O530J5227k0218
1416g885Q59J9289j5797m054J8070j2528o521J9832j0877j1253K0481n715j4635
1429a0734J7298k083j4987J6638L11j8683J5113N846j8874J0158R003j7780Q118
$$ [...]
8191i9
##END NTUPLES=NMR FID
##END=
