##TITLE=1H_Pr 4893
 CDCl3, 8 sc, 
 7.2.2019
##JCAMPDX= 6.0         $$ Bruker NMR JCAMP-DX V2.0
##DATA TYPE= NMR FID
##DATA CLASS= NTUPLES
##ORIGIN= UXNMR, Bruker Analytische Messtechnik GmbH
##OWNER= root
$$ XWIN-NMR		Version 3.5
$$ Thu Feb  7 16:07:32 2019 Russian Standard Time (UT+4h)  she@DPX200
##.OBSERVE FREQUENCY= 200.1313
##.OBSERVE NUCLEUS= ^1H
##.DELAY= (6, 6)
##.ACQUISITION MODE= SIMULTANEOUS
##.ACQUISITION SCHEME= undefined
##.AVERAGES= 8
##.DIGITISER RES= 18
##SPECTROMETER/DATA SYSTEM= spect
##.PULSE SEQUENCE= zg30
##.SOLVENT NAME= CDCl3
##.SHIFT REFERENCE= (INTERNAL, CDCl3, 0, 15.7039)
##AUDIT TRAIL= $$ (NUMBER, WHEN, WHO, WHERE, WHAT)
$$ ##TITLE= Audit trail, XWIN-NMR		Version 3.5
$$ ##JCAMPDX= 5.01
$$ ##ORIGIN= Bruker BioSpin GmbH
$$ ##OWNER= she
$$ F:/spectra/data/she/nmr/H-F/1/audita.txt
$$ ##AUDIT TRAIL=  $$ (NUMBER, WHEN, WHO, WHERE, WHAT)
(   1,<2019-02-07 16:06:30.75 +0400>,<she>,<DPX200>,
      <created by zg, POWCHK disabled, PULCHK disabled
       configuration hash MD5:
       00 E9 B6 7A A2 85 ED C7 34 08 36 98 17 FE 4E 26
       data hash MD5: 16K
       3A 50 03 C9 BF 45 E9 5B 91 E5 F7 10 2C E0 19 7F>)
$$ ##END=
$$ 
$$ hash MD5
$$ 67 33 CB D9 C1 36 88 3A 5E 19 08 6B 07 2C F0 A4
##$RELAX= 
##$RELAX= 
##$RELAX= 
##$RELAX= 
##$RELAX= 
##$RELAX= 
$$ Bruker specific parameters
$$ --------------------------
##$DU= <F:/spectra>
##$EXPNO= 1
##$NAME= <H-F>
##$PROCNO= 1
##$TYPE= <nmr>
##$USER= <she>
##$AMP= (0..31)
100 100 100 100 100 100 100 100 100 100 100 100 100 100 100 100 100 100 
100 100 100 100 100 100 100 100 100 100 100 100 100 100 
##$AQSEQ= 0
##$AQ_mod= 1
##$AUNM= <au_zg>
##$AUTOPOS= <>
##$BF1= 200.13
##$BF2= 200.13
##$BF3= 200.13
##$BF4= 200.13
##$BF5= 200.13
##$BF6= 200.13
##$BF7= 200.13
##$BF8= 200.13
##$BYTORDA= 1
##$CFDGTYP= 0
##$CFRGTYP= 5
##$CHEMSTR= <none>
##$CNST= (0..31)
1 1 145 1 1 1 1 1 1 1 1 1 1 1 1 1 1 1 1 1 1 1 1 1 1 1 1 1 1 1 1 1 
##$CPDPRG= <>
##$CPDPRG1= <>
##$CPDPRG2= <>
##$CPDPRG3= <>
##$CPDPRG4= <mlev>
##$CPDPRG5= <mlev>
##$CPDPRG6= <mlev>
##$CPDPRG7= <mlev>
##$CPDPRG8= <mlev>
##$CPDPRGB= <>
##$CPDPRGT= <>
##$D= (0..31)
0 1.2 0 0 0 0 0 0 0 0 0 0.03 0 0 0 0 0 0 0 0 0 0 0 0 0 0 0 0 0 0 0 0 
##$DATE= 1549541190
##$DBL= (0..7)
120 120 120 120 120 120 120 120 
##$DBP= (0..7)
150 150 150 150 150 150 150 150 
##$DBP07= 0
##$DBPNAM0= <>
##$DBPNAM1= <>
##$DBPNAM2= <>
##$DBPNAM3= <>
##$DBPNAM4= <>
##$DBPNAM5= <>
##$DBPNAM6= <>
##$DBPNAM7= <>
##$DBPOAL= (0..7)
0.5 0.5 0.5 0.5 0.5 0.5 0.5 0.5 
##$DBPOFFS= (0..7)
0 0 0 0 0 0 0 0 
##$DE= 6
##$DECBNUC= <off>
##$DECIM= 32
##$DECNUC= <off>
##$DECSTAT= 4
##$DIGMOD= 1
##$DIGTYP= 9
##$DL= (0..7)
0 120 120 120 120 120 120 120 
##$DP= (0..7)
150 150 150 150 150 150 150 150 
##$DP07= 0
##$DPNAME0= <>
##$DPNAME1= <>
##$DPNAME2= <>
##$DPNAME3= <>
##$DPNAME4= <>
##$DPNAME5= <>
##$DPNAME6= <>
##$DPNAME7= <>
##$DPOAL= (0..7)
0.5 0.5 0.5 0.5 0.5 0.5 0.5 0.5 
##$DPOFFS= (0..7)
0 0 0 0 0 0 0 0 
##$DQDMODE= 0
##$DR= 18
##$DS= 0
##$DSLIST= <SSSSSSSSSSSSSSS>
##$DSPFIRM= 0
$$ [...]
##$SUBNAM2= <"">
##$SUBNAM3= <"">
##$SUBNAM4= <"">
##$SUBNAM5= <"">
##$SUBNAM6= <"">
##$SUBNAM7= <"">
##$SUBNAM8= <"">
##$SUBNAM9= <"">
##$SW= 20.0189088683792
##$SWIBOX= (0..15)
0 0 2 0 0 0 0 0 0 0 0 0 0 0 0 0 
##$SW_h= 4006.41025641026
##$TD= 16384
##$TD0= 1
##$TE= 0
##$TE2= 300
##$TE3= 300
##$TEG= 300
##$TL= (0..7)
0 120 120 120 120 120 120 120 
##$TP= (0..7)
150 150 150 150 150 150 150 150 
##$TP07= 0
##$TPNAME0= <>
##$TPNAME1= <>
##$TPNAME2= <>
##$TPNAME3= <>
##$TPNAME4= <>
##$TPNAME5= <>
##$TPNAME6= <>
##$TPNAME7= <>
##$TPOAL= (0..7)
0.5 0.5 0.5 0.5 0.5 0.5 0.5 0.5 
##$TPOFFS= (0..7)
0 0 0 0 0 0 0 0 
##$TUNHIN= 0
##$TUNHOUT= 0
##$TUNXOUT= 0
##$USERA1= <user>
##$USERA2= <user>
##$USERA3= <user>
##$USERA4= <user>
##$USERA5= <user>
##$V9= 5
##$VALIST= <valist>
##$VCLIST= <CCCCCCCCCCCCCCC>
##$VD= 0
##$VDLIST= <DDDDDDDDDDDDDDD>
##$VPLIST= <PPPPPPPPPPPPPPP>
##$VTLIST= <TTTTTTTTTTTTTTT>
##$WBST= 1024
##$WBSW= 4
##$XGAIN= (0..3)
0 0 0 0 
##$XL= 0
##$YL= 0
##$YMAX_a= 186132
##$YMIN_a= -179092
##$ZGOPTNS= <>
##$ZL1= 120
##$ZL2= 120
##$ZL3= 120
##$ZL4= 120
##$ABSF1= 10
##$ABSF2= 0
##$ABSG= 5
##$ABSL= 3
##$ALPHA= 0
##$AQORDER= 0
##$ASSFAC= 0
##$ASSFACI= 0
##$ASSFACX= 0
##$ASSWID= 0
##$AUNMP= <proc_1d>
##$AZFE= 0.1
##$AZFW= 0.1
##$BCFW= 1
##$BC_mod= 2
##$BYTORDP= 1
##$COROFFS= 0
##$CY= 11.3945322036743
##$DATMOD= 1
##$DC= 2
##$DFILT= <>
##$DTYPP= 0
##$F1P= 18.9103706918063
##$F2P= -1.10871071338519
##$FCOR= 0.5
##$FTSIZE= 0
##$FT_mod= 4
##$GAMMA= 1
##$GB= 0.15
##$INTBC= 1
##$INTSCL= 1
##$ISEN= 128
##$LB= 0.24
##$LEV0= 0
##$LPBIN= 0
##$MAXI= 10000
##$MC2= 0
##$MEAN= 0
##$ME_mod= 0
##$MI= 1.114404
##$NCOEF= 0
##$NC_proc= 0
##$NLEV= 6
##$NOISF1= 3.799351
##$NOISF2= 2.8
##$NSP= 1
##$NTH_PI= 0
##$NZP= 0
##$OFFSET= 15.70392
##$PC= 1
##$PHC0= -8678.866
##$PHC1= 15.00019
##$PH_mod= 1
##$PKNL= yes
##$PPARMOD= 0
##$PSCAL= 0
##$PSIGN= 0
##$REVERSE= no
##$SF= 200.130013532006
##$SI= 16384
##$SIGF1= 3
##$SIGF2= 2
##$SINO= 400
##$SIOLD= 16384
##$SREGLST= <1H.CDCl3>
##$SSB= 0
##$STSI= 0
##$STSR= 0
##$SW_p= 3612.71676300578
##$SYMM= 0
##$S_DEV= 0
##$TDeff= 0
##$TDoff= 0
##$TI= <>
##$TILT= no
##$TM1= 0
##$TM2= 0
##$TOPLEV= 0
##$USERP1= <user>
##$USERP2= <user>
##$USERP3= <user>
##$USERP4= <user>
##$USERP5= <user>
##$WDW= 1
##$XDIM= 8192
##$YMAX_p= 0
##$YMIN_p= 0
$$ End of Bruker specific parameters
$$ ---------------------------------
##NTUPLES= NMR FID
##VAR_NAME=  TIME,          FID/REAL,        FID/IMAG
##SYMBOL=    X,             R,               I
##VAR_TYPE=  INDEPENDENT,   DEPENDENT,       DEPENDENT
##VAR_FORM=  AFFN,          ASDF,            ASDF
##VAR_DIM=   8192,          8192,            8192
##UNITS=     SECONDS,       ARBITRARY UNITS, ARBITRARY UNITS
##FACTOR=    0.0002496,     1,               1
##FIRST=     0,             0,               0
##LAST=      2.0444736,     0,               0
##MIN=       0,             -179092,         0
##MAX=       2.0444736,     186132,          0
$$ Real data points
##PAGE= N=1
##DATA TABLE= (X++(R..R)), XYDATA
0 0 0 0 0 0 0 0 0 0 0 0 0 1 -8 8 -8 9 -16 16 -21 25 -32 36 -42 50 -59 70 -82 93 -108 126 -143 165 -186 212
34 212 -236 268 -301 338 -377 420 -469 521 -577 642 -710 783 -865 953 -1052 1159 -1275 1407
52 1407 -1551 1710 -1887 2091 -2318 2579 -2882 3238 -3663 4181 -4830 5666 -6796 8409 -10908
67 -10908 15361 -25714 104627 -12768 -57001 186132 -8979 -34464 109696 -43932 -99018
78 -99018 119906 -9938 -142217 12770 -3903 -83334 33612 -51822 -124126 53748 11595
89 11595 -111728 67800 64973 -71246 81972 80850 -103582 71348 145113 -96115 -5080
100 -5080 150036 -56236 -51154 94586 -73307 -82793 92234 -59334 -127688 67021 10967
111 10967 -68248 61563 -4510 -62681 93441 15024 -104727 58644 39306 -87934 54647
122 54647 44014 -100291 59499 87187 -115396 7846 112922 -82037 -23827 108192 -54508
133 -54508 -29031 104244 -64346 -76269 101285 -22692 -95106 59341 -4687 -55369 82780
144 82780 -12430 -97911 81264 39414 -100423 26969 26228 -73994 67464 58176 -101303
155 -101303 42109 112680 -66443 -8760 70100 -69213 -3572 85355 -87054 -55818 92728
166 92728 -48154 -78927 62878 -32208 -58184 87912 -12048 -72873 102054 42089 -74649
177 -74649 62718 43278 -70795 44378 26156 -100780 34731 68918 -87920 -6839 61328
188 61328 -64003 -2969 50953 -90378 -18132 92093 -58241 -45283 86410 -23355 -28697
199 -28697 93984 -27898 -55097 110689 12390 -82990 70392 29938 -78350 41093 11945
210 11945 -100472 27552 31368 -106974 -785 60168 -53672 12051 56110 -54119 23033
221 23033 81872 -65394 -20923 87006 -29553 -24510 66926 -46512 -31754 98960 -30370
232 -30370 -86580 71647 11772 -74837 43976 2179 -76465 57577 31178 -98600 15183
243 15183 54990 -56256 12054 43761 -49818 33906 73326 -60537 -6297 72886 -44332
254 -44332 -24406 49869 -55440 -22445 81091 -46344 -60456 82763 -3015 -63707 56966
265 56966 -1480 -63521 63401 13728 -87305 41834 48607 -66764 12881 34884 -55312
276 -55312 27121 50943 -62266 12242 72179 -44974 -13017 48678 -50127 -13911 58036 -59334
288 -59334 -40122 78102 -22201 -51559 64351 -3849 -45203 64102 -4015 -70933 58064
299 58064 29291 -73291 24721 35603 -51020 25806 30619 -66008 19814 58609 -54613 -7206
311 -7206 52828 -36367 -3226 43283 -59584 -20625 69206 -37379 -44733 60691 -9519 -30430
323 -30430 62003 -14192 -48096 70414 9478 -75271 32305 23279 -54517 28808 19675 -62500
335 -62500 32527 46774 -64878 1237 53022 -37374 1548 41327 -50554 -2360 62812 -46924
347 -46924 -35841 57122 -19281 -28522 51247 -21995 -31002 71782 -4578 -61595 47346 16044
359 16044 -55028 26084 5364 -58703 37629 32403 -65063 15420 51699 -40044 2764 36341
371 36341 -42471 9435 54497 -48062 -21258 55931 -24370 -26532 40825 -26957 -21706 59779
383 59779 -21120 -48992 55712 8440 -48090 32502 34 -50696 39608 13600 -66120 27459
395 27459 44783 -44217 12139 37820 -38477 16244 43771 -52696 -9496 53974 -33025 -23296
407 -23296 39013 -29683 -17091 49784 -30443 -34973 58620 -3121 -42880 39338 -37 -38321
419 -38321 42833 785 -59205 34159 26300 -54722 15171 33237 -34568 22874 35370 -48067
431 -48067 7637 50822 -39420 -17031 38654 -28298 -11641 38665 -36965 -23931 55296 -15612
443 -15612 -39867 38925 -3317 -30230 40447 -7060 -45759 44019 17053 -52535 21232 25427
455 25427 -35656 24196 25856 -43906 21325 45410 -44187 -8629 35641 -35057 -11602 30618
467 30618 -41934 -16816 49233 -26304 -31973 46054 -3909 -22939 43080 -6426 -32101 48490
479 48490 7754 -45879 30876 18834 -39975 18943 11942 -45343 21579 27647 -49650 3359
491 3359 36006 -37065 -6129 29637 -36620 -4856 44048 -31502 -18661 52708 -5966 -20718
503 -20718 41265 -4856 -20320 43927 -6900 -43658 32274 8336 -45097 12592 4445 -37896
515 -37896 23025 12476 -50542 15394 37220 -33275 3889 32015 -27388 8503 38600 -38776
527 -38776 -12462 50917 -16243 -23875 33972 -12100 -16675 40983 -15247 -37520 37806 3906
539 3906 -41624 17439 2485 -31149 28294 7792 -44841 23912 30467 -36832 7073 26058
551 26058 -30056 10599 30757 -41068 -5407 43112 -26121 -20150 34463 -13555 -10134 40662
563 40662 -14274 -22371 43764 550 -32610 24818 -165 -31736 20578 -5702 -43957 22233
575 22233 14712 -42505 10183 22531 -30328 12777 26988 -31572 10952 42862 -26372 -8128
587 -8128 39709 -13322 -8722 32437 -19124 -16147 37572 -14917 -34600 26076 -5113 -32151 17135
600 17135 -11643 -36102 28689 6622 -41154 21450 27258 -23057 20383 25358 -26534 19825
612 19825 35490 -33814 -5229 34042 -22019 -12794 20131 -29007 -13338 32491 -22185 -26839
624 -26839 31609 -4282 -21946 25951 -6198 -21994 35947 3440 -36639 24351 17062 -29035
636 -29035 16368 15331 -29436 17133 23297 -36692 -354 28371 -26243 -8073 21726 -23827
648 -23827 -4342 31255 -21490 -14040 35761 -7099 -16949 29364 -6223 -18812 30332 -6854
660 -6854 -33528 25635 6748 -34572 14376 10330 -28389 17271 16541 -31299 13949 29525 -27376
673 -27376 -1818 23900 -21465 12 24154 -27575 -8270 33775 -17409 -19271 27997 -7428
685 -7428 -13721 28438 -11929 -26093 32679 4443 -32259 17481 9469 -23116 17785 7420 -30713
698 -30713 18118 23100 -29414 1065 19845 -21820 2935 17212 -31112 -2654 31856 -20804
710 -20804 -14302 29120 -8137 -8585 29857 -11326 -17572 35089 292 -29960 18419 4551 -24297
723 -24297 15483 1463 -30285 16093 13245 -30571 6260 17471 -20920 8325 16870 -27005
735 -27005 5533 28331 -23935 -6018 30522 -14105 -8457 28776 -13755 -14175 32196 -8027 -26825
748 -26825 23127 303 -26935 14105 -348 -25612 17591 7353 -28134 13711 18105 -20303
760 -20303 9422 15752 -20240 11956 22001 -27232 -913 27649 -20142 -9331 23561 -16678
772 -16678 -9115 29287 -14539 -21850 27943 -959 -23292 16966 -324 -20956 18751 2256
784 2256 -26306 17238 14626 -21261 9600 12464 -19109 13031 15727 -27505 4587 23932 -22748
797 -22748 -6634 20450 -18740 -5164 25915 -18510 -14603 30704 -5346 -20597 21216 -1226
809 -1226 -17850 20456 -1480 -24743 19486 8201 -24501 11781 11025 -18462 13514 11677 -25383
822 -25383 9567 20420 -24633 -1820 20202 -19206 -3679 19658 -20578 -7110 29760 -11416
834 -11416 -16555 24594 -2681 -14661 20632 -4805 -19125 22767 2703 -26685 12839 9302
846 9302 -19013 11650 7247 -22314 13566 17099 -25547 1382 19586 -17557 -850 16291 -20494
859 -20494 -1882 26065 -16690 -13070 25107 -4877 -11058 20426 -7797 -15649 24304 -2614 -25425
872 -25425 16821 6443 -20828 11445 3761 -21648 16180 13865 -24924 6357 18944 -17932
884 -17932 1333 14849 -19411 1827 22555 -19967 -9332 23788 -9208 -9756 19978 -9238
896 -9238 -11150 24161 -6801 -21673 19566 2152 -20574 12704 2439 -19720 15750 8694 -23489
909 -23489 10581 16938 -18137 4448 14607 -17763 3799 17269 -21002 -4169 22140 -12672
921 -12672 -9102 18118 -10651 -8356 21696 -9561 -16022 21807 -1423 -20017 14795 940 -17597
934 -17597 16689 4263 -22578 14106 13583 -20087 6581 14317 -16704 5944 13997 -21405 -56
947 -56 19703 -17011 -7503 17788 -11962 -6013 19254 -12560 -11111 23567 -4951 -17378 17834
960 17834 -288 -15722 16055 -69 -20169 16772 9250 -21075 9176 12791 -16639 7071
972 7071 11754 -19201 4615 17055 -19448 -5590 16424 -13127 -5068 15598 -13011 -6334 22188
985 22188 -8877 -13748 20019 -693 -12636 16188 -2349 -16244 18107 3955 -21426 11362
997 11362 10448 -17332 6761 8166 -19064 7346 13484 -21130 -1677 16585 -13697 -3369 14364
1010 14364 -13453 -2019 21612 -10460 -9013 22081 -2768 -10581 16532 -4547 -13112 18192
1022 18192 -1724 -21719 12445 5203 -19275 8007 5886 -17693 9781 11218 -20095 3540
1034 3540 17212 -13449 -7 14792 -12568 -229 17767 -12357 -5972 20015 -6384 -10164
1046 -10164 15238 -6358 -11076 16188 -5642 -17932 14936 1730 -19036 9789 4937 -15600
1058 -15600 11313 8424 -17872 8794 15563 -15854 1176 13988 -12731 1056 14324 -15056
1070 -15056 -4325 18059 -10074 -9471 15215 -5800 -7882 15551 -7487 -13537 17079 -747 -17052
1083 -17052 11706 2731 -14793 11429 3769 -18020 11181 11904 -17147 4118 12932 -13266 2412
1096 2412 13165 -14963 -846 17137 -11902 -7176 15734 -6387 -6441 14320 -7533 -9727 16424
1109 16424 -3760 -15125 12321 95 -13657 11264 1179 -15416 12172 7647 -17122 7476
1121 7476 12194 -13188 4642 11522 -14002 1672 14572 -14224 -4730 15500 -8890 -7324 12039
1134 12039 -8054 -6824 15611 -6315 -12015 14538 -639 -12524 11050 -86 -11716 13899
1146 13899 3269 -16871 10234 10049 -14236 4815 8629 -14396 4635 11851 -16912 -2471 15039
1159 15039 -10652 -5576 12321 -8396 -3599 15440 -7335 -9115 16148 -1022 -10381 11362 -1856
1172 -1856 -10468 12765 -719 -16289 10525 6386 -14498 5836 6409 -13308 6536 10157 -15686
1185 -15686 1573 14521 -11145 -3480 11825 -8692 -1904 14213 -8735 -7297 15121 -3371
1197 -3371 -9439 11350 -3082 -9456 11825 -2453 -14017 11234 2728 -14143 8264 5750 -12520
1210 -12520 7935 8203 -14173 5289 12283 -13157 -162 12134 -9899 -1945 11662 -10474 -4379
1223 -4379 14723 -7100 -8609 12465 -3523 -8074 11514 -3654 -10334 12664 705 -13592 8949
1236 8949 4117 -11367 8505 5167 -13275 7229 9520 -13734 1633 11179 -10633 -696 10019
1249 10019 -10875 -2191 12936 -8792 -6284 12957 -4120 -6608 11296 -4116 -7798 12715 -1876
1262 -1876 -12142 10362 2248 -11259 7744 2424 -12216 8249 7049 -13635 3726 9827 -11148
1275 -11148 1003 9178 -10867 66 11939 -9790 -4010 12320 -5988 -5328 11428 -4393 -6317
1288 -6317 11727 -3617 -10087 11446 -65 -11534 8394 1417 -10799 8355 3839 -12912 6650
1301 6650 8451 -11563 2479 8651 -9624 1901 9462 -10805 -1765 12172 -7514 -5195 10372
1314 10372 -4954 -4640 10675 -5337 -7825 11927 -880 -10333 8412 991 -9179 8804 1560
1327 1560 -11720 7721 6134 -11824 3261 7527 -9308 3009 7456 -11222 16 11299 -8710
1340 -8710 -3529 10134 -5859 -3381 10390 -6178 -5367 12201 -2773 -8870 9151 -409 -8183
1353 -8183 8570 -582 -11233 8404 3817 -11595 4957 5460 -9680 4248 6600 -10366 2712
1366 2712 9369 -9412 -1219 9560 -6783 -2077 9476 -6889 -3666 11078 -4941 -7589 9969
1379 9969 -1524 -7909 8251 -1590 -8959 8994 1702 -10635 6442 5404 -9120 4447 5075
1392 5075 -9010 4101 7650 -9983 248 8837 -7758 -1548 7896 -7239 -1974 9956 -6653
1405 -6653 -5754 10639 -2625 -6712 8605 -1831 -7521 9129 -216 -10270 7293 3286 -9235
1418 -9235 4753 3898 -8241 5043 5827 -10077 2159 8072 -8149 -300 7156 -7499 -627 8806
1432 8806 -7431 -3584 10310 -4357 -5562 8734 -2651 -6173 9000 -1737 -8805 8167 1872
1445 1872 -9700 5327 3221 -8143 4620 4159 -9035 3645 6939 -7925 924 6463 -6798
1458 -6798 426 7248 -7606 -1479 9449 -5395 -4466 8534 -3326 -4560 8441 -3274 -7267
1471 -7267 8723 220 -9095 6473 2282 -7657 5186 2524 -8409 4993 5797 -8132 1844 6508
1485 6508 -6464 1363 6155 -7808 -169 8531 -7024 -3778 7913 -4211 -3428 7634 -4228
1498 -4228 -5457 9212 -1337 -7505 7180 1341 -6846 6201 1821 -7985 5602 4493 -8411
1511 -8411 2781 5641 -6931 1853 5249 -7575 532 6619 -7231 -2313 7537 -4873 -3117 6989
1525 6989 -4213 -3502 8731 -2364 -5873 7983 67 -6465 6057 558 -7091 6131 2361 -8404
1539 -8404 3667 4405 -7230 2111 4583 -7185 1434 5686 -7200 -589 7317 -5322 -2082 7041
1553 7041 -4068 -2224 8074 -3349 -4318 8182 -1255 -6002 6049 -475 -6548 5973 489 -8058
1567 -8058 4771 3257 -7575 2605 3830 -6548 2640 5047 -6690 858 6514 -5947 -1262
1580 -1262 6341 -4496 -1814 6815 -4087 -3607 7565 -2313 -5017 6599 -1051 -5271 5927 -525
1594 -525 -6842 5105 1931 -7269 3552 3185 -6173 2775 4025 -6807 1990 5836 -6372 -262
1608 -262 6303 -4437 -1017 6112 -4515 -2110 7328 -3069 -4383 6633 -1483 -4821 5518 -1504
1622 -1504 -5979 5928 609 -7418 3822 2275 -6297 3246 3002 -6386 3002 4855 -6201 1100
1636 1100 6197 -4429 148 5387 -5278 -1156 6667 -4364 -3738 6297 -2499 -4149 5098 -2099
1650 -2099 -4769 6085 -680 -6497 4629 1996 -5362 3641 2025 -5693 3948 3834 -6272 1729
1664 1729 5349 -5221 289 4453 -5361 -721 5596 -5101 -2971 5638 -3027 -3332 5519 -2241 -3744
1679 -3744 5946 -927 -5183 5860 824 -5448 4211 1430 -5369 3814 2290 -6409 2613 4091 -5875
1694 -5875 759 3617 -5169 472 4724 -5373 -1408 6049 -3550 -2476 5636 -2093 -2793 6231 -1559
1709 -1559 -4274 5847 48 -5102 4382 626 -5112 3626 1224 -5944 2987 2956 -6017 1289 3704
1724 3704 -5273 1248 4234 -5353 129 5749 -4077 -1335 5638 -2779 -2303 5562 -2440 -3484 5633
1739 5633 -939 -4956 4361 301 -4959 3483 335 -5500 3411 1888 -5773 2227 3158 -4766 1996
1754 1996 3890 -5091 1121 5283 -4587 -796 5436 -3546 -1931 5131 -3148 -2769 5519 -1905 -4246
1769 -4246 4780 -264 -4213 3922 -203 -4594 4121 1072 -5341 3148 2754 -4827 2153 2933 -4688
1784 -4688 1858 4081 -5176 -124 5066 -4221 -1421 4626 -3345 -1694 5440 -2556 -3383 5271 -688
1799 -688 -3699 4398 -449 -4169 4220 471 -5115 3272 2144 -5093 2151 2299 -4649 2298 3435
1814 3435 -4874 1026 4394 -4056 -196 4402 -3770 -1208 4886 -3231 -2744 5284 -1894 -3670 4233
1829 4233 -1185 -3870 4202 -360 -4767 3908 1380 -4625 2875 2149 -4111 2810 2725 -4941 1610 3628
1845 3628 -4510 169 3709 -4265 -713 4064 -3805 -2084 4791 -2405 -2689 4702 -954 -2740 4877
1860 4877 -612 -3444 4420 772 -4554 3064 1697 -4627 2518 1180 -5147 1563 2770 -4982 173
1875 173 3367 -4188 220 4018 -3940 -612 4999 -2637 -1962 4549 -1736 -2064 4765 -1354 -3198 4559
1891 4559 -560 -4203 3520 364 -4655 2691 816 -4812 2640 2300 -4488 1716 3518 -4009 898
1906 898 3818 -3467 397 4370 -3629 -1292 4405 -2347 -2444 3985 -2159 -2997 4425 -1433 -4087 3987
1922 3987 -294 -4058 3145 749 -3910 3084 1855 -4611 1913 2795 -4095 1080 3013 -4044 616
1937 616 3618 -4094 -552 4357 -3029 -1886 3953 -2016 -2062 4477 -1684 -3156 4676 -183 -3934 3336
1953 3336 278 -3566 3314 577 -4438 2550 2502 -4216 1285 2544 -3868 1167 3218 -3985 42
1968 42 4386 -3289 -898 3903 -2675 -1254 4114 -2358 -2678 4192 -1097 -3462 3673 -432 -3231 3592
1984 3592 254 -4182 3112 1448 -4121 2221 2023 -3966 1814 2320 -3987 825 3839 -3489 -667
1999 -667 3684 -2821 -928 3934 -2684 -1971 4222 -1901 -2835 3988 -832 -2836 3517 -250 -3574 3563
2015 3563 922 -3911 2563 1775 -3948 1852 2055 -3904 1538 3051 -3834 130 3642 -3098 -541
2030 -541 3771 -3216 -1183 4070 -2355 -2130 4071 -1422 -2741 3804 -875 -3149 3513 389 -3531
2045 -3531 3154 1108 -3949 2428 1611 -4130 1623 2536 -4119 696 3080 -3326 -128 3173 -2924
2060 -2924 -778 3712 -2702 -1355 4130 -1588 -2010 3744 -1101 -2537 3810 -519 -3453 3204 349
2075 349 -3810 2439 1022 -4094 2044 1904 -4369 1297 2628 -3638 466 3244 -3182 180 3471
2090 3471 -3286 -860 3907 -2316 -1846 3856 -1854 -2395 3548 -1107 -3069 3564 -187 -3445 2948
2105 2948 452 -3574 2807 1024 -3904 2014 2246 -3785 892 2899 -3295 341 3303 -3360 -255
2120 -255 3852 -2529 -1327 3548 -1968 -1557 3964 -1716 -2375 3606 -390 -3122 2813 88 -3284 3075
2136 3075 669 -3553 2454 1747 -3992 1513 2179 -3513 1001 2741 -3257 83 3243 -2814 -810
2151 -810 3682 -2234 -1397 3246 -2047 -1959 3718 -1171 -2539 3178 -580 -2990 2884 -28 -3194 2678
2167 2678 775 -3738 2117 2110 -3641 1340 2465 -3501 932 2710 -3125 -53 3510 -2535 -1017 3362
2183 3362 -2034 -1327 3682 -1512 -2283 3359 -844 -2641 2975 -292 -2811 2901 439 -3352 2751
2198 2751 1401 -3225 1744 1623 -3365 1643 2575 -3444 265 2770 -3339 -682 3157 -2540 -1148
2213 -1148 3320 -1780 -1700 3130 -1108 -2272 3101 -631 -2384 3149 10 -3061 2771 778 -3075
2228 -3075 1887 1382 -3188 1607 1831 -3647 837 2759 -3258 244 3078 -2532 -337 3055 -2187
2243 -2187 -1079 3607 -1318 -1581 3161 -804 -2167 3007 -287 -2587 2963 105 -3207 2347 578
2258 578 -3232 1663 1304 -3410 1289 2326 -3217 487 3043 -2427 171 3244 -2595 -554 3358
2273 3358 -1849 -1662 3340 -1326 -1926 3073 -1029 -2405 2939 -458 -3061 2701 335 -3159 2296
2288 2296 764 -3290 1639 1558 -3397 1391 2190 -2936 786 2374 -2926 169 3153 -2185 -778 3106
2304 3106 -1970 -1403 3106 -1603 -2157 2761 -796 -2621 2766 20 -2687 2408 553 -3021 2071
2319 2071 1055 -3044 1335 1658 -3085 931 2117 -2584 313 2480 -2470 -385 3002 -2021 -903
2334 -903 2962 -1867 -1702 2949 -1215 -2108 2516 -553 -2512 2586 -34 -2722 2273 745 -2749 1901
2350 1901 1387 -2899 1426 1938 -2711 959 2253 -3029 126 2271 -2710 -491 2825 -2082 -1279 2874
2366 2874 -1812 -1565 2990 -985 -1976 2705 -229 -2233 2417 484 -2440 2377 1083 -2810 1744
2381 1744 1403 -2877 1239 1410 -2920 502 2019 -2823 -312 2605 -2243 -941 2694 -1684 -769 3090
2397 3090 -1413 -1509 3017 -614 -1731 2476 -143 -2340 2246 157 -2961 1873 852 -2911 1079
2412 1079 1260 -2965 1201 1804 -2709 811 2208 -2195 -138 2757 -1756 -527 2807 -1729 -1006 2897
2428 2897 -1086 -1734 2187 -712 -2349 2400 -277 -2776 2009 338 -2713 1819 1013 -2814 1320
2443 1320 1458 -2799 925 2021 -2535 258 2029 -2124 -42 2733 -1730 -636 2550 -1426 -1040
2458 -1040 2515 -1113 -1896 2581 -387 -2168 2114 -322 -2472 2042 479 -2392 1461 1145 -2520
2473 -2520 1130 1582 -2391 813 1888 -2282 313 2274 -2031 -392 2255 -1578 -807 2386 -1246
2488 -1246 -1341 2414 -1006 -1688 2188 -411 -1961 2180 152 -2213 2018 604 -2286 1530 1190 -2202
2504 -2202 1154 1648 -2254 818 1840 -2239 38 2041 -1868 -721 1979 -1862 -1132 2289 -1067
2519 -1067 -1142 2269 -916 -1489 2416 -109 -1801 1944 641 -1924 1711 845 -2097 1079 1321 -2198
2535 -2198 806 1256 -2512 296 1683 -2004 -362 1925 -1753 -450 2098 -1462 -938 2619 -981
2550 -981 -1223 2281 -530 -1724 2071 -149 -2109 1971 121 -1982 1318 739 -2167 978 987 -2238
2566 -2238 757 1211 -2086 153 2044 -1707 42 2100 -1558 -322 2145 -1440 -860 2288 -694
2581 -694 -1356 2068 -436 -1651 2119 -99 -1983 1616 539 -1858 1388 1066 -2093 815 1203 -1810
2597 -1810 764 1395 -1888 267 1727 -1743 -52 1485 -1321 -532 2010 -1137 -798 2164 -823 -983
2613 -983 1944 -397 -1390 1497 208 -1612 1582 331 -2069 1074 784 -1810 1075 1162 -1625 482
2629 482 1269 -1424 358 1567 -1710 -405 1931 -1146 -651 1688 -1083 -1003 1691 -718 -1096 1569
2645 1569 -83 -1359 1451 207 -1828 1193 467 -1717 1422 905 -1793 743 1242 -1905 480 1234
2661 1234 -1565 85 1259 -1636 -674 1705 -943 -766 1524 -965 -794 1603 -179 -1078 1658 9
2677 9 -1312 1642 223 -1528 1460 676 -1695 1143 823 -1535 533 862 -1800 225 1081 -1585 65
2694 65 1650 -1347 -144 1333 -988 -696 1733 -748 -942 1583 -356 -995 1558 -23 -1212 1499
2710 1499 95 -1444 1207 473 -1601 943 826 -1461 654 1049 -1475 530 1303 -1022 118 1648
2726 1648 -986 -341 1403 -1047 -545 1569 -697 -978 1575 -536 -1113 1409 -405 -1067 1279 140
2742 140 -1497 825 425 -1567 750 728 -1380 734 940 -1457 97 1072 -1280 -164 1811 -930
2758 -930 -123 1353 -915 -260 1242 -461 -708 1146 -314 -1138 1180 -301 -1226 721 167 -1296 659
2775 659 327 -1582 853 808 -1318 351 843 -1196 200 1178 -1246 14 1166 -1180 -535 1146 -1037
2792 -1037 -844 1394 -679 -1047 977 -341 -1187 1148 -79 -1266 1199 40 -1105 1165 416 -1205
2808 -1205 748 699 -1336 647 982 -1351 450 999 -924 -183 947 -1014 -64 1229 -777 -394 1300
2825 1300 -457 -618 1122 -350 -837 1123 -89 -1091 937 97 -992 793 389 -1239 525 640
2841 640 -1503 241 598 -1103 118 1033 -1254 -124 998 -791 -264 979 -477 -651 1212 -410
2857 -410 -622 1127 -139 -751 880 35 -1381 581 170 -1098 599 462 -962 656 810 -1361 576
2874 576 898 -951 152 1017 -880 -6 1077 -651 -447 920 -753 -583 1167 -362 -661 1048 -104
2891 -104 -862 915 -135 -1223 1100 172 -1109 694 47 -1071 795 409 -862 385 687 -1016
2907 -1016 5 896 -984 -129 1018 -703 -176 1184 -571 -328 916 -461 -547 1051 -92 -853 868
2924 868 79 -956 595 27 -874 705 325 -1089 297 746 -957 517 981 -756 14 1058 -869
2941 -869 13 1100 -550 -657 938 -774 -499 1016 -210 -551 1107 -303 -498 781 192 -738 753
2958 753 297 -872 368 441 -863 450 791 -924 543 781 -511 30 858 -1064 177 743 -528
2975 -528 -169 881 -578 -466 727 -211 -373 983 -107 -775 884 -60 -943 688 669 -935 244
2992 244 388 -858 403 492 -853 322 724 -637 8 844 -699 167 832 -342 -276 915 -302 -344
3010 -344 712 -195 -570 625 -218 -686 794 -88 -869 802 255 -659 414 263 -749 232 290 -948
3028 -948 285 485 -636 95 682 -853 26 719 -561 -287 673 -174 -440 881 -53 -602 697 -5
3046 -5 -415 583 189 -637 498 237 -748 650 194 -655 265 463 -683 -11 600 -894 -269 907 -715
3065 -715 -255 568 -335 -98 881 -486 -616 709 -257 -497 711 -167 -516 576 -47 -673 447 291
3083 291 -768 423 195 -714 248 108 -798 42 535 -520 -164 616 -541 -183 698 -227 -213 792 -346
3102 -346 -306 824 -304 -312 580 -121 -697 881 -77 -564 410 199 -557 338 43 -631 329 524 -759 133
3122 133 420 -696 189 459 -530 -35 501 -661 -234 795 -206 -278 521 105 -665 534 -40 -437 571
3141 571 -128 -716 548 359 -566 201 112 -538 334 425 -493 210 449 -540 -96 506 -691 -367 601 -592
3161 -592 -115 568 -327 25 831 -180 -577 751 9 -756 558 -84 -559 442 199 -377 418 168 -764
3180 -764 1 348 -741 14 451 -406 253 482 -180 51 496 -343 4 448 -496 -495 708 -31 -497 478
3200 478 -248 -415 674 200 -496 368 -22 -895 400 91 -485 293 364 -716 493 456 -364 -126 545
3219 545 -548 -196 535 -398 -324 626 -388 -126 417 -211 -340 287 86 -352 304 -17 -270 357 214 -431
3239 -431 357 314 -541 250 662 -206 98 177 -369 -310 566 -584 -332 288 -378 -2 499 -318 -492 526
3259 526 -113 -122 456 -185 -505 430 22 -1028 393 174 -446 329 450 -465 196 264 -709 180 455 -618
3279 -618 -141 439 -436 -173 238 -276 -434 450 -504 -275 378 -234 -452 566 17 -512 443 160 -528 362
3299 362 137 -503 341 274 -276 159 -123 -494 -31 566 -352 49 553 -550 17 512 -288 -313 421 -148
3319 -148 -136 463 -139 -340 605 17 -596 310 177 -333 467 -23 -674 157 58 -615 199 271 -352 -307 442
3340 442 -258 200 482 -478 -213 629 -449 107 493 -388 -280 371 -388 -311 552 45 -451 546 18 -527
3360 -527 498 138 -345 126 -21 -382 -36 438 -377 107 198 -713 279 589 -606 -162 431 -304 -176 588
3380 588 -305 -442 393 21 -375 84 45 -269 354 -17 -385 220 102 16 393 260 -367 425 344 -348 89
3401 89 491 -519 261 115 -266 68 693 -370 -464 414 -370 -246 310 -172 -227 338 -30 -197 388 -73
3421 -73 -299 518 348 -253 180 -27 -503 177 319 -586 134 383 -587 118 250 -277 21 286 -438 -153
3441 -153 527 -263 -56 480 -171 -136 365 -50 -170 247 158 -508 71 252 -204 368 14 -449 268 383 -478
3462 -478 248 114 -600 180 326 -364 36 430 -351 -182 445 -195 -217 259 -37 -470 233 -255 -420 389
3482 389 290 -560 390 105 -625 136 191 -312 270 422 -521 152 367 -384 97 265 -235 -19 443 68 -127
3503 -127 514 -186 -339 481 -222 -255 350 -268 -363 445 9 -243 391 309 -724 316 319 -555 19 189 -455
3524 -455 -114 168 -169 45 228 -358 -251 445 -155 -328 255 -242 -163 205 -41 -210 207 265 -307 97 -215
3545 -215 -328 176 120 -349 205 214 -298 272 115 -313 35 397 -302 -120 548 -465 -208 341 -255 -170 516
3566 516 -387 -342 347 -82 -546 342 315 -369 412 154 -383 296 275 -459 278 250 -756 213 506 -343 -96
3587 -96 338 -358 -78 365 -312 166 421 -359 -173 446 15 -166 446 -444 -368 337 -167 -269 111 -26 -314
3608 -314 180 133 -351 199 56 -533 179 301 -368 -282 233 -495 -231 450 -164 59 465 -180 -241 213 -29
3629 -29 -245 419 -262 -201 166 -193 -610 0 -145 -597 303 12 -451 169 -195 -501 228 175 -223 226 450
3650 450 -202 -129 363 -172 39 54 -376 -124 450 -376 -149 311 -214 -213 91 242 -100 311 156 -441 178
3671 178 56 -428 183 218 -167 56 440 -566 192 427 -422 315 255 -164 -220 456 -316 -431 440 -153 -89
3692 -89 194 -49 -301 240 6 -177 436 179 -137 133 -138 -198 407 195 -270 79 400 -414 326 369 -389
3713 -389 113 196 -241 114 167 -96 58 106 -218 -144 267 7 -411 490 10 -252 256 -57 -258 290 -5
3734 -5 -251 180 323 -209 -164 52 -271 71 76 -357 43 396 -78 -166 306 -187 -36 244 -295 -315 212 -256
3756 -256 -401 326 -42 -169 246 -148 -226 67 -203 -264 17 398 -309 172 181 -526 195 82 -29 46 469 -278
3778 -278 189 461 -188 -81 412 -298 -193 363 -125 -104 120 30 -7 416 -145 -332 185 395 -206 160 264
3799 264 -320 216 143 -224 -75 397 -372 41 135 -293 -102 381 -520 -34 278 -95 -104 220 -290 -351 208 -17
3821 -17 -296 241 -127 -52 244 -81 -115 345 -30 -265 201 94 -64 94 235 -396 200 175 -293 -184 451
3842 451 -286 43 45 -150 -341 95 -132 -212 287 -71 -114 -35 -174 -163 219 113 -273 332 20 -456 396 177
3864 177 -156 91 213 -344 27 525 -568 -98 274 -82 -306 150 34 -253 280 -124 -75 100 -58 -414
3884 -414 -1 74 -370 243 49 -288 260 -5 -118 58 201 -420 211 224 -417 112 233 -459 6 452 -150
3905 -150 -241 388 -222 81 337 82 -304 81 250 -53 73 33 -129 176 19 -421 107 82 -209 255 127
3926 127 -203 78 530 -332 -201 214 -317 184 255 -294 -268 145 13 -2 282 -167 -165 329 43 -330 84 -119
3948 -119 -215 508 -38 -136 166 -5 -252 76 150 -212 305 146 -86 9 386 -43 -252 312 -163 -111 -306 -111
3970 -111 -290 684 -138 -67 105 294 -442 251 -33 -242 338 -90 -363 409 168 -383 -30 88 -231 37
3990 37 57 -300 -275 39 -281 -155 366 -207 2 -35 -117 -74 32 -74 -371 -29 290 -190 224 -109 -81 -5 4
4013 4 -164 133 230 -255 -184 130 -211 -24 176 -214 171 521 -363 24 313 -169 -76 417 -156 -212 485 62
4035 62 -206 226 -265 -282 288 -17 -274 180 273 -182 257 233 -98 -54 190 -304 179 95 -202 -93 466 -296
4057 -296 89 214 -222 -406 -10 -223 -33 218 -91 -18 271 59 -174 338 -105 -538 134 249 -148 214
4077 214 79 -374 -1 312 -172 -125 214 -352 -164 32 -175 -135 60 -202 -192 475 170 50 -68 -270 -65
4098 -65 199 -103 -28 271 71 -236 313 35 -301 57 103 -290 195 349 -285 182 272 -175 -129 171 -134 -21
4120 -21 214 -372 -160 195 77 -178 260 -160 -136 306 -57 -311 65 96 -305 75 81 -417 -102 -68 -215 -93
4142 -93 423 25 -158 141 85 198 272 35 -212 486 -18 -130 -67 -78 -178 314 -154 -24 113 -166 -187 -138
4164 -138 -7 -378 217 -168 -78 -179 165 16 320 486 -357 80 109 -317 -212 74 60 -102 301 -262 -345
4185 -345 115 -234 -11 36 -225 -83 32 105 -276 -74 -42 120 -24 206 -167 339 330 -190 -25 260 -143 -80
4207 -80 318 -227 159 349 -236 13 240 -136 -167 360 -253 -213 184 -3 72 207 -159 -143 103 210 -89 81
4229 81 -3 -186 -94 72 -247 -195 77 -95 164 132 -216 277 124 -163 -163 244 46 -235 473 -206 -175 103 -217
4252 -217 -68 282 -96 -77 360 -24 -149 275 1 -138 3 158 -111 34 163 -69 114 183 -67 -245 153
4273 153 -336 -444 186 -85 33 498 -177 93 231 -6 -230 108 290 -101 133 44 -175 204 281 -268 22
4294 22 -48 -287 244 15 -260 -122 224 -72 -91 414 -141 -80 275 -256 -127 286 -78 -153 226 -181 -151 196
4316 196 155 -201 212 74 -329 -105 -47 -202 15 131 -150 102 5 -194 221 137 59 -101 13 171 -83 57
4338 57 -109 -126 212 43 -247 -150 -207 8 364 60 -292 -89 118 -94 -147 -54 -61 193 -90 -346 -89 463 -18
4361 -18 -219 270 -252 -120 65 -15 127 21 156 -63 122 21 155 196 252 -267 336 -243 -113 255 51
4382 51 -221 305 44 -375 240 135 -35 -232 91 -49 -142 361 152 -74 218 18 4 157 -245 -159 17
4403 17 -43 -282 107 187 160 126 163 -193 -18 -168 -281 87 11 -353 72 192 -11 -52 -130 -307 -102 -8 -73 47
4427 47 -216 -60 53 154 -74 42 31 -168 -154 -17 112 -10 94 79 49 143 205 -58 179 380 -212 126
4449 126 84 -240 -11 349 -138 -332 198 -50 -106 73 11 66 258 -51 -51 10 -244 -51 92 -30 -120 178 -15
4472 -15 4 133 372 -314 -6 160 -107 -73 229 -67 -85 -16 28 200 190 -227 155 487 -71 36 342 -298
4494 -298 151 -113 -124 282 -9 0 -69 223 314 51 -139 -109 -36 115 -64 -54 97 245 196 106 140 -66 -52 -45 109
4519 109 95 71 63 -35 253 142 -248 226 -132 271 229 -114 -128 85 79 101 29 71 -79 14 107 -263 425 56 43
4544 43 380 68 -376 44 242 -68 23 64 32 -133 0 -218 -287 139 -87 2 313 -193 -161 102 108 -74 83
4567 83 92 -69 -194 64 -177 249 119 -236 175 100 -184 -61 254 -16 137 -2 -134 15 -67 -261 -199 100
4589 100 -185 20 283 104 -177 225 -89 -255 69 36 -127 248 -41 -118 -15 9 -405 314 82 -150 -138
4610 -138 182 -5 112 200 -142 -110 57 -83 -105 270 -338 -209 53 -62 -66 208 192 -41 -71 178 -140 113
4632 113 234 -174 194 55 -90 31 185 -269 88 -111 -109 -61 127 -64 173 -16 -214 -107 180 -268 -73
4653 -73 106 -179 293 274 -135 -27 208 77 -49 391 11 -249 -42 -81 -229 277 233 -95 205 -90 1 -211
4675 -211 145 -86 234 182 -180 -153 218 -51 -332 160 -66 29 171 -121 -40 21 -157 -68 301 -30 -249 248
4697 248 211 -392 108 297 36 -93 169 -40 3 218 -255 209 144 -60 66 317 -94 -161 -31 -276 -90
4718 -90 173 -338 -214 -237 -118 -29 260 -12 -218 446 -73 -27 164 52 -288 50 373 -63 62 143 -111 -158
4740 -158 296 214 -211 195 -293 -155 431 -34 136 276 62 -58 -70 -140 -123 -227 178 -268 179 187 -130 111
4762 111 187 -47 22 211 -342 76 284 2 -15 65 16 10 393 -203 -253 234 -213 -143 -44 -22 -237 -31 -224 -424
4786 -424 192 -64 -42 -36 155 -66 36 97 -227 -115 132 -326 64 87 -47 104 -23 -225 64 165 83 -25
4808 -25 20 -128 -250 6 -120 123 -36 -92 -202 143 -71 24 -216 46 -114 74 -46 -229 -175 -25 27 -75
4830 -75 15 -187 -113 371 -287 -192 250 -100 -71 156 -210 -174 197 -7 -87 229 89 -170 -52 -6 -274 139 140
4853 140 48 199 144 -123 -96 79 -110 -324 295 -10 -181 177 -148 324 28 -179 -55 236 172 21 -45 38
4875 38 -205 244 236 -253 36 273 -388 -148 263 43 -58 42 -177 -297 190 -360 -147 315 -80 -95 76
4896 76 -28 -69 379 -47 157 63 -81 -185 9 21 -66 201 179 -64 69 -151 -343 198 59 -169 116 141
4918 141 -34 39 155 -100 7 -76 -85 -44 98 50 27 47 -99 -280 216 200 -282 92 -73 -484 -94 129 -432
4941 -432 80 265 35 52 -67 -56 -95 234 -262 -187 0 81 -178 281 -269 -193 42 -88 192 -64 -6 15 342
4964 342 -32 -4 366 130 -315 79 379 -291 33 188 -10 86 36 -128 8 415 -112 -328 98 -17 -272
4985 -272 499 -92 18 370 81 -225 59 -36 -318 316 11 -8 359 93 -147 8 21 -111 151 243 -306
5006 -306 -126 146 -199 131 231 -27 -130 72 20 -194 88 18 -166 29 -306 -206 150 143 -7 110 -30
5027 -30 -476 31 65 -243 85 80 -201 -3 389 -18 70 202 -2 239 170 79 -20 363 161 -133 194 -67 -18
5050 -18 328 -143 -333 175 10 -131 212 121 -178 116 -194 -205 123 -75 42 62 171 -232 102 33 -48 10
5072 10 183 -184 43 50 -115 -117 -54 -35 62 -60 62 -87 1 170 -311 -8 21 70 -5 161 -197 208 142 -137
5096 -137 51 83 -58 48 486 -321 8 18 154 -132 236 74 -62 278 195 -68 227 57 -176 165 130
5117 130 -338 189 303 9 49 174 -279 -201 -35 -227 -112 224 -40 -369 312 -46 -225 144 -168 -309 284
5138 284 181 -84 95 63 -87 208 197 -347 75 213 -253 286 263 -299 -138 222 -490 -30 -66 -83 -90 140
5160 140 -246 114 382 -17 -337 217 -50 -243 375 273 -287 311 90 -321 308 139 -99 -148 188 -309
5180 -309 -208 -154 -20 64 26 -138 -91 59 -218 -5 96 -165 -3 258 1 49 275 107 -181 187 -52 -464
5202 -464 264 -64 -228 -73 26 -367 251 39 -152 328 208 -197 58 165 -114 174 1 -158 -259 24
5222 24 -129 14 352 -344 -182 378 -118 -82 92 -119 -264 247 227 -41 372 124 -383 151 231 -372 214
5243 214 -164 -139 40 283 -312 -169 -254 -196 -228 48 142 -93 207 -411 -377 198 -56 -87 163 102 -105 -47 129
5266 129 -294 282 229 221 283 86 -68 -82 29 -338 94 175 -91 -41 9 -277 -35 385 -224 -174 148 -138 -187
5289 -187 61 -222 -49 248 97 124 10 62 -172 293 90 16 12 332 -22 -190 135 -242 162 104 -193 110
5311 110 62 -318 -227 166 93 -299 63 -171 -250 25 356 -318 71 24 -301 108 246 -122 35 45 -174 202
5333 202 -106 -267 -57 304 -447 60 -11 -233 -131 193 18 -74 344 -314 101 204 -29 -156 255 231 -165
5354 -165 110 -45 -260 225 193 -212 105 158 -134 41 44 -60 184 233 113 -216 -71 -158 133 69 -177 38
5376 38 81 -34 -200 155 -102 -161 202 79 -146 179 -92 -122 348 172 -295 -25 193 -144 -23 202 -194
5397 -194 -54 90 -73 -151 287 20 -9 235 -197 150 -57 -99 -385 263 101 -200 220 -49 -112 205 65
5418 65 -45 274 78 -254 7 279 -99 -148 178 132 62 212 21 39 -113 -230 38 -50 11 13 302 56 -9
5441 -9 204 -99 -336 -7 45 -124 468 185 -181 9 -187 -218 170 211 -446 132 -57 -113 7 -144 -189 -50
5463 -50 244 -25 -90 245 94 -66 113 157 -68 -8 62 -337 54 318 -279 -21 24 -246 -72 -104 -444 233
5485 233 276 24 307 43 -132 46 388 -60 -283 91 -143 86 73 -74 51 58 -90 -56 456 -73 -239 -17
5507 -17 144 -75 298 -166 -661 258 219 -436 -175 71 -123 25 -82 -135 -78 251 -7 -191 121 -369 -234
5528 -234 203 -148 4 302 21 -111 79 -343 -101 342 -12 -271 47 -15 -10 128 75 -78 240 246 -169 -151
5550 -151 176 -214 149 449 -57 21 282 -91 -18 326 -136 -216 325 -95 -108 71 -287 -93 226 112 -173
5571 -173 105 59 -321 154 101 -180 45 43 -255 -110 47 -154 208 285 -103 -7 209 -196 111 296 115 -187
5593 -187 -71 -15 -194 298 188 -158 225 -67 -235 207 46 -59 127 146 -130 178 406 -181 -10 220 227
5614 227 -27 269 -178 158 165 -89 -167 -77 37 -254 266 55 -317 46 142 31 287 -78 -93 262 138 -216
5636 -216 280 -12 -20 -35 158 -261 -70 388 -240 112 221 -90 -81 211 37 -238 254 24 -119 114 168 -360
5658 -360 92 39 -320 186 157 -143 37 -21 -49 -213 294 -277 50 -141 -100 -145 166 -202 -50 97 -1 -43 -102
5681 -102 -163 -273 174 -151 -118 336 -248 -18 216 36 -321 96 361 -262 142 53 -191 44 206 -208 160
5702 160 374 -119 -85 258 -214 -12 348 -43 193 230 101 -222 228 -132 -111 42 -114 -95 -121 -211 -248 300
5724 300 181 -310 -69 236 -152 -257 172 -224 177 402 87 -118 17 -124 -30 221 -225 -473 194 -31
5744 -31 82 99 -16 -228 163 91 -69 49 144 -27 159 168 -182 9 355 -146 7 374 -228 83 -68 -316
5766 -316 255 364 -244 79 421 -481 -40 360 -176 -328 -14 -126 -69 416 54 -99 118 23 -59 102 169
5787 169 -28 129 123 -475 238 227 -207 44 564 -187 66 207 -37 54 123 -138 -206 193 -135 63 8 -81 -343
5810 -343 164 195 -218 77 66 -243 174 124 -362 185 63 -394 -143 69 -101 114 178 -181 -162 150 70 -59
5832 -59 271 -35 64 276 -241 25 132 -106 -323 198 -40 -434 166 36 -449 33 38 -103 364 366 -179 89
5854 89 308 -77 -205 222 4 -14 272 -271 -107 230 -340 20 397 -204 -77 40 -132 -164 66 -36 -391
5875 -391 430 95 -401 104 226 -281 170 83 -99 -37 476 -256 78 251 -162 -61 349 -328 166 113 -87
5896 -87 -271 175 -90 -85 291 46 -156 65 63 -328 88 384 -228 162 267 -66 -222 191 -217 117 274 -218
5918 -218 -290 92 -145 -228 292 -181 17 51 69 -219 216 -74 -137 193 73 -61 240 96 -414 119 239 -223
5940 -223 81 -50 -354 -317 184 -467 -88 380 -210 -170 274 100 -220 246 -315 -285 218 -33 -227 281 243
5961 243 -279 87 137 -273 345 242 -436 77 129 -217 53 165 -245 -145 137 -297 -105 194 -190 -106 182
5982 182 57 -216 399 -103 -189 270 10 -254 202 -117 -305 -26 68 0 162 43 -203 54 271 -345 23
6003 23 160 -125 -210 452 -147 105 16 -377 -265 216 -166 -301 396 143 -279 42 -51 -156 164 117 -272 288
6025 288 345 -512 81 309 -613 116 37 -114 114 138 89 -71 83 -65 81 -2 -279 78 176 -261 -76 297
6047 297 -1 -136 -114 159 80 198 -136 -155 65 125 -185 -161 -186 -217 98 235 -445 68 347 -336 -130 455
6069 455 -66 -19 561 -215 -91 216 -491 -134 286 -37 -58 231 23 -37 336 135 -161 424 -24 -235 102
6090 102 348 -336 -97 194 -298 16 374 -95 43 151 109 -378 56 -304 -334 362 -162 -216 302 -43 -179
6111 -179 328 143 -259 144 266 -390 -12 -115 -159 216 411 -347 -31 99 -58 -164 402 -249 -15 195
6131 195 -236 -262 133 -63 -205 414 -10 -194 184 106 -361 34 39 -313 85 253 -271 112 -85 -153 66 60
6153 60 -394 21 133 -478 -34 126 3 34 258 -254 -46 396 -134 -237 206 -5 -327 324 230 -387 197
6174 197 180 63 -12 36 -520 105 411 -431 132 447 -425 131 255 -237 -220 334 -183 -340 55 -270 -120
6195 -120 215 160 -101 564 -283 -294 350 118 -192 376 -9 -234 367 -2 -557 5 66 -51 75 223 -365
6216 -365 -149 252 21 -176 246 -14 -120 206 28 -112 169 -198 -124 264 -15 -226 266 -137 -116 411 195
6237 195 -217 77 181 5 62 159 -136 -69 42 -109 -179 248 -78 30 214 8 -466 20 250 -118 471
6258 471 96 -202 15 263 -311 525 -46 -296 288 286 -336 178 191 -373 -44 186 -310 66 329 -298 77
6279 77 204 -181 -217 363 -237 -172 26 -102 -209 151 -123 -386 402 -279 -380 221 96 -476 290 221 -158
6300 -158 7 19 -244 -78 279 -183 -11 193 -10 -175 386 -117 -188 208 -323 -143 209 80 -234 126 -77
6321 -77 -550 235 -38 -124 159 276 -236 137 398 -455 101 57 -210 153 249 -431 -432 321 -287 -258 372 -218
6343 -218 -97 618 -304 -49 446 -147 -165 -8 142 -294 327 89 -487 210 228 -165 -172 343 -438 -7 216
6364 216 -138 -173 260 -62 -20 412 -378 -43 380 -10 -283 349 253 4 362 188 -168 398 130 -267 384
6385 384 265 -337 -76 133 -129 173 212 -362 -36 205 -478 -34 380 -337 54 368 -168 -72 380 -186 -438
6406 -438 448 -14 -98 95 -100 -49 490 72 -299 313 -9 -194 137 181 -171 -13 249 -250 124 136 -507
6427 -507 -72 155 -328 21 235 -353 -186 131 -69 -650 325 30 -298 278 -4 -282 373 54 -466 41
6447 41 198 -363 -317 259 -112 166 408 -372 62 407 -266 103 247 -269 52 -15 -174 -93 221 51 -55
6468 -55 55 134 -304 231 -154 -308 322 -30 -222 146 298 -147 477 -129 -441 234 136 -263 -10 303 -132
6489 -132 -355 398 -333 -63 409 -147 -166 336 -179 -133 273 -140 -258 475 -202 -330 169 121 -194 162 -26
6510 -26 -255 315 78 38 10 346 -511 -131 318 -301 -207 528 -372 -115 440 -122 -35 288 -123 -84 451 -150
6532 -150 -438 109 -95 -153 -92 27 -290 97 95 -599 126 186 -241 20 356 -165 -2 164 -140 -149 78 -156
6554 -156 -286 264 -155 -248 118 -61 -231 73 -52 57 276 17 -57 311 -105 -313 65 140 48 228 147 -301
6576 -301 132 194 -454 78 340 -228 -39 322 -35 66 8 -32 -138 205 -97 -496 271 -14 -110 100 -101
6597 -101 -268 5 180 -309 137 150 -394 272 191 -274 274 346 -181 103 237 -144 -255 254 -193 -69 231
6618 231 -140 -451 -58 191 -201 52 101 -263 285 -195 -276 133 6 -344 -117 -37 -73 192 111 -143 393 235
6640 235 -475 -94 99 -14 -376 313 -87 -110 296 131 -481 389 -289 -295 335 157 -249 194 83 -325 372
6661 372 320 47 195 241 -62 314 426 -312 65 272 -390 -151 347 -114 -272 121 -281 -81 285 24 -126
6682 -126 308 -38 -75 246 81 -222 56 442 -273 260 97 -354 49 -86 -357 98 81 -221 74 253 -47
6703 -47 -45 186 -117 8 64 140 7 253 48 -216 301 -59 -297 146 117 110 371 -45 -131 198 156 -57 281
6726 281 283 -367 126 261 -208 -130 178 -489 -114 241 -351 -207 350 85 -215 457 132 -287 202 143 -394
6747 -394 295 250 -22 192 210 -261 37 -32 -477 -53 177 -207 35 235 -326 -102 460 -322 -168 87 -59
6768 -59 -66 193 -345 -186 445 -119 -111 128 93 -284 -59 82 -426 31 -103 -233 139 389 -386 459 217 -302
6790 -302 40 432 -268 127 629 -262 -9 140 -11 -116 160 -178 -189 466 -42 -254 321 -96 -496 206
6810 206 236 -366 196 19 -211 92 -48 -378 226 38 -138 177 -75 -476 85 187 -161 -64 366 -118 25
6831 25 345 -137 -176 177 -70 -123 307 111 -362 21 -83 -153 123 -108 -74 321 353 -318 72 -18 -76 48 38
6854 38 -235 150 168 -175 -206 145 -11 15 225 109 -242 286 -199 -149 -28 10 -394 340 68 -213 73 66 -260
6877 -260 292 116 -295 145 297 -460 -38 96 -136 -49 275 -199 -121 519 -172 -253 70 140 -310 176 -103
6898 -103 -142 196 154 -397 181 -11 -80 37 -52 -340 23 84 -230 86 174 -258 69 40 -65 -212 203 -243
6920 -243 -137 233 -279 -405 294 -24 -413 149 68 -279 328 -67 -322 121 -46 -252 99 -9 -448 54
6940 54 135 -183 229 219 -233 -265 477 -90 -141 360 5 -35 141 63 -249 -34 -184 100 479 127 -490 472
6962 472 133 -138 292 324 -322 37 47 -527 145 -186 -192 -36 436 -183 -78 487 -337 -213 303 -63 87
6983 87 270 -56 -42 237 -45 -342 286 154 -400 164 -204 -251 86 162 -138 171 210 -458 9 491 -178 -71
7005 -71 193 -282 118 112 -81 -339 199 -208 -191 666 -24 -325 238 186 -78 184 201 -192 391 47 -299 183
7027 183 98 -352 274 237 -110 97 166 -527 -142 212 -345 35 115 -158 -262 276 -123 -165 447 -90 -133 179
7049 179 -50 -406 163 360 -264 229 92 -314 -238 299 -431 223 158 -417 -63 231 -175 -174 360 -100 -117 -23
7071 -23 -80 -46 31 -212 -309 620 -206 -302 149 -45 -168 277 -91 -137 324 -114 -212 -169 273 -216 374 26 -116
7094 -116 -61 320 -330 24 435 -108 -74 106 -67 -159 432 -267 -173 528 0 -34 308 13 -254 277 -68 -95
7116 -95 -27 279 -402 57 190 -498 -52 280 -209 -78 44 -228 -164 346 -123 212 397 -215 -193 345 -296
7137 -296 -413 414 -265 -92 104 78 -422 380 232 -220 206 469 -549 294 139 -407 -38 169 -343 59
7157 59 247 -102 -41 -24 -122 -244 342 -86 -52 337 200 -102 108 -28 -488 321 153 -374 49 74 -162 50
7179 50 277 -327 214 80 -152 -6 254 -222 63 39 -190 -52 420 -68 -307 275 -33 20 376 -281 -483
7200 -483 68 189 -213 102 3 -259 141 -7 -459 78 85 -261 -237 400 -363 -68 265 -306 62 403 -62
7221 -62 -35 315 -282 -57 265 -307 -394 334 14 -291 207 -80 -469 433 227 -200 302 22 -344 185 436
7242 436 -378 65 363 -282 -202 71 -357 78 604 -107 -116 296 -206 -285 127 -207 -417 134 -72 -211 408
7263 408 -28 -210 308 -20 -567 264 324 -195 25 17 -325 336 301 47 -218 293 -158 -229 500 -2 -4 124
7285 124 -12 45 451 -22 -189 363 98 -256 330 -157 -590 206 106 -223 119 314 -273 -21 78 -622 -163
7306 -163 308 -384 -114 95 -354 -210 320 -17 -15 462 -213 -13 267 84 -318 154 -70 -194 20 -22 -227
7327 -227 70 111 -417 55 247 -175 177 403 -400 -315 291 -268 40 327 53 1 205 -38 -288 172 -157
7348 -157 -305 344 -131 -137 335 -173 -351 201 282 -218 241 36 -272 -117 286 -247 471 98 -523 92 412
7369 412 49 -306 354 -125 -46 489 -51 -121 95 25 -351 465 -323 -168 355 28 -419 3 269 -363 335
7390 335 201 -263 9 216 -222 -92 428 -69 -111 329 -295 -300 437 54 -15 290 -240 -428 136 -18 -127
7411 -127 183 119 -344 205 130 -480 314 102 -118 181 151 -327 -93 228 -189 -65 318 -249 110 372 -425
7432 -425 -191 235 -120 -185 133 -117 55 449 44 1 263 -60 -177 50 202 -292 196 136 -287 114 378
7453 378 -348 279 130 -198 43 259 -120 -165 502 -164 3 255 -200 -433 215 -148 49 91 231 -172 380
7474 380 285 -327 107 401 -228 271 46 -148 -207 78 -359 -51 504 22 -173 283 -155 -137 510 -320 -126
7495 -126 347 -85 -139 225 -134 -382 84 96 -172 215 -157 -298 190 271 -178 -61 60 36 212 245 -51 -203
7517 -203 190 -122 332 374 -313 -71 251 -43 -349 180 92 -357 192 -146 -355 135 -65 -335 189 -117 -420
7538 -420 37 9 -411 194 266 -33 -315 118 -67 31 301 -112 252 470 -348 -146 460 34 -160 305 131
7559 131 -207 209 35 -285 40 -59 -302 232 -92 -412 -209 144 -240 79 267 -205 42 306 -138 18
7579 18 306 -282 -231 239 -79 -197 434 -20 -335 370 -64 -203 129 59 67 393 91 -233 152 -41 -195 302
7601 302 429 -330 -6 127 -350 -189 155 -453 113 190 -228 -48 232 94 -75 375 74 -132 419 -91
7621 -91 46 114 -18 -167 322 157 -190 254 146 -22 -177 219 -240 22 -58 -3 213 429 64 7 26 -196
7643 -196 42 191 47 -142 120 130 -71 164 -10 -272 250 98 -387 -22 9 -315 260 408 -203 262 86
7664 86 -88 -3 132 -197 -215 168 47 -230 133 -108 -50 195 -264 -292 132 34 -154 106 -91 -300 10 -55
7686 -55 -232 231 -130 -29 15 81 35 -18 272 -43 18 -23 14 -12 228 201 -76 226 -74 -203 -74 204 -143
7709 -143 244 164 9 38 76 -226 230 103 -150 73 -129 -132 43 108 -344 67 222 -161 -102 191 71 7 163
7732 163 -148 114 76 -299 -132 163 -93 -240 81 253 -112 -69 -146 -130 -4 -119 -272 -157 84 -383 80
7753 80 -125 -242 100 254 76 -289 63 -335 -200 228 -183 -160 113 -175 -252 296 -128 -317 311 79 -176
7774 -176 138 270 -263 159 -52 -22 43 84 -181 -94 213 -217 -1 344 -71 -152 307 -9 -73 271 122 -74
7796 -74 247 -5 -147 157 -31 -148 141 -135 -332 308 -155 -99 14 -35 -322 175 0 -472 9 87 63 -3
7818 -3 358 -60 -91 302 -41 -204 303 17 -264 -79 -70 -263 119 -89 6 -69 88 -414 83 20 -208 62 209
7841 209 -211 135 -18 -352 107 145 -303 176 102 -374 68 327 48 176 181 -54 -226 263 -16 -210 236
7862 236 145 -50 161 -101 -382 353 190 -211 -13 292 -67 0 388 -333 71 81 7 -81 61 24 -343 475
7884 475 -158 -42 90 -31 -495 122 131 -324 293 203 -19 -88 45 -176 -40 63 175 175 156 118 -133 152 -13
7907 -13 -156 157 -227 -80 177 -7 -161 30 45 -44 -107 97 -65 135 -227 -293 -95 -82 -72 187 59 -164
7929 -164 265 117 -29 79 151 -277 -67 223 54 -117 362 -190 -169 210 -42 251 249 -18 -163 92 25 -80
7951 -80 82 118 -81 -225 -372 -35 -30 345 153 -140 135 -170 87 93 -183 124 133 -68 -421 -25 -37 238 175
7974 175 -117 -206 65 287 -276 152 14 -412 57 -179 -244 -121 -81 -184 77 223 25 95 4 -221 4 330
7996 330 -30 -49 254 -108 -362 294 -204 8 41 -212 -123 90 101 -197 453 -162 -116 -37 73 -136 15 213
8018 213 -32 32 115 162 12 -150 -198 -144 397 -247 -355 236 0 -74 246 -58 165 126 -35 -242 174 123 -458
8041 -458 190 407 -61 157 224 -72 -169 35 -240 165 -89 -360 82 115 -123 150 263 -178 -62 -26 -66 103
8063 103 314 208 89 328 85 -155 189 198 -272 155 62 -159 153 154 -94 -13 -174 -279 9 14 -279 -95 288
8086 288 -120 -60 -299 -5 149 248 68 -45 69 -38 166 391 -86 -247 220 136 -313 23 -19 -231 1
8107 1 -37 -17 -46 110 -410 118 301 -80 -67 30 205 -144 296 -261 -225 273 -188 -139 163 -140 -12 86 53 -278
8131 -278 250 15 -32 89 281 -10 133 185 -326 70 195 -114 229 79 -354 48 61 -112 168 212 -73
8152 -73 -151 21 -237 -115 211 -231 -58 166 155 -249 241 74 -257 9 132 -126 0 83 -140 44 -221
8173 -221 -161 106 423 -226 -21 -115 45 -151 -2 -144 84 221 -141 -110 -154 166 -390 -121
8191a21
$$ Imaginary data points
##PAGE= N=2
##DATA TABLE= (X++(I..I)), XYDATA
0 0 0 0 0 0 0 0 0 0 0 0 0 0 0 -8 8 -8 8 -8 12 -16 16 -20 24 -28 34 -40 44 -51 59 -68 79 -90 101 -115 130 -145
36 -145 162 -181 201 -225 251 -277 307 -338 375 -415 456 -504 555 -610 674 -742 817 -905 998
55 998 -1107 1233 -1378 1546 -1749 1994 -2301 2695 -3221 3958 -5068 6909 -10502 19961 -94525
70 -94525 -179092 145659 50567 -75150 102851 38366 -71862 148209 105612 -84038 60923
81 60923 105237 -44149 31251 19453 -101696 22463 22530 -160337 -36347 42903 -113773 -10615
93 -10615 82464 -99262 -4360 138693 -82525 -64977 158720 -4400 -84149 109985 13961
104 13961 -69872 117420 29805 -114048 65072 57651 -99313 10831 24000 -76806 50488
115 50488 38600 -120384 10993 67548 -92270 1435 72646 -82378 14827 114491 -83116
126 -83116 -32869 132497 -49647 -83096 90892 -32305 -83796 89771 -10433 -85557 107943
137 107943 44117 -96781 53649 51036 -65765 48425 22580 -105060 46094 70447 -107301
148 -107301 -16899 54232 -76871 4039 62142 -98076 -6367 129566 -41007 -44775 94134
159 94134 -21575 -32545 92438 -43079 -79425 97937 4478 -92057 63505 21792 -76595
170 -76595 54760 9033 -110707 41976 48380 -103597 14516 72204 -64252 15454 70647
181 70647 -66177 16494 105209 -55470 -28174 94190 -25956 -31728 64617 -56757 -57174 76223
193 76223 -48117 -100349 60528 -2645 -70581 68672 10466 -72218 85954 47070 -96039
204 -96039 43241 71905 -71926 20794 65934 -65151 17473 76446 -76642 -24181 79597
215 79597 -47205 -42502 48994 -48613 -29379 67155 -55630 -62898 79068 -10595 -64539 57791
227 57791 -2340 -41128 97360 20949 -83652 70695 60963 -79904 15308 36530 -74421
238 -74421 23533 54129 -90153 -10331 80838 -46670 -30137 48753 -43188 -12708 65086 -52556
250 -52556 -41190 79617 -15400 -49106 57296 -14357 -39093 77294 -9310 -72966 77657
261 77657 38443 -75051 36287 32605 -72777 27249 32860 -92861 8960 71929 -59839
272 -59839 -15433 60781 -35892 -1910 60798 -51363 -24381 72693 -32197 -45550 55515
283 55515 -17922 -32411 63087 -24195 -56730 73232 8518 -70654 49498 27379 -59256 39763
295 39763 22954 -78157 28418 49110 -77195 -4073 59727 -40543 1136 53932 -45165
306 -45165 -2983 70238 -41870 -38375 56182 -20905 -34499 45368 -29677 -35304 71353 -8776
318 -8776 -63499 52451 15881 -52786 40300 11634 -59251 47762 33457 -78982 12730 51799
330 51799 -50993 3545 43988 -47477 10685 64832 -49270 -22090 64697 -26875 -34780 38006
342 38006 -35055 -30544 59552 -24485 -51782 60825 10998 -45865 41766 5936 -44900 52499
354 52499 17033 -69938 31912 44524 -56876 5457 32293 -50524 14648 48234 -57329
365 -57329 -8465 65460 -31215 -27192 42013 -28370 -19748 49147 -35592 -43766 58081 491
377 491 -40880 43093 5658 -31025 50710 2099 -59761 41580 30509 -58263 13404 26307
389 26307 -47980 19769 33494 -61471 4879 58861 -41305 -17827 46817 -27504 -10905 46791
401 46791 -38382 -30978 57319 -14724 -43008 41923 -1240 -27101 49666 -1869 -43942 50212
413 50212 17277 -57875 20836 20375 -46384 22031 21279 -57522 16731 46422 -50072 -6929 47136
426 47136 -29554 -5854 39901 -38588 -14620 55783 -25115 -36332 43484 -7134 -27483 40417
438 40417 -10544 -31315 54764 8562 -49800 30502 17383 -42959 19706 8348 -52959 23626
450 23626 32209 -53851 2786 43003 -32113 119 36500 -36139 -1336 51756 -32921 -25945
462 -25945 47687 -12796 -24526 38242 -16612 -28349 47904 -7046 -46269 38222 12260 -42224
474 -42224 22857 5426 -46800 25817 19676 -51650 16026 40129 -33171 8392 37740 -28585
486 -28585 10028 43862 -37652 -13873 44608 -27210 -28666 31747 -23558 -26438 37733 -20653
498 -20653 -39061 43749 5613 -39570 30627 14047 -28677 33729 13997 -42647 26517 32535
510 32535 -39633 6190 30341 -27158 10271 26563 -44333 -4104 41577 -35231 -26577 29175
522 29175 -24076 -17958 34776 -25285 -25859 53196 2240 -35610 34023 11570 -23415 34432 5295
535 5295 -41072 30229 21995 -45800 5303 21450 -30937 12299 21110 -41082 8940 42377 -32975
548 -32975 -12811 33901 -23248 -11206 31294 -31480 -22679 44502 -12597 -34890 33471 3376
560 3376 -24605 31865 92 -32368 35483 17201 -36885 18998 22377 -28312 14986 17616 -35193
573 -35193 14467 30983 -38163 -6548 30132 -30087 -13160 23910 -32756 -17075 35052 -23933
585 -23933 -28511 38747 1323 -19531 35482 4917 -17326 40974 9662 -32759 27427 18060
597 18060 -32542 10930 7663 -36590 13441 14926 -47307 -550 29383 -31422 -7753 25313
609 25313 -26747 -2400 37333 -25121 -16555 43539 -3366 -18645 31181 -2552 -14004 37668
621 37668 -2864 -33254 27141 7366 -35948 10879 2457 -33221 18220 10829 -41410 11327
633 11327 30398 -27261 3271 28532 -21774 4361 32474 -27470 -11403 36393 -15279 -21482
645 -21482 24478 -11431 -17276 29036 -10291 -25184 31981 4148 -28862 21288 6576 -26338
657 -26338 21096 8139 -34056 18956 23298 -32735 4942 24812 -24679 2769 23422 -28728
669 -28728 -3685 31659 -24595 -18242 28050 -11295 -12948 26954 -13349 -16432 36075 -2451 -26897
682 -26897 26981 7053 -23796 19223 -930 -32778 21628 14158 -37669 6462 22948 -22056
694 -22056 6436 19526 -24894 7684 31603 -24529 -10421 27682 -13562 -10191 20915 -20205
706 -20205 -13451 32490 -12031 -27106 26041 1657 -21850 21386 -679 -25587 26403 11561
718 11561 -33675 12571 21208 -21253 9427 17444 -23324 9168 24604 -26190 -5501 23866
730 23866 -19238 -9168 17076 -23550 -10359 27825 -17470 -19303 30874 -3104 -19133 27346
742 27346 1027 -20326 28884 6843 -29939 18763 15369 -27845 7604 13735 -24249 7926
754 7926 16813 -27064 1780 23509 -21541 -6525 18548 -18297 -3654 22871 -21368 -11959 31593
767 31593 -8706 -17683 27140 -1351 -16047 26796 -1389 -27172 23761 10829 -29562 8626
779 8626 11071 -23219 8547 11113 -26547 7694 22252 -21802 -2342 19509 -16029 437 20258
792 20258 -21839 -6001 28884 -14593 -16092 25283 -5799 -13619 25571 -6321 -21927 27014
804 27014 4384 -29322 13842 9367 -23328 11600 8087 -26081 11465 18217 -23867 2728 20688
817 20688 -16205 2174 17759 -21464 -1351 25447 -18844 -12515 24518 -9991 -13546 21891
829 21891 -9295 -14951 27750 -2085 -25354 19374 6786 -22428 12667 5061 -22698 14808
841 14808 12110 -26545 6461 20341 -17338 2228 15710 -18378 3336 21501 -22023 -9121
853 -9121 23920 -11619 -12267 18780 -11106 -10469 25893 -7688 -20950 23589 4274 -20055 14762
866 14762 1817 -20425 17755 7205 -27179 10983 17743 -20197 3840 14226 -18433 6608
878 6608 19550 -22618 -4803 22756 -15304 -10660 17820 -12328 -8150 23357 -11455 -16597 25148
891 25148 823 -17310 17814 1606 -16813 18432 2652 -25491 14189 12235 -22948 5321
903 5321 12421 -18686 6960 15574 -21917 518 22086 -15992 -7170 18032 -12740 -6247 19916
916 19916 -12656 -10978 24929 -3942 -16285 18642 -42 -14322 18208 -582 -21721 16785
928 16785 6950 -24959 8156 10626 -19001 8333 11553 -21835 5348 20343 -18317 -3113 19409
941 19409 -12857 -4338 17412 -14452 -7714 23439 -8843 -14414 20147 -2049 -13023 17717 -3289
954 -3289 -17251 19107 2426 -23654 11478 7761 -20128 8206 8325 -20497 9361 16813 -20083
967 -20083 1179 19905 -13656 -2638 16867 -13364 -3439 20810 -12995 -12133 20016 -4384 -12199
980 -12199 16131 -4930 -13310 18348 -2288 -21003 14582 6399 -19423 8738 5490 -18337 11960
993 11960 12112 -20487 6043 19586 -14427 125 15521 -13684 -262 17981 -16130 -9348 19380
1006 19380 -8731 -12739 14441 -6994 -10723 18350 -5398 -17347 17716 3799 -17417 11966
1018 11966 5076 -15182 14241 8231 -20367 9323 15860 -16827 2305 14055 -15042 524
1030 524 14511 -18227 -6271 18095 -11931 -11292 14283 -7590 -8525 17371 -5781 -11855 19879
1043 19879 1428 -14482 14066 3739 -13363 13329 3749 -18774 10933 9983 -19231 3705
1055 3705 12067 -15601 2256 12300 -17447 -960 17643 -14061 -8102 16693 -7679 -7096 16171
1068 16171 -7680 -9296 19489 -2241 -14247 15121 2235 -12842 11780 17 -16808 12635
1080 12635 6522 -19120 6498 10296 -15103 4782 10498 -16389 4095 16188 -16038 -4967
1092 -4967 16086 -10469 -6432 14534 -10021 -7754 18236 -5550 -12576 15862 1274 -11327 12850
1105 12850 142 -13065 13500 3573 -17598 8593 7816 -15175 5530 7707 -15660 5164 11838
1118 11838 -16775 -794 16062 -11846 -4427 13983 -10169 -4883 16816 -7677 -9485 17328
1130 17328 -1584 -11623 12722 -434 -10716 12977 -367 -16047 10190 5150 -16483 5818
1142 5818 6096 -13369 7399 8793 -16364 4510 15681 -12689 -1625 13752 -10173 -2082 14774
1155 14774 -11838 -7927 17148 -5199 -11790 12187 -2126 -9477 12826 -2506 -13851 12913
1167 12913 4276 -14226 7139 4999 -11696 8353 6294 -15045 6925 12781 -14014 40 11675
1180 11675 -11177 -308 12273 -13525 -5542 15631 -8068 -10211 12738 -3288 -7666 13306
1192 13306 -3041 -11249 13918 2622 -12625 8892 3565 -11313 8367 3925 -14189 7175
1204 7175 8858 -14472 2806 10191 -12046 837 10899 -12592 -2289 14307 -10286 -6899 14233
1217 14233 -5356 -7243 12680 -4128 -8480 14624 -894 -12359 10914 2765 -11678 7926
1229 7926 2108 -12803 8378 5706 -15076 4267 9474 -11310 2665 9477 -11825 1094 12943
1242 12943 -11295 -3984 13678 -6559 -6383 11500 -5886 -6740 13442 -3283 -10667 11713 1192
1255 1192 -10782 8535 1318 -10686 9142 3405 -13924 6467 8112 -11709 3445 7938 -10929
1268 -10929 3534 10809 -11992 -1701 12887 -8952 -4830 10932 -7195 -5524 12386 -5766
1280 -5766 -9255 12447 -893 -9452 10220 681 -9821 9292 1763 -11968 8190 5790 -12493
1293 -12493 4631 6892 -10645 3705 8198 -11628 1756 11402 -10419 -3487 11230 -7115 -4049
1306 -4049 10696 -7066 -5917 13093 -2899 -9401 10618 362 -8191 8854 -128 -10296 9230
1319 9230 3463 -12415 4992 6071 -9847 4241 6083 -11220 3755 10128 -10314 -1461 10975
1332 10975 -7208 -2603 9276 -8177 -4252 12107 -5264 -8075 10545 -1440 -7218 9127 -1641
1345 -1641 -8722 10365 1556 -11264 6856 4630 -9358 5544 4480 -10789 4899 8276 -11030
1358 -11030 644 9438 -8348 -1051 8598 -8377 -2847 10640 -7087 -6160 10470 -2916 -6261
1371 -6261 9344 -2335 -7053 10482 -276 -9902 8578 3191 -9693 5472 3276 -9799 5205
1384 5205 5968 -10820 2513 8709 -8848 -549 7815 -7469 -766 9525 -7584 -3855 10388
1397 10388 -4233 -5794 8750 -3032 -5318 10031 -2280 -8544 9377 1525 -9800 6302 2383
1410 2383 -9119 6317 3821 -10524 4215 7742 -9040 1007 7573 -7340 583 7879 -8061
1423 -8061 -2106 10016 -5813 -4769 8427 -4249 -4543 8693 -3695 -6359 10092 -76 -8950
1436 -8950 7284 1773 -8160 6750 2690 -10017 5261 5862 -9795 1914 6974 -7221 1152
1449 1152 6403 -7934 -524 8848 -6540 -3598 8075 -4255 -3690 7663 -4361 -4765 9694 -1960
1463 -1960 -7539 8275 668 -7134 6799 990 -8588 6547 3791 -9908 3202 5852 -7963
1476 -7963 1418 5581 -7947 1079 7747 -7733 -2254 7980 -4894 -2787 7145 -4740 -3198 9307
1490 9307 -3148 -6176 8364 -3 -6264 6693 -448 -7759 6842 1918 -9688 4326 4433 -8222
1504 -8222 2670 4637 -7730 2596 7111 -7299 -563 7954 -4874 -1404 7003 -4863 -2711
1517 -2711 7675 -4409 -4959 8092 -1605 -6230 6336 -1029 -6267 6927 215 -8232 5298 3460
1531 3460 -7824 3462 4427 -6632 3632 5615 -7473 1202 7616 -6037 -1177 6527 -5364
1544 -5364 -2375 6556 -5433 -4147 7446 -3191 -5406 6555 -1692 -5056 6993 -262 -6276 6892
1558 6892 2031 -7501 4811 3619 -6874 3599 4104 -7461 2522 5814 -7266 -422 6130 -5781
1572 -5781 -1107 6190 -5488 -2541 7352 -3981 -4570 6609 -1704 -4132 6891 -1543 -5507 6505
1586 6505 957 -6898 5318 2591 -6716 3984 3211 -7170 3171 5007 -7096 697 5860 -5888
1600 -5888 -807 5848 -5295 -1501 6585 -4819 -3511 6820 -2766 -4465 5677 -2020 -4720 7022
1614 7022 -261 -6132 5968 1914 -5749 4572 1914 -6468 3976 3392 -7393 1640 4913 -6205
1628 -6205 123 4848 -5892 -248 6099 -5447 -2623 6844 -3216 -3531 5740 -2322 -3111 6821 -962
1643 -962 -5101 6401 1240 -5522 4346 1092 -5629 4008 2077 -7226 2333 3838 -6301 858 4248
1658 4248 -5360 591 5652 -5787 -612 6535 -3387 -2203 5778 -2902 -2757 6285 -2310 -4724 6069
1673 6069 -340 -5464 4520 255 -5598 4188 1304 -6564 3510 3168 -6102 1872 3878 -4895 1756
1688 1756 4950 -4930 449 6004 -4330 -1870 5765 -3206 -2171 5416 -3526 -4080 5689 -1778 -5320
1703 -5320 4867 -15 -4970 4658 233 -5733 4305 2651 -5822 2920 3583 -4969 1845 4069 -5217
1718 -5217 1063 4967 -4853 -698 5065 -4147 -1784 4803 -4222 -2882 5756 -2180 -4189 5377 -567
1733 -567 -4317 4837 255 -4781 4885 1756 -5728 3198 2929 -4912 2450 2853 -5377 1772 3866 -5358
1749 -5358 -351 4448 -4326 -892 4364 -4055 -1798 5578 -3276 -3108 5827 -1500 -3793 5068 -608
1764 -608 -4177 4852 729 -5362 3962 2055 -5527 2520 2487 -4855 2067 3249 -5327 979 4298 -4580
1780 -4580 -400 4639 -3724 -544 5017 -3756 -2171 5435 -2354 -3433 5019 -1223 -3894 4723 -488
1795 -488 -5269 4470 1432 -5063 3027 1717 -4762 2574 2609 -5224 1550 3784 -4519 3 3885 -3954
1811 -3954 -378 4482 -4331 -1240 5092 -2909 -2644 4529 -1686 -2806 5032 -948 -3978 4896 752
1826 752 -4571 3437 1546 -4566 2967 1667 -5211 1934 2967 -4830 715 3755 -4044 487 3977
1841 3977 -4094 -544 5203 -3175 -1653 5010 -2131 -2631 4611 -2070 -3650 4526 -784 -4343 3742
1856 3742 155 -4482 3167 1028 -4557 2837 2697 -4651 1681 3743 -3596 1137 3678 -3759 256
1871 256 4307 -3741 -1798 4512 -3036 -2560 4052 -2529 -3071 4274 -1416 -3917 4163 364 -3603 3907
1887 3907 855 -4001 3639 1727 -4318 2580 3138 -4565 1053 2818 -4480 600 3982 -4297 -607
1902 -607 4087 -3573 -2060 4127 -2467 -2020 4346 -2116 -2764 4887 38 -3547 3881 412 -3774 3408
1918 3408 799 -4610 2774 1974 -4466 1626 2209 -4526 1215 2885 -4285 333 4009 -3680 -777
1933 -777 4168 -2745 -1516 4271 -2287 -2202 4636 -1186 -3184 3705 -186 -3077 3647 87 -4002 3403
1949 3403 1550 -4409 1884 2089 -3822 1945 2394 -4404 935 3500 -4035 -415 3871 -2840 -864
1964 -864 3701 -3047 -1560 4492 -1769 -2807 3789 -872 -3042 4039 -305 -3693 3753 1000 -4089
1979 -4089 2710 1504 -4096 2154 2227 -4129 1578 3253 -4347 312 3240 -3028 -262 3448 -2971
1994 -2971 -986 4123 -2564 -2191 3922 -1300 -2360 4226 -1014 -3125 3681 89 -3693 3165 1119
2009 1119 -3796 2422 1350 -4225 2137 2782 -4154 848 3204 -3705 293 3563 -3257 -532 4001
2024 4001 -2840 -1581 4236 -1797 -2401 3963 -1510 -2927 3921 -508 -3317 3071 298 -3927 2966
2039 2966 928 -3599 2528 2132 -4019 1459 2903 -3685 841 3182 -3529 30 3657 -3158 -949
2054 -949 3846 -2490 -2110 3767 -1720 -2717 3783 -1327 -3128 3637 -13 -3400 3078 812 -3458 2725
2070 2725 1199 -3904 2399 2229 -3872 1319 2672 -3538 260 2993 -3417 -365 3544 -3014 -1552
2085 -1552 3774 -2138 -1505 3841 -1639 -2672 4063 -706 -2927 3624 235 -3339 2908 620 -3528
2100 -3528 2487 1492 -3697 2096 2027 -3829 1286 2344 -3696 611 3568 -3112 -829 3753 -2374 -1368
2116 -1368 3352 -2575 -1855 3763 -1304 -2638 3309 -285 -3089 3109 211 -3102 3034 1213 -3303
2131 -3303 2236 1855 -3643 1483 2251 -3797 1136 3181 -3558 40 3622 -2858 -1002 3275 -2582
2146 -2582 -1229 3711 -1790 -2198 3672 -705 -2722 3387 -84 -2858 3166 571 -3259 2734 1546
2161 1546 -3284 1734 1559 -3479 1568 2256 -3663 710 3028 -3228 16 3119 -2874 -969 3635
2176 3635 -2089 -1635 3853 -1428 -2344 3521 -770 -2518 3105 -124 -3319 2786 679 -3196 1989
2191 1989 1282 -3419 1752 1904 -3673 978 2452 -3408 63 2823 -2674 -70 3126 -2410 -962
2206 -962 3471 -1751 -2021 3539 -1019 -2292 2895 -525 -2999 3172 260 -3143 2609 837 -3168
2221 -3168 1848 1315 -3039 1727 2073 -3100 784 2637 -2888 198 3034 -3033 -533 3398 -2502
2236 -2502 -1290 3447 -1652 -1983 2995 -1301 -2809 3365 -310 -2901 2624 483 -2821 2498 1056
2251 1056 -3145 2183 2285 -3262 1199 2568 -3032 520 2459 -3194 44 2799 -2838 -995 2938
2266 2938 -1990 -1819 3062 -1510 -2166 3407 -620 -2495 3239 207 -2573 2593 590 -2864 2510
2281 2510 1107 -3206 1863 1967 -3069 827 1824 -3205 635 2339 -2867 -267 2922 -2246 -946
2296 -946 3087 -1766 -1350 3090 -1106 -2333 3289 -577 -2389 2899 279 -2556 2618 615 -2911
2311 -2911 2190 1322 -3149 1405 1667 -2850 627 2135 -3075 65 2531 -2519 -482 2819 -2036
2326 -2036 -1394 2952 -1555 -1654 3395 -517 -2077 2864 -478 -2529 2773 238 -2752 2335 877 -3041
2342 -3041 1772 1211 -2930 1345 1723 -3099 158 2146 -2657 45 2465 -2067 -715 2817 -1815
2357 -1815 -919 3270 -1278 -1171 2911 -657 -1887 2739 -152 -2607 2529 528 -3184 1872 958 -2752
2373 -2752 1935 1589 -2842 1280 2156 -2823 343 2606 -2448 -55 2870 -2034 -687 2782 -1987
2388 -1987 -1286 3005 -1340 -2031 2486 -921 -2525 2425 -491 -2398 2101 797 -2524 1734 942 -2682
2404 -2682 1621 1885 -2665 1009 2183 -2547 363 2458 -2198 -416 2442 -2409 -934 2312 -1605
2419 -1605 -1412 2443 -948 -1802 2811 -546 -1932 2711 88 -2129 2157 599 -2389 2182 1045
2434 1045 -2615 1220 1707 -2661 694 1881 -2398 107 2205 -2221 -649 2327 -1856 -1070 2377
2449 2377 -1318 -1427 2650 -890 -1828 2523 -52 -1818 2433 169 -2210 2223 687 -2626 1871
2464 1871 1455 -2694 920 1543 -2224 221 2041 -2739 24 2507 -2103 -702 2371 -1835 -1051 2391
2480 2391 -1183 -974 2707 -621 -1506 2220 -23 -1952 2515 188 -2144 1752 825 -2666 1348 1145
2496 1145 -2573 738 1414 -2475 297 1652 -2006 430 1919 -1889 -649 2438 -1355 -646 2402
2511 2402 -948 -1376 2295 -805 -1670 2238 -255 -1915 1706 65 -2600 1595 861 -2203 1245 1356
2527 1356 -2290 816 1613 -1991 185 1804 -1873 98 2101 -1481 -650 2071 -1165 -1010 2048 -1237
2543 -1237 -1654 1931 -573 -1851 2276 -158 -2297 1978 411 -2069 1459 980 -1933 962 1159 -2086
2559 -2086 373 1616 -2165 397 1651 -1732 -124 2184 -1795 -641 2169 -1283 -1152 1970 -825
2574 -825 -1310 1823 -486 -1656 1796 107 -1835 1533 622 -1969 1448 894 -2091 854 1256 -1877
2590 -1877 308 1371 -1705 211 1463 -1649 -146 1924 -1469 -629 2000 -984 -932 1931 -737 -1505
2606 -1505 1866 -353 -1456 1661 86 -1921 1543 793 -1939 1119 1016 -1936 759 1223 -1818 325
2622 325 1373 -1907 113 1814 -1445 -229 1825 -1424 -434 1942 -539 -961 1851 -774 -1335 1765
2638 1765 -284 -1791 1435 11 -1835 1413 399 -1795 914 742 -1522 654 895 -1745 332
2653 332 1345 -1803 140 1667 -1316 -204 1756 -1212 -537 1973 -737 -976 1768 -533 -1380 1519
2669 1519 -239 -1403 1601 257 -1974 1207 342 -1643 1054 676 -1390 749 913 -1501 285 1552
2685 1552 -1172 152 1617 -1337 -303 1636 -1239 -808 1535 -1082 -1140 1400 -554 -1299 1610 69
2701 69 -1244 1206 112 -1486 1256 538 -1411 933 841 -1562 601 955 -1346 340 1161 -1423 -137
2718 -137 1260 -1450 -213 1398 -1202 -794 1661 -701 -1179 1502 -415 -1161 1717 23 -1383 1301
2734 1301 269 -1047 977 613 -1562 804 715 -1360 440 1186 -1272 189 1183 -1456 -126 1322
2750 1322 -831 -641 1494 -867 -576 1355 -519 -638 1191 -237 -1173 1496 -90 -1152 1028 441
2766 441 -1295 792 251 -1271 863 461 -1450 65 744 -1503 141 1075 -962 269 1086 -983
2782 -983 -494 1251 -928 -486 1362 -412 -1059 1457 -165 -1103 1290 -125 -1229 944 84 -1496
2798 -1496 863 490 -1302 686 565 -1268 455 1052 -1284 257 1230 -1301 62 1182 -779 -382
2814 -382 1330 -737 -705 1497 -440 -656 1053 -443 -775 1171 339 -1256 1051 191 -1048 900 423
2831 423 -1071 390 769 -933 370 942 -845 293 1043 -1038 -152 983 -988 -621 987 -868
2847 -868 -778 1023 -423 -606 1391 -15 -889 1141 154 -1005 762 334 -1180 678 647 -1062 405
2864 405 560 -831 355 659 -1121 106 1043 -931 -379 957 -862 -370 1000 -596 -485 1172 -175
2881 -175 -843 1044 -111 -622 922 55 -1054 760 455 -1063 706 191 -1028 655 685 -874 61
2898 61 649 -1107 286 687 -991 -66 1016 -822 -240 1264 -628 -166 1202 -55 -483 1128 -6
2915 -6 -785 943 327 -823 598 68 -768 784 353 -996 521 609 -891 297 560 -947 138 971
2933 971 -635 -184 1058 -576 -477 1021 -301 -330 934 -155 -692 835 -77 -1176 878 121 -818
2950 -818 664 190 -993 813 376 -771 248 549 -814 47 1009 -1071 116 703 -702 -428 1005
2967 1005 -502 -308 654 -436 -442 913 -397 -729 1026 40 -765 799 -105 -970 599 455 -880 559
2985 559 465 -1086 527 689 -774 434 733 -651 193 766 -533 -355 612 -514 -296 929 -356
3002 -356 -413 817 -303 -550 522 -149 -437 829 -77 -694 771 17 -866 829 470 -1070 311 501
3020 501 -903 219 386 -713 -212 823 -699 -46 1101 -705 -433 639 -453 -457 828 -378 -754
3037 -754 545 -126 -704 660 97 -746 529 139 -838 305 451 -646 412 628 -897 124 540
3054 540 -507 73 562 -499 -159 743 -744 -342 573 -482 -646 575 -394 -482 899 -105 -872 480
3072 480 49 -441 666 76 -603 304 345 -649 209 606 -461 -119 497 -368 11 613 -582 -286 661
3091 661 -189 -218 352 -467 -312 620 -282 -667 609 -302 -650 861 223 -690 418 210 -731 424 171
3110 171 -657 87 427 -911 159 323 -599 -201 584 -105 -154 615 -360 -415 467 -518 -479 894 -376 -477
3130 -477 664 -133 -610 667 143 -609 341 302 -518 400 72 -562 430 444 -483 74 470 -390 -67 475
3150 475 -401 -148 633 -580 -280 512 -418 -333 268 -187 -416 557 38 -574 464 90 -488 476 131 -648
3170 -648 437 136 -542 210 257 -597 221 609 -388 3 321 -575 195 528 -485 -382 579 -138 -370 774
3190 774 -122 -355 599 -298 -596 278 -98 -463 493 73 -643 272 438 -512 -25 405 -660 -60 383 -571
3210 -571 -40 541 -45 -117 358 -242 -202 354 -430 -171 398 -211 -555 375 184 -405 492 -28 -308 280 280
3231 280 -559 78 323 -270 298 381 -509 152 337 -313 -165 353 -374 -150 849 -463 109 460 -545 -160
3251 -160 502 -19 -617 196 8 -435 399 142 -431 113 319 -680 135 308 -489 -26 338 -452 25 390
3271 390 -526 -33 412 -185 -115 606 -270 -137 823 -150 -324 458 -69 -291 311 -45 -646 345 59 -467
3291 -467 419 163 -486 312 230 -508 209 587 -314 18 461 -260 22 323 -458 141 618 -294 -233 500 -397
3312 -397 -187 348 -118 -303 331 -21 -410 491 103 -572 287 -36 -414 255 317 -467 84 219 -294 -54
3332 -54 338 -269 75 575 -431 -34 369 -399 -132 309 -166 -315 322 -260 -547 629 -33 -342 546 128
3352 128 -383 291 321 -424 440 342 -513 192 423 -127 128 522 -426 105 448 -553 -176 700 -133 -82 260
3373 260 -249 -300 381 95 -88 634 -86 -281 537 -126 -492 462 65 -337 301 429 -499 365 -9 -421
3393 -421 -34 265 -448 14 361 -402 133 345 -495 -156 573 -306 -202 97 128 -379 348 156 -307 184
3413 184 -211 -319 225 -4 -519 272 196 -547 66 54 -481 100 365 -407 -299 166 -511 93 552 -277 -51
3434 -51 283 -198 -468 486 -342 -328 190 3 -412 304 57 -484 140 253 -341 344 142 -490 -70 555 -288
3455 -288 -69 372 -194 -74 324 -176 6 406 -178 -228 414 -175 -379 571 -179 -416 449 274 -340 300
3475 300 199 -303 204 97 -461 439 148 -302 151 567 -328 134 372 -306 150 420 -163 -106 454 -184
3495 -184 -98 423 -251 -318 288 -120 -509 335 72 -386 415 -30 -565 492 -46 -644 248 266 -462 -143 188
3516 188 -318 197 455 -210 -80 567 -386 -337 480 -171 -64 569 -79 -182 514 -234 27 85 46 -510 411
3537 411 68 -606 328 346 -347 117 47 -401 94 395 -607 91 278 -538 2 373 -305 21 382 -236
3557 -236 -253 224 -196 -379 440 -265 -574 166 -133 -179 322 105 -286 317 18 -327 350 176 -303 54 382
3578 382 -295 195 379 -306 30 449 -296 244 228 -406 235 404 22 -168 397 -63 -384 220 -54 -469
3598 -469 386 -64 -284 288 296 -313 321 271 -444 283 92 -256 -40 129 -812 93 202 -339 -102 378 -380
3619 -380 -57 460 -231 20 489 -175 -432 232 84 -588 269 102 -279 302 143 -535 -106 310 -591 249
3639 249 480 -375 34 379 -408 -151 218 -192 -101 464 -197 89 305 -96 -177 389 10 -395 159 95 -305
3660 -305 597 169 -213 427 -120 -347 387 6 -192 250 311 -293 -203 498 -439 30 124 -340 -317 415 -170
3681 -170 -530 394 -369 -164 162 -293 -26 90 -14 -320 52 140 -199 156 197 -432 136 -11 -172 -86 117
3702 117 -523 -54 473 -181 44 569 -172 85 201 -183 -211 476 -114 -312 519 295 -331 223 -66 -418
3722 -418 153 -135 -418 262 164 -310 241 281 -410 212 242 -502 -98 291 -257 233 397 -465 -249 260 -38
3743 -38 -90 547 -443 -293 49 -126 -275 70 -138 -125 152 87 -358 235 114 -414 -28 241 -344 166 248 -149
3765 -149 4 246 -327 -54 258 -299 44 443 -163 -233 421 -222 -384 235 -266 -126 296 -92 -469 216
3785 216 92 -424 313 33 -207 284 150 -436 -34 256 -318 16 353 -308 311 358 -332 124 149 -245 -43
3806 -43 363 -302 -142 326 -292 -244 99 -80 -56 -95 63 -389 200 140 -581 42 53 -196 346 224 -354 173
3828 173 284 -230 -7 259 -431 -9 470 -156 -303 198 -54 71 476 -270 -128 303 51 -236 413 -255
3848 -255 -360 143 -60 33 233 147 -217 183 -64 -284 82 502 -399 97 367 -70 151 305 -439 -104 162
3869 162 -423 -128 204 57 -208 243 -234 -62 452 -236 -235 81 -113 -425 127 32 -542 77 126 -177 251
3890 251 91 -290 -276 206 -278 24 452 6 -395 282 -160 -274 246 -175 -341 30 -91 -178 175 147 -280
3911 -280 106 -160 -142 55 -99 -234 263 155 -340 196 371 -680 -186 146 -406 337 220 -157 95 235
3931 235 -334 -114 176 -286 -99 322 285 -397 43 34 -198 136 -38 -433 401 72 -420 71 276 -305 173
3952 173 323 -106 24 498 -223 -334 156 -18 -25 288 -114 -193 307 -143 -109 248 266 -93 392 242 -16 -27
3974 -27 195 -255 334 -21 30 30 13 -284 189 164 -147 -103 206 -140 -145 491 -283 -171 388 -464 -96 355 -61
3997 -61 -92 154 182 -180 359 245 -485 254 54 -115 177 187 -335 16 500 -406 67 300 -293 -163 310
4018 310 70 -175 83 -314 -182 313 -155 84 193 48 -404 72 23 -126 141 181 -258 265 2 -238 267
4039 267 193 -386 121 282 -152 -37 202 -213 17 191 -21 -100 464 -72 1 33 -57 -177 168 -47 -340 408
4061 408 191 63 62 180 -66 65 32 -296 91 369 -436 59 253 -40 -249 100 11 -141 456 -171 -139 210
4083 210 -7 -15 336 47 -51 -102 -304 -292 2 -55 -587 412 16 -320 147 316 -323 302 -22 -414 -69 202
4105 202 -301 -105 -74 -196 58 189 -172 -215 44 5 -181 337 79 167 293 -53 -354 189 -91 -272 106
4126 106 218 -74 214 209 -268 266 255 -178 -111 291 -203 125 157 -261 124 330 -72 -82 324 -360 36 204
4148 204 -38 -121 339 189 -246 118 69 -252 34 40 -272 352 -40 -465 186 53 -435 137 341 -82 229
4169 229 165 -196 -72 279 -108 101 364 -167 -44 134 3 -119 196 -340 -386 -29 -60 -406 149 252 -324
4190 -324 -62 -134 -144 36 247 -201 -210 271 -130 144 202 -87 74 245 -131 19 220 -253 150 203 -154 -27
4212 -27 38 -203 182 293 87 -175 83 -80 -348 -10 140 -346 91 213 -315 21 181 -116 -3 238 -201
4233 -201 -33 289 83 133 256 -23 -345 133 -258 123 309 -208 -248 401 39 -3 230 70 -21 73 131 -298
4255 -298 25 25 38 -63 149 -250 22 421 -145 -269 234 -235 -268 140 181 90 193 80 -198 108 -47 -415
4277 -415 288 63 -477 85 77 -256 172 -80 -71 174 -50 -98 100 271 -30 -175 169 -54 36 260 -396 253
4299 253 37 -57 -156 275 150 -247 344 203 170 81 4 -87 92 -2 -147 9 -153 -190 0 296 -148 217 204
4322 204 -248 137 117 -167 -164 221 -82 7 124 26 -295 44 -127 -114 83 140 -379 174 9 -346 -61 258
4344 258 27 242 230 -293 12 16 1 107 288 -261 52 212 -90 36 245 -144 -308 443 -305 -238 367 -175
4366 -175 -598 355 129 -266 149 -46 -251 100 70 -21 3 42 -47 138 365 -112 -54 192 -70 19 77 -149 -171
4389 -171 153 -294 -190 352 -85 -200 75 -51 -198 54 125 -179 245 64 -143 -15 247 -11 -58 274 -239
4410 -239 123 146 -73 377 213 -437 -23 219 -177 -74 281 -154 -89 332 5 -126 99 36 -50 329 146
4431 146 88 65 158 -77 160 108 27 -125 322 -77 -95 26 -116 102 26 96 14 195 -93 -61 140 -130 -68 165
4455 165 0 -92 -15 43 -196 314 54 -359 170 181 241 304 -221 -203 -182 77 -41 40 344 -328 -33 201 -234
4478 -234 -35 53 -169 137 39 59 -176 417 -281 238 316 -193 95 181 -72 179 297 276 -291 -99 277 -443
4500 -443 130 22 -353 111 231 -61 -127 62 -211 14 126 -118 10 211 -29 -107 301 -238 165 102 117
4521 117 -85 117 -5 -74 531 277 -269 117 247 17 -78 237 -299 274 80 -162 195 201 -232 -193 174 -295
4543 -295 64 257 -181 -126 -32 -324 -273 17 62 -259 104 61 75 308 130 -39 151 -95 -120 159 -7 -30 -173
4566 -173 55 -353 -163 69 -103 -64 -9 -46 44 194 -212 153 71 -5 -79 80 -115 -1 -13 258 -248 177 56
4589 56 -385 -26 -181 0 -92 150 -125 62 101 -328 109 2 -315 169 53 -218 -87 201 -428 53 172
4610 172 75 30 343 -91 -160 -125 -71 -126 36 -96 -135 168 116 -94 76 -71 -37 -68 116 15 113 234 -143 -28
4634 -28 116 -60 -72 257 -304 190 218 -207 19 208 -160 -47 87 102 50 -59 -134 -178 400 -10 109 118 -8
4657 -8 -255 41 -71 -359 107 135 -271 -156 31 -224 -343 -89 -104 -32 249 -270 -79 103 82 46 41 -8 -5 432
4681 432 -97 -61 76 22 -311 322 -27 -217 135 30 -306 -24 -16 69 -116 177 -170 89 270 -245 -97 127
4703 127 101 208 263 -92 -290 83 124 -114 304 93 -42 46 102 -173 59 76 -441 2 60 -235 -31 142
4725 142 -98 36 186 -356 348 319 -284 -40 205 -128 -49 44 -94 146 -160 95 71 141 -145 -227 145 -87
4747 -87 -85 185 41 -214 380 8 -88 -25 137 -64 36 73 -120 48 399 -248 -223 53 -7 -179 194 -98 3
4770 3 147 47 -268 344 390 2 139 138 -117 139 169 -23 81 22 -83 -108 67 -190 -93 149 -200 -61 68
4793 68 -142 120 46 108 37 147 432 -94 -14 19 41 88 -83 -255 266 201 -231 60 142 -156 -58 280 -350 77
4817 77 80 -198 -63 120 -421 32 393 -159 -179 231 -67 62 238 -136 -206 81 40 -34 106 44 -204 107 177
4840 177 -209 16 301 -239 14 284 -22 -90 11 65 -175 379 -250 106 375 115 70 314 -108 -213 220
4861 220 -131 -181 91 71 -13 161 115 -233 167 -62 -342 -69 -5 -130 303 28 -168 33 461 -458 -53 290
4883 290 137 -153 302 -68 -23 83 -333 147 50 -264 -314 161 356 29 204 159 -187 122 17 -116 218
4904 218 134 -1 183 195 -37 236 140 -138 -103 209 -108 -198 57 -56 34 407 -29 95 301 -262 -124 200
4926 200 22 -135 351 226 -163 189 49 -63 125 100 -85 -69 276 -107 -157 155 -95 -49 -8 -231 -94 180
4948 180 -35 -92 213 -182 -291 34 -170 -129 132 145 2 -292 218 -194 -26 -124 -237 53 141 -192 91 10
4970 10 -138 4 115 -193 -148 287 -225 4 371 -31 -186 25 -22 -160 158 -16 -152 96 -127 -12 -84
4991 -84 313 -245 42 379 -126 184 163 -176 199 148 -313 187 44 49 -54 265 -188 -235 85 -116 -226 202
5013 202 96 -271 351 -182 -244 278 -161 -215 176 -28 -215 78 149 -146 223 64 39 0 458 -119 -201 47
5035 47 -431 34 165 131 -154 91 -44 -184 181 53 143 157 239 -178 135 281 -321 12 220 -115 30 -35
5057 -35 -148 -179 111 -89 -181 238 -252 -121 287 -294 -122 201 72 0 -52 146 6 207 183 -476 232 106
5079 106 -517 150 37 -99 54 226 -149 -150 151 -139 -9 190 -19 -86 451 -204 -182 269 -18 -74 327 115
5101 115 6 487 20 -188 461 12 -294 81 -151 -137 42 381 1 30 218 -138 138 163 -409 268 242
5122 242 31 -39 96 185 143 226 46 -149 218 -28 -295 465 -172 -189 -52 98 -44 43 151 -202 162 116
5144 116 -98 -16 347 4 14 107 9 92 246 77 -59 243 -188 -87 323 50 -376 159 -140 -150 209 56
5166 56 -145 445 130 -190 59 22 8 57 220 -149 193 430 -135 -346 139 -115 222 422 75 -176 -15
5187 -15 41 -162 248 -56 -209 165 -114 -237 -1 76 -106 88 123 -252 -39 26 -73 -37 270 -219 22 351
5209 351 -209 -114 116 -35 -74 535 8 -44 35 -104 -89 17 -53 -8 274 -126 -338 10 59 -5 131 321 -160
5232 -160 109 232 -368 -51 176 -87 -87 267 -233 -100 83 -252 -98 11 -429 -208 104 10 129 185 58
5253 58 -137 226 201 129 273 -74 -113 141 -12 -268 106 208 -264 -68 71 -176 82 171 91 -91 316 79
5275 79 -142 -42 -329 -279 421 -140 -119 117 -212 -252 127 112 118 105 129 -96 27 218 -76 0 113 -193 -49
5298 -49 156 -171 252 305 -343 -82 88 -166 -290 99 123 -100 109 53 -96 287 -6 -135 336 3 -370
5319 -370 -207 254 -246 -299 290 222 -32 96 27 144 408 10 320 195 115 -259 -3 -121 -225 219 -252
5340 -252 -163 59 5 134 118 -106 -142 178 240 -327 -43 252 -214 -126 -116 -58 38 28 -47 -160 118 -116 -301 110
5364 110 -116 -4 360 -130 -168 86 -87 -137 32 6 -448 114 196 -296 28 162 -64 272 53 28 -43 38
5386 38 -261 213 -102 -352 152 234 -30 182 126 27 -117 230 -89 -169 80 39 34 338 -27 -341 196 46 -336
5409 -336 206 39 -304 191 229 123 -8 -43 -123 97 57 -234 -35 135 -374 102 260 -123 -60 55 -22 -54
5431 -54 -26 -184 -166 363 16 -163 122 81 -82 170 130 -58 142 40 -166 63 144 -221 -30 212 -217 -216 142
5454 142 -146 -2 10 -141 -178 -113 -59 101 50 -67 16 103 -133 -3 -144 243 -139 150 -18 -403 274 -5
5476 -5 -90 82 -88 -199 -65 288 -153 13 189 37 135 159 -194 44 288 -249 269 215 -35 -45 59 -84
5498 -84 -30 70 283 -164 84 133 -445 134 111 -355 88 78 180 47 80 -166 -14 149 -228 33 260 -215
5520 -215 226 129 -46 -11 207 120 -141 198 10 -443 235 -21 -237 197 260 -520 -145 66 -189 381 224
5541 224 -296 168 142 -191 167 220 -1 -143 141 -277 -307 158 -317 -133 227 176 -221 413 181 -108 145
5562 145 9 -364 61 -27 -155 285 222 -154 -98 186 -200 -135 241 -56 62 210 -222 -40 295 91 -115
5583 -115 86 -260 272 301 -123 -75 42 184 -253 142 -85 -45 -109 237 -442 66 -89 -388 -29 23 -187 -329
5605 -329 183 -90 -196 91 -112 72 315 -152 90 121 -150 -317 207 -86 5 344 3 -122 326 116 -185
5626 -185 -71 170 35 -252 175 -276 240 127 -72 343 -72 -43 -261 346 95 -180 180 -166 -43 188
5646 188 -8 -234 249 -147 -10 56 -113 -210 124 -37 -159 27 108 -125 141 236 53 255 232 -411 211 318
5668 318 -334 329 -51 -326 -120 248 10 -408 209 -344 -175 -146 15 -176 141 148 -137 178 318 -177 -67
5689 -67 104 -389 -3 306 -4 76 148 -189 -65 33 61 13 451 -193 194 206 7 118 254 -68 -169 237
5711 237 -208 -224 255 121 -128 282 -46 -69 -20 -78 -150 61 97 -194 227 24 -157 53 521 -252 -298 238
5733 238 -64 60 203 192 -236 330 -14 -325 61 30 -177 59 116 -280 224 95 -129 -115 194 -325 -44
5754 -44 256 -307 -119 121 -16 192 159 -70 -336 390 24 -2 415 -111 -162 122 -137 -158 197 58 -343 -100
5776 -100 -71 -310 56 206 -253 -99 73 -215 156 215 -92 -106 26 -102 -218 43 -281 31 52 124 -243 346
5798 346 -46 -466 211 -2 -297 131 -50 -324 298 79 -44 -8 226 -299 78 -91 -222 117 353 -89
5818 -89 50 129 -218 -7 111 91 -205 305 305 59 251 -46 -185 507 83 -96 269 134 -234 243 -2 -225
5840 -225 152 153 -309 202 95 -196 139 44 -249 -185 225 -162 -226 424 -234 -180 122 -167 -138 -20 -116 -92 310
5863 310 209 -31 250 252 -277 40 -89 -405 -32 327 -242 127 55 -115 -151 242 -251 -163 313 -47 -104 272
5885 272 79 -179 382 -399 -170 93 169 -232 84 -76 -272 216 61 -257 236 -21 -390 150 538 -3
5905 -3 478 74 -148 75 142 -79 -137 263 -88 -133 365 -72 -176 356 141 -142 166 -177 -325 240 351 59
5927 59 176 103 -179 165 229 -460 56 36 -293 -8 141 -168 49 139 13 138 454 -74 -304 255 -7 -7
5949 -7 108 -73 -66 115 60 -97 164 -7 -348 491 161 -197 -47 117 -46 86 401 -187 -24 129 -83 -228
5971 -228 74 -120 216 383 -14 -302 191 -12 -248 259 74 -230 304 -31 21 224 148 -351 431 135 -231
5992 -231 -46 156 -406 253 107 -467 -71 367 -111 14 515 -7 -68 103 -34 -201 559 -151 -341 260
6012 260 160 -137 322 51 -359 248 175 -288 205 428 -182 146 218 -234 -24 132 -146 -128 170 -108 -119
6033 -119 141 -218 -367 318 52 -42 129 36 100 33 -211 -176 368 86 -173 317 74 -252 251 380 -259 -42
6055 -42 129 10 160 324 -352 482 202 -61 -266 176 -279 -145 89 271 -176 145 -66 -163 288 103 -174
6076 -174 131 -198 -452 106 108 61 393 373 -208 -236 244 -316 -18 57 -232 84 473 -74 115 199 -143 -120 538
6099 538 -200 -344 51 153 -317 277 -4 -303 146 125 -251 319 131 -275 211 208 -309 12 228 -267 153
6120 153 379 -161 -179 346 -148 -22 225 52 -109 181 29 -333 327 41 -147 152 -25 -6 14 218 -242
6141 -242 -43 254 -139 202 385 -366 92 394 -385 -76 397 -176 -7 494 -15 -95 293 33 -398 415
6161 415 70 -504 83 -242 -272 146 73 -69 353 116 -513 60 159 -390 80 362 -344 -138 -32 -57 -183
6182 -183 332 -378 -226 349 -162 -7 185 55 -187 410 4 -152 334 -5 -553 272 64 -256 236 320
6202 320 -26 25 -62 -184 54 227 -52 -50 266 -21 -108 489 -296 -235 38 18 -108 358 -97 -3 404 -265 -256
6225 -256 -28 0 -365 216 435 -256 114 135 -147 372 482 -285 175 172 -175 104 454 57 -129 271 -344
6246 -344 -119 421 27 -231 200 -44 -12 318 -96 -147 135 -82 -423 345 -79 -216 260 297 -354 75 606
6267 606 -285 -73 429 -233 177 334 -221 134 223 -23 -9 320 261 -173 263 62 -223 285 74 -129 133
6288 133 262 -194 99 89 -217 -33 84 -327 124 438 -150 -50 137 -44 -207 271 -60 -273 349 52
6308 52 -9 128 -61 -188 453 -255 -323 186 213 -332 54 117 -295 136 96 -439 14 152 -40 -193 220 -67
6330 -67 -141 -173 -289 -88 322 -161 -30 214 -270 -412 -47 48 -265 371 264 -117 305 60 -537 91 146 -65
6352 -65 -2 348 -200 -54 160 -63 99 88 -79 -189 350 -196 -40 252 -69 7 255 -108 -193 312 132 -5
6374 -5 335 -177 -374 123 60 -312 86 316 -228 -9 475 -376 88 376 -276 -75 326 -17 116 352 -210
6395 -210 -320 372 -53 -276 426 13 -627 489 -3 -67 420 160 -176 185 18 -246 160 42 -401 221
6415 221 296 -231 275 388 -292 -59 119 -80 -345 177 18 -103 408 -103 -161 138 -93 -306 262 89 -491
6436 -491 130 175 -186 62 235 -353 262 265 -376 16 196 175 86 18 -363 14 303 -204 17 156 -42 -342
6458 -342 468 5 -587 172 -287 5 326 197 -264 244 19 -278 218 117 -206 241 301 -157 221 206 -82
6479 -82 -180 226 -251 -252 13 -179 -199 366 -312 -381 344 -196 32 138 -150 -306 203 131 -148 364 -44 -408
6501 -408 35 83 -7 -98 -44 -235 136 81 -288 -81 47 -176 -85 142 -477 -279 262 108 -143 156 1 29
6523 29 135 -130 -67 219 124 -202 263 197 -75 235 71 -98 273 318 -204 123 187 -190 35 -24 -207 -80
6545 -80 284 -241 -25 340 -176 -200 364 7 -234 242 235 -229 106 139 -260 374 -95 -266 65 88 -284 -44
6567 -44 364 -262 38 244 -212 -41 407 -226 -253 472 -156 231 468 -169 -365 377 198 -315 183 -123 -63
6588 -63 414 -116 -226 120 193 -260 192 36 -292 329 116 -219 11 438 -301 -89 137 -128 103 428 -302
6609 -302 -53 201 31 -301 23 55 -117 83 -25 -73 320 -225 -239 40 140 -531 377 292 -311 305 134
6630 134 -242 215 23 -217 -79 155 -63 -25 269 -42 26 269 -286 -159 328 -54 -434 443 278 152 157
6651 157 -227 -392 288 237 -466 210 287 -205 160 235 -66 -262 402 -245 -65 517 59 54 143 -126 -394 338
6673 338 -153 -74 255 -204 -427 403 -33 -455 125 94 -33 275 12 -40 84 17 -33 58 156 -83 281 390
6695 390 -125 -268 313 -94 -157 84 22 -177 496 307 -373 330 58 -59 439 -113 -672 317 436 -260 276
6716 276 -90 -276 173 200 -217 26 144 -418 11 184 -131 -67 363 -135 -309 374 57 -178 275 63 -174
6737 -174 315 -23 -280 313 137 -71 92 140 -277 12 32 -209 -29 203 -242 -136 370 -388 13 288 -375
6758 -375 -159 291 -377 -21 99 -237 -176 366 -115 -290 193 143 -633 157 -146 -515 70 181 -236 77 334
6779 334 -494 237 -72 -315 123 250 -118 50 391 -390 -220 36 -144 -202 213 -147 -49 122 -84 -69 220
6800 220 140 -176 426 520 -183 -165 67 -27 96 23 -332 -120 164 -219 -51 296 -27 75 190 -287 101 393
6822 393 -202 27 253 -317 -371 168 -151 -21 410 62 -33 272 103 -417 307 351 -282 290 -26 -366 83
6843 83 508 -195 158 145 -71 -132 124 -88 -28 466 -163 -237 397 -42 -347 213 22 -190 374 183 -508 119
6865 119 49 -391 74 229 -405 208 91 -365 29 233 -320 -123 217 -257 -208 250 -251 -25 123 -202 -195
6886 -195 86 298 -174 211 -93 -287 215 71 -51 -55 1 -205 240 104 -356 148 -76 -105 -57 391 -110 -125
6908 -125 440 -118 -41 430 -172 -98 132 -74 -51 110 -97 -176 158 -347 -228 284 351 -241 -10 172 -386 218
6930 218 116 -254 361 255 -200 -20 72 -158 -95 304 -20 -49 516 -483 -219 328 -335 -275 268 -337 -311 287
6952 287 86 -176 238 89 -340 13 163 -451 165 -41 -400 64 147 -161 71 364 -330 -166 97 -213
6972 -213 -171 413 -249 -30 320 -106 -139 136 -190 -76 406 -6 -280 257 -58 -383 128 290 -426 154 104
6993 104 -579 70 316 -465 -135 1 -162 14 402 -113 -315 97 -122 -177 527 -137 -237 375 -50 -21 256
7014 256 -124 -257 370 139 -298 -57 -51 -118 -129 194 -449 17 155 -250 31 474 -159 -332 191 -265 -35
7035 -35 362 -35 -256 161 -45 -197 299 44 -247 229 -113 -345 491 234 -295 -140 79 -106 -80 174 -208
7056 -208 113 342 -175 -73 225 -370 -224 460 3 -121 380 158 -477 415 -149 -313 387 -184 -443 345
7076 345 -34 -346 325 -5 -358 124 430 -566 178 175 -370 61 153 -183 191 292 -241 56 313 -493 -290
7097 -290 407 -71 -106 433 -136 -387 277 -71 -133 233 61 -278 283 383 -53 54 351 -291 8 212 -260
7118 -260 153 145 -466 -161 384 -265 -216 286 31 -135 188 126 -346 419 46 -135 478 -1 -244 261 11
7139 11 -306 94 278 -322 -123 317 -108 -168 193 -191 245 327 -267 -25 157 -372 -182 487 -231 -282 -6
7160 -6 26 -457 321 69 -238 6 -4 -524 259 23 -373 94 231 -271 172 332 -175 -13 307 -230 10
7181 10 315 -260 -213 263 -86 -45 174 -27 -343 209 -79 -247 198 5 -478 255 121 -313 136 -22 -383
7202 -383 358 141 -198 83 265 -97 127 290 -137 63 412 -158 -34 298 70 -200 -7 -374 -396 544
7222 544 -269 -155 280 -7 -276 249 363 -156 294 382 -138 -205 145 -395 52 119 -437 -221 397 -119 -23
7243 -23 542 -152 -85 419 52 -58 196 -345 12 416 213 -201 309 -160 -41 261 -20 -125 377 424 -257
7264 -257 6 378 -217 192 346 -369 75 245 -279 -229 193 -329 179 225 29 -132 246 -116 -334 530 -41
7285 -41 -411 196 144 -339 324 113 -368 190 416 -259 418 186 192 114 314 -204 -239 251 -344 -159 -50 -75
7307 -75 -466 209 54 -195 410 -125 -305 334 169 -142 101 514 -352 -51 126 -412 303 125 -456 125
7327 125 558 -454 121 356 -453 69 426 -87 75 173 -163 -185 156 168 -393 246 -57 -371 305 -38 -224
7348 -224 207 45 -59 136 476 -286 -358 199 -271 -217 188 -412 33 411 -154 -85 336 -11 -99 31 -192
7369 -192 -182 169 45 -224 173 180 -122 209 167 -208 341 267 -334 251 251 -281 -34 352 -543 -5 242 -196
7391 -196 27 79 -61 126 326 -223 -240 308 117 -220 197 196 -351 12 -12 -204 333 125 -409 128 79 -277
7413 -277 30 308 -297 -72 45 -185 -45 255 -175 -37 371 -223 -152 193 21 -65 419 -152 -403 254 227
7434 227 -354 63 -1 -488 3 418 -200 173 349 -375 65 363 -318 -99 188 -308 -68 306 -334 -116
7454 -116 556 -385 -220 455 -31 -446 166 -245 -191 249 -106 -316 232 102 -470 377 -35 -278 224 199 -367
7475 -367 125 256 -81 117 354 -150 -167 99 -132 107 29 10 -252 504 -403 -261 132 51 -183 256 227 -242
7497 -242 149 -168 -410 366 197 -46 324 20 -261 177 269 23 290 463 -97 -232 219 -225 22 155
7517 155 -91 -161 182 -217 -115 258 156 -257 344 59 -283 43 20 -209 102 325 -261 62 38 -136 171
7538 171 267 -82 -78 405 31 39 136 -104 -26 176 -117 -194 469 97 -170 595 148 -501 58 -138 -425 424 263
7561 263 -391 125 76 -505 219 189 -351 22 -23 -149 37 135 -111 0 77 10 -208 225 -90 -296 125 -100
7583 -100 -91 233 35 83 221 -3 -361 341 170 110 20 227 -297 264 547 -89 207 197 -156 164 264 -178
7605 -178 -67 73 62 -301 164 -206 -328 165 -105 -388 38 -103 -257 175 20 17 -22 380 -128 -43 157 -123
7627 -123 -60 184 -237 62 243 -242 -122 260 -344 -3 206 -290 -243 42 201 -491 333 -204 -282 12 -63
7648 -63 -274 131 21 -236 150 236 -11 146 226 -90 -36 248 -179 67 467 -48 -87 184 -23 -334 176 -100
7670 -100 -307 130 -41 -289 17 -114 -399 82 301 -316 258 57 -223 342 287 -470 249 201 -359 36 286
7691 286 -397 74 235 74 -4 122 -190 -77 268 -21 -21 34 -67 -27 110 -3 -441 291 -31 -122 65 -88
7713 -88 -440 81 -85 -410 129 182 -15 214 239 -256 168 271 21 16 110 -166 -249 -66 -194 -404 119 4
7735 4 -162 179 1 -155 140 -55 -182 3 227 -386 94 -35 -102 -58 -65 -274 -49 244 -119 -67 151 77 -118
7758 -118 6 118 -321 210 -10 -262 381 -185 -271 241 206 -235 231 140 -322 131 289 -225 -11 269 -291
7779 -291 55 43 -246 -282 220 -148 36 234 18 -211 406 -174 -75 242 349 22 -32 -67 -81 128 5 -325
7801 -325 27 225 -254 300 134 -320 -72 317 -177 101 310 -264 39 232 -131 -261 -181 -96 -59 124 -62
7822 -62 -231 312 -105 -105 178 278 -239 437 82 -6 95 225 -287 -79 28 -148 -345 186 133 40 247 -142
7844 -142 154 116 -137 -56 -103 -87 -269 85 136 -28 9 30 -114 26 23 -126 160 -255 -176 50 167 -173 -158 295
7868 295 -93 -168 291 -68 -137 148 -193 -274 277 -72 3 216 12 -25 60 98 -46 60 145 -299 -21 132 86
7891 86 101 -99 -69 277 260 -168 94 196 -209 -367 64 -279 0 206 -55 -291 132 189 67 178 -39 -63
7913 -63 80 -4 -132 95 -119 -11 261 17 -119 65 136 -323 2 362 -240 -33 177 -343 -82 228 229 92
7935 92 409 -85 -23 -48 -70 -203 199 -78 -81 226 -189 -87 54 69 -315 269 82 -98 162 204 -129 -137 370
7958 370 -187 91 188 -113 -143 180 11 45 -41 -8 -52 267 -212 -63 507 -17 -8 -30 43 -262 189 68 -22 75
7982 75 -31 -212 -51 38 -308 -26 79 -196 100 409 -384 -22 309 4 -201 202 100 -30 -11 -77 -321
8003 -321 201 169 54 22 0 -219 223 267 -330 -102 173 41 -115 206 -376 162 87 -246 101 51 -130 14
8025 14 -31 201 -251 181 50 -121 295 43 -16 245 9 -216 -83 -1 -372 60 158 -102 267 11 -287 -30
8047 -30 289 -311 -125 347 -155 233 328 -31 -261 176 264 -65 182 119 -308 192 303 -452 -74 252 -72
8068 -72 179 -40 -97 -144 187 144 107 37 -157 -42 181 -129 -81 323 206 203 168 -206 -348 154 -252 -116 198
8091 198 89 -326 -9 120 -186 116 338 -207 179 77 -39 152 240 -350 -56 223 -61 -98 139 63 -140
8112 -140 213 -203 -292 120 102 -229 314 -28 -296 -44 -100 -67 138 259 -100 323 18 -74 119 60 -250 84
8134 84 -58 -185 12 221 -270 120 148 -328 72 190 114 -109 316 -17 -148 213 11 -147 122 210 -105
8155 -105 40 291 -251 -42 214 -22 -9 202 -58 -46 208 -306 123 288 -151 50 135 -92 122 47 -306
8176 -306 -262 -160 29 -11 112 -80 -209 134 93 -394 78 108 -237 198 -27
8191b7
##END NTUPLES=NMR FID
##END=
