##TITLE=1H_Pr 4892
 CDCl3, 8 sc, 
 7.2.2019
##JCAMPDX= 6.0         $$ Bruker NMR JCAMP-DX V2.0
##DATA TYPE= NMR FID
##DATA CLASS= NTUPLES
##ORIGIN= UXNMR, Bruker Analytische Messtechnik GmbH
##OWNER= root
$$ XWIN-NMR		Version 3.5
$$ Thu Feb  7 15:56:07 2019 Russian Standard Time (UT+4h)  she@DPX200
##.OBSERVE FREQUENCY= 200.1313
##.OBSERVE NUCLEUS= ^1H
##.DELAY= (6, 6)
##.ACQUISITION MODE= SIMULTANEOUS
##.ACQUISITION SCHEME= undefined
##.AVERAGES= 8
##.DIGITISER RES= 18
##SPECTROMETER/DATA SYSTEM= spect
##.PULSE SEQUENCE= zg30
##.SOLVENT NAME= CDCl3
##.SHIFT REFERENCE= (INTERNAL, CDCl3, 0, 15.7039)
##AUDIT TRAIL= $$ (NUMBER, WHEN, WHO, WHERE, WHAT)
$$ ##TITLE= Audit trail, XWIN-NMR		Version 3.5
$$ ##JCAMPDX= 5.01
$$ ##ORIGIN= Bruker BioSpin GmbH
$$ ##OWNER= she
$$ F:/spectra/data/she/nmr/H-F/1/audita.txt
$$ ##AUDIT TRAIL=  $$ (NUMBER, WHEN, WHO, WHERE, WHAT)
(   1,<2019-02-07 15:55:18.98 +0400>,<she>,<DPX200>,
      <created by zg, POWCHK disabled, PULCHK disabled
       configuration hash MD5:
       00 E9 B6 7A A2 85 ED C7 34 08 36 98 17 FE 4E 26
       data hash MD5: 16K
       A7 44 2F E3 82 D6 C9 DA 0C 86 60 00 7E 5B E2 25>)
$$ ##END=
$$ 
$$ hash MD5
$$ 2A 4C 81 44 A2 6A 8C E5 54 B8 4E 9C F9 A8 A5 5A
##$RELAX= 
##$RELAX= 
##$RELAX= 
##$RELAX= 
##$RELAX= 
##$RELAX= 
$$ Bruker specific parameters
$$ --------------------------
##$DU= <F:/spectra>
##$EXPNO= 1
##$NAME= <H-F>
##$PROCNO= 1
##$TYPE= <nmr>
##$USER= <she>
##$AMP= (0..31)
100 100 100 100 100 100 100 100 100 100 100 100 100 100 100 100 100 100 
100 100 100 100 100 100 100 100 100 100 100 100 100 100 
##$AQSEQ= 0
##$AQ_mod= 1
##$AUNM= <au_zg>
##$AUTOPOS= <>
##$BF1= 200.13
##$BF2= 200.13
##$BF3= 200.13
##$BF4= 200.13
##$BF5= 200.13
##$BF6= 200.13
##$BF7= 200.13
##$BF8= 200.13
##$BYTORDA= 1
##$CFDGTYP= 0
##$CFRGTYP= 5
##$CHEMSTR= <none>
##$CNST= (0..31)
1 1 145 1 1 1 1 1 1 1 1 1 1 1 1 1 1 1 1 1 1 1 1 1 1 1 1 1 1 1 1 1 
##$CPDPRG= <>
##$CPDPRG1= <>
##$CPDPRG2= <>
##$CPDPRG3= <>
##$CPDPRG4= <mlev>
##$CPDPRG5= <mlev>
##$CPDPRG6= <mlev>
##$CPDPRG7= <mlev>
##$CPDPRG8= <mlev>
##$CPDPRGB= <>
##$CPDPRGT= <>
##$D= (0..31)
0 1.2 0 0 0 0 0 0 0 0 0 0.03 0 0 0 0 0 0 0 0 0 0 0 0 0 0 0 0 0 0 0 0 
##$DATE= 1549540518
##$DBL= (0..7)
120 120 120 120 120 120 120 120 
##$DBP= (0..7)
150 150 150 150 150 150 150 150 
##$DBP07= 0
##$DBPNAM0= <>
##$DBPNAM1= <>
##$DBPNAM2= <>
##$DBPNAM3= <>
##$DBPNAM4= <>
##$DBPNAM5= <>
##$DBPNAM6= <>
##$DBPNAM7= <>
##$DBPOAL= (0..7)
0.5 0.5 0.5 0.5 0.5 0.5 0.5 0.5 
##$DBPOFFS= (0..7)
0 0 0 0 0 0 0 0 
##$DE= 6
##$DECBNUC= <off>
##$DECIM= 32
##$DECNUC= <off>
##$DECSTAT= 4
##$DIGMOD= 1
##$DIGTYP= 9
##$DL= (0..7)
0 120 120 120 120 120 120 120 
##$DP= (0..7)
150 150 150 150 150 150 150 150 
##$DP07= 0
##$DPNAME0= <>
##$DPNAME1= <>
##$DPNAME2= <>
##$DPNAME3= <>
##$DPNAME4= <>
##$DPNAME5= <>
##$DPNAME6= <>
##$DPNAME7= <>
##$DPOAL= (0..7)
0.5 0.5 0.5 0.5 0.5 0.5 0.5 0.5 
##$DPOFFS= (0..7)
0 0 0 0 0 0 0 0 
##$DQDMODE= 0
##$DR= 18
##$DS= 0
##$DSLIST= <SSSSSSSSSSSSSSS>
##$DSPFIRM= 0
$$ [...]
##$SUBNAM2= <"">
##$SUBNAM3= <"">
##$SUBNAM4= <"">
##$SUBNAM5= <"">
##$SUBNAM6= <"">
##$SUBNAM7= <"">
##$SUBNAM8= <"">
##$SUBNAM9= <"">
##$SW= 20.0189088683792
##$SWIBOX= (0..15)
0 0 2 0 0 0 0 0 0 0 0 0 0 0 0 0 
##$SW_h= 4006.41025641026
##$TD= 16384
##$TD0= 1
##$TE= 0
##$TE2= 300
##$TE3= 300
##$TEG= 300
##$TL= (0..7)
0 120 120 120 120 120 120 120 
##$TP= (0..7)
150 150 150 150 150 150 150 150 
##$TP07= 0
##$TPNAME0= <>
##$TPNAME1= <>
##$TPNAME2= <>
##$TPNAME3= <>
##$TPNAME4= <>
##$TPNAME5= <>
##$TPNAME6= <>
##$TPNAME7= <>
##$TPOAL= (0..7)
0.5 0.5 0.5 0.5 0.5 0.5 0.5 0.5 
##$TPOFFS= (0..7)
0 0 0 0 0 0 0 0 
##$TUNHIN= 0
##$TUNHOUT= 0
##$TUNXOUT= 0
##$USERA1= <user>
##$USERA2= <user>
##$USERA3= <user>
##$USERA4= <user>
##$USERA5= <user>
##$V9= 5
##$VALIST= <valist>
##$VCLIST= <CCCCCCCCCCCCCCC>
##$VD= 0
##$VDLIST= <DDDDDDDDDDDDDDD>
##$VPLIST= <PPPPPPPPPPPPPPP>
##$VTLIST= <TTTTTTTTTTTTTTT>
##$WBST= 1024
##$WBSW= 4
##$XGAIN= (0..3)
0 0 0 0 
##$XL= 0
##$YL= 0
##$YMAX_a= 182723
##$YMIN_a= -169085
##$ZGOPTNS= <>
##$ZL1= 120
##$ZL2= 120
##$ZL3= 120
##$ZL4= 120
##$ABSF1= 10
##$ABSF2= 0
##$ABSG= 5
##$ABSL= 3
##$ALPHA= 0
##$AQORDER= 0
##$ASSFAC= 0
##$ASSFACI= 0
##$ASSFACX= 0
##$ASSWID= 0
##$AUNMP= <proc_1d>
##$AZFE= 0.1
##$AZFW= 0.1
##$BCFW= 1
##$BC_mod= 2
##$BYTORDP= 1
##$COROFFS= 0
##$CY= 11.3945322036743
##$DATMOD= 1
##$DC= 2
##$DFILT= <>
##$DTYPP= 0
##$F1P= 18.9103706918063
##$F2P= -1.10871071338519
##$FCOR= 0.5
##$FTSIZE= 0
##$FT_mod= 4
##$GAMMA= 1
##$GB= 0.15
##$INTBC= 1
##$INTSCL= 1
##$ISEN= 128
##$LB= 0.24
##$LEV0= 0
##$LPBIN= 0
##$MAXI= 10000
##$MC2= 0
##$MEAN= 0
##$ME_mod= 0
##$MI= 1.114404
##$NCOEF= 0
##$NC_proc= 0
##$NLEV= 6
##$NOISF1= 3.799351
##$NOISF2= 2.8
##$NSP= 1
##$NTH_PI= 0
##$NZP= 0
##$OFFSET= 15.70392
##$PC= 1
##$PHC0= -8675.355
##$PHC1= 9.000189
##$PH_mod= 1
##$PKNL= yes
##$PPARMOD= 0
##$PSCAL= 0
##$PSIGN= 0
##$REVERSE= no
##$SF= 200.130013532006
##$SI= 16384
##$SIGF1= 3
##$SIGF2= 2
##$SINO= 400
##$SIOLD= 16384
##$SREGLST= <1H.CDCl3>
##$SSB= 0
##$STSI= 0
##$STSR= 0
##$SW_p= 3612.71676300578
##$SYMM= 0
##$S_DEV= 0
##$TDeff= 0
##$TDoff= 0
##$TI= <>
##$TILT= no
##$TM1= 0
##$TM2= 0
##$TOPLEV= 0
##$USERP1= <user>
##$USERP2= <user>
##$USERP3= <user>
##$USERP4= <user>
##$USERP5= <user>
##$WDW= 1
##$XDIM= 8192
##$YMAX_p= 0
##$YMIN_p= 0
$$ End of Bruker specific parameters
$$ ---------------------------------
##NTUPLES= NMR FID
##VAR_NAME=  TIME,          FID/REAL,        FID/IMAG
##SYMBOL=    X,             R,               I
##VAR_TYPE=  INDEPENDENT,   DEPENDENT,       DEPENDENT
##VAR_FORM=  AFFN,          ASDF,            ASDF
##VAR_DIM=   8192,          8192,            8192
##UNITS=     SECONDS,       ARBITRARY UNITS, ARBITRARY UNITS
##FACTOR=    0.0002496,     1,               1
##FIRST=     0,             0,               0
##LAST=      2.0444736,     0,               0
##MIN=       0,             -169085,         0
##MAX=       2.0444736,     182723,          0
$$ Real data points
##PAGE= N=1
##DATA TABLE= (X++(R..R)), XYDATA
0 0 0 0 0 0 0 0 0 0 0 0 0 0 -7 8 -8 8 -9 16 -17 23 -25 32 -35 42 -50 59 -68 77 -91 104 -119 136 -157 175
34 175 -199 225 -253 285 -318 352 -392 437 -484 537 -595 656 -724 800 -882 970 -1068 1177
52 1177 -1297 1430 -1581 1749 -1940 2158 -2412 2709 -3064 3497 -4038 4737 -5677 7019 -9098
67 -9098 12783 -21324 86430 -14133 -36799 165096 -1082 11494 106540 -82840 -79738 135631
79 135631 -59727 -169085 30706 -26394 -103502 68869 -38161 -133096 107863 76477 -116221
90 -116221 49657 83678 -55672 77905 66805 -135611 25751 120648 -99800 -42542 79233
101 79233 -65754 4224 104482 -95848 -42170 160780 -9079 -68922 93361 -14379 -52037
112 -52037 96378 -56226 -137580 83492 7790 -147876 14798 2940 -102352 66848 41642
123 41642 -113200 76367 130119 -63966 36861 110098 -47856 46915 111589 -97643 -29883
134 -29883 108538 -80258 -85365 55300 -78971 -67951 85972 -70509 -102626 107391 11227
145 11227 -83646 82095 23259 -57855 104600 24782 -114499 71803 73240 -101299 15805
156 15805 48852 -85438 36336 65516 -111848 9888 121627 -59874 -25508 88026 -48990
167 -48990 -13368 93893 -78279 -72404 99674 -34902 -100188 49093 -31972 -73152 85724
178 85724 -12067 -101842 92384 64099 -72696 57634 54172 -54789 83068 65047 -111474
189 -111474 20999 92003 -83855 -29532 42087 -86194 -3679 76357 -106628 -57222 109782
200 109782 -25606 -54207 72834 -25678 -26268 111986 -28428 -92423 94588 31496 -82089
211 -82089 42629 2226 -76196 75203 29014 -114679 39828 81292 -65078 17109 49563
222 49563 -72349 37555 86920 -94562 -31779 88526 -47312 -40836 46034 -71731 -31940
233 -31940 97369 -51422 -84656 84020 14517 -47640 65048 -7192 -48192 106014 26367
244 26367 -97964 50173 55764 -64098 26052 16128 -90218 38827 57950 -106915 -17506
255 -17506 71336 -52753 -7059 54804 -70972 -4759 102822 -49480 -53438 82935 -9391
266 -9391 -33646 68168 -36355 -56814 95818 3611 -89252 50595 25650 -57132 48901
277 48901 5493 -85487 58819 54866 -92618 3974 55277 -55834 12670 43261 -80009
288 -80009 7967 88413 -60956 -36399 72906 -25793 -18144 67882 -44179 -38970 90890 -14287
300 -14287 -71190 55555 3524 -51399 54654 -8730 -77917 60179 32888 -82194 23271
311 23271 39771 -54019 32905 36552 -77834 23444 76161 -62344 -16623 61930 -38957
322 -38957 -4711 58011 -61286 -26285 86579 -30815 -58584 57075 -11282 -40099 57419
333 57419 -24570 -63145 72408 15167 -76853 36989 27145 -51047 43975 23610 -71869 41079
345 41079 60885 -66394 1746 52331 -46051 9211 48950 -70116 -14621 73653 -45353
356 -45353 -45113 49804 -26892 -24224 59859 -37841 -50402 78097 8112 -58945 43774 13845
368 13845 -36197 55632 5021 -71742 49142 46606 -66077 6825 32679 -48029 22971 35505
380 35505 -74514 2071 69694 -45877 -26537 44673 -35892 -8387 59023 -49041 -41918 71720
392 71720 -7780 -48312 42406 -7723 -30387 67201 -2174 -64161 56892 38260 -50539 24856
404 24856 18725 -48378 39720 27633 -82617 2986 50942 -53839 -17261 28225 -50476 3349
416 3349 56593 -54391 -25713 73794 -8964 -23784 52026 -14448 -17635 70708 -12808 -56156
428 -56156 52338 13703 -50616 25779 -3325 -55038 40314 17213 -72711 16490 41066 -44873
440 -44873 8880 29030 -48520 19519 54472 -53503 -15338 57591 -25803 -17932 41015 -34317
452 -34317 -15206 63682 -24900 -44468 56359 5460 -34930 41387 -3819 -39369 51918 7115
464 7115 -65333 26933 24117 -53047 12395 13800 -56992 19683 36584 -58772 61 52899 -30565
477 -30565 218 46588 -32968 566 64458 -28919 -30063 54595 -10088 -31294 36868 -22493
489 -22493 -38599 50651 -6609 -59609 32988 16644 -42100 24925 8348 -46232 36645 30716
501 30716 -58621 7470 41311 -35991 2418 28786 -43491 6830 53410 -39547 -20287 53514
513 53514 -11173 -13140 43547 -22355 -21007 58085 -11412 -50142 34051 2058 -40519 23465
525 23465 -12525 -54626 34936 17149 -59400 12691 31571 -30486 21966 27993 -41345 25510
537 25510 58346 -36482 -8959 46457 -19969 -5787 33869 -42066 -20969 51995 -25176 -46468
549 -46468 32014 -7518 -28306 34804 -15165 -41204 48134 14419 -48859 21475 19446 -30619
561 -30619 27535 14148 -49844 22988 42064 -41055 -2167 34836 -24454 10614 36955 -41057
573 -41057 -7026 54476 -22057 -28979 30725 -18012 -20313 33681 -30210 -43128 41434 251
585 251 -45452 22235 6142 -27154 37562 11342 -41301 35620 38959 -33465 13242 28655 -29524
598 -29524 16134 29595 -47612 -5768 40032 -33761 -21687 26008 -29539 -13697 38950 -29051
610 -29051 -30058 45091 -3022 -29950 32000 -2106 -23996 41834 2096 -42831 32671 22533
622 22533 -36084 16594 16935 -32340 22807 24687 -44779 6935 38035 -31163 -7311 26784 -30673
635 -30673 -5472 33633 -35077 -22555 39225 -15676 -25970 30532 -10793 -20257 41393 -3382
647 -3382 -31817 38990 15157 -29665 25315 10869 -30743 26916 14476 -45384 11115 26063
659 26063 -37559 -2032 19366 -33676 4700 31049 -37075 -9094 42481 -17122 -14987 32181
671 32181 -15210 -10477 40267 -17547 -30266 38784 1863 -31771 23184 -241 -27716 31450
683 31450 5492 -41924 22984 24612 -31929 9635 17097 -30743 15444 26361 -40927 -3453
695 -3453 35639 -23493 -11285 22611 -25316 -4680 38543 -23694 -24789 38848 -1018 -20667
707 -20667 25579 -7483 -19180 39091 176 -39454 23810 16509 -28466 13004 5337 -32429
719 -32429 22221 20776 -41889 1771 29570 -22772 457 20405 -29326 2728 37931 -26506
731 -26506 -18635 33327 -8863 -12703 26479 -18088 -18708 40161 -4212 -33953 24766 7401 -22292
744 -22292 22443 -1348 -33054 27814 17965 -38456 6812 20369 -24192 9395 15124 -34810
756 -34810 7258 34062 -27975 -10847 28538 -14993 -4366 27719 -22551 -12992 38063 -9155
768 -9155 -25607 25358 -2513 -18876 26211 -5838 -30008 27418 10319 -32467 13343 12182
780 12182 -24380 16468 13095 -33658 11364 27285 -27487 -1958 24054 -20067 1287 25435
792 25435 -25901 -7989 34492 -15465 -18600 26162 -9307 -15237 26370 -11458 -24455 30379
804 30379 2045 -29317 19759 7192 -23269 20022 7631 -30266 18482 20187 -29912 5158
816 5158 20408 -23318 5434 20628 -28659 -1246 30206 -21687 -13246 25209 -13484 -9219 26278
829 26278 -16532 -18050 32154 -3358 -24879 21459 2013 -18732 22953 -234 -28660 23040
841 23040 14805 -28861 8873 14856 -21388 11234 14435 -30406 5444 26826 -23962 -8152 20681
854 20681 -17505 -3709 23429 -22189 -12995 31810 -7585 -18994 22486 -3457 -12229 28166
866 28166 -4150 -24721 26699 10355 -25630 12038 6040 -22573 16772 7930 -34993 7096
878 7096 20836 -25206 -2517 15429 -20328 5590 24579 -24509 -6146 32570 -8876 -10446
890 -10446 22383 -9738 -8039 28415 -11198 -23563 25019 2114 -22786 14255 -1690 -21861
902 -21861 20588 5067 -31179 12208 16725 -21676 5791 11551 -22412 10074 21590 -25396
914 -25396 -3262 25868 -13111 -5227 19404 -15485 -3720 28918 -13051 -17871 25215 -2053
926 -2053 -16788 17406 -6351 -19369 22248 -510 -29406 13668 8789 -22194 9870 7505 -22814
939 -22814 14283 18028 -24626 4492 23466 -14738 1787 19189 -18473 -574 25648 -17706
951 -17706 -13608 22517 -9195 -13871 17647 -11632 -16336 24133 -3975 -23257 18582 5251 -18262
964 -18262 15069 3558 -21019 17564 12020 -25416 7244 16747 -18579 4624 14040 -20242 4293
977 4293 22466 -19137 -6047 22852 -10742 -7144 18745 -13511 -10442 23397 -9501 -20526 17985
990 17985 -1669 -17391 15585 -2729 -19724 19717 7331 -23329 12284 13484 -15588 10830
1002 10830 11141 -20431 10033 19682 -21619 -2830 18613 -14511 -3508 15030 -19036 -6103
1014 -6103 23999 -12900 -15398 19582 -3979 -11174 18155 -6683 -16005 22826 2320 -22235 12896
1027 12896 6937 -16391 12731 4856 -21834 12747 16000 -20928 2213 15767 -13489 4376
1039 4376 14973 -19667 -1382 22646 -14271 -12193 15758 -9257 -8104 16375 -13039 -15192 21936
1052 21936 -1142 -18435 14179 3074 -11833 17391 2226 -19390 16936 13344 -19036 5517
1064 5517 10955 -15904 7273 11185 -22185 1152 19040 -16268 -6539 14195 -12631 -3190 17934
1077 17934 -14436 -10696 21683 -4660 -13802 15408 -3275 -11192 19149 -1684 -18598 16814
1089 16814 7795 -17213 10085 6570 -15420 11800 9124 -21343 4996 15307 -16976 -1785
1101 -1785 11920 -15831 -654 15317 -16691 -7059 19200 -8319 -8738 16256 -5915 -7726 19738
1114 19738 -3880 -13726 18354 3431 -14857 11665 2121 -15531 12389 4430 -20593 7168
1126 7168 10546 -17321 2274 9637 -15267 4060 14234 -16724 -1725 18598 -9919 -5407 15072
1139 15072 -8691 -4380 17927 -8915 -12090 17812 -1534 -13627 12470 -1571 -12749 14544
1151 14544 905 -18579 11103 8140 -15779 5853 6903 -14758 8002 11030 -17886 1594
1163 1594 16094 -11411 -1997 12561 -11413 -1012 16766 -11697 -9116 17249 -3850 -9786 11904
1176 11904 -5120 -9451 16320 -2610 -17099 12272 5512 -13551 7938 3123 -13457 11510
1188 11510 8382 -17707 4361 12936 -11518 1570 9777 -13121 1953 15233 -13526 -6337 14975
1201 14975 -6534 -6098 11863 -8902 -7755 16887 -4425 -14022 12863 1577 -10275 11085 -226
1214 -226 -13122 13568 6287 -16147 6553 8899 -11376 5160 6619 -15341 4751 13283 -14768
1227 -14768 -3581 12033 -8897 -2616 10998 -11071 -4498 16476 -5999 -10194 12646 -1522
1239 -1522 -7327 12650 -2677 -11286 13829 3186 -14003 7493 4292 -11375 7439 4235 -14963
1252 -14963 6248 10303 -13276 151 9586 -9829 974 10232 -12142 -2338 14630 -7846 -7019
1265 -7019 11712 -4450 -5088 12297 -5399 -8968 14155 462 -11316 9770 1987 -9753 9608
1278 9608 2095 -13707 7925 6667 -13546 2679 6820 -11237 2833 7956 -12631 845 12411
1291 12411 -9444 -2902 11452 -6457 -2333 12156 -7082 -6283 13830 -3058 -9556 9786 -1395
1304 -1395 -8155 9995 -1278 -11708 9932 4351 -11882 5288 5058 -9763 5537 5468 -12562
1317 -12562 3394 9915 -10866 -1535 8886 -7966 -397 9718 -9180 -3441 13036 -4467 -6253
1330 -6253 10782 -2464 -5002 11008 -2756 -9586 10621 1577 -11087 5467 1317 -10159 6454
1343 6454 2216 -13420 4772 7945 -10875 1074 7363 -7726 3076 9463 -9770 -708 12842
1356 12842 -5808 -3912 9155 -5070 -3290 10641 -5858 -8323 10472 -440 -8556 6636 -713
1369 -713 -8132 8641 678 -11892 6214 5399 -9638 2799 4040 -8800 4821 7287 -10355
1382 -10355 815 10509 -5703 -992 8047 -6117 -36 10915 -6448 -5985 9972 -2212 -6622
1395 -6622 6155 -4088 -7201 8816 -1801 -11253 6297 2663 -8035 4991 2374 -8093 7117
1408 7117 6289 -9190 2906 8595 -6273 1654 6306 -7894 855 9213 -7713 -4129 8152 -4703
1422 -4703 -4174 7123 -5255 -4925 9130 -2564 -7999 7409 482 -6478 6381 285 -7575 7453
1436 7453 3688 -9055 4137 5921 -6452 3127 5195 -7658 2666 7896 -7725 -1484 7295
1449 7295 -5660 -2324 6354 -6593 -3855 8053 -4766 -6675 6999 -1513 -5423 7107 -862
1462 -862 -6188 8234 2359 -7251 5704 3877 -6191 4519 3347 -7703 3795 5610 -8502
1475 -8502 -75 5709 -6413 -678 5119 -7168 -1133 8003 -5345 -3830 7573 -2533 -3352 6785
1489 6785 -2871 -4633 8159 -434 -6978 5753 1551 -5639 5199 1292 -7249 5287 3969 -7702
1503 -7702 1670 4728 -5705 1719 4157 -7346 596 6671 -6312 -2858 6078 -3677 -1616 6254
1517 6254 -4541 -3353 8084 -1522 -5193 5719 6 -3977 5822 -405 -6536 5966 2323 -6837
1531 -6837 2591 2744 -5358 2800 2937 -7394 1724 5725 -5577 -791 4931 -4270 -63 5490 -5259
1546 -5259 -2140 7074 -2681 -3649 5167 -2081 -3176 6048 -1999 -5457 6193 1109 -5709 3842 1062
1561 1062 -4844 4648 1741 -6818 2674 4325 -5773 442 3521 -5164 1091 4732 -5950 -988
1575 -988 6381 -3409 -2069 4956 -2793 -1693 5884 -2769 -4244 6120 -94 -4482 4095 -593 -4515
1590 -4515 4734 485 -6144 3616 2877 -5328 1950 2332 -4897 2269 3474 -5500 253 5371 -3837
1605 -3837 -847 4412 -3707 -376 5500 -3549 -2869 5587 -1418 -2976 4202 -1392 -3123 4988 -736
1620 -736 -5174 4228 1156 -4569 2617 1330 -4520 3286 2631 -5607 1597 4255 -4063 596 3378
1635 3378 -4024 595 4655 -4386 -1670 4834 -2260 -2277 3860 -2781 -2112 4923 -1624 -4208 4094 183
1651 183 -3679 3115 -78 -3542 3970 1482 -4808 2478 3022 -3766 1521 2296 -3992 1582 3352 -4268
1667 -4268 -474 3878 -2921 -1179 3264 -3035 -1445 4332 -2468 -2902 4010 -379 -2362 3741 -1014
1682 -1014 -2876 4351 438 -4183 2682 1554 -3251 2174 1051 -4465 2082 2608 -4626 31 2975
1697 2975 -3007 335 2560 -3810 -67 4143 -2572 -1819 4022 -1116 -1386 3520 -1762 -2087 4291 -428
1713 -428 -3352 2716 416 -2803 2547 -21 -3700 2312 1515 -4130 808 1933 -3016 997 2206
1728 2206 -3833 681 3297 -3000 -619 3212 -1843 -214 3270 -2410 -1232 4298 -963 -2079 3101
1743 3101 -527 -1785 3169 -900 -3418 2616 625 -3639 1454 892 -2882 1456 1047 -3296 1579
1758 1579 2483 -2832 424 2733 -2032 547 2868 -2838 -390 3401 -1822 -1499 2780 -1580 -1538 2774
1774 2774 -1263 -2362 2915 -307 -2723 2195 164 -2225 2147 235 -3090 1873 1569 -2760 773
1789 773 1616 -2204 940 1991 -2533 576 3135 -1792 -429 2773 -1543 -516 2681 -1761 -1708 2786
1805 2786 -1065 -2201 1939 -763 -2010 2265 -488 -2552 2241 785 -2403 1527 1071 -2067 1522
1820 1522 1156 -2561 1019 2107 -2025 70 1771 -1875 78 1949 -2222 -620 2498 -1306 -1504
1835 -1504 1976 -1077 -1326 2405 -765 -2132 2281 -217 -2042 1423 -79 -1900 1979 590 -2486
1850 -2486 1634 1673 -1970 1034 1309 -1841 1167 1529 -2489 -211 1973 -1506 -832 1253 -1912 -629
1866 -629 1901 -1739 -1405 2198 -301 -1429 1771 -633 -1217 2307 98 -2188 1701 842 -1601 1268
1882 1268 379 -1763 1190 1043 -2336 660 1378 -1636 215 1308 -1730 132 1965 -2046 -810 1839
1898 1839 -1180 -813 1876 -1159 -762 2105 -590 -1666 1855 30 -1208 1793 -60 -1361 1879
1913 1879 478 -1801 929 955 -1728 785 968 -1837 381 1255 -1831 -594 1223 -1290 -125 1426
1929 1426 -1454 -71 2337 -756 -678 1897 -285 -757 1603 -714 -1100 1776 -208 -1449 1364 398
1945 398 -1235 1097 46 -1785 975 684 -1836 644 1055 -1319 292 865 -1310 265 1776 -1409
1961 -1409 -475 1551 -1230 -321 1415 -911 -575 1696 -482 -1085 1592 -370 -1227 891 -136 -1422
1977 -1422 1399 476 -1710 825 471 -1366 830 579 -1628 598 1290 -1525 251 1403 -1159 93
1993 93 1336 -991 -421 1777 -982 -917 1359 -450 -1022 1128 -548 -1036 1555 -157 -1284 1214 359
2010 359 -987 1187 -11 -1575 1147 537 -1474 452 665 -1266 406 857 -1490 344 1306 -1235
2026 -1235 -357 1237 -877 -390 1196 -1050 -869 1647 -600 -1061 1298 -120 -966 1233 -387 -1164
2042 -1164 1403 185 -1210 576 366 -1137 793 457 -1511 577 1205 -1219 74 1004 -1252 345
2058 345 1106 -1528 -350 1787 -733 -801 1116 -767 -490 1342 -813 -720 1628 -155 -960 893 155
2075 155 -1201 1146 -13 -1382 1056 791 -1261 573 760 -1120 714 770 -1540 272 1307 -860
2091 -860 -193 840 -847 -49 1331 -1089 -565 1415 -401 -595 1461 -460 -758 1419 -231 -943 1101
2108 1101 352 -859 895 184 -1282 852 636 -1327 649 962 -1238 210 539 -1102 188 1098
2124 1098 -903 168 1374 -625 -298 1049 -819 -350 1526 -780 -805 1324 -74 -853 985 -500
2140 -500 -1040 1270 -98 -1327 772 322 -1089 559 607 -1509 541 948 -1464 193 1048 -1070 416
2157 416 1136 -1007 118 1476 -865 -476 1306 -638 -624 1104 -450 -555 1517 -278 -1046 1028 170
2174 170 -1127 802 139 -1397 1087 555 -1290 551 905 -1054 378 1038 -1365 540 1310 -1219
2190 -1219 -332 1207 -1266 -142 1120 -881 -602 1186 -1053 -1030 1176 -505 -896 1216 -510 -959
2206 -959 1529 -10 -1316 1052 532 -1275 766 539 -1393 977 823 -1838 440 1042 -1415 394
2222 394 930 -1329 43 1402 -1026 -354 1332 -699 -631 1359 -502 -510 1461 -144 -1104 1330 -27
2239 -27 -1055 959 2 -1086 1175 515 -1625 1084 566 -1413 704 448 -1464 265 1023 -1619 -268
2256 -268 1305 -1100 -171 1149 -1290 -240 1454 -705 -634 1598 -213 -846 1402 -636 -1217 1373
2272 1373 66 -1366 1047 297 -1554 656 237 -1447 750 847 -1635 276 801 -1199 451 1173
2288 1173 -1284 -65 1589 -904 -493 1700 -764 -445 1600 -806 -1006 1752 -220 -1114 1221 -198
2304 -198 -1228 1268 -93 -1735 1112 377 -1559 879 670 -1494 613 728 -1724 338 1229 -1441
2320 -1441 12 1434 -1037 9 1729 -1460 -687 1656 -934 -867 1518 -591 -1061 1339 -628 -1428
2336 -1428 1493 2 -1539 1357 187 -1607 1102 622 -1945 678 1167 -1654 625 951 -1375 552
2352 552 1283 -1453 -32 1709 -1431 -595 1336 -951 -514 1642 -990 -755 1575 -273 -1297 998
2368 998 -112 -1428 1585 -57 -1723 1185 650 -1581 874 944 -1261 979 808 -1858 386 1708
2384 1708 -1316 49 1013 -1388 -87 1395 -1280 -920 1613 -868 -1226 1239 -714 -1183 1991 -364
2400 -364 -1619 1320 80 -1365 1075 383 -1356 978 473 -1723 956 1381 -1428 -9 1017 -1376
2416 -1376 359 1267 -1560 -263 1550 -1134 -786 1625 -1194 -772 1847 -906 -1512 1424 -389 -1105
2432 -1105 1542 43 -1293 1521 446 -1652 1408 1051 -1157 787 792 -1826 869 1185 -1854 134
2448 134 1508 -1589 -207 1663 -1474 -204 1629 -1217 -808 1738 -673 -1085 1668 -375 -1002 1867
2464 1867 172 -1525 1361 219 -1445 1165 300 -1712 907 697 -1968 381 1187 -1385 352 1265
2480 1265 -1665 30 1635 -1520 -727 1697 -813 -661 1814 -905 -503 2288 -467 -1268 1858 -104
2496 -104 -1104 1510 -430 -1652 1511 224 -1818 1214 622 -1742 828 712 -1896 625 1501 -1788
2512 -1788 64 1377 -1234 125 1610 -1386 -31 1959 -994 -803 1712 -540 -1042 1423 -447
2527 -447 -1226 1535 87 -1720 1304 341 -1374 1248 745 -1747 1126 1125 -1861 576 1220 -1748 379
2544 379 1410 -1514 32 1824 -1508 -803 1736 -1278 -776 1979 -1317 -758 2244 -133 -1418 1839
2560 1839 -169 -1333 1664 -206 -1675 1603 446 -1840 896 729 -1541 606 1034 -2010 376
2575 376 1533 -1716 -335 1407 -1646 -246 1660 -1390 -730 2121 -1056 -1036 1448 -677 -1147 1443
2591 1443 -372 -1680 1597 220 -1704 1074 156 -1888 1049 577 -2178 1018 1045 -2015 432 1199
2607 1199 -1567 453 1514 -1830 -172 1450 -971 -564 1686 -1057 -574 1668 -991 -1195 1883 -250
2623 -250 -1413 1505 -282 -1560 1634 139 -1872 1345 827 -1673 1098 913 -1852 664 1010 -1956
2639 -1956 384 1763 -1652 55 1547 -1576 -256 1832 -1273 -929 1929 -814 -963 1449 -595
2654 -595 -1270 2149 -292 -1528 1426 410 -1681 1225 174 -1767 1244 946 -1849 644 1226 -1812
2670 -1812 599 1172 -1363 41 1373 -1646 -151 1744 -1242 -697 1555 -1006 -872 2054 -747 -1318
2686 -1318 1658 -105 -1437 1485 -7 -1690 1700 534 -1873 1007 1021 -1969 721 910 -1778 544
2702 544 1392 -1901 22 1422 -1628 114 1550 -1355 -528 1593 -1026 -686 1963 -626 -1076 1719
2718 1719 -663 -1348 1845 -183 -1715 1384 442 -1742 1402 313 -1786 983 1283 -2044 538 1293
2734 1293 -1403 334 1420 -1505 347 1955 -1640 -674 2022 -922 -526 1911 -1116 -956 1969 -788
2750 -788 -1540 1628 -280 -1354 1561 -220 -1580 1769 668 -1755 895 1008 -1409 877 1055 -1900
2766 -1900 572 1588 -1613 -107 1517 -1496 -210 1378 -1392 -532 1910 -1227 -1406 1546 -573
2781 -573 -1200 1826 -241 -1601 1689 254 -1478 1351 269 -1709 1330 628 -2079 864 1224 -1813
2797 -1813 374 1252 -1440 -137 1414 -1675 -304 1692 -1219 -712 1668 -1058 -929 2047 -681 -1206
2813 -1206 1966 -330 -1158 1594 34 -1337 1603 271 -1599 1442 806 -1761 882 787 -1775 930
2829 930 1482 -1761 310 1462 -1626 -161 1658 -1391 -248 1760 -1216 -691 1807 -782 -1066 1718
2845 1718 -479 -1270 1530 -157 -1484 1482 396 -1867 1225 462 -1714 1088 955 -2045 769 1146
2861 1146 -1787 169 1377 -1195 115 1332 -1545 -415 1843 -1058 -852 1851 -800 -974 1853
2876 1853 -913 -1315 1718 -139 -1591 1437 137 -1578 1327 290 -1791 1174 996 -1491 635
2891 635 1313 -1615 716 1141 -1670 -160 1918 -1088 -356 1554 -1210 -522 1713 -1256 -925 1789
2907 1789 -498 -974 1564 -421 -1045 1625 -427 -1880 1335 638 -1821 959 505 -1622 1014 1107
2923 1107 -1885 533 1377 -1519 213 1311 -1411 -135 1601 -1048 -523 1861 -1013 -459 1667 -679
2939 -679 -1235 2116 -594 -1566 1476 107 -1318 1269 100 -1587 1101 726 -1839 543 1013 -1453
2955 -1453 624 1152 -1769 174 1513 -1618 -129 1468 -1297 -113 1632 -837 -699 1861 -682
2970 -682 -1333 1439 -212 -1068 1633 -255 -1237 1563 47 -1583 807 293 -1440 1145 579 -1767
2986 -1767 730 1249 -1987 233 1460 -1192 188 1333 -1454 -175 1460 -1277 -798 1506 -757
3001 -757 -1000 1591 -646 -1202 1646 -187 -1582 1598 160 -1332 1243 404 -1566 1065 755 -1569
3017 -1569 732 869 -1426 666 1129 -1680 84 1485 -1526 -408 1478 -1142 -372 1554 -1013 -508
3033 -508 1591 -682 -1127 1625 -346 -1308 1559 -226 -1337 1243 571 -1568 1100 557 -1662 915
3049 915 1010 -1686 606 1013 -1377 -113 1402 -1211 223 1652 -1052 -142 1772 -735 -546 1483
3065 1483 -727 -858 1528 -537 -1168 1600 -71 -1464 1137 31 -1498 1054 276 -1691 1053 1098
3081 1098 -1307 524 959 -1241 696 1279 -1605 74 1568 -1014 -255 1431 -1113 -424 1587 -1100
3097 -1100 -860 1457 -358 -1027 1367 -87 -1198 1551 54 -1459 1315 393 -1418 737 661 -1218
3113 -1218 858 1027 -1527 409 1224 -1380 163 1494 -1276 126 1408 -1254 -632 1785 -788 -747
3129 -747 1222 -886 -969 1679 -647 -1388 1407 -243 -1169 1406 133 -1147 1204 675 -1577 653
3145 653 753 -1556 407 894 -1436 387 955 -1772 -196 1449 -1177 -433 1359 -1076 -503 1590
3161 1590 -543 -1147 1229 -421 -1052 1386 -242 -1062 1308 200 -1452 1336 579 -1679 1009 735
3177 735 -1432 756 940 -1629 154 1145 -1496 -143 1248 -1413 -269 1291 -1175 -732 1516 -707
3193 -707 -787 1249 -581 -984 1210 -397 -1296 1272 309 -1452 1149 303 -1266 878 639 -1430 586
3210 586 1073 -1152 390 1121 -1392 331 1683 -1410 -140 1433 -769 -608 1465 -1047 -670 1769
3226 1769 -652 -1214 1410 -186 -911 1200 -300 -1284 1631 338 -1539 984 736 -1355 866 737
3242 737 -1687 629 1015 -1471 125 1540 -1343 210 1362 -1072 -128 1572 -1051 -564 1419 -481
3258 -481 -630 1634 -264 -1218 1468 21 -1457 959 220 -1183 1125 313 -1749 885 880 -1732 483
3275 483 1029 -1101 414 1188 -1416 -34 1484 -1054 -297 1543 -758 -499 1500 -858 -860 1458 -211
3292 -211 -962 1546 -566 -1148 1268 70 -1580 895 477 -1632 699 749 -1251 784 932 -1539 264
3309 264 1430 -1128 221 1257 -878 -376 1619 -1227 -663 1255 -634 -506 1226 -583 -995 1288
3325 1288 -261 -1536 1215 -85 -1324 1133 173 -1290 1052 525 -1537 1009 1106 -1418 448 1218
3341 1218 -1462 224 1357 -1472 -449 1635 -1521 -618 1257 -975 -608 1599 -760 -1010 1707 -114
3357 -114 -1215 1389 77 -1079 1129 175 -1525 1070 646 -1411 673 637 -1237 374 1192 -1705
3373 -1705 191 1301 -1272 -345 1308 -1246 -397 1773 -945 -729 1682 -572 -776 1606 -284 -1143
3389 -1143 1528 -65 -1454 1549 439 -1223 1038 409 -1390 730 496 -1614 520 1070 -1301 464
3405 464 1400 -1235 134 1282 -1331 -346 1408 -1008 -660 1439 -879 -716 1802 -500 -1263 1479
3421 1479 95 -972 1303 -150 -1327 1331 396 -1617 555 817 -1308 686 1072 -1419 454 1252
3437 1252 -1361 -261 1302 -875 28 1508 -982 -378 1567 -509 -886 1347 -100 -832 1283 -218
3453 -218 -1293 1206 -8 -1533 1129 506 -1184 890 427 -1574 809 895 -1463 -30 1039 -1179
3469 -1179 272 1175 -1402 127 1365 -1019 -538 1403 -488 -903 1282 -486 -1131 1208 -260 -1182
3485 -1182 1121 131 -1485 1089 465 -1418 707 495 -1470 628 802 -1289 288 1196 -1401 62
3501 62 1027 -1253 -46 1691 -1122 -287 1293 -949 -680 1553 -347 -904 1312 -476 -1164 1222 159
3518 159 -1308 1271 176 -1638 1031 468 -1257 581 644 -1494 717 1141 -1164 272 1228 -923
3534 -923 -233 1305 -923 -392 1328 -994 -750 1212 -369 -701 1358 -348 -1125 1274 161 -1328
3550 -1328 842 732 -1164 677 405 -1488 660 876 -1548 439 1189 -1161 251 1213 -1176 -336
3566 -336 1594 -632 -417 1357 -813 -705 1514 -746 -760 1605 -33 -1062 1026 -4 -1097 1130
3582 1130 137 -1336 998 585 -1495 887 771 -1209 619 926 -1464 -108 1148 -1486 -243 1089
3598 1089 -1028 -215 1186 -1042 -888 1401 -489 -913 1119 -156 -757 1351 67 -1255 1264 499
3614 499 -1269 689 317 -1384 640 635 -1619 466 979 -1239 226 1052 -1337 -67 1085 -1233 -341
3631 -341 1329 -681 -515 1438 -575 -663 1325 -497 -1066 1317 -91 -1222 1201 115 -1271 741
3647 741 384 -1221 872 724 -1148 617 440 -1181 470 1032 -851 -76 993 -1035 -49 1341 -1014
3664 -1014 -475 1276 -571 -567 1231 -372 -721 1080 23 -1104 997 90 -1244 1184 234 -1517 784
3681 784 576 -1353 659 944 -1315 442 1024 -1004 10 1276 -1234 -169 1005 -811 -425 1211
3697 1211 -436 -715 1207 -703 -999 1076 -129 -1147 1332 92 -991 924 233 -1272 1087 594
3713 594 -1441 522 666 -1237 119 597 -1115 281 1049 -1057 -495 1284 -903 -477 1158 -722
3729 -722 -579 1201 -588 -833 1210 57 -838 1093 3 -1227 1098 403 -1168 667 490 -1025
3745 -1025 476 518 -1417 566 987 -1002 -77 1051 -1060 -2 1095 -778 -274 1172 -379 -697
3761 -697 1169 -297 -666 1057 -211 -1055 1068 -117 -883 887 377 -954 874 255 -1413 926
3777 926 922 -1121 203 820 -1084 304 1097 -770 33 1111 -876 -373 881 -705 -441 1249 -471
3794 -471 -923 865 -105 -882 786 -52 -955 1010 142 -857 720 579 -1110 689 833 -1255 675
3811 675 639 -1134 183 894 -1023 -23 1002 -735 113 1218 -753 -345 1013 -591 -780 683 -425
3828 -425 -934 943 122 -1029 893 263 -874 799 389 -912 466 633 -962 472 601 -1069 129
3845 129 852 -857 57 747 -948 -268 1373 -675 -339 1328 -341 -559 1016 -260 -1037 812 16
3862 16 -1007 1013 130 -994 922 380 -937 467 551 -966 115 706 -900 80 800 -1067 -54
3879 -54 890 -685 -283 823 -372 -308 1057 -445 -588 1085 -81 -636 732 -116 -807 589 289 -949
3897 -949 459 178 -1031 460 466 -844 860 547 -928 201 856 -778 -35 611 -494 6 877 -750
3915 -750 -602 710 -217 -447 1008 -336 -714 1010 63 -757 942 223 -916 833 98 -883 624
3932 624 318 -786 503 375 -837 190 632 -761 53 745 -723 -108 596 -620 -331 908 -561
3949 -561 -653 710 -148 -440 520 -101 -1012 809 285 -889 681 305 -654 420 249 -768 274 586
3967 586 -1189 196 569 -764 -100 573 -525 -15 515 -568 -150 929 -425 -501 704 -301 -531
3984 -531 503 -114 -766 586 -112 -578 537 73 -763 585 421 -665 412 331 -755 315 828 -756
4002 -756 90 316 -833 -24 407 -703 -284 1013 -430 -147 985 -252 -557 825 -46 -668 765
4019 765 72 -573 475 254 -545 647 344 -797 261 476 -457 137 502 -414 269 867 -733 -69
4037 -69 834 -651 -30 632 -387 -560 617 -183 -377 889 -237 -651 535 24 -770 745 125 -815
4055 -815 471 420 -734 407 280 -603 159 787 -796 136 552 -710 102 592 -603 -411 575 -457
4073 -457 -316 687 -435 -241 566 -346 -303 597 59 -451 476 389 -662 568 265 -654 190 326 -601
4092 -601 280 484 -559 249 584 -514 -349 412 -396 -301 679 -415 -356 880 -268 -639 863 -56 -579
4111 -579 398 -62 -328 327 248 -529 300 87 -624 322 205 -690 -47 575 -501 103 368 -186 89 528
4131 528 -445 -147 751 -439 -495 745 -329 -386 359 -72 -551 611 154 -386 401 44 -589 228 99
4150 99 -778 325 216 -403 175 557 -239 63 573 -616 3 325 -353 -246 312 -327 -71 487 -407 -453
4170 -453 463 -19 -433 582 310 -581 535 332 -767 415 305 -544 354 116 -373 97 182 -498 68
4189 68 458 -246 -116 30 -461 -204 594 -358 -284 519 -429 -300 452 -123 -459 256 -24 -440 460 389 -571
4210 -571 319 377 -360 286 354 -321 254 440 -539 -33 698 -241 -109 325 -852 -238 644 -203 -182 556 36
4231 36 -117 639 -29 -486 472 -227 -479 276 211 -309 494 184 -372 -61 374 -330 175 329 -525 -112 321
4252 321 -401 -233 526 -217 -508 412 -251 -107 372 -239 -621 332 56 -234 206 54 -473 440 356 -473
4272 -473 30 376 -421 -67 193 -608 -108 295 -140 -193 531 33 -244 207 -444 -186 235 -141 -197 386 -70
4293 -70 -124 355 111 -411 325 -235 -367 259 254 -439 64 506 -359 137 363 -336 -150 350 -189 -77 358
4314 358 -455 -83 228 -304 -113 184 -172 -307 363 174 -140 209 90 -236 341 161 -215 58 213 -355
4334 -355 158 273 -283 96 268 -311 -99 224 -238 93 351 -378 -221 356 -95 -234 148 -42 -217 482
4354 482 -158 -97 417 -63 -318 -8 29 -67 347 125 -466 -110 163 -479 -245 34 -144 44 310 -212 -283
4375 -283 403 -298 108 275 -179 -244 323 129 -378 256 256 -378 334 107 -262 222 61 -337 -55 105 -55
4396 -55 -14 140 -326 45 248 -185 -363 165 -253 -252 344 19 142 401 -235 -150 250 -7 -136 268 -103 -499
4418 -499 422 520 -328 50 -48 -363 153 310 -188 -106 447 -227 309 170 -185 -202 351 -92 10 207 -8
4439 -8 -29 354 -38 -164 301 124 -371 310 -60 -185 276 193 -512 314 170 -216 94 201 -48 206 320
4460 320 -43 29 -100 -198 -157 477 -180 -263 246 -271 -30 309 -358 -226 170 36 52 -10 -134 -181 130 295
4482 295 39 138 -21 -92 18 32 -257 240 165 -434 125 234 -89 -188 14 -82 -47 219 42 178 -17 -40 -150
4505 -150 72 -4 -109 205 -299 -162 162 0 -123 113 115 -387 12 118 -240 -43 -10 20 -263 316 -313 -103
4527 -103 -4 35 21 326 -18 -472 27 -204 -252 221 156 -78 210 341 -197 23 164 -519 410 165 -318 129
4549 129 315 -214 125 228 -111 242 246 -284 5 116 -175 -314 27 -118 -244 327 -145 -346 242 -59 -461
4570 -461 -112 20 -95 271 531 -319 -170 -15 -382 -238 -98 55 -156 42 -99 -10 209 -142 37 -50 -9
4591 -9 114 85 -19 -346 -28 -215 -266 149 66 -135 -17 153 -501 43 240 -194 163 106 -64 -23 183 71
4613 71 -236 217 -175 35 383 -110 -53 213 -87 -490 396 -116 -249 348 32 146 391 172 -208 -23 -166
4634 -166 -324 90 322 -202 146 -30 -170 145 226 -33 -93 221 -236 -196 115 -177 -261 230 -145 -173 249 -54
4656 -54 -385 87 -134 18 165 595 205 -32 129 -435 237 -105 -62 94 249 -182 23 183 -342 103 292
4677 292 -290 -246 44 3 28 123 -61 -9 8 -145 -242 388 -173 -251 234 84 -272 194 -80 -215 -21 356 -202
4700 -202 -26 36 -67 -115 353 -280 78 32 -152 -288 258 -116 90 261 -167 -103 375 -100 -184 34 -19 -396
4722 -396 108 303 -147 3 456 84 245 279 46 -126 325 -136 45 227 -77 -131 395 94 -191 180 -1
4743 -1 -83 258 10 -195 367 16 -269 115 185 -233 451 99 -137 276 63 -222 86 360 -142 -25 432
4764 432 12 103 203 103 -81 200 -50 -154 139 -128 -167 241 -47 -176 361 -51 -303 -5 80 15 130
4785 130 23 -310 31 121 -98 -16 56 -168 -39 107 -11 -107 437 -89 -68 133 -182 -87 374 -94 -159 130
4807 130 -49 -128 329 -22 -338 335 155 -90 176 -61 82 196 154 -197 6 -38 -184 -79 237 -228 74
4828 74 350 6 -190 100 -119 -310 -14 -132 -382 422 -162 -307 88 12 -142 238 -14 -94 69 -41 -406
4849 -406 -37 61 -11 -29 120 50 -183 456 -62 26 245 -31 -9 266 39 125 75 -139 47 51 32 -99 83 -139
4873 -139 -182 -30 -168 -323 128 252 -221 55 139 -151 17 359 -242 -98 -87 -173 80 17 -99 60 128 54
4895 54 227 281 117 -1 -42 -180 120 179 250 -137 161 7 -159 73 176 -107 -102 436 -268 -183 275 137 -48
4918 -48 259 -61 -315 -36 182 -189 109 -13 -151 145 24 -178 -42 -82 -321 218 -81 35 140 188 -53
4939 -53 175 143 1 -187 -84 -234 24 -55 -579 -24 28 -65 188 141 192 17 303 30 -327 201 -113 -30 201
4962 201 -184 -219 303 47 -392 278 223 -236 80 -12 -68 242 -59 -290 52 483 -285 -26 106 260 -198
4983 -198 155 -137 -4 329 57 -199 191 -77 -183 299 103 -79 280 -31 -292 222 -117 -156 -68 -135 -431
5004 -431 10 237 24 -299 320 -214 -52 39 49 -82 308 -83 -152 182 -57 -99 -23 -18 -168 89 -128 -35 -162
5027 -162 174 10 139 48 20 87 79 193 266 26 -142 -336 351 -61 -5 208 142 -12 19 -185 -259 34 -21 -358
5051 -358 39 67 98 206 1 -27 113 216 -80 154 45 -130 -125 112 -122 -75 118 -332 -131 353 -63 234
5073 234 -54 -139 -52 106 -77 -212 -149 -302 -41 391 -47 -327 279 -108 -296 -60 259 29 97 -12 1 132
5095 132 290 -142 72 151 -242 34 170 75 -112 -56 266 -30 150 -119 119 -1 -199 -10 91 189 -249
5116 -249 263 189 -115 14 211 -278 120 259 -261 -90 10 26 -64 103 -215 -155 -131 -194 -94 -152 55 244
5138 244 325 -164 -250 50 43 -26 -7 93 -257 313 129 -136 -16 128 -292 -68 211 -13 -285 425 -298 -162
5160 -162 296 -313 -110 77 58 -55 10 -208 0 434 -36 -55 -98 -245 -180 308 -162 -66 87 1 -244 -124
5182 -124 65 46 112 43 -186 19 11 -55 -119 271 -270 158 370 -340 -109 344 -119 -179 14 -64 -218 243 47
5205 47 -66 144 143 -64 75 111 -225 263 135 -3 -137 165 -304 100 200 -65 -105 100 -332 -105 424 -284
5227 -284 -51 -57 -156 -164 89 108 -8 -42 -58 -217 231 273 -5 120 -32 -407 197 26 44 -49 97 -229 134 305
5251 305 -209 -188 323 -97 -27 211 -157 -107 243 -52 0 90 -100 -149 245 142 -350 77 -38 -414 -187 149
5273 149 -178 -251 85 -185 266 110 159 36 114 -354 129 101 127 -74 184 84 -303 204 -156 -16 57 -130
5295 -130 -237 279 -92 -93 63 35 -252 -4 332 -266 -44 255 -62 -224 252 -150 68 118 -81 67 155 72
5317 72 -110 220 -218 -111 211 105 -327 -13 194 -125 -3 -16 -146 187 110 -72 355 244 173 132 188 -239
5339 -239 -146 190 -267 160 309 -82 -39 318 -132 -78 414 -21 -134 313 -75 -217 275 133 -50 124 126 -120
5361 -120 54 70 -220 -170 262 -70 -87 380 -65 23 90 -5 -97 165 -142 -180 207 -3 -183 88 104 -52 155
5384 155 56 -136 293 -58 -212 230 96 -464 189 66 -133 47 92 -152 39 154 -100 176 247 -19 136
5405 136 194 -100 -48 431 18 -367 56 -56 -156 88 -146 -166 96 22 -29 -120 36 -131 250 245 -163 -137 -190
5428 -190 -238 38 264 -416 -63 247 -15 66 172 -366 -62 130 -295 -77 169 -320 -209 59 25 -72 493
5449 493 115 -72 12 61 -370 330 80 -252 81 -25 -210 -348 125 -360 -82 130 11 -302 227 -202 -154
5470 -154 509 -171 -481 407 47 -334 288 -179 -440 85 -17 -65 175 31 -335 201 128 -117 109 186 -102
5491 -102 -119 111 -377 88 228 -317 -291 -11 -251 -211 308 -9 -334 149 -303 -326 -63 -11 -141 110 121 -481
5513 -481 188 281 17 85 96 -141 51 48 106 -45 217 -260 -112 94 -454 -169 243 -13 -115 467 -20 -156
5535 -156 450 -312 -380 268 120 -114 416 164 -84 151 331 -622 122 221 -150 167 361 -351 182 256 -195
5556 -195 -51 66 -138 -47 182 -78 287 365 -308 -182 387 -89 18 243 -14 -472 288 -142 -492 77 159
5577 159 -273 233 245 -332 184 337 -292 76 184 -274 -301 230 -275 -39 476 -118 -119 254 -73 -318 72
5598 72 -121 -292 299 -74 -206 223 31 -380 277 254 -381 19 207 -421 226 333 -342 -195 344 -22 -3
5619 -3 587 -183 -209 306 -332 18 201 -199 11 426 -49 -334 327 142 -217 -102 70 -322 138 117 -373
5640 -373 45 155 -267 35 216 -306 228 258 -365 245 -12 -378 -26 452 -169 -340 346 -228 -101 278
5660 278 93 -454 259 -32 -428 127 -110 -92 105 -23 -249 153 325 -162 392 394 -207 72 483 -469 -23
5681 -23 191 -296 82 372 -280 229 676 -80 -210 197 -51 -396 194 49 -304 392 -88 -176 55 173 -261
5702 -261 27 130 -229 55 154 -137 98 429 -304 -98 206 -494 -107 103 -527 -108 415 -102 47 600
5722 600 -232 -385 331 95 -61 228 46 -448 292 307 -292 66 445 -233 246 287 -384 34 251 -188 -248
5743 -248 481 -377 108 246 -92 -26 72 -242 -149 219 -19 -201 351 -354 -360 333 71 -475 390 95 -422 177
5765 177 283 -417 245 429 -510 -40 218 -411 95 251 -114 73 595 -168 -263 327 -287 93 508 -88
5785 -88 -236 187 44 -135 380 -16 -496 262 135 -12 553 318 -623 120 378 -240 52 476 -550 -132
5805 -132 294 -359 76 219 -333 -233 501 -295 -171 301 -180 -158 440 51 -286 481 -302 -545 199 39
5825 39 -600 283 95 -269 396 -144 -422 211 376 -264 -43 320 -293 -38 338 -380 -146 575 -144 8
5845 8 325 -98 -112 313 -70 -377 230 112 -521 224 326 -569 116 148 -549 204 284 -571 250 424 -486 256
5867 256 646 -204 -119 495 -248 -84 476 -179 -42 469 -6 -120 386 -140 -292 477 -189 -463 463 -41
5887 -41 -656 127 298 -584 -167 133 -318 291 362 -523 -7 542 -303 -121 221 -292 -51 294 171 -167 398
5908 398 -197 -136 296 -352 -544 258 -291 -420 186 276 -185 411 48 -635 152 217 -255 334 339 -477 115 169
5930 169 -238 78 458 -474 43 440 -255 -289 168 -167 -408 556 -71 -167 624 72 -358 368 67 -374 327
5951 327 335 -325 293 273 -499 131 246 -636 223 280 -426 40 389 -262 -152 214 -515 -224 589 -37 -263
5972 -263 602 -234 -339 573 -46 -251 507 17 -491 603 230 -591 353 158 -647 498 439 -492 24 413
5992 413 -450 144 277 -531 -2 639 -500 -352 297 -127 -81 433 -81 -333 531 182 -229 444 -204 -598
6012 -598 306 206 -423 425 458 -586 251 298 -676 -155 390 -580 177 531 -353 5 318 -172 -25 624
6032 624 -229 -107 584 -183 -110 351 -25 -128 344 -105 -349 102 83 -379 385 127 -416 347 132 -746 278
6053 278 343 -422 227 230 -397 23 361 -388 -168 246 28 -59 460 -112 -138 515 65 -207 430 -124 -458 529
6075 529 -136 -508 313 113 -455 323 165 -230 305 285 -468 -13 398 -538 96 591 -351 -83 347 -229
6095 -229 -297 328 -349 -227 432 -296 -237 728 -65 -480 544 -165 -270 648 82 -265 267 -71 -651 255
6115 255 216 -335 196 207 -331 -9 449 -724 22 350 -307 -246 252 -394 -40 536 -184 -242 181 -289 73
6136 73 506 102 -400 269 280 -551 225 148 -396 383 -92 -709 65 172 -535 137 311 -260 346 77 -396
6157 -396 -195 414 -281 -252 517 -119 -273 441 -129 -419 464 -154 -502 395 -284 -585 354 95 -642 211
6177 211 163 -352 182 254 -423 152 315 -415 90 374 -554 -101 408 -141 -258 130 -175 -141 445 -371 -257
6198 -257 313 8 -509 470 -108 -523 371 172 -551 556 270 -295 244 182 -252 115 606 -550 -177 518
6218 518 -461 -135 336 -251 -199 643 -234 -248 320 -294 -130 244 10 -331 611 50 -275 581 -45 -626 -20
6239 -20 -18 -472 222 605 -336 110 236 -251 90 258 -370 -3 535 -453 84 426 -491 44 492 -118 -218
6260 -218 262 -283 -415 128 74 -437 166 62 -412 317 44 -476 304 298 -506 140 360 -779 138 400 -565
6281 -565 311 424 -575 -310 384 -493 164 391 -225 -280 144 -176 -322 409 -236 -429 351 218 -580 199
6301 199 232 -511 213 85 -533 202 -61 -382 -40 456 -282 194 434 -346 -101 117 -78 -203 460 -487
6321 -487 -272 345 -304 -461 414 -239 -539 453 -10 -378 142 104 -526 199 340 -678 245 293 -619 187
6341 187 4 -348 261 381 -456 -163 537 -485 -143 526 -296 -460 589 -272 -305 417 1 -251 733 -289
6361 -289 -332 348 133 -574 75 241 -510 159 213 -630 211 505 -375 103 380 -482 -126 575 -545 -117
6381 -117 304 -208 -238 452 -188 -389 619 -113 -220 309 -261 -594 242 -91 -225 350 -43 -594 -9 106
6401 106 -568 482 426 -368 30 490 -357 -105 360 -430 -177 455 -212 -433 345 -428 -246 655 -367 -263
6421 -263 266 -308 -324 68 -158 -432 422 -47 -506 329 148 -149 131 474 -524 253 354 -522 -124 580
6441 580 -3 -106 501 -469 -133 427 -223 -63 364 -130 -228 489 -119 -449 271 -73 -446 390 127 -619
6461 -619 253 259 -494 210 197 -593 149 475 -549 -325 528 -246 57 711 -216 -455 542 -321 -79 261 -185
6482 -185 -210 471 -313 -249 345 -71 -491 139 61 -378 343 126 -492 152 452 -424 111 153 -224 -88 268
6503 268 -305 -48 331 -410 -158 399 -620 -124 542 -367 -262 465 -236 -462 828 -120 -458 317 -41
6522 -41 -195 478 276 -495 293 335 -398 228 384 -342 197 272 -540 231 358 -551 116 464 -254 -71 614
6543 614 -441 -278 564 -53 -241 572 52 -535 568 18 -365 241 208 -504 162 273 -308 -34 218 -231
6563 -231 -118 496 -551 -47 504 -543 -163 303 -394 -55 446 -374 -504 490 -196 -281 493 -129 -613 496
6583 496 233 -350 429 -95 -371 378 127 -404 73 395 -431 391 91 -226 -88 585 -375 -153 616 -213
6603 -213 23 637 -324 -252 358 -294 -231 415 -191 -514 468 -9 -192 368 49 -341 356 408 -562 172 352
6624 352 -448 166 314 -194 -191 298 -383 236 490 -549 -21 399 -483 -64 544 -316 -381 556 -189 -451 303
6645 303 206 -380 593 336 -318 422 309 -492 398 298 -192 267 283 -53 -24 367 -459 -79 207 -419 -119
6666 -119 624 -163 -107 250 -175 -223 566 27 -231 527 -321 -481 373 141 -516 304 75 -528 426 223 -306
6687 -306 247 138 -453 107 23 -340 -100 525 -37 -100 370 -422 -232 513 -401 -265 649 -314 -394 375 -228
6708 -228 -141 431 183 -520 321 127 -527 71 263 -674 -28 322 -289 348 244 -537 -42 317 -440 -95
6728 -95 455 -193 -211 654 -443 -293 605 -69 -79 572 41 -438 149 75 -373 217 55 -406 325 352 -493
6749 -493 155 290 -644 88 448 -468 290 590 -555 193 653 -335 -127 309 -152 -55 595 -38 -619 484
6769 484 53 -447 468 -102 -350 263 -69 -374 316 0 -553 139 329 -594 -111 403 -432 382 221 -484
6789 -484 35 299 -349 -262 397 -495 -112 338 -495 -456 332 -183 -418 572 -314 -170 353 295 -480 221 127
6810 127 -265 114 144 -469 143 379 -203 127 350 -520 186 504 -566 -101 385 -98 -255 484 -229 -274
6830 -274 573 -25 -291 430 2 -343 545 192 -345 430 125 -313 311 122 -260 382 389 -580 140 620 -600
6851 -600 -280 310 -483 -98 435 -465 -44 588 -153 -201 493 -69 -311 431 -339 -579 453 -122 -339 340
6871 340 90 -205 396 116 -515 161 197 -636 -59 384 -500 27 432 -460 -66 289 -421 -35 319 -560
6891 -560 -390 442 -113 -178 584 -152 -344 450 -101 -324 402 98 -321 473 9 -245 -48 365 -369 181
6911 181 224 -459 80 272 -236 -72 475 -174 10 571 -33 -349 445 -233 -308 393 -170 -349 457 241 -63
6932 -63 248 278 -461 460 203 -519 187 309 -240 255 487 -351 91 349 -182 -154 552 -335 49 559 -308
6953 -308 -116 573 -43 -156 268 -197 -278 80 -135 -426 399 63 -365 118 353 -488 112 249 -660 272
6973 272 153 -542 161 320 -303 82 382 -369 -14 701 -79 -420 397 -33 -590 299 -153 -284 245 -12
6993 -12 -381 385 -64 -438 543 47 -378 351 268 -491 113 610 -423 247 289 -484 -72 509 -356 -259 553
7014 553 -67 -133 521 -163 -295 469 -332 -448 336 113 -75 305 -54 -377 401 91 -535 362 146 -592
7034 -592 42 300 -248 170 163 -164 274 302 -363 -197 513 -194 -244 356 -264 -124 464 174 -173 216 -52
7055 -52 -18 174 -38 -400 227 143 -563 545 192 -441 229 263 -625 255 306 -320 121 323 -599 50 236
7076 236 -489 -224 268 -79 73 329 33 -71 408 46 -274 592 336 -407 455 -80 -351 385 291 -370
7096 -370 409 55 -366 221 418 -388 116 481 -172 -144 495 -297 -47 400 -293 -103 373 -195 -403 457
7116 457 197 -269 521 6 -443 310 241 -441 182 -138 -373 195 159 -309 131 12 -262 -3 91 95 -246 464
7138 464 -139 64 242 15 7 318 -183 -417 261 -230 -441 595 -45 -143 353 265 -514 291 19 -209 68
7159 68 196 -563 13 178 -291 -37 218 -288 178 562 -638 -38 475 -466 -168 486 -70 -386 317 -109
7179 -109 -400 370 91 -383 472 114 -368 193 -143 -435 42 241 -279 333 358 -599 -113 469 -169 161
7199 161 211 -330 -32 190 -436 -270 332 -320 -416 485 -286 -311 399 280 -381 65 94 -254 295 15 -345
7220 -345 340 -115 -324 199 250 -43 86 -56 -264 62 330 -333 -158 328 -181 -182 83 -249 -221 468 -226
7241 -226 -327 247 -87 -313 195 10 -172 607 55 -367 156 305 -567 156 414 -302 -25 233 -93 -179
7261 -179 553 -260 -214 171 -152 -164 208 -58 -256 611 -118 -146 289 -33 -431 48 -79 -171 371 -36 -241
7282 -241 320 249 -311 39 154 -374 63 306 -209 -33 -15 -110 -230 266 -446 121 482 -428 -137 241 -514
7303 -514 21 244 -100 -444 213 -62 -304 386 -5 -194 325 24 -570 362 253 -424 308 88 -393 -35
7323 -35 -4 -281 202 284 28 -53 450 -406 -15 465 -55 -372 151 -215 -182 224 -172 -425 77 26 -360 186
7345 186 97 -268 -108 -40 -166 216 335 -337 330 133 -340 -76 117 -253 -217 225 -119 -62 246 -174 -409
7366 -409 238 -80 -280 228 100 -424 126 222 -57 341 244 -309 220 187 -306 160 372 -426 -60 171 -287
7387 -287 145 455 -42 -88 349 -206 125 418 61 -188 -75 -41 -244 285 -3 -375 237 196 -267 103 201
7408 201 -137 256 61 -231 162 393 -446 204 84 -220 87 244 -150 -195 264 -267 44 310 -36 -135 26
7429 26 -20 -230 -88 -92 -243 -31 -81 -146 295 53 -316 109 41 -114 136 289 -376 -81 344 -289 132 326
7451 326 -175 35 430 44 -110 450 8 86 340 -113 -121 313 -253 -99 415 182 -366 94 69 -201 355
7472 355 260 -282 277 -73 -249 -20 260 -84 172 69 -331 113 173 -134 58 229 -161 -145 181 -3 -344
7493 -344 279 -68 -205 15 64 -146 152 195 -446 -26 99 -432 88 87 -368 -68 92 -478 194 199 -273 53
7515 53 180 -563 -77 184 -196 -128 192 -162 -301 -91 -80 -542 19 -148 -251 223 15 -169 -13 21 -429
7536 -429 366 107 -90 16 65 -281 -52 -92 -315 -116 153 -447 71 301 34 -95 299 -139 -228 242 115
7557 115 -96 394 181 -88 103 163 -37 80 265 -217 255 129 -168 152 60 -162 -70 65 -59 -107 58
7578 58 -491 -39 318 -145 -230 377 -303 -163 406 14 -154 136 226 -190 37 -7 -310 76 124 -224 129 123
7600 123 -161 115 228 -67 20 451 -118 21 271 -485 -217 321 100 -40 155 12 75 239 43 -30 250
7621 250 -13 -217 154 208 -322 419 113 -316 47 242 -358 96 322 58 -158 -1 -202 95 59 -321 20
7642 20 323 -121 -165 150 -122 -247 224 -209 -52 -20 85 6 212 -31 -138 156 157 -297 49 196 -269 -253
7664 -253 152 -164 179 265 -255 -90 216 19 -22 117 -383 6 -2 -84 -7 118 -94 -139 293 161 -21 193
7686 193 -41 -158 148 236 -375 -2 -143 77 70 49 -226 -23 -44 -238 -77 473 -218 1 36 -231 -153 212
7708 212 -36 -88 230 63 -228 534 349 -303 469 65 -413 -1 159 8 -137 9 -139 169 49 2 65
7729 65 147 -302 132 -131 -159 -150 329 166 152 349 -112 -233 170 22 -128 35 -201 -295 73 -273 -110 171
7751 171 193 -147 205 12 -235 -159 11 -8 149 -28 -6 -336 18 -223 -67 -43 -363 -282 79 -18 -145 243
7773 243 9 -81 299 140 -364 179 -135 -300 1 77 -414 99 -180 -118 287 -48 -29 -138 203 -302 -242 330
7795 330 -112 -248 114 -27 73 196 -10 -262 2 -57 -367 26 38 -279 -26 -40 -1 -101 294 -179 256
7816 256 166 -219 191 22 -53 -21 219 -412 34 92 -30 18 233 -5 13 245 -230 1 379 -215 -134 -103 197
7839 197 -178 228 -44 -22 17 -110 -246 173 -35 -559 29 352 -91 67 164 -268 274 54 -246 -355 139
7860 139 12 -240 330 69 -78 420 -116 -22 111 -153 -237 540 -56 -152 248 206 -10 69 -40 140 -77 72
7882 72 -88 -214 147 16 130 -1 -160 98 58 -145 -226 397 72 76 335 -327 -91 -22 -47 -139 445 -138 124
7905 124 31 67 -149 453 199 -30 -54 -15 -231 -110 355 -144 206 74 -116 6 206 120 -8 148 153 69 -93
7928 -93 -231 23 86 -251 -91 83 -170 -253 162 171 134 161 -343 -223 149 172 -265 74 134 -579 -49 472 -16
7951 -16 121 21 17 81 51 76 -72 11 -95 -219 200 -19 -299 71 -62 167 91 100 -301 190 -23 -25 9 211
7975 211 -67 83 65 -149 -149 104 162 -15 391 -14 -315 -116 -382 -33 308 -89 -106 251 33 -139 256 172
7997 172 45 -16 156 -115 193 -40 20 18 116 -170 180 62 -30 120 105 -110 -79 4 -72 -66 57 150 -30 160
8021 160 -101 -36 174 161 -47 322 16 97 172 126 -275 -133 -182 -289 223 104 -181 -98 253 -185 -38 -45 158
8044 158 161 146 -94 121 363 -150 11 219 5 -65 -17 27 -71 281 -244 -72 209 -137 -46 79 -230 -107 -78
8067 -78 7 -69 -57 -17 -83 74 66 -137 12 -6 242 -73 138 220 54 195 -116 78 17 -120 -26 100 71 -191
8091 -191 -74 -98 -288 298 52 -189 20 -25 -165 78 -50 -44 -56 48 -239 58 110 -6 -31 -78 -91 -136 325
8114 325 145 180 151 -293 -176 101 -11 -277 62 -207 -181 -31 119 89 98 119 76 -124 -104 -169 187 6 -84 197
8138 197 -166 -385 10 236 -74 154 147 86 -17 130 -205 -404 251 -89 -65 175 -58 120 -23 -157 -112 -13
8160 -13 95 67 -26 -3 -159 -52 -304 213 149 -168 -105 -154 -130 -193 146 138 -271 48 149 14 215 246 -40 -307
8184 -307 -125 -49 66 198 -234 -100 -12
8191a2
$$ Imaginary data points
##PAGE= N=2
##DATA TABLE= (X++(I..I)), XYDATA
0 0 0 0 0 0 0 0 0 0 0 0 0 0 0 -3 5 -8 8 -8 8 -13 16 -16 21 -24 28 -34 37 -43 51 -58 67 -75 85 -95 108 -122
36 -122 137 -153 170 -188 208 -232 258 -284 314 -347 381 -421 463 -510 563 -620 682 -754 835
55 835 -927 1029 -1152 1293 -1462 1668 -1927 2259 -2700 3321 -4257 5814 -8847 16832 -79976
70 -79976 -150598 118331 34375 -37992 117738 20218 -39974 182723 62135 -124366 77311
81 77311 88553 -84752 34556 6331 -151384 33916 72574 -160487 -39182 92902 -68556
92 -68556 -2444 80717 -102675 -7612 154643 -58638 -82634 101045 -22414 -55858 81455
103 81455 -67200 -92343 134888 18329 -116173 77645 54613 -52245 97265 36359 -95582
114 -95582 102496 94320 -125606 -5210 57932 -105087 -11683 30780 -150284 -29595 93495
125 93495 -107289 -65104 98471 -32973 -7562 129333 -31878 -28671 161888 14637 -71945
136 -71945 101113 14099 -71805 77157 -25315 -136454 62893 27084 -137184 15860 41584
147 41584 -89081 43563 53418 -109038 40933 119566 -80178 -17173 91967 -55752 -11118
158 -11118 77751 -91770 -43043 117629 -46906 -83512 85394 -6291 -43217 99479 -12571
169 -12571 -69791 118177 36016 -100385 50117 31493 -83460 44686 9180 -133061 26559
180 26559 62004 -115901 -18864 61941 -64283 23593 84489 -83746 2039 139927 -31111
191 -31111 -40538 91706 -19171 -21233 90221 -62642 -86783 101485 -2537 -108486 39849
202 39849 696 -68100 70384 -374 -110397 72462 73801 -90252 15177 51874 -65660
213 -65660 39410 57618 -107465 1153 102268 -62838 -35176 66313 -46988 -1407 98468
224 98468 -59995 -53093 111704 -972 -63766 57524 -17938 -51276 83123 -22834 -115077
235 -115077 57765 36054 -88216 19384 16083 -68476 62264 48330 -101355 26129 98123
246 98123 -49173 695 59966 -54901 17649 85049 -79961 -44410 91102 -30153 -52629
257 -52629 52312 -44209 -43212 89459 -28057 -87336 73160 23480 -63627 47907 2732
268 2732 -67713 74441 35547 -99463 28454 62907 -60992 14681 37886 -72858 30142
279 30142 79867 -80130 -23770 83428 -34409 -23211 56671 -52957 -24106 88130 -42616
290 -42616 -72514 69837 -595 -55038 51505 -14238 -59603 75706 16726 -84222 44799
301 44799 45495 -55933 33353 28444 -71402 37937 60678 -79453 -6109 64500 -48096 -7864
313 -7864 47990 -64206 -11170 82059 -49483 -50882 69401 -12916 -36319 57156 -27203 -44037
325 -44037 84247 878 -75836 53067 27838 -53217 40333 10374 -67928 50531 39340
336 39340 -86652 7711 51232 -56143 3799 38121 -67500 6698 72996 -57562 -27621
347 -27621 72084 -20582 -16108 62309 -34982 -28684 84627 -13798 -63749 51901 5265 -48414
359 -48414 40824 -15461 -70552 54269 23612 -81807 16844 37890 -45977 25762 28881 -64112
371 -64112 30849 72102 -56426 -13962 60156 -27939 -3151 48580 -53236 -19932 77278 -29366
383 -29366 -54797 48635 -8045 -32772 51540 -23483 -58320 63725 15219 -69563 25483 18538
395 18538 -45681 37804 13824 -73996 32114 57506 -55887 -185 46653 -33212 20245 52741
407 52741 -58102 -6222 78648 -29554 -37021 43209 -26237 -24212 48907 -43079 -57893 59041
419 59041 -1250 -61238 30476 3845 -38064 52270 11513 -60288 46017 48092 -47706 16032
431 16032 33081 -41764 25463 39816 -64446 -4102 57353 -40058 -21901 37869 -35904 -8840
443 -8840 55875 -40111 -38568 61108 -6877 -42183 36853 -11298 -35246 50630 -7957 -62854
455 -62854 42429 25999 -49861 24058 22617 -39046 38560 35728 -54702 20066 56407 -39360
467 -39360 -2931 37762 -42851 -4037 43015 -53665 -31727 49383 -28958 -38372 36805 -22678
479 -22678 -27091 56563 -10377 -43994 55370 19943 -37634 36896 13144 -36740 43415 19265
491 19265 -61592 19004 37315 -47515 433 24234 -43816 11949 40991 -52837 -12454 55225
503 55225 -24150 -20964 36769 -26899 -15496 50421 -28725 -44191 47569 1243 -38830 32082
515 32082 -2237 -31991 50376 14081 -49755 35064 37264 -34192 19034 19750 -43311 22681 33737
528 33737 -59866 -11977 38591 -37104 -16996 23379 -42885 -7351 53078 -32379 -32113 52945
540 52945 1554 -19532 40901 -9353 -21767 58535 2838 -50797 33026 19397 -36799 20364
552 20364 3875 -47336 29340 26133 -56917 1719 35031 -32259 2643 24177 -44480 2459
564 2459 48370 -37574 -25623 40699 -14069 -13523 36402 -24725 -19914 58470 -1274 -37768 38172
577 38172 12945 -22703 33684 -1882 -42735 36698 18370 -55490 3740 17628 -39519 6651
589 6651 12803 -50859 8406 41919 -37378 -9590 41757 -15466 2765 43954 -24533 -10340
601 -10340 55550 -10394 -30876 34324 -6481 -26338 32695 -14595 -45062 34246 8088 -46855
613 -46855 16290 12547 -32785 24146 15717 -45646 18311 37514 -36668 -1033 30694 -26895
625 -26895 3847 33119 -35884 -8272 47469 -18779 -21451 36124 -10541 -15625 38210 -14719
637 -14719 -30701 39785 1044 -39931 21245 2373 -34919 23149 4195 -44985 20132 23929
649 23929 -38141 8149 26632 -26764 14567 32035 -33771 3563 44113 -23667 -12781 32840
661 32840 -19236 -11365 32963 -26789 -26954 39258 -8852 -34723 25653 -1605 -25036 31087 -2016
674 -2016 -37531 32372 19529 -37167 13919 18393 -28242 17884 18702 -40767 9535 36549 -30489
687 -30489 -7352 28516 -21780 103 33187 -29695 -15417 42333 -11758 -25959 25091 -9777
699 -9777 -18351 32838 -12356 -37312 32053 11088 -33827 15317 8036 -24483 27440 13497 -40367
712 -40367 15678 32884 -27401 205 20538 -25156 8547 28805 -36192 -11580 37681 -15644
724 -15644 -17114 23881 -17531 -11224 36827 -15964 -30605 33556 5213 -25627 20370 -2720
736 -2720 -26082 31408 7856 -40779 16341 22519 -26541 9129 12873 -30204 16514 29702 -34925
749 -34925 -4616 33075 -17507 -5702 22633 -24874 -6067 36631 -20929 -26210 29564 -4727
761 -4727 -19999 23137 -10111 -23160 33218 2672 -34002 21043 13857 -23164 18068 9490 -30157
774 -30157 19248 22863 -33159 2415 24453 -22473 1256 20324 -29325 -2713 31849 -22739
786 -22739 -16532 28073 -11172 -12717 25991 -14154 -17926 34496 -2842 -27971 24518 5723 -22958
799 -22958 20493 2550 -28695 22429 13496 -33970 8837 18937 -25963 6309 17258 -28246
811 -28246 5442 28150 -26202 -7056 29363 -14986 -6868 25862 -17730 -11676 32766 -11195
823 -11195 -24000 25275 -1415 -20278 20994 -4712 -25714 25909 6877 -31801 14020 14647
835 14647 -22578 11942 11204 -27737 13049 24687 -27978 -2216 25125 -16535 -1287 21159
847 21159 -22372 -4679 32350 -15766 -18777 24575 -5814 -14558 22013 -11331 -21665 28073
859 28073 789 -29993 15561 6946 -20505 17458 5377 -28422 18439 21473 -26215 4320
871 4320 20291 -16723 8032 19425 -27152 -229 30047 -19475 -14723 20230 -13489 -9253 21718
884 21718 -19294 -19679 29617 -2923 -23965 18376 1782 -15651 23441 1288 -25977 22351
896 22351 16383 -24382 8436 12385 -19892 11995 14609 -29333 2711 24966 -20326 -6790 17830
909 17830 -17162 -2285 23232 -20575 -14777 27169 -6814 -18127 17601 -6070 -13609 25054
921 25054 -4007 -24149 23250 10738 -20393 14226 8894 -18228 18086 12452 -27877 7657
933 7657 19885 -22117 -1935 13076 -22543 -413 19083 -24773 -9826 24764 -11863 -11378 20897
946 20897 -9122 -8562 27776 -5817 -18156 25242 4213 -18603 16412 1552 -19661 18286
958 18286 5433 -27966 10432 13678 -22313 4233 11297 -20981 7132 18234 -23324 -2110
970 -2110 23378 -14452 -6651 18525 -13924 -6123 23425 -13065 -15552 23832 -2400 -15188 18260
983 18260 -1567 -14722 21757 2125 -22935 16295 10177 -20201 8494 6566 -21534 9907
995 9907 12272 -26043 1024 18690 -17120 -2110 15499 -16539 468 24090 -15289 -9927 24295
1008 24295 -5017 -10971 17857 -8141 -12003 23336 -4334 -22756 17086 5147 -18225 11982
1020 11982 2419 -19136 16148 10152 -24832 6057 15905 -16909 2957 11439 -19827 3155 19739
1033 19739 -19393 -7942 20679 -8691 -5498 17494 -11321 -7379 25204 -5094 -16914 18374
1045 18374 2330 -12947 14411 -3181 -18841 16957 5274 -24943 6123 9390 -16881 6504
1057 6504 7388 -20591 8061 19037 -17901 -1885 18642 -10213 174 16834 -14645 -4589
1069 -4589 23103 -9625 -14197 16475 -4718 -11203 16143 -6853 -16888 18962 2454 -20130
1081 -20130 10868 5449 -15387 11746 5231 -21097 10033 14202 -18959 1956 13742 -13639
1093 -13639 3451 15137 -16948 -1036 21117 -11079 -7749 17142 -7661 -7073 16935 -9890
1105 -9890 -13681 18119 -2444 -17503 11876 -92 -14997 12947 1800 -18302 12447 10330
1117 10330 -16877 6630 11380 -13510 7288 12991 -16813 2402 17324 -13596 -4968 14354
1129 14354 -11041 -4320 15194 -12968 -10104 18278 -5595 -13887 13982 -1902 -10882 15201 -1977
1142 -1977 -16172 15589 6669 -16615 8514 7290 -13553 9245 8116 -18212 5802 14769 -15283
1155 -15283 -1417 12472 -12270 -226 14285 -14790 -5688 18135 -8134 -10083 13430 -5665
1167 -5665 -7690 16083 -5454 -13620 16635 3395 -14444 9764 3145 -11856 12192 4079 -18244
1180 -18244 7940 11490 -14898 1194 8525 -12715 4024 11816 -16445 -2758 16808 -8889
1192 -8889 -5877 12449 -7797 -3498 16329 -7803 -11208 16136 -184 -11560 10800 -1561 -11162
1205 -11162 13745 971 -17403 8917 7905 -13807 4493 5272 -13833 7404 10638 -15938 677
1218 677 14713 -9239 -1270 11156 -10250 -601 16122 -10050 -8950 14705 -3719 -8475 10824
1231 10824 -5145 -9826 14164 -1385 -15052 10097 4325 -11565 8106 3059 -12919 9732
1243 9732 8243 -14929 3363 10841 -10077 2011 9218 -12229 914 14136 -10815 -5545 12654
1256 12654 -5974 -5031 10995 -7555 -7404 14348 -3362 -11899 10623 615 -10444 9361 -401
1269 -401 -12391 10500 5066 -14071 5490 7796 -10237 4915 7639 -11845 4157 11955 -11505
1282 -11505 -1725 11487 -8124 -2559 10105 -9549 -5054 12903 -6473 -9679 10855 -2547 -7966
1295 -7966 10199 -2230 -9603 12095 2535 -12239 7998 4951 -9801 6911 4292 -11922 6033
1308 6033 8627 -12436 519 9378 -8530 341 8908 -9900 -1135 12490 -7711 -6329 10714
1321 10714 -4168 -5847 9488 -5115 -8256 11300 -1391 -11020 8135 2216 -8356 8209 2226
1334 2226 -10334 8772 7318 -10818 3584 7813 -8342 3258 6739 -11133 633 10492 -9677
1347 -9677 -4737 8743 -6321 -3284 9084 -7317 -5629 12517 -2396 -8462 8753 37 -6079
1360 -6079 9250 -703 -9800 9630 4458 -10191 4345 4816 -7957 5308 4769 -11179 3002
1373 3002 9276 -9031 -1886 7173 -7454 -354 8121 -9240 -4589 10694 -4345 -6783 7803
1386 7803 -2610 -4221 10577 -1988 -7741 10540 3362 -7725 6318 2464 -6959 7016 2980
1399 2980 -11450 3427 6248 -9848 -177 4042 -8889 1054 6612 -10004 -1812 9929 -4758
1412 -4758 -2767 8170 -3964 -1863 10787 -3748 -6280 9828 386 -6667 6622 -1059 -6907
1425 -6907 7857 967 -10159 4728 4262 -8597 2504 3080 -8550 3589 5558 -8967 59
1438 59 7779 -6150 -1368 6715 -5830 -930 9323 -4903 -4017 9752 -1603 -4596 7571 -1631
1452 -1631 -5306 8544 -945 -8481 5526 1614 -8199 3577 1131 -8451 4156 4060 -8888 2098
1466 2098 6553 -5921 1103 6317 -5603 1311 8356 -5997 -1987 8481 -3414 -3093 6697 -3886
1480 -3886 -4006 7355 -2956 -6919 6321 115 -6601 5078 187 -6485 6230 2471 -8480 3594
1494 3594 4573 -6354 1953 3899 -6609 2126 6584 -7240 -779 7210 -4012 -1090 6092 -4568
1508 -4568 -1790 8026 -3521 -5465 6165 -876 -4869 5007 -2095 -5704 6817 602 -7514 4159
1522 4159 3107 -5323 3588 2263 -6587 4042 5435 -6775 480 5612 -4369 22 4824 -5786
1536 -5786 -770 7183 -4563 -3780 5989 -2252 -2951 5538 -3061 -4341 6882 -355 -6322 4646 938
1551 938 -4831 4203 464 -6281 4707 3886 -6378 1583 4030 -4869 2126 4142 -5899 696 6246
1566 6246 -4245 -2102 5543 -2991 -1491 5207 -4077 -3271 6316 -1777 -4870 4633 -518 -4105 4642
1581 4642 -597 -5540 4732 2237 -5388 2580 2550 -4696 2922 3240 -5473 1510 4982 -4769 -253
1596 -253 4184 -3913 -227 4639 -4511 -2013 5606 -2644 -3113 4444 -1718 -2574 5193 -1394 -4357 5350
1612 5350 542 -4697 3580 1207 -4311 3607 1537 -5646 2698 3530 -5020 821 3120 -4305 970
1627 970 3732 -5028 -579 4962 -3392 -1792 4048 -2479 -1259 4723 -2759 -3017 5042 -642 -3770
1642 -3770 3503 -130 -3282 3844 172 -5157 3006 2149 -4778 1669 1997 -4043 1939 2809 -5003 474
1658 474 4239 -3388 -677 3535 -2896 -423 4377 -2990 -1990 4738 -1084 -2598 3395 -1396 -2554
1673 -2554 4115 -969 -4473 3229 771 -4015 2112 777 -3829 3011 2111 -4458 1359 3356 -2729
1688 -2729 924 2857 -3111 937 3839 -3577 -1235 4290 -2053 -2049 2955 -2417 -1917 4160 -1928 -3592
1704 -3592 3544 96 -2990 2436 -33 -3182 3373 1160 -4073 1962 2276 -2931 1411 2085 -3266
1719 -3266 1345 2959 -3303 -326 3335 -2300 -625 2706 -2934 -1193 3489 -2364 -2587 3177 -764
1734 -764 -2229 2700 -964 -2295 3572 314 -3124 2325 1201 -2631 2315 1201 -2809 2024 2243
1749 2243 -3397 707 2501 -2627 187 1895 -3429 -417 3087 -2738 -1344 2804 -1588 -1157 2654
1764 2654 -1253 -1548 3328 -379 -2592 2518 527 -2096 2423 158 -3000 2284 1022 -3124 1143
1779 1143 1530 -2543 1045 1494 -3039 914 2304 -2841 -421 2318 -1776 -790 2472 -1868 -818 3180
1795 3180 -985 -1766 2685 -359 -1526 2535 -394 -1728 2709 563 -2578 1554 967 -2147 1380
1810 1380 667 -2838 1161 1666 -2673 95 1875 -1998 466 1687 -2436 -137 2709 -1305 -919 2262
1826 2262 -867 -665 2409 -1522 -1575 2739 -473 -1953 1962 60 -1812 2044 20 -2470 1682 1363
1842 1363 -2412 708 1122 -1991 1228 1113 -2738 504 1895 -1810 -289 1717 -1477 -34 2222
1857 2222 -1464 -830 2725 -570 -1258 1939 -428 -1230 1985 -677 -1834 1946 333 -2160 689 200
1873 200 -1822 1483 603 -2184 844 1807 -1504 652 1196 -1662 654 1899 -1819 -203 2192 -824
1889 -824 -476 1989 -708 -738 1973 -1274 -1633 1811 -370 -1590 1106 -263 -1563 1520 -93 -2166
1905 -2166 1519 653 -2120 526 738 -1475 917 1484 -1639 576 1993 -1299 25 1720 -1191 -274
1921 -274 2017 -1555 -837 2011 -846 -1244 1229 -1005 -1142 1733 -731 -1616 1495 87 -1525 1341
1937 1341 385 -1489 1495 1004 -1740 822 1097 -1437 377 1036 -1545 277 1221 -1877 -629 1548
1953 1548 -1359 -276 974 -1038 -463 1453 -870 -1347 1726 -300 -1227 1359 -89 -1024 1837 120
1969 120 -1447 1317 847 -1306 1093 759 -1438 795 925 -1720 257 1155 -1553 -237 1059 -1529
1985 -1529 -139 1601 -1170 -577 1377 -606 -574 1419 -703 -550 1575 -209 -1108 1038 170 -1685
2001 -1685 1079 259 -1082 1502 481 -1723 449 900 -1384 477 890 -1457 492 1545 -1428 -96
2017 -96 1235 -1176 -201 1287 -1025 -330 1433 -1004 -884 1341 -310 -992 1303 -472 -1338 1320 236
2034 236 -1609 1204 342 -1252 1074 395 -1125 914 755 -1500 326 1297 -992 219 1064 -1361
2050 -1361 127 1734 -969 -496 1172 -602 -448 1308 -616 -886 1515 -361 -1062 1214 -6 -902
2066 -902 1017 -3 -1416 1370 469 -1384 726 767 -914 785 757 -1483 588 1240 -1371 18 1102
2083 1102 -1115 -3 1277 -1000 -489 1357 -810 -722 1370 -349 -659 1093 -603 -1212 1305 -29
2099 -29 -1261 1112 142 -1074 1128 141 -1536 795 667 -1255 385 554 -1357 683 820 -1254 88
2116 88 1419 -1076 -6 1135 -1171 -655 1212 -921 -622 1519 -540 -780 1253 6 -779 943
2132 943 -396 -1150 1295 167 -1177 747 274 -1050 955 777 -1321 500 1022 -1098 47 1053
2148 1053 -991 -77 1185 -1403 -296 1303 -723 -694 1218 -890 -475 1401 -837 -909 1318 -79
2164 -79 -1045 1248 -115 -1055 1025 -28 -1432 549 335 -1346 545 666 -951 632 841 -1625 138
2181 138 1080 -1026 -5 1316 -1149 -203 1431 -926 -746 1322 -407 -382 891 -646 -987 1392 -314
2198 -314 -1232 1168 39 -1078 993 147 -1441 820 315 -1359 526 880 -1406 468 728 -1328
2214 -1328 154 1265 -1216 -72 1439 -930 -621 1074 -963 -471 1372 -771 -1122 1238 -345 -1009
2230 -1009 1111 -498 -1377 1333 271 -1530 872 567 -1102 753 370 -1227 559 984 -1316 181
2246 181 1220 -1147 -83 1394 -1186 -229 1214 -1116 -623 1251 -454 -953 1277 -534 -844 1496
2262 1496 -186 -1374 1285 309 -1187 1309 127 -1248 925 591 -1455 581 1034 -1291 388 1030
2278 1030 -1568 -17 1003 -1536 22 1550 -963 -206 1229 -849 -623 1652 -511 -1177 1407 -209
2294 -209 -755 1189 -57 -1507 1469 198 -1510 1057 691 -1513 1097 577 -1659 654 1127 -1443
2310 -1443 -18 1502 -1277 -103 1350 -1294 -437 1689 -1233 -738 1643 -724 -789 1627 -855 -792
2326 -792 1873 -87 -1424 1365 212 -1558 1115 368 -1451 1075 762 -1924 380 1043 -1499 520
2342 520 1127 -1703 -42 1561 -1458 -458 1555 -1032 -593 1277 -1031 -804 1834 -654 -946 1545
2358 1545 -393 -1277 1464 -173 -1739 1140 363 -1506 932 542 -1413 898 567 -1945 579 1168
2374 1168 -1851 -66 1394 -1244 -151 1435 -1428 -280 1914 -1093 -1031 1768 -492 -679 1929 -470
2390 -470 -1292 1595 317 -1920 993 6 -1424 1133 345 -1855 886 640 -1680 464 836 -1753
2406 -1753 370 1392 -1614 -63 1626 -1134 -364 1697 -955 -390 1659 -752 -954 1897 -131 -1105
2422 -1105 1309 -120 -1221 1619 -332 -1403 1058 369 -1956 733 405 -1821 954 931 -2020 571
2438 571 1439 -1546 375 1277 -1235 239 1544 -1252 -467 2212 -595 -919 1546 -955 -887 1657 -642
2455 -642 -1592 1372 -239 -1617 1170 56 -1523 1565 502 -1852 1145 1228 -1662 497 1323 -1367
2471 -1367 565 1502 -1466 -74 1574 -1256 -393 1354 -1280 -708 1669 -1088 -1390 1788 -607 -1186
2487 -1186 1307 -301 -879 1826 259 -1914 1070 616 -1608 1031 750 -1537 903 1354 -1622 347
2503 347 1200 -1518 -83 1401 -1211 -297 1517 -1207 -1111 1979 -639 -867 1721 -863 -1131 1760 -101
2520 -101 -1580 1459 390 -1484 1274 525 -1542 1406 645 -1854 479 1051 -1485 209 1081 -1605
2536 -1605 376 1715 -1705 -385 1859 -957 -458 1775 -1236 -766 1984 -679 -1207 1688 -512 -1474
2552 -1474 1587 -215 -1575 1826 377 -1566 866 710 -1589 951 550 -1756 790 1209 -1557 283
2568 283 1350 -1490 54 1585 -1358 -327 1916 -1238 -889 1782 -951 -883 1432 -673 -1073 1717
2584 1717 -127 -1469 1435 392 -1661 1222 570 -1987 1136 814 -1823 872 1299 -1393 261 1166
2600 1166 -1789 71 1775 -1392 -303 1708 -1187 -362 1607 -1144 -1013 1959 -631 -1226 1728 67
2616 67 -1201 1881 -51 -1502 1561 489 -1653 1026 705 -1616 1102 744 -1943 623 1484 -1705
2632 -1705 315 1743 -1540 -269 1582 -1329 -438 1915 -1032 -944 1864 -935 -1032 1767 -578 -1804
2648 -1804 1768 202 -1605 1369 -3 -1853 1273 514 -1910 1156 1136 -1703 420 1140 -1408 245
2664 245 1245 -1750 -121 1683 -1392 -612 1648 -897 -526 1921 -828 -1218 1771 -696 -1141 1341
2680 1341 -338 -1444 1363 45 -1957 1467 587 -1583 985 700 -1564 847 1065 -1837 519 1480
2696 1480 -1634 1 1401 -1501 14 1831 -1525 -928 1698 -1063 -1298 1677 -580 -1008 1619 -396
2712 -396 -1623 1699 346 -1558 1318 398 -1592 1513 909 -1953 1090 1148 -1979 274 1368 -1553
2728 -1553 101 1527 -2020 -471 1708 -1252 -675 1770 -823 -567 2021 -722 -1250 2005 -174 -1255
2744 -1255 1736 -94 -1302 1518 105 -1907 1041 483 -1850 531 797 -1810 774 1405 -1988 63
2760 63 1441 -1725 -193 1532 -1150 -93 2162 -1067 -947 1967 -587 -1088 1738 -697 -1126 1854
2776 1854 -90 -1644 1325 129 -1904 1223 542 -1853 1118 813 -1809 818 1216 -1454 247 1497
2792 1497 -1738 391 1813 -1286 -362 1863 -985 -837 1892 -940 -674 2055 -751 -1577 1714 -209
2808 -209 -1475 1512 -292 -1880 1435 573 -2276 1182 884 -1705 921 1231 -1919 616 1500 -1857
2824 -1857 229 1531 -1435 -318 1728 -1485 -450 2163 -1045 -781 1786 -560 -1083 1697 -452
2839 -452 -1697 1739 11 -1816 1225 528 -1746 1296 698 -1802 1129 1362 -1672 532 1433 -1492
2855 -1492 12 1608 -1715 -137 1590 -1486 -540 1586 -1136 -749 1788 -817 -1334 2066 -584 -1424
2871 -1424 1546 -104 -1161 1663 209 -1507 1334 932 -1639 857 891 -1722 580 847 -1980 527
2887 527 1633 -1700 -284 1457 -1255 -456 1688 -1490 -540 1711 -727 -1141 1525 -353 -1092 1614
2903 1614 -381 -1695 1748 341 -1608 975 304 -1440 1042 657 -1963 793 1429 -1618 94 1115
2919 1115 -1411 -206 1467 -1708 -231 1934 -959 -773 1396 -941 -572 1728 -828 -1142 1759 -179
2935 -179 -1484 1442 -218 -1540 1587 191 -1861 1135 954 -1686 773 740 -1598 626 1320 -1856
2951 -1856 -99 1611 -1275 -17 1442 -1310 -232 1661 -1319 -928 1518 -569 -943 1340 -193
2966 -193 -1263 1539 -30 -1480 1551 301 -1260 927 529 -1549 868 815 -1984 565 1127 -1497
2982 -1497 5 1126 -1516 123 1516 -1038 -537 1687 -843 -496 1776 -954 -873 1843 -453 -1162
2998 -1162 1391 -12 -1288 1540 51 -1541 1323 337 -1711 813 894 -1682 608 767 -1517 644
3014 644 1317 -1478 -56 1837 -1091 -78 1398 -1236 -618 1956 -955 -1050 1462 -579 -1029 1438
3030 1438 -392 -1404 1483 124 -1582 1134 460 -1314 1112 844 -1411 1095 975 -1749 479 929
3046 929 -1284 213 1374 -1498 -111 1667 -1183 -538 1386 -967 -741 1355 -676 -970 1751 -500
3062 -500 -1407 1438 60 -1362 1611 135 -1446 1489 393 -1702 851 881 -1457 404 1082 -1565
3078 -1565 503 1309 -1552 -375 1365 -1095 -247 1418 -1288 -671 1830 -596 -894 1602 -260 -970
3094 -970 1238 -95 -1379 1293 228 -1664 796 403 -1215 816 662 -1910 780 1017 -1679 166
3110 166 960 -1459 18 1330 -1438 -254 1450 -1038 -715 1730 -799 -499 1721 -881 -926 1883
3126 1883 -309 -1335 1235 -61 -1019 1229 107 -1613 691 542 -1425 515 915 -1242 418 1143
3142 1143 -1521 27 1493 -1463 -208 1307 -844 -506 1344 -1123 -595 1433 -1045 -996 1419 -319
3158 -319 -1218 1630 -38 -1513 1381 403 -1515 1027 562 -1590 796 816 -1557 441 1210 -1356 126
3175 126 1255 -1087 186 1313 -1027 -123 1496 -996 -878 1587 -562 -797 1603 -292 -1251 1414
3191 1414 -173 -1150 1151 179 -1295 1336 340 -1705 943 759 -1673 724 822 -1498 622 1086 -1588
3208 -1588 15 1334 -1113 16 1335 -685 -215 1766 -761 -880 1757 -266 -1229 1132 -249 -961
3224 -961 1450 -28 -1702 1019 485 -1563 735 360 -1487 795 1125 -1477 376 1139 -1274 192
3240 192 1331 -1541 42 1711 -1037 -416 1496 -523 -1026 1240 -926 -1005 1413 -347 -1493 1255
3256 1255 295 -1128 1062 323 -1424 1332 566 -1695 544 1082 -1099 554 1038 -1534 380 1091
3272 1091 -1257 -301 1371 -1525 -469 1169 -802 -899 1669 -784 -1233 1604 -322 -1067 1387 -12
3288 -12 -1254 1363 445 -1522 591 708 -1167 866 594 -1582 618 1234 -1639 222 1115 -1199 -46
3305 -46 1161 -1482 -383 1534 -878 -773 1314 -750 -974 1433 -536 -1152 1619 -69 -1127 1248
3321 1248 83 -1266 1000 267 -1626 777 611 -1752 436 918 -1357 158 1072 -1425 -133 1182
3337 1182 -1088 -115 1429 -709 -678 1348 -681 -782 1528 -499 -1103 1447 -381 -1340 1378 -51
3353 -51 -1406 1158 342 -1798 792 621 -1437 747 735 -1540 272 1479 -1058 40 1257 -856
3369 -856 -127 1385 -1298 -327 1443 -823 -867 1612 -387 -1003 1414 -458 -1141 1155 84 -1515 1178
3386 1178 114 -1218 780 573 -1531 846 1006 -1571 232 736 -1193 331 1093 -1398 -136 1277
3402 1277 -1172 -301 1048 -816 -383 1596 -730 -1214 1592 -403 -1116 1173 -83 -980 1367 248
3418 248 -1268 1037 677 -1253 740 950 -1237 562 776 -1689 141 1528 -1256 -288 1202 -1052
3434 -1052 -193 1424 -953 -731 1625 -491 -845 1313 -274 -761 1637 -234 -1528 993 190 -1426
3450 -1426 780 346 -1500 782 742 -1653 501 925 -1683 408 996 -1427 101 1349 -1291 -772
3466 -772 1109 -737 -721 1495 -711 -945 1603 -347 -1103 1496 9 -1190 1200 -11 -1495 1270
3482 1270 536 -1537 521 577 -1563 765 829 -1349 315 1138 -1390 65 1128 -1304 -150 1194
3498 1194 -884 -456 1595 -804 -835 1309 -713 -780 1322 -32 -1062 1281 149 -1331 1148 539
3514 539 -1460 613 647 -1450 825 702 -1423 470 1096 -1327 -253 1250 -1038 -68 1180 -973
3530 -973 -445 1516 -908 -727 1456 -533 -997 1345 -350 -1120 1289 142 -1263 814 362 -1245
3546 -1245 1025 676 -1485 597 858 -1471 100 1086 -1549 349 1338 -1158 -282 1311 -932 -618
3562 -618 1452 -644 -649 1364 -318 -623 1567 -163 -1164 1181 -194 -1548 968 294 -1409 813
3578 813 392 -1587 509 824 -1477 370 1065 -1214 -180 1136 -681 -238 1193 -1018 -153 1246
3594 1246 -734 -687 1253 -279 -879 1314 -387 -1254 976 38 -1243 1031 -156 -1319 1190 367
3610 367 -1137 500 1090 -1399 135 961 -1015 206 1142 -1244 11 1131 -1086 -559 1333 -897
3626 -897 -522 1347 -775 -841 1102 -510 -1267 1061 109 -861 1274 301 -1388 676 367 -1498 603
3643 603 805 -1270 348 981 -1179 129 1327 -1189 -97 1342 -1258 -247 1367 -793 -550 1159
3659 1159 -712 -782 1189 -305 -917 1088 -209 -1215 1061 445 -1110 1003 697 -1205 652 803
3675 803 -1302 615 892 -1054 75 1063 -1241 -152 1022 -1132 -258 1410 -859 -436 1109 -271
3691 -271 -904 1447 -480 -854 1289 175 -1158 846 99 -1402 1044 130 -983 645 840 -1440
3707 -1440 474 750 -1190 -11 985 -1009 -37 1233 -996 -624 1308 -865 -419 1272 -600 -647 1085
3724 1085 -275 -872 940 -471 -921 1099 2 -1207 676 380 -1232 357 475 -1265 706 787
3740 787 -1533 205 820 -1081 23 1155 -680 -7 1151 -1305 -742 1146 -450 -868 853 -405
3756 -405 -735 1041 28 -1046 1124 162 -980 890 430 -1209 737 525 -1156 487 777 -958
3772 -958 444 886 -1240 216 871 -1048 -328 1034 -493 -460 1031 -708 -685 1423 -406 -680 999
3789 999 14 -830 1055 24 -1015 838 139 -1006 455 372 -1116 774 832 -1015 345 838 -1111
3806 -1111 34 982 -1099 -169 1236 -596 -299 1168 -781 -485 1009 -456 -447 1082 5 -996 779
3823 779 96 -1174 953 215 -1251 597 234 -1229 469 648 -1046 320 652 -1344 -5 1073
3839 1073 -1114 -43 1036 -501 -122 1088 -825 -404 1020 -241 -617 1014 -291 -827 920 -129
3855 -129 -747 1030 121 -1161 643 512 -1307 638 805 -926 121 724 -1218 306 984 -886 -95
3872 -95 914 -827 -392 1156 -467 -197 1041 -629 -621 852 -317 -760 875 -149 -643 620 238
3889 238 -923 701 443 -901 644 435 -1108 435 806 -681 11 974 -879 -23 944 -1016 -313
3906 -313 768 -565 -278 924 -339 -516 1145 -247 -874 908 28 -812 693 23 -861 641 338
3923 338 -1046 579 865 -847 337 421 -1055 152 958 -876 -83 982 -845 -220 726 -566 -247
3940 -247 999 -395 -666 981 -129 -826 697 19 -820 701 74 -977 193 402 -748 501 418
3957 418 -557 356 458 -695 139 567 -313 106 601 -789 -2 844 -580 -336 766 -378 -642 694
3975 694 -109 -404 745 -58 -607 613 -5 -593 593 523 -708 381 442 -443 355 637 -879 69 557
3994 557 -457 -105 684 -566 -128 624 -138 -384 565 -191 -334 762 -588 -405 706 -139 -790 458
4012 458 -136 -747 829 121 -1003 564 426 -682 535 515 -822 26 488 -563 138 418 -183 -30
4030 -30 681 -486 -222 804 -336 -252 694 -215 -377 801 6 -343 714 148 -716 445 -35 -680 506
4049 506 392 -652 274 392 -510 438 786 -684 140 860 -497 19 680 -565 -380 506 -244 -277 634
4068 634 -452 -449 922 25 -529 412 -139 -474 626 162 -461 737 450 -617 334 657 -649 244 366
4087 366 -617 42 725 -439 57 488 -505 0 871 -521 -476 646 -279 -472 701 -108 -587 541 63
4106 63 -397 461 392 -742 582 315 -727 598 381 -749 121 669 -343 -161 420 -719 -158 252
4124 252 -552 -349 579 -396 -483 590 -240 -631 424 -258 -571 513 -211 -576 422 190 -494 162 465
4143 465 -666 282 206 -689 196 489 -596 128 875 -582 -142 683 -287 -388 393 -286 -446 435 -148
4162 -148 -479 622 47 -503 315 2 -342 311 -2 -748 293 285 -648 65 79 -343 54 435 -340 18
4182 18 684 -242 -283 409 -398 -341 494 -177 -310 284 15 -522 442 -80 -353 369 -38 -446 419 228 -423
4203 -423 328 111 -608 361 109 -751 256 640 -585 -44 498 -179 -138 632 -452 -407 530 6 -213 644
4223 644 -197 -250 464 -63 -346 334 109 -318 304 239 -374 294 219 -603 90 271 -217 148 369 -423 73
4244 73 361 -254 -78 290 -374 -216 456 -207 -345 282 -225 -486 447 -24 -545 501 164 -688 161 240
4264 240 -697 211 360 -405 24 319 -467 104 447 -237 -270 250 -62 -207 502 -315 -495 485 -67 -381
4284 -381 143 -366 -403 310 -255 -209 360 -54 -333 514 -196 -359 312 474 -546 141 174 -380 131 216 -230
4305 -230 -313 116 -239 -61 523 13 -44 622 -29 -332 299 10 -359 376 -260 -389 200 12 -454 507 144
4326 144 -228 223 16 -471 90 341 -267 25 390 -190 -55 202 -421 104 336 -284 -139 305 -64 -454
4346 -454 219 -208 -366 591 -231 -389 169 -77 -375 97 240 -288 218 326 -317 21 163 -236 -50 200
4366 200 -143 -203 171 -516 31 323 -122 -218 250 -172 -111 208 14 -148 283 -269 -241 196 106 -230 35 173
4388 173 -305 164 205 -544 143 217 -165 -13 214 -237 -157 219 -163 -226 270 -178 -356 364 -109 -279 456
4409 456 4 -135 236 82 -107 596 109 -154 187 210 -175 152 223 -45 -82 302 -92 -254 78 -69 -70 315
4431 315 83 -135 295 87 20 96 250 -284 219 -161 -104 105 27 0 160 215 -94 124 74 -194 100 282
4453 282 -276 -82 144 -336 123 241 -96 -196 261 19 -186 262 -201 -396 -13 120 -239 233 -100 -176
4473 -176 272 230 66 328 89 -429 185 306 -305 66 427 -209 125 215 -119 29 82 -161 -147 67 -98
4494 -98 -247 305 -4 -305 259 176 -235 45 -57 -146 212 108 -543 62 264 -351 317 78 40 -222 -10
4515 -10 48 -77 87 -234 -200 382 8 -314 249 68 -194 162 162 148 347 86 12 330 -23 -71 179 16 -8
4538 -8 175 140 -127 12 -117 -194 40 -22 -151 -45 153 -91 -263 191 -48 -40 263 117 33 85 -1 -266 107
4561 107 -73 -27 86 172 -292 195 286 -277 -142 291 -56 -47 191 -222 49 300 100 52 223 -25 111 200
4583 200 106 -248 300 -27 -317 81 4 -337 191 136 -91 -162 91 27 -7 280 -281 -35 -38 -384 -227 238 -105
4606 -105 108 299 -215 -223 103 75 -257 179 -75 -198 226 -205 2 -80 134 -225 228 -201 -410 -175 -229 -165
4628 -165 41 143 -434 148 44 -241 -134 348 -152 -172 269 -213 -215 169 -26 -207 332 -84 -249 -42 142
4649 142 -86 383 -91 -105 127 143 -251 -141 174 -156 315 218 -119 40 238 -199 -172 425 -164 -32 164
4670 164 -70 -48 -201 -54 -306 255 -300 -286 164 -147 -82 135 -196 -317 303 123 -174 288 15 -256 83
4691 83 63 -42 340 253 -94 -70 259 -212 -69 61 -143 -36 192 -104 -440 47 56 -83 213 -37 41 233
4713 233 255 -90 -12 80 -223 27 23 137 -106 178 25 -315 164 -180 177 79 -148 -30 320 -132 -206 155
4735 155 222 -94 404 -125 -325 243 -165 -158 161 34 31 364 445 -383 85 289 -342 -173 269 -20 21 614
4757 614 -190 -184 336 44 -215 335 6 -84 248 97 -121 281 98 -91 197 -227 -352 284 6 -392 139
4778 139 139 -93 168 8 -328 -62 66 -498 -81 64 -471 -114 173 -269 -17 101 -181 -233 426 159 -235
4799 -235 174 -181 -159 161 126 -156 9 88 -420 31 121 15 -11 10 -361 27 148 -116 56 -17 -248 -90
4821 -90 316 -187 -80 184 49 -42 340 270 -414 147 52 102 245 192 -191 10 27 -257 -71 190 -285 16
4843 16 136 -261 153 269 -254 78 260 -283 75 95 7 2 577 -178 -301 170 58 -174 214 -84 -322 230
4865 230 -327 -331 -118 23 -223 -180 180 -91 154 244 -160 56 211 5 -45 73 -222 -312 217 -356 -28 299
4887 299 -125 -306 341 -296 -196 205 46 -323 166 128 -225 206 -64 -89 110 130 -226 44 -30 -49 60 345
4909 345 -89 -183 -135 -311 -294 356 55 177 361 -148 -275 169 -2 -80 -101 251 -115 341 -257 -12 -196 -44
4931 -44 -253 -2 93 -193 -75 -65 -118 -21 90 -88 -2 430 -150 -117 94 290 -376 361 112 -395 312 -340
4953 -340 -258 16 129 -92 -18 -154 -352 -18 25 -364 -144 107 -41 93 -71 -44 -211 81 -308 -62 125
4974 125 53 -325 143 -125 -98 443 75 -84 -53 115 -66 290 101 -59 125 210 135 -117 300 -26 -30 -65 -240
4997 -240 -88 150 -221 -201 107 -180 -15 -38 -61 -363 62 -68 -266 288 -258 -111 175 220 -45 -2 -52 -139
5019 -139 69 -30 113 123 159 -302 -99 -53 -48 -167 -65 42 25 118 -145 -68 202 -337 -91 86 31 5 182 28
5043 28 -247 123 -185 -345 195 -149 -120 -249 377 -408 -13 53 -239 91 111 -184 61 125 84 -392 207 -200
5065 -200 -154 216 -19 -179 87 -11 66 342 -128 -158 55 240 -154 285 -141 -118 -163 51 -173 -80 -28 -224 147
5088 147 56 -110 -8 206 -220 -51 175 -76 31 329 -158 -46 -14 130 -197 -112 290 -436 219 61 31
5109 31 -101 131 -110 1 78 -87 101 319 -195 141 72 -147 -121 102 93 40 325 -165 194 -32 125 -112
5131 -112 222 -58 6 305 -51 -170 88 109 -289 121 -6 -116 107 1 -292 48 147 -72 -4 -34 -51 -20
5153 -20 81 -123 8 194 38 130 114 44 42 77 121 -246 225 8 -225 34 10 -219 188 216 98 49 -45 -230
5177 -230 154 -106 -173 104 213 -317 63 144 -106 -9 5 -119 -276 154 -294 -367 98 -140 -129 184 66 -189
5199 -189 -131 -276 -407 313 -77 -325 136 312 -113 -63 207 16 10 -99 92 -154 182 -145 -52 130 71 -112
5221 -112 25 163 -124 5 -168 54 172 17 -85 60 216 42 -232 280 -54 146 121 -434 34 39 -95
5242 -95 277 71 -118 46 65 5 27 205 -133 -110 -70 -48 -3 294 -69 -74 242 -55 -123 -30 -8 -136 65 194
5266 194 -301 63 -66 -18 -21 239 5 -99 122 -341 181 99 -108 -184 288 -249 -163 271 266 -90 109 265 -201
5289 -201 -53 204 -250 -45 -131 -294 118 185 -202 -88 116 -199 -111 -11 -10 -118 -7 -15 -208 301 39 -18 -70
5312 -70 -161 -85 -25 322 -275 -41 168 -155 220 61 -9 324 303 -293 -75 93 -306 117 150 -151 96 131 -117
5335 -117 -24 335 -28 -130 123 14 -187 317 -181 -64 328 -35 -329 -39 383 -218 213 -81 -295 258
5355 258 142 49 -106 301 -190 48 178 -503 69 364 -499 -64 159 -69 160 97 -4 -306 230 43 -127
5376 -127 35 -99 -234 296 -145 -312 164 -45 -130 157 394 -300 166 -78 -168 109 227 -305 -83 244 -495
5397 -495 -192 164 -122 -118 260 -157 -401 310 -12 -3 154 -111 -119 166 29 -101 96 178 -272 257 236 -300 6
5420 6 218 -14 252 69 -136 -208 244 -18 123 71 -390 -168 375 -123 -216 328 3 -120 281 135 -77 35
5442 35 35 -29 286 30 -244 18 -23 -43 -91 191 -276 268 237 -303 -85 86 -296 -265 349 -159 -33 300 -61
5465 -61 -347 98 -175 -229 175 -370 -218 81 127 -513 296 116 -433 64 -73 -356 239 493 89 75 133 -375
5487 -375 131 284 -306 48 121 -142 -190 333 -29 -254 101 -97 -281 126 -405 -148 158 -108 -233 -109 244
5508 244 -184 325 122 -161 83 192 -298 218 342 -31 -258 232 -402 -303 366 46 65 369 15 -375 225
5529 225 -168 -122 302 29 -26 318 -148 -396 170 28 -351 20 325 -140 60 412 -516 -34 483 -308 -73
5550 -73 233 -314 -133 112 -368 -415 391 -31 -49 421 -40 -169 243 28 -452 183 137 -331 182 34 -355
5571 -355 106 226 -453 -270 116 112 -176 -27 -384 -355 233 -383 6 427 -54 -359 207 24 107 176 -26 -243
5593 -243 204 37 -301 180 -19 -343 245 128 -102 378 50 -55 271 459 -449 3 240 -281 -21 379
5613 379 -65 267 651 0 -201 105 -289 -103 575 101 -246 120 43 -113 124 203 -234 -173 246 -223 279
5634 279 192 -610 2 319 -285 -114 101 -48 -45 264 62 -223 465 -359 -151 423 -51 -523 184 151 -207
5655 -207 189 -212 -391 335 -107 -452 329 329 -247 495 235 -184 36 66 -125 108 170 -37 -157 249 -272
5676 -272 -362 461 -260 184 330 4 -406 300 -128 -14 453 -90 -137 449 67 -331 38 -7 -464 253 229
5697 229 -505 -77 333 -388 232 381 -402 268 317 -160 118 332 -303 -106 374 -219 -411 556 -283 -124
5717 -124 372 -38 -301 530 -41 -248 324 115 -608 162 415 -452 49 155 -459 21 513 -525 176 62
5737 62 -312 207 300 -255 -128 236 -280 35 147 21 -186 449 -114 -406 406 40 -301 645 31 -243 216
5758 216 254 -302 304 230 -217 -154 334 -281 131 435 -124 -7 604 -22 -311 455 -213 -333 431 -96 -153
5779 -153 324 -115 -248 485 -27 -507 226 290 -79 190 130 -481 133 67 -360 -52 312 -535 -69 493 -461
5800 -461 -70 349 -260 -23 358 -25 -155 497 -198 -335 453 16 -199 410 166 -618 435 190 -178 136
5820 136 189 -296 51 181 -406 283 50 -421 -131 319 -319 -41 383 -508 -259 501 81 -346 332 -149
5840 -149 -403 307 -169 -477 253 228 -362 504 76 -668 507 -73 -369 56 7 -446 2 220 -412 -145
5860 -145 642 -191 -148 384 -232 -306 430 -346 -33 500 -189 -435 408 -149 -532 408 218 -514 218 301 -382
5881 -382 442 -129 -520 388 342 -409 12 -50 -636 171 177 -276 61 507 -264 -305 421 63 -331 439 -210 -423
5903 -423 586 -204 -547 474 66 -313 510 385 -416 411 227 -383 447 147 -316 148 198 -464 114 500
5923 500 -456 -14 636 -399 -71 650 -372 -26 254 -223 -251 575 -54 -166 514 118 -419 444 1 -580
5943 -580 318 -51 -439 253 31 -351 179 298 -388 299 563 -257 159 181 -290 -105 728 -172 -350 593
5963 593 -254 -219 555 32 -538 417 135 -504 558 174 -365 471 -43 -227 243 391 -401 169 167 -339 150
5984 150 263 -464 227 429 -138 45 475 -348 -34 580 -184 -386 458 -139 -374 344 -161 -401 538 37
6004 37 -826 407 491 -567 366 321 -410 354 454 -387 138 132 -362 -145 234 -401 151 396 -451 -212 562
6025 562 -216 -62 511 -108 -153 285 -206 -392 132 126 -370 438 30 -265 350 189 -582 123 139 -496 48
6046 48 362 -342 -8 403 -534 -131 138 -29 -286 529 -425 -397 280 -222 -317 654 128 -275 432 20 -446
6067 -446 326 2 -274 316 -119 -601 272 345 -451 276 313 -305 116 335 -556 142 390 -595 -33 327 -437
6088 -437 -344 787 -307 -211 205 -271 -252 368 -209 -605 272 -154 -376 408 81 -373 432 322 -429 252
6108 252 192 -491 -3 549 -516 4 519 -256 -130 515 -285 -258 584 -405 -369 468 75 -263 225 -85 -329
6129 -329 553 -50 -419 200 -61 -469 223 311 -368 244 334 -328 44 233 -659 -11 511 -390 -106 383 -350
6150 -350 -86 345 -114 -100 623 -223 -274 455 115 -519 340 -49 -475 101 -107 -567 441 -131 -307 373
6170 373 162 -431 175 208 -496 86 -74 -369 -89 499 -219 -119 723 -152 -187 549 -275 177 376 -199 -350
6191 -350 390 89 -524 550 -47 -368 324 107 -244 47 149 -417 216 393 -539 34 462 -200 142 459
6211 459 -275 124 317 -275 -406 394 -412 -282 420 -128 -433 522 -161 -474 397 -29 -455 501 121 -418
6231 -418 312 160 -402 64 229 -568 77 222 -192 273 549 -538 55 366 -348 -264 232 -504 -186 633
6251 633 -244 -142 486 -26 -264 354 41 -405 300 -35 -363 242 139 -429 292 400 -698 421 259
6270 259 -356 85 194 -485 -53 446 -198 -135 481 -439 -246 475 -331 -159 273 -199 -287 457 36 -456 476
6291 476 59 -306 308 185 -415 308 157 -558 326 393 -280 78 356 -367 219 478 -66 50 546 -146
6311 -146 -69 647 -420 -180 404 -65 -107 435 -69 -247 308 -62 -77 513 -84 -361 70 1 -481 -30 312
6332 312 -420 -30 458 -644 84 506 -583 -350 319 -147 46 505 -404 -349 527 -188 -421 427 -93 -395
6352 -395 486 72 -303 312 -25 -515 436 -75 -402 287 230 -659 270 325 -547 60 426 -161 -70 355 -355
6373 -355 -237 282 -413 -91 441 -103 -206 732 -67 -379 487 3 -681 665 157 -365 423 18 -513 347
6393 347 177 -813 -184 675 -448 93 417 -462 72 546 -288 -144 236 -119 -250 598 -583 -235 654
6412 654 -47 -333 763 152 -439 302 64 -418 229 149 -392 419 359 -443 415 326 -661 39 396 -438 85
6433 85 323 -318 -89 401 -131 -171 598 -341 -61 442 -48 -224 298 -14 -358 578 160 -505 203 229 -527
6454 -527 232 209 -256 234 303 -436 271 566 -436 45 309 -496 98 85 -366 -169 443 -37 -267 467 144
6475 144 -413 413 113 -421 207 160 -572 203 -69 -391 483 261 -670 148 510 -642 328 350 -459 105
6495 105 525 -477 70 634 -372 -206 408 -160 105 644 44 -146 112 -133 -391 341 120 -531 474
6514 474 -33 -709 403 118 -493 249 150 -396 3 349 -530 8 505 -488 -36 252 -249 -148 402 -316
6534 -316 -351 403 -170 -310 604 -127 -176 368 -102 -248 509 20 -656 329 -75 -226 301 -33 -476 164 116
6555 116 -687 206 301 -79 117 205 -175 29 646 -132 3 402 -385 -49 326 -279 -336 304 56 -349 355
6576 355 173 -358 415 221 -668 301 176 -395 217 341 -634 28 463 -536 99 352 -429 62 299 -352
6596 -352 -64 209 -139 -179 402 -268 -406 287 -267 -474 371 -98 -418 558 139 -576 131 284 -447 405
6616 405 445 -670 49 102 -268 143 543 -450 -274 376 -325 -201 414 -54 -467 481 -247 -19 399 144
6636 144 -350 264 -110 -594 406 89 -374 121 254 -415 285 104 -422 208 334 -415 111 386 -435 -23
6656 -23 419 -185 -119 394 -433 -230 737 -249 -195 537 -74 -289 397 80 -525 657 162 -329 472 52 -326
6677 -326 230 520 -359 147 233 -575 98 269 -351 5 282 -451 12 426 -300 -156 258 -354 -206 630
6697 630 -166 -385 483 121 -280 68 -16 -624 247 129 -856 300 174 -480 278 386 -454 166 653 -619
6717 -619 44 187 -356 106 536 -622 -259 531 -266 -320 468 -91 -319 460 18 -147 382 -100 -602 559
6737 559 206 -504 220 215 -539 343 210 -652 144 104 -551 164 214 -383 40 398 -271 -261 494 -164 -203 644
6759 644 -346 -107 630 -388 -558 239 64 -559 325 5 -473 99 404 -398 336 143 -559 -32 650 -339
6779 -339 69 435 -253 33 335 -227 -159 651 -266 -62 725 -88 -290 316 -205 -370 274 45 -344 613
6799 613 -3 -406 328 334 -436 216 327 -449 203 324 -511 -12 366 -659 -122 234 -345 -51 678 -382
6819 -382 -288 524 -211 -206 431 84 -402 434 136 -426 324 224 -473 432 69 -261 100 76 -533 62 299
6840 299 -563 125 62 -472 -199 316 -376 81 639 -148 -185 563 -65 -269 363 -258 -563 440 178 -234
6860 -234 477 209 -513 229 178 -353 557 140 -634 336 406 -313 37 604 -173 62 228 -382 -61 640 -258
6881 -258 -300 432 -466 -207 812 -124 -444 94 -76 -263 245 -22 -445 40 2 -373 439 22 -644 -14
6901 -14 324 -520 120 267 -348 28 265 -394 77 568 -202 -66 514 -252 -412 490 -57 -470 402 -81
6921 -81 -128 629 51 -345 243 -76 -549 510 -59 -97 549 104 -255 -181 445 -364 47 205 -583 -217 226
6942 226 -392 -236 617 -286 -152 390 -199 -395 372 -53 -339 215 -218 -405 426 52 -504 338 256 -471
6962 -471 71 408 -230 395 236 -519 74 212 -588 -226 180 -261 -114 546 -256 -516 431 -207 -313 584
6982 584 53 -276 274 -100 -410 615 139 -402 438 302 -307 187 -168 -518 172 -56 -401 33 332 -245
7002 -245 146 266 -205 -98 574 -241 56 436 -331 -308 534 -126 -258 551 -473 -341 384 274 -881 212
7022 212 368 -324 472 152 -391 270 174 -224 320 418 -329 -51 582 -427 -152 368 -289 -124 112 -286
7042 -286 -145 591 42 -3 528 73 -243 319 -181 -269 278 12 -542 191 86 -179 123 378 -507 50 359
7063 359 -296 13 233 -300 -126 538 -476 -310 535 -348 -221 379 30 -472 438 29 -280 465 27 -328
7083 -328 446 -96 -361 252 167 -277 231 73 -330 -51 230 -388 -5 374 -329 -262 302 -486 -142 249 -133
7104 -133 -156 261 -139 -405 458 10 -107 370 -96 -273 250 156 -565 225 108 -549 155 284 -462 145 147
7125 147 -367 -215 406 -569 85 551 -547 -362 341 -300 -96 371 -310 -331 394 -330 -399 393 195 -189
7145 -189 387 307 -78 233 69 -199 235 404 -475 -97 276 -205 264 80 -64 18 162 -260 -187 262 -271
7166 -271 -176 416 -35 -9 511 -128 -346 383 60 -367 245 288 -334 161 200 -91 423 99 -411 105 268
7187 268 -402 -107 219 -639 166 283 -212 47 334 -391 -324 291 -26 -382 302 -138 -237 588 135 -325 398
7208 398 79 -378 158 126 -263 210 443 -262 353 191 -108 233 257 -293 204 471 -165 237 398 -157 -318
7229 -318 411 -206 -259 233 -225 -123 293 22 -272 222 164 -308 282 186 -433 131 129 -274 278 334 -391 395
7251 395 -16 -57 -77 126 -540 172 270 -5 -507 525 -354 -229 367 -341 -370 359 64 -176 300 91 -257
7272 -257 295 -137 -379 350 89 -242 41 508 -482 83 570 -303 273 113 -368 -80 173 -350 -311 234
7292 234 -399 -25 340 -41 -38 484 -18 -209 348 14 -194 551 104 -345 390 -67 -405 226 256 -277 90
7313 90 267 -165 -301 240 -228 11 168 -290 152 32 -162 -113 496 -32 -224 271 -130 -390 121 -136 -332
7334 -332 202 232 -452 158 18 -381 29 107 -157 39 253 -723 -19 205 -316 -68 152 67 -88 264 -508
7355 -508 -165 301 -382 -207 347 40 -214 124 -18 -136 202 115 -411 133 -175 -499 173 105 -123 -72 356
7376 356 -96 106 199 -296 140 320 -545 -156 480 -264 -128 87 -20 5 508 -629 -337 182 113 -114 320
7397 320 -62 -596 6 46 -46 316 373 -644 242 76 -249 123 32 -460 80 464 22 -385 178 -78 151
7418 151 264 -189 -126 197 57 -153 331 310 -429 169 105 -296 134 88 -383 -115 587 -265 -29 335 -210
7439 -210 1 267 -215 142 254 -128 -200 243 26 -245 321 143 59 342 19 -21 274 -5 -292 253 -71
7460 -71 -275 166 35 -258 378 200 -133 -172 304 -352 -182 257 -277 166 331 -21 -324 241 -15 -149 396
7481 396 -121 -144 433 -258 -209 362 -141 -192 463 -77 -560 109 200 -112 213 108 -258 23 412 -274 -82
7502 -82 283 -215 190 211 -243 87 461 -224 87 -50 -168 -125 141 112 223 107 -162 -140 301 104 -232 284
7524 284 -14 -427 -9 -74 -254 -179 177 -188 141 389 -68 59 325 -329 -80 277 -43 -112 291 -46 -98
7545 -98 191 -153 -34 418 31 -383 211 202 -469 251 -92 -362 224 217 -161 -70 -180 -171 95 124 -125 73 265
7568 265 -189 -31 279 -267 -174 59 -216 -88 -36 -131 47 289 -5 -98 359 -243 60 287 -26 -249 78
7589 78 -134 -393 249 0 -77 61 200 -66 357 83 -377 153 138 125 -180 200 -11 -138 239 56 -100
7610 -100 652 79 -162 382 -90 -64 41 -48 -186 -78 148 -469 346 185 -157 72 388 -127 71 419 151
7631 151 46 261 -259 -153 136 -78 13 385 -233 -342 168 214 -311 88 -167 -252 104 -7 -2 193 32 -134
7653 -134 92 202 -245 97 387 -496 -198 -111 -218 -122 164 10 -267 145 -200 -105 238 -375 -145 574 -46
7674 -46 -138 193 130 -212 236 264 -118 -33 -210 -122 193 73 102 147 171 -341 -33 281 -132 72 245 -118 -87
7697 -87 266 -392 -329 299 57 -113 118 -77 -309 228 10 -55 68 -291 -233 183 64 -344 -7 149 -309
7718 -309 -34 -10 -302 260 306 -264 121 147 -158 43 32 45 -218 62 -139 -69 165 -191 -305 630 -361 -180
7740 -180 322 -96 -158 143 63 31 -126 -141 -325 -118 -37 -257 -100 150 -170 -138 276 -196 -45 132 60 48 -158
7763 -158 -247 -150 64 -276 -118 149 182 -166 311 211 -379 137 243 -230 82 116 123 -119 111 -92 -357 105
7785 105 -367 123 16 -244 -205 198 167 35 213 86 -80 150 204 -405 150 79 -316 32 173 -404 201
7806 201 108 -219 142 -143 38 -56 -69 -478 165 135 71 252 -3 -72 -73 20 -108 1 190 -86 -104 62 64 -164
7830 -164 142 25 -105 98 -142 -321 222 175 -237 86 78 -415 -192 208 -220 -113 142 -126 30 -26 -411
7851 -411 2 191 44 -86 80 -71 91 249 200 -89 64 179 49 187 -15 -152 184 306 -21 71 9
7872 9 -264 37 186 -204 131 -48 32 188 -44 146 -177 -27 -232 -230 35 -90 -318 345 -220 -67 364 -245
7894 -245 250 85 -112 -137 -68 -218 -79 -89 77 -208 126 23 69 43 99 -163 162 67 -88 108 266 -143
7916 -143 -182 466 -264 -215 222 38 -46 216 -12 -51 -75 -133 173 273 -130 -251 322 -160 -201 -47 94 -74
7938 -74 183 70 -311 212 72 -293 -65 267 -104 84 156 -279 -65 235 -127 -88 216 -47 -6 283 -218
7959 -218 -81 100 -30 -184 166 138 -121 202 123 -42 262 135 57 -87 129 110 109 61 116 90 172 -197 -336
7982 -336 21 -198 -57 424 -102 93 213 65 -73 287 -135 -276 62 53 -254 -135 189 -126 154 43 -211
8003 -211 -102 222 -165 -180 55 -212 -124 195 -164 -65 -17 -323 -261 162 -125 21 235 175 -131 81 -57 57
8025 57 141 -180 -195 140 52 -179 15 351 92 83 -19 -373 -51 488 166 -99 -64 -269 -18 -14 -186 71 134
8048 134 154 11 302 -102 -273 63 139 -221 266 256 87 22 163 243 109 121 -121 105 107 -137 61 -37 -133
8071 -133 136 103 -262 86 -141 -38 -70 -7 -300 -81 -6 -33 -341 12 -41 94 119 -41 -23 44 -34 17 109 144
8095 144 -42 -40 24 -9 -96 121 -123 165 -53 93 45 64 -82 -15 77 -52 -11 95 159 -252 434 -50 57 31
8119 31 -115 -108 -112 177 45 127 74 -255 15 354 30 -80 129 -156 155 2 -230 -93 -2 0 -147 168 -137
8142 -137 -24 130 -151 -7 329 -76 -3 9 170 -169 14 95 -4 -198 -42 -44 -7 -151 123 -27 -65 8 -65
8165 -65 -5 56 373 88 -159 -16 200 -84 -176 135 38 -59 16 30 159 63 -132 74 239 29 4 -59 -98 -176
8189 -176 425 -120
8191a20
##END NTUPLES=NMR FID
##END=
