##TITLE=1H_Pr 4891
 CDCl3, 8 sc, 
 5.2.2019
##JCAMPDX= 6.0         $$ Bruker NMR JCAMP-DX V2.0
##DATA TYPE= NMR FID
##DATA CLASS= NTUPLES
##ORIGIN= UXNMR, Bruker Analytische Messtechnik GmbH
##OWNER= root
$$ XWIN-NMR		Version 3.5
$$ Tue Feb  5 15:35:09 2019 Russian Standard Time (UT+4h)  she@DPX200
##.OBSERVE FREQUENCY= 200.1313
##.OBSERVE NUCLEUS= ^1H
##.DELAY= (6, 6)
##.ACQUISITION MODE= SIMULTANEOUS
##.ACQUISITION SCHEME= undefined
##.AVERAGES= 8
##.DIGITISER RES= 18
##SPECTROMETER/DATA SYSTEM= spect
##.PULSE SEQUENCE= zg30
##.SOLVENT NAME= CDCl3
##.SHIFT REFERENCE= (INTERNAL, CDCl3, 0, 15.7039)
##AUDIT TRAIL= $$ (NUMBER, WHEN, WHO, WHERE, WHAT)
$$ ##TITLE= Audit trail, XWIN-NMR		Version 3.5
$$ ##JCAMPDX= 5.01
$$ ##ORIGIN= Bruker BioSpin GmbH
$$ ##OWNER= she
$$ F:/spectra/data/she/nmr/H-F/1/audita.txt
$$ ##AUDIT TRAIL=  $$ (NUMBER, WHEN, WHO, WHERE, WHAT)
(   1,<2019-02-05 15:34:06.76 +0400>,<she>,<DPX200>,
      <created by zg, POWCHK disabled, PULCHK disabled
       configuration hash MD5:
       00 E9 B6 7A A2 85 ED C7 34 08 36 98 17 FE 4E 26
       data hash MD5: 16K
       41 3C 91 6E 39 A9 82 F3 BA 70 20 BF 23 3A 20 54>)
$$ ##END=
$$ 
$$ hash MD5
$$ 5B D3 95 AB 3A E5 58 5E C7 51 8D 8D 80 50 7D 93
##$RELAX= 
##$RELAX= 
##$RELAX= 
##$RELAX= 
##$RELAX= 
##$RELAX= 
$$ Bruker specific parameters
$$ --------------------------
##$DU= <F:/spectra>
##$EXPNO= 1
##$NAME= <H-F>
##$PROCNO= 1
##$TYPE= <nmr>
##$USER= <she>
##$AMP= (0..31)
100 100 100 100 100 100 100 100 100 100 100 100 100 100 100 100 100 100 
100 100 100 100 100 100 100 100 100 100 100 100 100 100 
##$AQSEQ= 0
##$AQ_mod= 1
##$AUNM= <au_zg>
##$AUTOPOS= <>
##$BF1= 200.13
##$BF2= 200.13
##$BF3= 200.13
##$BF4= 200.13
##$BF5= 200.13
##$BF6= 200.13
##$BF7= 200.13
##$BF8= 200.13
##$BYTORDA= 1
##$CFDGTYP= 0
##$CFRGTYP= 5
##$CHEMSTR= <none>
##$CNST= (0..31)
1 1 145 1 1 1 1 1 1 1 1 1 1 1 1 1 1 1 1 1 1 1 1 1 1 1 1 1 1 1 1 1 
##$CPDPRG= <>
##$CPDPRG1= <>
##$CPDPRG2= <>
##$CPDPRG3= <>
##$CPDPRG4= <mlev>
##$CPDPRG5= <mlev>
##$CPDPRG6= <mlev>
##$CPDPRG7= <mlev>
##$CPDPRG8= <mlev>
##$CPDPRGB= <>
##$CPDPRGT= <>
##$D= (0..31)
0 1.2 0 0 0 0 0 0 0 0 0 0.03 0 0 0 0 0 0 0 0 0 0 0 0 0 0 0 0 0 0 0 0 
##$DATE= 1549366446
##$DBL= (0..7)
120 120 120 120 120 120 120 120 
##$DBP= (0..7)
150 150 150 150 150 150 150 150 
##$DBP07= 0
##$DBPNAM0= <>
##$DBPNAM1= <>
##$DBPNAM2= <>
##$DBPNAM3= <>
##$DBPNAM4= <>
##$DBPNAM5= <>
##$DBPNAM6= <>
##$DBPNAM7= <>
##$DBPOAL= (0..7)
0.5 0.5 0.5 0.5 0.5 0.5 0.5 0.5 
##$DBPOFFS= (0..7)
0 0 0 0 0 0 0 0 
##$DE= 6
##$DECBNUC= <off>
##$DECIM= 32
##$DECNUC= <off>
##$DECSTAT= 4
##$DIGMOD= 1
##$DIGTYP= 9
##$DL= (0..7)
0 120 120 120 120 120 120 120 
##$DP= (0..7)
150 150 150 150 150 150 150 150 
##$DP07= 0
##$DPNAME0= <>
##$DPNAME1= <>
##$DPNAME2= <>
##$DPNAME3= <>
##$DPNAME4= <>
##$DPNAME5= <>
##$DPNAME6= <>
##$DPNAME7= <>
##$DPOAL= (0..7)
0.5 0.5 0.5 0.5 0.5 0.5 0.5 0.5 
##$DPOFFS= (0..7)
0 0 0 0 0 0 0 0 
##$DQDMODE= 0
##$DR= 18
##$DS= 0
##$DSLIST= <SSSSSSSSSSSSSSS>
##$DSPFIRM= 0
$$ [...]
##$SUBNAM2= <"">
##$SUBNAM3= <"">
##$SUBNAM4= <"">
##$SUBNAM5= <"">
##$SUBNAM6= <"">
##$SUBNAM7= <"">
##$SUBNAM8= <"">
##$SUBNAM9= <"">
##$SW= 20.0189088683792
##$SWIBOX= (0..15)
0 0 2 0 0 0 0 0 0 0 0 0 0 0 0 0 
##$SW_h= 4006.41025641026
##$TD= 16384
##$TD0= 1
##$TE= 0
##$TE2= 300
##$TE3= 300
##$TEG= 300
##$TL= (0..7)
0 120 120 120 120 120 120 120 
##$TP= (0..7)
150 150 150 150 150 150 150 150 
##$TP07= 0
##$TPNAME0= <>
##$TPNAME1= <>
##$TPNAME2= <>
##$TPNAME3= <>
##$TPNAME4= <>
##$TPNAME5= <>
##$TPNAME6= <>
##$TPNAME7= <>
##$TPOAL= (0..7)
0.5 0.5 0.5 0.5 0.5 0.5 0.5 0.5 
##$TPOFFS= (0..7)
0 0 0 0 0 0 0 0 
##$TUNHIN= 0
##$TUNHOUT= 0
##$TUNXOUT= 0
##$USERA1= <user>
##$USERA2= <user>
##$USERA3= <user>
##$USERA4= <user>
##$USERA5= <user>
##$V9= 5
##$VALIST= <valist>
##$VCLIST= <CCCCCCCCCCCCCCC>
##$VD= 0
##$VDLIST= <DDDDDDDDDDDDDDD>
##$VPLIST= <PPPPPPPPPPPPPPP>
##$VTLIST= <TTTTTTTTTTTTTTT>
##$WBST= 1024
##$WBSW= 4
##$XGAIN= (0..3)
0 0 0 0 
##$XL= 0
##$YL= 0
##$YMAX_a= 165465
##$YMIN_a= -160051
##$ZGOPTNS= <>
##$ZL1= 120
##$ZL2= 120
##$ZL3= 120
##$ZL4= 120
##$ABSF1= 10
##$ABSF2= 0
##$ABSG= 5
##$ABSL= 3
##$ALPHA= 0
##$AQORDER= 0
##$ASSFAC= 0
##$ASSFACI= 0
##$ASSFACX= 0
##$ASSWID= 0
##$AUNMP= <proc_1d>
##$AZFE= 0.1
##$AZFW= 0.1
##$BCFW= 1
##$BC_mod= 2
##$BYTORDP= 1
##$COROFFS= 0
##$CY= 11.3945322036743
##$DATMOD= 1
##$DC= 2
##$DFILT= <>
##$DTYPP= 0
##$F1P= 18.9103706918063
##$F2P= -1.10871071338519
##$FCOR= 0.5
##$FTSIZE= 0
##$FT_mod= 4
##$GAMMA= 1
##$GB= 0.15
##$INTBC= 1
##$INTSCL= 1
##$ISEN= 128
##$LB= 0.24
##$LEV0= 0
##$LPBIN= 0
##$MAXI= 10000
##$MC2= 0
##$MEAN= 0
##$ME_mod= 0
##$MI= 1.114404
##$NCOEF= 0
##$NC_proc= 0
##$NLEV= 6
##$NOISF1= 3.799351
##$NOISF2= 2.8
##$NSP= 1
##$NTH_PI= 0
##$NZP= 0
##$OFFSET= 15.70392
##$PC= 1
##$PHC0= -9038.212
##$PHC1= 11.60004
##$PH_mod= 1
##$PKNL= yes
##$PPARMOD= 0
##$PSCAL= 0
##$PSIGN= 0
##$REVERSE= no
##$SF= 200.130013532006
##$SI= 16384
##$SIGF1= 3
##$SIGF2= 2
##$SINO= 400
##$SIOLD= 16384
##$SREGLST= <1H.CDCl3>
##$SSB= 0
##$STSI= 0
##$STSR= 0
##$SW_p= 3612.71676300578
##$SYMM= 0
##$S_DEV= 0
##$TDeff= 0
##$TDoff= 0
##$TI= <>
##$TILT= no
##$TM1= 0
##$TM2= 0
##$TOPLEV= 0
##$USERP1= <user>
##$USERP2= <user>
##$USERP3= <user>
##$USERP4= <user>
##$USERP5= <user>
##$WDW= 1
##$XDIM= 8192
##$YMAX_p= 0
##$YMIN_p= 0
$$ End of Bruker specific parameters
$$ ---------------------------------
##NTUPLES= NMR FID
##VAR_NAME=  TIME,          FID/REAL,        FID/IMAG
##SYMBOL=    X,             R,               I
##VAR_TYPE=  INDEPENDENT,   DEPENDENT,       DEPENDENT
##VAR_FORM=  AFFN,          ASDF,            ASDF
##VAR_DIM=   8192,          8192,            8192
##UNITS=     SECONDS,       ARBITRARY UNITS, ARBITRARY UNITS
##FACTOR=    0.0002496,     1,               1
##FIRST=     0,             0,               0
##LAST=      2.0444736,     0,               0
##MIN=       0,             -160051,         0
##MAX=       2.0444736,     165465,          0
$$ Real data points
##PAGE= N=1
##DATA TABLE= (X++(R..R)), XYDATA
$$ [...]
2416a234K179q19j374K335o85j799K229o2k087J629N94k362J777P14k363J341
2432A3J367k043O35J560k307K31K026k095k27J942j849k53K394j675j104K500
2448A115j052j267K264p35j414J932m5j990J884K06k070J585N51k261J314R68
2464I85k129R63J512k347L50K080k097j60K314j696o28K114j410j004K187o72
2480C62j504K246p34j687K098Q2k330K139L82k506J576P53k090J314J025k288
2496a162Q61J663k406N14J879k092j59K052j691k33K188j771m70K279j393j284
2512a225K152l21j860K212n24j875J889K39k217J657J062k671J542J017k064Q38
2528a49J548k572P17J887k124P4J955j671n66K083j355o80J881r93j195K109n66
$$ plain form
2416 -1234 945 126 -1248 1087 402 -1397 832 770 -1317 312 906 -1456 321 1035 -1328 13
2432 13 1380 -663 -28 1532 -775 -544 1482 -613 -840 1102 -747 -1000 1394 -281 -1385 1115
2448 1115 63 -1204 1060 325 -1089 843 798 -1192 692 898 -1172 413 964 -1297 17 985
2464 985 -1144 -181 1331 -1016 -666 1414 -683 -843 1471 -225 -853 1261 -149 -1153 1034 362
2480 362 -1142 1104 370 -1317 781 863 -1467 672 1054 -1452 124 877 -1213 101 1126 -1162
2496 -1162 -301 1362 -1044 -530 1349 -743 -902 1150 -541 -774 1414 -357 -827 1452 59 -1225
2512 -1225 927 606 -1254 958 434 -1441 448 687 -1530 127 1189 -1482 60 1077 -987 -149
2528 -149 1399 -1173 -456 1431 -693 -619 1336 -335 -901 1182 -173 -853 1028 35 -1160 949 383
2545C83j760K070l23j891J855K68j978J710P31k018J127J038k165R41J500k479
2561i91N73J775k085KJ935j648m76K453j614r35K169j200j129K273q95j507K132
2578H32k64k053K200K53k552J701R92k405J581P23k111P95J417j991L58J953k031
2595f02j88K026j675l89K124j683o74J961j015j247K423n09j744J898K65k226
2611a255J948N56k273J589K50k010J172R69k165R31J730k262K68J912k043j06
2627g89K268k152l73K276j545p40K473j400j310K161n00j438J864j22j790J694
2643E77Mk041J499R83k178J301J114k236Q12J343j811J59J856k431J22K088j787
2660f26k37K038j228r55K235r48j507K194o10j719K222j95j851J809K06k112J469
$$ plain form
2545 383 -1377 693 370 -1521 334 602 -1376 334 1065 -953 174 1212 -953 -12 1488 -991
2561 -991 -418 1357 -728 -726 1209 -439 -915 1538 -76 -1011 1158 -42 -1171 1102 207 -1300 832
2578 832 568 -1485 715 968 -1584 117 1109 -1296 285 1008 -1103 -308 1109 -882 -524 1429 -602
2595 -602 -790 1236 -439 -828 1296 -387 -1061 900 -115 -1362 1061 552 -1192 706 971 -1255
2611 -1255 693 1249 -1024 565 815 -1195 -23 946 -1219 -288 1442 -820 -552 1360 -683 -789
2627 -789 1479 -673 -1046 1230 -315 -1055 1418 18 -1292 869 369 -1069 795 673 -1117 577
2643 577 581 -1460 39 1022 -1156 145 1259 -977 -165 1178 -633 -474 1382 -1049 -927 1161 -626
2660 -626 -863 1175 -53 -1008 1227 279 -1228 966 356 -1363 859 664 -1187 622 828 -1284 185
2677A85R54k329J128R04k073J043J618k346P36J507j991J23J631j200p54K074
2693A210j201j021J567m60j554K277n89j385J614q7j590J694L66k130J424J234
2709A369k485R46J158k009Q27J449j967Q7J701j575q0J607j146o82K022j327j065
2726a170K323j051j211K182r15j281J809j13j582J600K01j970J614O79k068P61
2742a92J216j973N93J272j930N41J605j844k18K297j674k45J462j226n64K049
2758A169p80j788K182m87j495J966k05j548J479J92j873J401Q85k093J126R39
2774A070k059P77J296j917L73J377j752P3J946j506l32J912j169j065K138j050
2790A12j185J930m79j552J737P2j920J729N9j932J834M25k077J119J088j768O54
$$ plain form
2677 185 1139 -1190 -62 842 -1231 -188 1430 -916 -180 1327 -664 -541 1090 -110 -864 1210
2693 1210 9 -1012 555 95 -1459 818 229 -1156 458 371 -1219 475 841 -1289 135 1369
2709 1369 -1116 -170 988 -1021 -194 1255 -712 -625 1076 -499 -579 1028 -118 -800 1222 -105 -1170
2726 -1170 1153 102 -1109 1073 158 -1123 686 573 -1009 591 792 -1178 436 1115 -953 -192
2742 -192 1024 -949 -356 916 -1014 -473 1132 -712 -930 1367 -307 -552 910 -316 -880 1169
2758 1169 389 -1399 783 296 -1199 767 562 -986 493 685 -1188 213 1098 -995 131 1070
2774 1070 -989 -212 1084 -833 -460 917 -835 -762 1184 -322 -654 1258 89 -976 1162 112
2790 112 -1073 857 378 -1174 563 635 -1285 444 503 -1429 405 830 -1247 -128 960 -808 -154
2807a54J218j465J05J284j452m69J974j449m45J797r80r51J808o26j180J890k34
2824F71j978J720m2j210J387L97j932J186P94k124J069J147j743K28J408j241
2840b63m60J944j807j02J759j212n91J746j048j010K061r90j248J980m17j556
2856a214J830J90j664R79O46j803J280O36k042Q12J350j742M4J783j846M13J151
2873H03j369m9J636j205n80K029j108q24J582p33j331J834l08j248J391k22j208
2890i10J325L52j625J152P79k031R27P99j711M36J612j510k69J464j412j4J755
2907A119j342q00K010r62p69J549p91j145J918n24j515J781J17j563R22Q53j568
2924g10P58P36j891P52J430j649K12J551j875J04J387j416rJ581j155o12J669
$$ plain form
2807 -154 1064 -401 -296 988 -464 -933 1041 -408 -853 944 -36 -987 821 195 -985 905 671
2824 671 -1307 413 371 -839 548 945 -987 199 993 -1131 -62 1085 -658 -430 978 -263
2840 -263 -723 1221 -586 -688 1071 -141 -732 1014 -34 -1044 1017 27 -1221 759 342 -1214
2856 -1214 616 806 -858 121 767 -1036 244 880 -1162 -350 1000 -742 -698 1085 -761 -348 803
2873 803 -566 -615 1021 -184 -764 1265 157 -667 915 182 -1149 685 377 -871 520 298 -910
2890 -910 415 767 -858 294 1073 -958 -31 768 -943 -507 1105 -405 -674 790 -622 -636 1119
2907 1119 -223 -1023 987 25 -744 805 14 -1131 787 263 -1252 529 646 -917 5 858 -710
2924 -710 48 784 -1107 -355 1075 -574 -362 1189 -686 -582 805 -611 -620 961 -194 -806 863
2941H63p26j051J609k90j683J977j53j768J385M17j480J184L81j575J139R72k181
2958i80O76J302j467J75J126j139rJ486j607l48J840r43q91J587l19j233J343
2975E99l92j221J838n09j276J265N89j691J030P26j939J128R10j876P38R98j436
2992e19j01J673j351l30J556j316k72J510q35j280J848m88q57J563l34j237J185
3009D15K10j516J033O44j584P72Q15j691P16J015j713L34J318j364J7J600j100
3026g9m21J313j253j24J608j222q06J697k40j338J417p2j543J606M6j526J318
3043C81L32j459O26Q76j598L76J383j693N22J297j517K9J424j124l54J323p41
3060H3r04J730p35j020J584k17j300J154oj213J375p4j302Q78J025j713N44Q91
$$ plain form
2941 863 137 -914 695 405 -1278 699 546 -1222 163 580 -900 284 665 -910 229 1201 -980
2958 -980 -304 998 -469 -294 832 -307 -316 1170 -437 -785 1055 112 -779 808 489 -744 599
2975 599 207 -1014 824 315 -961 304 893 -798 232 958 -981 147 1057 -819 -81 917 -519
2992 -519 -620 1053 -298 -628 928 -388 -660 850 15 -1265 583 95 -762 801 467 -770 415
3009 415 625 -891 142 786 -798 -26 789 -902 -186 829 -884 -550 768 -596 -579 1021 -79
3026 -79 -500 813 -440 -564 1044 -178 -984 713 473 -865 552 480 -1063 543 589 -937 381
3043 381 713 -746 -120 756 -842 -466 917 -776 -254 1043 -474 -445 979 -145 -499 824 83
3060 83 -821 909 174 -846 738 521 -779 375 369 -844 531 457 -845 33 1058 -655 -111 780
3078G80j280O11Q57j447K42J238j605J34J483j215n39J520q12o23J354n85j065
3095i52J669m71j063J232J50j385J023L67j250R15O47j693N88R39j484O30J235
3112A097j636M86J034j614J44J605j299m58J420r91l36J363p86j036J748m81j204
3129i44J501j05j407J357K69j509R43J029j725N84R21j677N11Q66j010l06J623
3146I21j491l7J658j062p74J574q77m89J225n81q13J366j50j317J457J6j424Q62
3164F4M59j352P09R99j709P96Q58j902Q59J154j462R2J735j584l20J557j233m81
3182g61J576r13n23J270l77j105J297o5j102R01J86j214J158K31j508J093O71
3199H15j674N88J250j397J24J155j293N3J348j402k66J688j074o41J440q19o48
$$ plain form
3078 780 -500 111 968 -479 -237 1001 -604 -470 1013 -202 -741 779 -33 -656 698 113 -952
3095 -952 717 246 -817 415 565 -820 203 570 -680 235 882 -811 -223 716 -768 -138 1097
3112 1097 -539 -53 981 -633 -489 1116 -183 -641 779 -212 -548 815 29 -1007 741 260 -944
3129 -944 557 452 -955 402 671 -838 105 1134 -591 -7 914 -763 -252 614 -396 -702 921
3146 921 -570 -607 1051 -11 -785 789 -88 -577 648 67 -746 620 470 -847 610 626 -798 64
3164 64 523 -829 -120 879 -830 -34 824 -1078 -219 935 -527 -435 1300 -284 -604 953 -280 -761
3182 -761 815 -98 -621 649 272 -833 464 399 -703 198 384 -830 328 559 -949 144 815
3199 815 -859 -271 979 -418 -294 861 -432 -379 969 -433 -699 989 -85 -726 714 -105 -753
3216g53J443n10r61J358o5j585J279J34j099Q32O71j528Q88O69j491N40R24j298
3234e52M35Q77j288OJ647j501n97J641q95n79J453l97j101J567n95j231J757k67
3252C80j345J470l5j313J022Q02j855Q70P29j449K79J405j406K6J157j187j95
3269f45J387j101j39J485q10j255J791n64o69J161l51j173J454Jj585J208O52
3286H47j690J018L14j389R33O91j476P12Q45j230k68J565j116j42J176j058o09
3303h77J858j004o81J388m88p37J327m99q87J076l2j370J261L55j691R81N77j568
3321a011J058P38j679M16J226j274J22J262j292JJ461j194n28J429r79n81J260
3338D35k69j127J670m98j246J429K1j063P72P20j907J333L11j165M32R18j190
$$ plain form
3216 -753 690 180 -781 577 512 -1073 206 340 -759 73 744 -784 104 773 -718 -178 746 -552
3234 -552 -117 760 -528 -522 1125 -376 -973 668 -227 -806 647 250 -851 716 121 -1110 647 380
3252 380 -965 505 470 -843 179 981 -874 -4 725 -724 -445 960 -446 -420 737 -450 -645
3269 -645 742 -359 -498 987 177 -1078 713 149 -520 641 290 -883 571 572 -1013 195 847
3286 847 -843 175 489 -900 33 724 -752 -40 805 -425 -693 872 -244 -386 790 -268 -877
3303 -877 981 -23 -704 684 196 -541 786 287 -600 476 444 -926 335 690 -1001 -20 557 -1011
3321 -1011 47 785 -894 -478 748 -526 -404 858 -434 -433 1028 -166 -694 735 -244 -825 435
3338 435 166 -961 709 211 -1035 394 415 -648 124 844 -1063 270 581 -584 -152 766 -424
3355d24j16J535j603J92J297j098k96J342j024m98J641q05j381K004n51j110J353
3372D58l05j075J355k2r01P51M23j515R35N58j465M98R99j258J45J144j199j09
3390e83J456j229o06J810q35p98J561m56j076J540n54r36J406k27j108R94K5j159
3408g75J047L86j387O77P85j322M36Q41j465K31J590j156k88J303j403r1J594
3425A003j129o09J627o88r11J579o71j227J286K9r25J050l5j243R71N22j560J096
3443A65M75j614O96J133j570L31J144j252QJ216p38m31J150q01l81J281q81o96
3461g65J347m45j156J555j57j233J295K12j735J270K81j100O83N61j498P35R04
3478G54j675P18Q95j125o5J123j008l88J594q30q47J595o89j059J650k40j485
$$ plain form
3355 -424 -540 995 -608 -416 881 -217 -513 829 -195 -693 948 143 -1238 766 215 -895 458
3372 458 153 -922 433 411 -490 261 684 -831 104 662 -803 -305 694 -564 -419 725 -474 -583
3390 -583 873 -356 -962 848 13 -785 776 320 -756 784 230 -706 700 473 -635 359 384 -775
3408 -775 272 658 -729 -52 733 -589 -153 688 -777 -546 1044 -112 -400 903 -500 -591 1003
3425 1003 -126 -735 892 204 -707 872 201 -1026 260 289 -636 414 379 -864 107 629 -931 165
3443 165 640 -974 -278 855 -715 -384 760 -492 -484 732 -6 -437 713 -88 -469 812 -69 -765
3461 -765 582 137 -1019 536 379 -854 441 653 -1082 188 469 -631 52 613 -885 -150 754
3478 754 -921 -203 692 -433 -498 625 -383 -771 823 -7 -854 741 52 -1007 643 403 -1082
3495a082J583qj255J163K57j445Q86P08j383O30Q16j594N05R36j326J58J399j102
3513a54n09J492p07q31J521o34j152J686o27j040J775l47j219J148K90j712J303
3530B83M80j473Q69P39j486O50N81j376N71R68j165J02Q84r59k90J285p33n39
3548f09J269p23p79J394m61r63J702m85r75Q45K77j137Q33L28j329Q92Q59j613
3566f75P92L68j210M25J011j127k52J544j136k92J322r35n60J166o18p69J531
3583E85k61j242J369j85j045J154J44j378R03L84j188P56Q69j623O88P41j021
3600c50o0J145q36o31J379q07o26J537r26l74J032k61j144J661m80j041J164k10
3618A72j050R80L83j363J435nj367Q17O79j303N84R02j124k61J270j120j38J402
$$ plain form
3495 -1082 501 493 -762 401 658 -787 99 807 -576 54 870 -724 -219 717 -609 -451 948 -154
3513 -154 -663 829 122 -709 812 178 -974 712 85 -955 820 473 -746 402 692 -1020 283
3530 283 763 -710 159 898 -588 62 643 -733 -162 806 -359 -257 627 -332 -622 663 -70 -609
3548 -609 660 -63 -842 552 91 -872 830 345 -630 215 492 -645 188 516 -813 79 938 -675
3566 -675 117 485 -725 -300 711 -416 -668 876 -260 -552 770 -165 -725 441 -177 -946 585
3583 585 324 -918 451 266 -779 375 519 -859 44 428 -760 -4 865 -758 -70 671 -350
3600 -350 -410 735 -101 -732 647 -160 -786 751 -175 -549 483 222 -922 739 259 -782 382 172
3618 172 -878 102 485 -878 557 552 -815 2 681 -622 -38 864 -260 -521 749 -371 -509 893
3636H93r63m07J492j142n89J397p36q73J387j6j288J404n6j205O84O50j397P25
3654d0N79q39J55J133j537L14J121j566M83O69p76n7J012p61l80J167o49o67J341
3673G02n87p15J195n18r29J238J64j193J010P6j273J084L43j436P33O21j363P78
3691g0R90j397J40J034j042l47J528j080l63J247n07p78J034m04n31J119n2j301
3709g80J086L7r27R26K7j075Q64N70j578P62P27j309L55J287j437J08J213j160
3727c04l09J292q40n51J463o12o33R47l56o98Q96J40j063Q32J64j155Q46O53j351
3746f39M74O64r73M34R17j552L63J274j295RR44r30j47R65m36p20J336o76o12
3765f00J038l91p60J064J0j383J106N07j185R41K80j084L03P96j186M06R51j385
$$ plain form
3636 893 -70 -477 1015 -127 -716 681 -55 -928 459 443 -845 559 503 -702 -18 632 -765 -40
3654 -40 539 -300 -145 988 -549 -235 886 -680 -197 472 -304 -361 651 -110 -490 677 28 -639 702
3673 702 115 -600 595 77 -852 386 550 -643 367 443 -830 254 597 -839 -106 515 -848 -70
3691 -70 920 -477 -337 697 -345 -692 836 -244 -607 640 133 -645 389 -15 -546 573 521 -780
3709 -780 306 343 -584 342 369 -706 158 728 -850 -88 639 -670 -315 972 -465 -357 856 -304
3727 -304 -613 679 -161 -712 751 139 -494 453 97 -601 295 435 -628 204 368 -787 59 712 -639
3746 -639 -165 499 -474 -40 877 -675 -312 962 -333 -324 620 -310 -457 508 72 -648 688 12 -600
3765 -600 438 47 -713 351 361 -1022 84 591 -594 347 627 -457 -154 642 -544 -138 813 -572
3783e72L79J076j139j17J122r61j75Q91p35n27J364l53p32J163l36j061J065l2
3801C20j055J079K71j440R11N09j125N39N91j227L54P87r14J89P60r24j32J057
3819E50p65k72J055n85m91R54m17p97J474j90j438J146K48j009M51O51j175P79
3837A69K40r52M31O94j317L97Q54r19J78J044j196K4J150p88m17R52p16m20J366
3856G74o95q12J008k7n05N88J91j351N52P28q70L32L53p27L93P92j317N00P34
3875F41j227K73Q49p39j49Q55p50r9J152p61o03J122k89q65P43J48q38M61M32
3894C56q46O66K88j191O36P30r79K84M33p87L61P29j029J4Q25n79m16J137p54
3913a22n3R38p83o03J185n76o77R18O7o47N36J33j022P70K82p95N58L75p63P2
$$ plain form
3783 -572 -193 883 -256 -373 749 -212 -387 504 -231 -758 606 253 -479 684 348 -713 352 320
3801 320 -735 344 615 -825 86 595 -530 9 600 -627 -273 514 -400 -211 549 -375 -507 550
3819 550 -215 -487 568 -17 -508 446 29 -768 706 516 -922 224 472 -537 -86 565 -610 169
3837 169 409 -543 -112 582 -735 -338 516 -403 -225 819 -377 -353 797 9 -408 544 -172 -592 774
3856 774 79 -733 275 248 -257 331 522 -829 -277 451 -419 -87 266 -461 -68 724 -593 -93 641
3875 641 -586 -313 536 -203 -352 503 -247 -346 806 45 -558 564 275 -590 153 301 -537 -76 356
3894 356 -490 176 464 -727 -91 639 -340 -56 377 -410 -49 680 -349 -335 490 -89 -505 632 -122
3913 -122 -175 763 -20 -623 562 -14 -691 227 294 -353 183 316 -706 64 346 -449 109 484 -279 -207
3933b07R22j177R3R79q67J32M68m47l38Q05p07k15J091l25n45Q11j2j023Q34R7
3953C69j159J108K81j032K82N76j023N07N32q84K01Q31r20J92P24j090J93O55
3971C43n41l09J057m40n27O56k93m18Q47r1o94P64j87p60J101m8j074Q21L41j199
3991f51N86K81l63M4Q56r74k1R55q69k05P33m79k76N82k07l01O09l28n81J147
4011E38m49n21O84K27j335R88J40p11L45N83r52L20M86n34J59K50l38k82O43m02
4031a61L8N01o29L0O17k68m73P37l25o66R36l0o37L09L82p69M49K58n96K77J77
4052A57m90K21M78n18N5N24o95R8N65l84k70N64k11m57O07q9n47Q15l46m80L54
4073d9K72p25O48L90p35K91J38n62K77K80n94R3R18j086K93Q71o77r6L73l00k92
$$ plain form
3933 -207 715 -462 -369 610 -257 -125 343 -104 -442 363 -344 -559 532 207 -338 473 461 -562 272 369
3953 369 -790 318 599 -433 -151 425 -598 -91 441 -443 -242 589 -331 -139 585 -505 -312 343
3971 343 -198 -507 550 110 -417 239 -54 -472 375 284 -410 354 167 -593 508 460 -614 207 548 -651
3991 -651 -65 216 -147 -103 753 -221 -242 713 -156 -361 372 -107 -383 199 -8 -309 300 -28 -609 538
4011 538 89 -432 252 479 -856 132 272 -439 -94 489 -463 -143 343 -191 -32 218 -120 -402 241 -161
4031 -161 -123 378 -251 -221 396 128 -345 392 67 -599 337 307 -330 -21 361 -408 41 299 -297 -20 157
4052 157 -333 -112 366 -152 -97 427 -268 -170 395 11 -259 305 94 -363 244 155 -392 423 77 -403 -49
4073 -49 223 -502 146 536 -199 92 230 -332 -55 225 -369 -276 642 -444 -151 720 43 -53 320 20 -272
4094b72O87m42k00O03q4q75Q00q7n47P00l9n40M61K35m64J71j81k49M00P4m38
4115b87rL25J7l33O44l74k33O27m41j46O80n41j75N88k57m87O08k76m24M53Q7
4136D6k10L89o1n51O16J88q16M57L59o55pO89o68J83M36n65l8M40m21N8P75o94
4158e0k33L97J04r05Q69o2p26P13%n03O38l1o37L48L68o36J60O48p01m3O88m80
4180g4m00Q08n12j42N25n00j70P82m76l66O50K06p02O99q7o64N84J64k92k9N05
4201E09q01M09K79n42N3N28m52p3N11q77J97Q70q67k83P78j37m48P55l92l41O41
4222C17j36l88L27J08k89M84j72o48M45L70n54M10K17o65n6M96m34K96J87n42
4242b27k1O57n62q8M81l07l07P27m48k68M88l20p6N84N8q65R25l05m32K13L54
$$ plain form
4094 -272 415 -27 -227 376 292 -583 217 130 -417 283 244 -296 165 400 -64 107 -74 -323 77 151 -287
4115 -287 -296 29 46 -287 357 -17 -250 377 -64 -210 470 -71 -246 342 85 -402 206 -70 -494 -41 46
4136 46 -164 225 164 -387 229 417 -399 58 417 -238 -245 444 -224 -41 395 -170 -208 232 -189 -131 644 -50
4158 -50 -283 114 218 -687 182 120 -606 107 107 -396 242 211 -426 -78 290 -346 -186 462 -239 -282 406 -74
4180 -74 -474 334 -178 -320 205 -295 -465 317 -159 -525 125 331 -371 328 241 -423 161 325 33 4 509
4201 509 -292 117 396 -146 -93 435 -17 -90 421 -456 -259 611 -256 -539 239 102 -346 409 17 -324 317
4222 317 181 -207 120 228 -61 423 251 -397 48 418 -136 274 491 -174 -230 266 -168 128 315 -227
4242 -227 -248 409 -153 -241 240 -67 -374 353 -95 -363 125 -195 -271 313 371 -494 431 126 -306 -93 261
4263B61n54R1N34o97M08P0l72n7L62l10l9Q55p14K25K11l71J6K17j38k66N11k51
4285hj52L59J76q21M79j1l47L85N8k06R3J65n43K01O07o97K81L06o53L8O70o60
4307b80K6O09p49L31M09m19l2L66k05m21O20J3m41J44M53p71M71J56o14J30O81
4328D77o38J37K50n18K73L67n59o8O19k48k80K98j12m09N54N6l22J52J88n62N48
4349B03K26p06M54l0n83N98J21o27L71J90l82K41L87n83K5L52j79l32M24j40l86
4370c56N84Q0n90O41j84p78P28N1n64O64l60j41J90K31n61K07O93o79J27L95q48
4391d70L46L53l88J08O88o95k07N33k03n95M16K20k49L63l07k90P92j44p58O26
4411A39N6l26J94n5k83M29j68j65K5M12k29n4N20p13J38M30o03p0M13Q6m80M44
$$ plain form
4263 261 -293 -202 332 -365 43 113 -259 -316 46 -264 -303 552 -162 63 274 -97 -81 136 -2 -268 243 -8
4285 -8 -160 199 375 -446 33 22 -325 60 118 -88 5 170 -373 -172 435 -262 19 325 -328 -290 380 -280
4307 -280 -254 355 -394 -63 346 -73 -105 261 56 -365 255 268 -173 -29 424 -347 124 280 -334 -204 477
4328 477 -161 -24 226 -292 -19 348 -211 -279 340 92 -188 110 -2 -411 143 199 -123 29 217 -345 203
4349 203 429 -277 177 147 -436 162 283 -344 27 217 -165 76 463 -120 -95 257 78 -254 170 30 -356
4370 -356 228 308 -282 359 175 -603 125 176 -388 276 -84 -225 -35 196 -365 -158 535 -144 -17 378 -470
4391 -470 -124 229 -159 -51 637 -58 -265 268 65 -530 -114 106 -143 220 -87 -377 415 271 -487 139
4411 139 195 -131 63 8 -275 154 -14 -179 -154 258 29 -25 495 -218 -80 350 -253 -323 90 176 -304 140
4433A40M5j61K5M7p8Q7j85n2M5J98n24L15M18m60J52L06m93O2N62o62j12N49l50
4456a26J7M93m07j27K40j55k86O27k51q8N20m84j79O57m10o31P27J41n74K09L80
4477B93p71L22M34n29K73J60k45J10R2j40j89P69m54l21M58k76m1N76m48j86K45
4498A32q3l14J3M12k29K09q7m67M48J69k04m9K84n90L03L53o05J90L98m55l1O34
4520D31n71j36L93o8k31M05p2k94L55l79O8K30q8k52L25J57n77M65j61r8K17N7
4542A76m78K26K25m18O9O55n66m6K45l70K2L12j05m4K49j53k5K29k97k31N58j65
4564F8o46M65M17k89LJ18n3k3K54p24L71K13k48j33N02l04j10Q8j08J15J91m16
4586b49J88N21m95l8PK2q7K42p8k58N08j28l66K66J02k01J9J98m76L30J7l5l05
$$ plain form
4433 140 185 24 49 96 18 105 -80 -132 -87 111 -413 -98 320 -140 12 318 -175 -113 449 -213 -325 224 -126
4456 -126 -109 384 -23 -150 90 -65 -351 276 25 -63 457 -27 -206 451 41 -590 137 278 -296 -87 293
4477 293 -478 -156 278 -251 22 182 -63 47 139 -1 -190 579 125 -196 262 -14 -55 521 73 -113 132
4498 132 49 -265 -252 160 -69 140 53 -414 34 203 -1 -50 234 -356 -53 300 -305 -115 283 -172 -203 431
4520 431 -140 -276 117 49 -182 223 151 -143 212 -167 -99 131 43 -209 116 273 -304 161 0 -98 119 176
4542 176 -302 -76 149 -269 -200 455 -111 -157 88 -282 -260 52 -53 -97 152 -1 -26 203 -94 -325 233 68
4564 68 -578 -113 304 15 18 136 83 60 314 -410 -39 174 -74 -207 295 -9 -119 -31 -139 -24 167 -249
4586 -249 -61 460 -35 -73 -66 -44 -131 111 33 -225 283 155 -211 55 157 -44 -25 173 -303 27 44 9 -296
4609b96P19j96m10O26n39K57j0K9m29N75l46k08M17k26k32N88l33j22J77j21j25
4630b05J47J24l55M47L0k74o3L87m77j08P12o11j06O86l44j89M90j33k22Q1J32
4651A49k57J77M4n22M56kk70K65P6m02L06N7l74O63j20n57K70K88l74K4M69n14
4673a48q7N89k75j29K33k22m8M32l07j41K77j71j63J76M63o87K79m4k92J89L53
4694B77l40K83j09j36P7N27q02N18k3k71j27K21q6k38L73j17p4K57j39j98J11
4715a6Qj30K44P2l64K35J57m54K35O6l83L06M07n21J27L40n56J86R5l11J74M78
4737C95p54M58O8l76K37j00J44J0j42o0K9L34R8l53K64k85m33P05j43r7K20N0
4759B69m15K61j4k64L66j39l77J91K40m04L64p6j57j34P02n88R1K21l4j06L67
$$ plain form
4609 -296 423 227 -183 443 -96 161 151 180 -249 326 -20 -228 189 -37 -269 319 -14 -136 41 -80 -205
4630 -205 -58 66 -289 158 188 -86 -149 238 -239 -347 365 -246 -352 334 -10 -199 291 158 -64 17 149
4651 149 -108 69 113 -409 47 45 -225 40 116 -286 20 77 -297 366 246 -311 -41 247 -127 -103 366 -148
4673 -148 -235 354 79 -50 183 -39 -87 345 38 -103 174 3 -160 16 479 -208 71 27 -265 -76 277
4694 277 -63 220 111 -25 52 579 -223 295 272 1 -126 95 9 -229 144 27 -47 210 71 -127 -16
4715 -16 -8 -138 106 178 -186 49 206 -248 -13 53 -330 -24 383 -138 -11 329 -227 -41 54 -257 -83 395
4737 395 -359 99 167 -209 28 -72 72 82 -60 -120 -91 243 341 -12 252 -33 -466 239 96 -1 219 269
4759 269 -146 115 101 -163 203 64 -313 -122 118 -286 78 2 -155 -289 413 -175 -84 137 103 -3 364
4780C64l66n03O15L29o85L02p1k29J24m1L2j9N18o84L99J14l09K05O3m53K22L05
4802B32k75j14M24n11L42J70o53R5N34m18j54L62j6k55M72k80NK85j29j51RJ08
4824H2l15NL93l10L45j42o9k61M69m92K31K75J03m40p4K62Q3L10n46j12M34j91
4846D0n58P49l84r1L09J61m04Q6Q3j80O3J49k33R3lj7l19N68k21n2K20p9K5K15
4870B20k35j92J60q1j26N27k56j16P4K54l40M3K69l45J45L98m79m7L28l10R2L83
4892C66m77K97k6j78k87O09l57j16L53p9l42N97l81k29O63m61q4J14Q7n53N53
4913F9r3j24K57j68k88K37L91m75K16L06n06K37L28n30L17K59p30L26K46k79J85
4934A81k9k76J09L34k19l70K77J73l23L99j34l88M07O6l79J84K97l41J32j49m9
$$ plain form
4780 364 -2 -505 110 439 -246 56 -15 -244 -120 -161 -129 -148 370 -314 85 199 -110 95 158 -295 -73 232
4802 232 -43 -157 267 -244 98 268 -385 -290 244 -174 -328 34 18 -237 235 -45 -40 245 116 -35 -26 82
4824 82 -233 -228 165 -145 200 58 -11 -272 197 -295 -64 211 314 -126 -200 62 145 455 -91 -203 231 40
4846 40 -518 231 -153 -244 65 226 -178 -92 -9 -189 -126 23 -210 -117 -120 -137 -456 112 -109 -161 59 -20 5 220
4870 220 -15 -207 -47 -128 -254 273 17 -99 -25 229 -111 -68 201 -144 1 399 -80 -127 201 -109 -17 366
4892 366 -111 186 160 -18 -305 304 -53 -169 184 105 -237 360 -21 -250 413 -48 -132 -18 69 -484 69
4913 69 -24 -148 109 -59 -347 -110 281 -194 22 328 -178 59 387 -143 174 433 -297 29 275 -4 181
4934 181 152 -124 -15 319 100 -270 7 180 -143 256 122 -266 141 207 -172 12 309 -32 100 -49 -98
4955i8K30p7n8k63M34k5k72K16P1m70O32k47m17O09k1n81L56l32J62J13K44j71
4977C5m9J12k04L91k19j83K69P0k87k62N14k02k22M92n32J31J26j02l5M49k73
4998A9l26M63j8k10J79j70p3N9J16j40Q9J48k98M99q0j73j03Kj06J76j12k24K93
5021A0J25k80M16l9n1p37N26k30j15L75j14k34N19n3m47N26m10L1M59j44k95J36
5043b6K52k19q2L05l13L77j21k60M9L22k14k07M54k91m81M51j23k85K34mr5K25
5065e2j17K38J20j00j46J36K21o66L16K94l26J58K46o78L67K07m78K57J82k86
5085a07k5J23j62j46O85n40j5N00m16o7L25q3j17J40Jm03J79J53j76L18k8l57
5107b18J90J57l6k77M34l14K28o3p5j67O18l36k56L61l60n0L91J59m88K53n1k27
$$ plain form
4955 -98 132 55 -3 -266 168 143 -129 87 158 -312 320 73 -344 265 244 -337 19 -313 -151 -38 206 35
4977 35 -14 98 -106 285 66 -117 152 222 -65 -327 187 -15 -237 255 -277 -146 -20 -122 -157 292 19
4998 19 -307 156 138 -72 107 -63 -136 -77 39 -101 -12 136 -162 337 257 84 -19 -17 -123 53 -59 -283 10
5021 10 135 -145 271 232 181 -556 -30 -260 -375 0 -114 -348 171 118 -329 197 -213 -182 277 133 -162 -26
5043 -26 226 7 -75 230 -83 294 173 -87 -38 284 70 -137 317 26 -455 -4 -127 -412 -178 -182 -277 -52
5065 -52 -169 69 189 89 -57 79 300 -366 -50 244 -82 76 322 -356 11 218 -260 -3 179 -107
5085 -107 -132 -9 -171 -317 368 -172 -187 313 -103 -170 155 72 -45 95 96 -307 -128 25 -151 167 139 -218
5107 -218 -28 129 93 -184 250 -64 164 101 26 -141 477 141 -115 246 -114 -164 227 386 -102 151 100 -127
5129a27M14Q0m75J02L61n97n0M89n81K94J60k34M3L97l63q9L45k19K20J65l31
5150Dj02K88j31k51M09r9k62L03Mn04L10Q3k17K76J21n56N72Q0m91K37J22l98
5172b02J47K87k92j81N64l36J4L52l82L7L05m17N0J45J8l76M47o6l06M39l75J75
5194D7o8J91l85J70rj90K04J2l37J23L06n2P9Lk33n4M16m59j8O50o30mL11L02
5218C75q75O80j70j33K54K9k46J36N1l72L58j19j87M18k05m05K67L05j77o9K05
5239A20p5K58j67k07k91L72k16J95J11j33n1N07j91m97N36k76k09K92K63m36K22
5260A27J3l80M00R9o60N28J56m59m2N12l72k6R4l53J48M47k01k94M42n9j51K42
5282B11j01n01N83p4l77N92k79m10N21K53o15R6Q7m85M53L05o44M02k8J75l51
$$ plain form
5129 -127 287 367 -108 -6 355 -242 -292 197 -384 -90 70 -164 -121 276 -87 -176 169 -50 170 335 4
5150 4 -98 190 59 -192 217 118 -144 159 163 -341 -31 52 -165 111 232 -324 248 328 -163 74 196 -202
5172 -202 -55 232 -60 -241 323 -13 1 353 -29 8 313 -104 -54 91 109 -267 180 114 -192 247 -128 47
5194 47 -21 170 -215 -45 -54 -244 -40 -28 -365 -242 64 12 91 94 -139 -193 223 -236 -254 396 -234 -238 73 375
5218 375 -500 180 10 -123 131 160 -86 50 101 -271 87 -32 -219 199 -6 -411 -144 161 -16 -85 120
5239 120 45 303 136 -71 -362 10 -206 -11 100 -33 -84 423 232 -265 271 -5 -214 78 341 -95 127
5260 127 140 -240 160 259 -401 127 283 -176 -218 294 -78 -104 -10 -363 -215 232 31 -263 179 120 -31 211
5282 211 110 -391 192 118 -259 333 54 -356 165 418 -197 -101 -14 -499 -46 259 -385 17 -11 164 -187
5303a87K66l0J0L64o86J94J82n7k22L84l46k58M78M4l10J86K98l46Qj2k85O11
5325B86K6n93K78J64l90M22k21QP5m9q5k79L53R7m75J125q64PP0J22J09n3J81
5348C14l94L26qm19K60K20n15K63J92p52P81j99m59K93M15p24J58L72k12k58M09
5369F3l0j06K67j81n40P70k89k32K40K09l87K02K92n11K3M62n69L03J94m65J50
5390a35K90k51q6Q81p02m4N30m18o5N26o23oJ41K8k94K48m2j63M52j94m00L39
5412A2K48n76N29j02k24J97J98n71K20L09l76mJ84p1kL84k85l4K00k79j27N62
5434C92m65n2K81j85n06O39pm42M18j67l97N52J15m07N01n0m79%K85m19M07M63
5456D77m43l07L36l25J14J79j58o3L43l15q4O67m38j05M52K09o66K80J64n65L17
$$ plain form
5303 -187 79 49 59 423 -263 -69 113 56 -166 218 -128 -386 92 136 -174 12 310 -36 -28 -40 -325 286
5325 286 312 -281 -3 161 -229 193 -28 -20 55 6 -79 -358 -5 92 -383 742 -122 -115 -45 77 186 133 314
5348 314 -80 246 238 -181 79 299 -216 47 239 -513 268 69 -390 -97 318 -406 -248 124 -88 -346 63
5369 63 33 -73 194 13 -527 243 -46 -278 -38 171 -216 -14 278 -233 -210 252 -317 -14 180 -285 -135
5390 -135 155 -96 -182 699 -3 -47 483 65 0 526 -97 -103 38 66 -228 20 -22 -185 267 73 -327 12
5412 12 260 -316 213 111 -113 84 282 -289 -69 240 -136 -140 44 -27 -29 355 70 36 236 -43 -170 392
5434 392 -73 -125 156 -29 -535 104 97 -345 73 -94 -491 61 176 -231 270 220 -259 -259 26 -393 14 477
5456 477 34 -273 63 -262 -148 31 -127 -190 153 -162 -246 421 -17 -122 330 539 -127 153 317 -248 69
5477F9K07n28K25O65q82L55N67o91j46M34j90j76K51l23n6N87k66l46N55j29o83
5498e01P13k12k36M44P3l74L03O6o08K61K71m51K41K04n20K62N74p81K21L42m04
5519a12J06o0K18k50L87m54m6M05k4n18M99J77m61L33l99J12J65J4m55M47J7n88
5541d87N87J68n89M42M94q31K48J47j73k55N82k87l39L49j9l74N82j37m28L22
5561BL60n57O34k12m98M28m9m58N17J14m12K63N20q88J69L00m11o6O03o29J6M17
5583A63k42L1M30k92l71L42j18k43M90Q6p50N81j24p51Q94Q9k96R9L74o87L80
5604H5K39p56L12J19j41r5N53l67k18N95m48m7N26k17o02P41r5l37J11J13m46
5625c75N06J29p12N24P2n09J86J35l24L08J24k15j9O29n05k61Q03n90o2M19j10
$$ plain form
5477 69 276 -252 -27 638 -244 111 678 -13 -159 275 85 -91 160 -163 -219 368 102 -244 311 182 -501
5498 -501 212 0 -236 208 281 -93 210 276 -332 -71 200 -251 -10 194 -326 -64 510 -271 -50 292 -112
5519 -112 -6 -66 152 -98 289 -165 -211 194 170 -348 151 328 -133 200 -199 -87 78 92 -363 84 101 -487
5541 -487 100 268 -321 121 615 -216 32 179 6 -249 333 46 -293 56 37 -337 245 108 -320 2
5561 2 362 -195 439 227 -271 157 108 -350 167 281 -131 132 652 -236 -67 233 -178 -244 359 -270 -254 163
5583 163 -79 -48 382 90 -281 61 -57 -300 190 276 -474 107 -17 -768 126 215 -81 18 392 -295 85
5604 85 324 -432 -120 -1 -142 -237 316 -51 -269 326 -122 -169 357 140 -462 279 184 -153 -42 71 -375
5625 -375 131 260 -452 72 144 -365 -179 -44 -368 -60 64 -151 -170 459 -46 -307 496 -94 -156 263 153
5646A53m91Q33k74l51M36l14k77L60P2n58K16J74k52P74l19m00K62K57p87L09
5666a77L49l60J48L15m93O8O07m51j33N59l74k7O8k41j88P60l37l85L77q3m85
5687d83M79J74o02Q51n64l43K12J31J78k31M33l49Q1L20n85R8O43o66Q0M90m87
5708a40KO42m77n01O40j02n72P76L8o28O59l36l52M00J37k32M5L54o10M81L61
5729E85j048L24N54o05m0M45l30NN58p21J30K73j34k89N60j97l61M84j88m35P31
5750C01k68m70N82J48l48J52L33p45J72N21q92M07J89k19O6J43j26N9K34l61j51
5771b73O41j49m38M61L02q76O09j47m12M97R8n82R5N46o57J32N37p24nP47p31
5792c29L07L29m72j34O32l83j17M60m28k17N65qm78M35q3k72N07l61k68N36J63
$$ plain form
5646 153 -338 495 221 -130 306 -8 -285 75 147 -411 -195 -21 -273 501 182 -218 44 301 -486 -177
5666 -177 172 -188 -40 275 -218 -150 457 6 -127 432 58 31 99 -142 -330 430 93 -292 85 2 -483
5687 -483 -4 170 -432 419 -145 -488 -276 -145 33 -198 235 -114 -33 287 -298 -200 443 -223 -143 347 -140
5708 -140 -138 504 27 -474 166 64 -508 268 306 -322 337 1 -351 49 186 -46 -1 353 -257 224 585
5729 585 -463 -139 415 -190 -230 215 -115 -110 448 -273 -143 130 -4 -293 267 70 -291 193 5 -430 301
5750 301 33 -437 145 293 -55 97 430 -315 -143 378 -514 -107 82 -137 -71 72 -54 5 239 -122 -273
5771 -273 368 219 -219 242 544 -332 277 130 -282 215 313 -269 -174 372 -285 -153 384 -340 -345 402 -329
5792 -329 -22 307 -165 -299 333 -50 -167 293 -135 -352 213 205 -273 162 79 -193 314 -47 -315 221 384
5813C84o60M08K23n44L51K42p75L88K54n62K05M20n41m8O43n06k31O48j29m54
5833b84M57j85m33M92N5j44J44J32o24O78Q8o83L89M49q69J82M83o33L43K63o11
5854c11J48L48l33rM78m14rN05l66j52K55n9m44Q44l91l53N75k00n13M06M13p62
5876c44M70J34n40J48O66q75K51K83n49L24M61p47J65M26l88k81O68k90k79O20
5896C23k32n36P46k50k12K29Q6k14J60n8k27K47L68n35K28jo94K96N93o96K87
5917i2K28k48j83O39l60l00P18p38R0P46k16p63N37K6m33N48P6m80J32L43m87
5938b17K30L26p94M95K18n69L63N28o52q6O52o27K0M46o86R6P04p60K10K79k1
5959A55m06M94k17l79N05J85o23K18L56p61O18L9n28N42J84q05O09L62q96L44
$$ plain form
5813 384 -276 132 355 -189 162 404 -371 17 271 -291 -86 334 -207 -255 388 -118 -349 299 170 -284
5833 -284 173 -12 -445 47 102 -42 102 234 -390 288 376 -307 82 531 -338 -156 327 -306 37 300 -311
5854 -311 -163 185 -148 -157 321 -93 -102 403 37 -115 140 81 -363 481 90 -263 312 112 -401 5 418 -344
5876 -344 126 260 -280 -132 534 -341 -90 193 -356 -32 429 -318 -153 273 -115 -396 272 -18 -297 323
5896 323 91 -445 301 51 -161 68 154 -60 100 42 -185 62 430 -105 123 122 -572 -276 317 -379 -92
5917 -92 136 -112 -295 344 -16 -316 402 -336 -246 500 284 -479 58 84 -349 199 275 -205 -73 270 -217
5938 -217 13 339 -455 40 258 -311 52 580 -72 -158 494 -133 -113 333 -353 -257 447 -313 -103 176 155
5959 155 -251 243 26 -353 152 337 -286 -68 288 -473 145 184 -344 198 382 -423 186 548 -348 -4
5979dL73p30qP98l93j28K61l79n2M43k00k73O23l32k50L97j72k05L47K63n65N27
6001C41j07l07K18Mm13Q8P14o28j01N03m01j55N51l59j45N61n3n94M09L7m73P66
6023D56l83m53O63k03o13O10O1n14K92L96p91K56R30j258L42M92k51j63P02m74
6043I7j30K58k90j22M47k78j94O05k43n19M25k1k63L92M10j072R06n1q81N22J3
6064A1l15L50J43l97L30J69m81L8N73m65k08P72l90l72L36j52k03M41Q9n52O43
6085C60J28o27M48j82k90J95L32q56L04P97j008M60J17m03L36K32l57k69L84p4
6105B7m66Q61n22m7M69r6q80J040k65n32O97j92m80M17K94p93N04J9m69L44N71
6126E01p72L50L25n24o9N26n08l06Q95p01j42O35l44l35Q76l95l34P16n30k65
$$ plain form
5979 -4 369 -361 -369 429 36 -92 169 -210 -262 181 -19 -292 331 -1 -251 146 -26 -231 116 379 -186 341
6001 341 234 -73 145 149 -264 -176 538 -90 -191 312 -89 -244 307 -52 -197 364 311 -283 126 163 -310 456
6023 456 73 -380 283 80 -533 77 138 -376 -84 312 -479 -223 707 -551 -209 283 32 -131 571 97
6043 97 -33 225 -65 -187 260 -18 -212 393 150 -369 56 35 -228 164 574 -498 408 357 -524 -2 11
6064 11 -304 46 189 -208 122 291 -190 -152 421 -44 -252 520 130 -242 94 -58 -261 180 269 -283 360
6085 360 488 -139 309 127 -163 32 364 -492 -188 609 -399 61 178 -225 111 343 -14 -283 101 27
6105 27 -439 422 -100 -147 322 226 -654 386 121 -411 286 94 -386 31 325 -468 36 55 -414 -70 501
6126 501 -271 79 404 -120 -189 337 -171 -477 418 -283 -425 210 -134 -469 407 12 -322 394 -136 -401
6146d01N60Mk33L08l1m50O79k93l83K50J98l11K61K42o46L84K6m96J24N44m83
6167a47k08Q34n69l62Q27l02m95P94l13k45J44J59n14O27L1n06K72L35n03L56
6187B15k10m87L95M78n88K05M59m92J3J92l56k10N91k60k62O87l19l15N47j18
6207A65k73J67J63l53M96k30m93L55J64l39K31L44p39J41N85o74J57K71l39l2
6227b33M95l35j56P13m05j16L21J21o61N34l70j30O50k66l66M38P6q20M41M78
6247D09o59K60K55p12K90L23l49J3M29l11q1L50k39j63N82m48j15M41n41j84O96
6268B46L2o29O68k19n38L42L59m99J50L69o24J33K97k16l9N50l36j9J18l44K78
6289G9Q0k57J6L16j64p4K91q6m40J67J81l42L39M63q16K87J68n60J14N22m76n7
$$ plain form
6146 -401 159 163 -70 238 207 -243 436 143 -240 10 208 -103 158 400 -246 138 164 -332 -208 336 -147
6167 -147 -355 479 -90 -452 375 73 -422 372 59 -186 -42 117 -397 230 261 -245 27 362 -141 215
6187 215 5 -482 -87 391 -197 8 467 -25 -12 180 -176 -386 205 -55 -317 370 51 -264 283 165
6207 165 -108 59 222 -131 365 135 -358 -3 161 -178 53 397 -342 -201 384 -290 -133 138 -201 -233
6227 -233 262 -73 -229 484 79 -37 284 405 -256 278 -92 -222 428 162 -204 234 310 -510 -69 409
6247 409 -250 10 265 -447 -157 166 -183 -170 259 -52 -133 217 -22 -185 397 -51 -166 275 -266 -450 246
6268 246 278 -351 317 98 -440 -98 261 -238 -88 281 -343 -210 87 -129 -168 382 46 27 145 -199 79
6289 79 159 -98 -82 234 70 -4 287 201 -239 -72 109 -233 106 569 -247 40 208 -352 -238 284 -192 -249
6311b49N34m25o5L57l61L74J48m27QL65l21k17N18j78m13M94M0l28M51m68j18
6332b81K42q3q3L84j16l52L19o6j02J06J87l45O3M17o16J44M83m11j74M63k19
6353d0p9L28l61p3L59j83l37N23j2k18Q1L86n96Q9L63n96M33K68o06J06L44k97
6375a18O2J80l17J24N54m65k14M94k43r9M89j20o49N70j29j34J65o5m84M23L15
6396C39n39K73m2l11K03L64m98K99n8k8J92J85m64M4M20l88K2L65l38l00N72k94
6418A8l50O63k52l68N13J4m97K62m6l96N63K36p07M17L7j91P8L75m50J05K47j33
6440A38j51M26l58j22Q0N1l85N73J35n92M89j89l42O18j35m76L93j90k26L18j21
6461f6k49N20j17k67R6M94m99J19K03j96k24M46k02j15K74j80j45O4Ll99O58n10
$$ plain form
6311 -249 285 -140 -205 152 -209 165 313 -114 -106 259 -62 -279 239 61 -352 142 182 -146 305 -163 -281
6332 -281 -39 -122 -205 179 63 -289 30 -36 -138 -32 155 -190 -127 290 -326 -182 301 -110 -284 179 -40
6353 -40 -119 209 -152 -225 134 -49 -386 137 125 -93 -12 374 -222 -133 230 -366 67 335 -271 -165 179 -118
6375 -118 -56 124 -193 -69 485 20 -194 300 57 -42 447 327 -322 248 119 -15 150 85 -399 24 339
6396 339 -200 73 31 -280 -77 287 -211 88 30 2 194 379 -85 -41 379 -9 13 378 40 -260 312 18
6418 18 -332 331 79 -289 224 238 -259 3 -43 -439 124 360 -347 70 107 -84 -6 369 -81 24 271 138
6440 138 -13 413 55 -67 13 64 -321 252 387 -205 284 95 -247 371 236 -240 153 -37 -263 55 -66
6461 -66 -315 205 88 -179 -83 411 -88 31 234 38 -186 260 58 -57 217 37 -108 -44 -41 -440 218 -292
6483b92J2K37K46n44M29K57p51O99n7m70N9L40l60L8J97J73k33N34q99J42J71
6504g2k16o7O63k64k0J5Q0l53L78j58m61M28K72m80K56J42l53J21K46l50K80r1
6526dQ3M2n5m9l55N57k91J21J34k03lL38j33k08J3Q3j82L46M3m60K50r7PO9J94
6551B40m24M72n1o03K00L06n42K84L44j84k62L59m49K61M95m29j36J11k09OJ91
6572b0n4l24N20Jj43P8O5k85J95J65m42L63q9J7P5N71n92j28J80k66j05K70m13
6595c61L22J37k03N4K12O5n74K59j06P5K80k07k27L03K66o88K35J33J32j95K21
6616A33k09J10M03p00K63K14j04k40Q0m7j09K79mj59P35n97L0J7J19m96M80J86
6638C84o11K32P4l87M31k9l52M21J98l53j02K25l23L8P9k12N9L24l19j32M18r9
$$ plain form
6483 -292 -280 -43 203 -341 88 345 -406 293 236 -234 -175 165 -195 -157 40 213 -20 514 -385 -243 -72
6504 -72 -288 -355 308 44 24 39 119 -234 144 -14 -475 -47 225 -255 1 143 -210 -89 157 -193 87 -4
6526 -4 79 121 66 17 -338 219 -72 49 183 -20 -23 315 182 -26 -13 70 -112 234 277 -183 67 -30 -23 46 240
6551 240 -184 288 237 -366 -166 140 -402 -118 226 42 -220 139 -310 -49 446 17 -119 -8 -217 -211 -20
6572 -20 -74 -398 122 123 -20 58 123 -162 33 198 -244 119 30 47 122 693 101 -27 153 -113 -218 52 -361
6595 -361 -39 98 -105 -51 161 226 -348 -89 -195 -120 160 -47 -274 29 295 -393 -158 -25 107 -88 133
6616 133 -76 34 437 -263 0 214 110 -130 -50 -97 -206 73 69 -90 645 48 78 95 214 -282 198 384
6638 384 -227 5 79 -308 123 94 -258 163 361 8 -94 131 -192 -154 -75 -287 -228 96 -223 -355 63 -36
6660c6m00O96m02jK80r8k38K49K11k98L40J44n34J21J68n12K78N09p41k66P19
6681A89K9l76K75p0k32K47rn55J037m37k24K97k08m09N99k0k02J26K84m07N5J80
6703A69m36L38k25J06KL88l85J53N4l4l40L22j61j8M13l04o9L15j13l92K95j6
6725F2j60K23Q5l25M04l00k40K37J13j69K05o8k82l4K55k1l2L4l43M33N13q10
6747b20P0N41n64r9N50m41J44J41R8l34O4O6k2Q0Q3m26M26m4n04K91M28l92o7
6770a31M54m37J42J02k03j74M00m15J26K82j97j01J64j44J83J99j89j60R3N9j36
6791h3p7L26k60K2L33l53M4K49j96j52N48n87N7K42k01m8L74l48l43N68k08J4
6813g9J79j28j74N56n16N3M33k38k63L66j94j87K40J31m84L58K05n43K71K22j85
$$ plain form
6660 -36 -436 260 -142 -143 137 39 -199 50 261 -37 303 447 -87 34 202 -310 -32 477 -264 -530 189
6681 189 218 -158 117 47 -185 62 53 -502 535 98 -126 171 -37 -446 153 133 -69 57 341 -66 -11 169
6703 169 -267 71 -154 -48 -46 342 -43 110 164 130 -210 112 -49 -67 346 42 -27 288 175 -217 78 62
6725 62 -98 125 210 -115 289 -11 -251 -14 99 -70 135 67 -215 -249 6 -15 -47 -13 -356 77 590 -220
6747 -220 -150 391 -173 -272 278 -163 -19 122 220 -114 -50 16 -6 74 157 -269 157 113 -391 -100 328 -64 -131
6770 -131 323 -114 28 130 -73 -247 153 -262 -136 146 -51 -152 12 -132 51 250 61 -99 -6 53 -83
6791 -83 -160 166 -94 -72 261 -92 -48 201 5 -147 401 -186 -129 113 -88 -136 238 -110 -453 115 -93 -79
6813 -79 100 -28 -202 354 -162 -109 324 86 -177 189 -5 -192 48 179 -305 53 258 -285 -14 208 23
6834B3l28P62m84j26L05j34nJ56k35P0J95k65j4K05J82n33K86j83k30N72j59j48
6856h8n1K45k6q0Q9k77M55n9J16n77M16j93J56Qj00p8K75l16j65M19km05N7J99
6880A8K9J06j81J64j48J34r1r8K72l68J66K1j03j81K70j59K20o5L04n98N23k02
6902C3j5Q9K1k07M21Kl75K96m69J36K39k98J58K7m7j25K44K20m65k31L66k49m4
6925b73L89n45L48J73p5k3J14r7j96N51m18k96O67l75P7j76M32j11M3l35K88j84
6947b2K85l30j46K16k89N95O0m23R3Q0k31j23K62l4k25L71O1k37K16k82Q1K07
6969A85l41oM21k1m38M15k48k03J26J05j34K64J44l70n4R1r6k9O85m86j97K57
6991G0M5j40np2j65L15q8j04J64l51M92j08j94OJ30K13k13j72Q7l59N14Q4j9l07
$$ plain form
6834 23 -305 457 -27 -153 152 18 13 169 -66 4 199 -66 -80 125 307 -226 60 -123 -353 219 60 -88
6856 -88 -139 106 80 0 89 -188 267 208 324 -253 163 -30 126 134 34 -44 231 -85 -250 169 167 -238 -181 18
6880 18 47 153 -28 136 -12 122 31 -67 205 -163 3 24 -79 -260 10 -149 71 6 310 -288 235 33
6902 33 18 107 128 -79 342 344 -31 265 -204 -68 171 -127 31 58 11 -114 130 350 -115 -346 20 -229 -273
6925 -273 116 -429 -81 92 17 -6 108 11 -185 366 -52 -348 319 -56 21 -155 277 166 209 -126 162 -22
6947 -22 263 -67 -213 3 -286 309 369 -54 39 119 -112 -235 27 -7 -232 139 200 -37 179 -103 -22 185
6969 185 -156 -162 259 238 -200 215 -33 -236 -110 -5 -139 125 269 -101 -155 -64 -160 -189 496 10 -187 70
6991 70 115 -25 -30 -102 -267 48 -40 -144 20 -331 161 53 -141 -135 -5 208 -5 -177 -90 -449 65 149 130 -177
7015a77N28r23K78L50k55K7K46k74L00P2L0l11l5L8k67M45M3k83K07q1M9K95l16
7038a4m2k67O11m24j6N69m28J03L0l89M62j77k5P3n3q0k34N11j82j91L78n03J98
7061i0n6L45n78M53Qk03L52j7l16R2j9O5k01J49j67J70K92l64M3J63q6q2l4K10
7085A29m2K45m60J14J71j87j15K20j90k78M47J83j75N4k08L3K16j21j03J03l22
7106b86J62J35K94n78K74N4j88P2J83k89j96M28l12O9K92m20P1M58l41M01j89
7127I4j06R6l00L12m70N16R8k60J41j84l7J47K13l67J49Q2l30N5M31m15L10q5
7149I0l01j21L15M0O8n0k8j8j34K03q8J04j39J68MJ15k64J40K2m26K68L13l89
7172a08J65Qj58J51O1q7k44K12j10o4K12Q5k73K90J70l88R5O4j91K71j37n3P2
$$ plain form
7015 -177 351 -572 -294 56 -199 -172 74 -200 100 172 202 -109 -144 -106 -373 72 115 -168 39 -42 7 302 -14
7038 -14 -56 -323 288 -136 -152 417 -11 92 122 -267 195 18 -7 66 13 -67 -301 210 28 -163 215 -288 -90
7061 -90 -146 199 -379 74 82 -121 231 214 -102 -10 -29 36 -165 -16 -183 -13 279 -85 -42 121 35 -47 -81 129
7085 129 87 332 -128 -14 157 -30 -145 75 -115 -393 54 237 62 116 -92 -59 157 36 -67 36 -286
7106 -286 -124 11 305 -273 1 55 -133 -61 122 -167 -363 65 -247 -178 114 -306 -235 223 -118 283 94
7127 94 -12 84 -216 96 -374 142 240 -20 121 -63 -100 47 260 -107 42 124 -206 -151 280 -135 175 90
7149 90 -211 -332 -17 23 91 41 13 -5 -139 64 -24 80 -59 109 113 228 -36 104 126 -300 -32 281 -108
7172 -108 57 65 -93 58 119 32 -212 0 -110 -174 38 123 -150 140 310 -78 17 81 -110 161 24 -29 43
7195D3J29k33l2J68L0j31QK39m45K14j58k10L59j5K71n7j84J68LO4k31J40k02
7218f2PQ3K57l94M92l86k4Q2K21l50O2J19j02J33j08n03L17M13m15L00J01l67
7240a24K9J19J62m16J39K9Q0Mrk15R4J15p8P9j01Q4M02m38j01J53j38K94j79J67
7264A51k85K16N2j58R2K01o8k1m81J72J18q3J94k02N4Rj77K24J95n39N53J24k11
7287A30K56k53k24K41jj53O5l12K23r6J79j86L15k9j39p4j48J22j89M19k62q4
7309b00K81J2j57K27q1mJ35J67l92k20K30j15j31M7L12j09K51q7j22KJ6k2p0K38
7333B08k63J27k51J82P7k42L24l6k15k22K62o2R9J98j39j27j0L22n22N86k32j8
7355D6K57l36%Oj93L14m03O60k18n81N53j27j22J72K8k63L29o6j73M6L06l04K39
$$ plain form
7195 43 172 -61 -93 75 105 -26 -18 221 -224 -10 -168 -378 -19 -34 237 180 -4 164 167 231 0 140 -62
7218 -62 -55 28 285 -109 383 -3 -27 55 276 -74 -12 107 5 138 30 -473 -156 257 -158 142 243 -124
7240 -124 -95 24 186 -230 -91 -62 18 22 13 -202 -108 7 -71 8 -93 -9 393 -45 -146 7 -131 163 -16 151
7264 151 -134 82 134 -24 68 269 201 180 -301 -129 -11 -94 100 -102 -48 -39 -216 8 203 -336 217 341 130
7287 130 386 133 -91 150 149 -4 61 -251 -28 -124 55 -131 184 155 16 -58 -206 -84 -273 146 -116 -200
7309 -200 81 93 -64 163 82 78 213 380 -12 -232 -2 -117 -248 -201 111 2 253 166 44 46 62 40 -30 208
7333 208 -55 72 -179 3 80 -162 162 126 -89 -311 -49 -111 -12 186 47 -80 -90 232 -290 296 64 46
7355 46 303 -33 -33 -27 -220 94 -309 351 133 -448 105 -22 -144 28 56 -207 122 56 -117 -71 235 -69 170
7378A70P3m46N6j34L02J62j69k0j35K58j60P6m4p6j35M72m03J09J27l1j57K91
7400A86m14Q0K86J1k46L47J55o24M04n13Q5L95k70N7q4J83j36M29j07k61L9m9
7422d7lJ75l43R8K38j72LP5j70J66K44r5j33oLJ50m43J86J00r3J0j58K69l16n1
7447c13K02J76J89j65j70J86n6pJ20l15K16R9j77pQ1k5m7j53J64n7r0KL58j37
7471G4n5j21N3J18o0j46K4M4J70k09m8R1j35J30kJ67o3jj04J06J35O6m26Q1l7
7496a48J47k6Q2p2J66j69N5l10K81J74j37k41K61o6j91Q5n4J51k3Ok75K17J86
7519I9k06R7J05j16J24j09J59k48K47%j30L41j27P4k72k7j05J90k01K57j41m3
7541c2l1K43k22P4K41j97K0N6j94j55M59m90K37K9k02J18j08J93J47O0l24lJ06
$$ plain form
7378 170 243 -203 -147 -281 21 183 14 -6 -141 117 -43 33 -11 -87 -222 250 -153 -44 83 52 -105 186
7400 186 -228 -148 138 149 -97 250 405 -219 185 -328 -243 152 -118 -61 -145 38 -98 331 224 -37 2 -47
7422 -47 -50 125 -218 -120 118 -54 -51 24 -146 20 264 169 36 30 33 183 -260 -74 26 -67 -57 -215 54 -262 -313
7447 -313 -111 65 254 89 -81 105 49 42 162 -153 63 162 -15 -22 59 34 -13 -166 -2 -59 -149 -147 211 74
7471 74 19 -102 -49 69 9 -137 -113 -69 101 -108 -156 -65 -200 -70 -72 95 32 31 -73 33 168 234 -192 -111 -148
7496 -148 -1 -27 55 -17 149 -20 35 -275 6 180 43 -198 63 -3 -194 -109 -163 -12 -35 -29 -304 -87 99
7519 99 -107 -10 95 -21 103 -6 153 -95 152 152 22 363 236 310 38 11 -94 96 -105 152 11 -32
7541 -32 -63 180 -42 32 273 76 96 152 -42 -197 262 -228 9 38 -164 -46 -154 39 186 246 -78 -81 25
7564B5K19l47k7lM0K66m14M01k52J77j96q3P9r1M43k80J64k83O6R7k14L56j48
7587eJ06j65J0J75m5j13j42L53L6m58L85J38n72P44m75L7M12m76L37j36k11k10
7609b75J43r5p2P8K39j09M6o3J63n9K20j83j85j06J71o2K55k33L32j70n3N1R3
7632A26q9j4l37J20K62J70n9j27M7J38j95K57l40L7o5o5L17Q6k70j63K12M9nj81
7656h9N7K45j34l8j47l4K21l18J82j10K7K44J75j66j55J95R7l97o8L1J69J37k77
7679a53j76J04K97k56K77k66q0L87j63p1m0L04j05l11L44l3j18Q5J1k00K48q9
7701dN9m1j15K73n54K99jp3O0J98o2J19j82N6J41r0j46M40j50j30N6j05P8J17
7725B43k13k84N44m16M30n0n43M18k7J10l62j1K7j87K15j0J25J32k69qN33l73
$$ plain form
7564 25 244 -103 -130 -133 -93 173 -241 160 -92 85 -111 -194 -115 -206 237 -43 121 -162 -96 1 -213 143 -5
7587 -5 101 -64 -54 121 76 -37 -179 174 210 -248 137 275 -297 447 -28 9 421 -55 282 146 -65 -275
7609 -275 -132 -227 -299 -221 18 -91 -45 -108 55 -4 216 33 -152 -258 -87 -149 106 -127 205 35 -18 33 126
7632 126 37 23 -314 -194 68 238 179 52 99 237 42 299 -41 -4 -69 -134 183 269 -1 -164 48 97 92 -89
7656 -89 -32 213 79 41 -106 -140 81 -237 -55 -165 -138 106 281 115 -40 155 252 -145 -213 -182 -13 124 -153
7679 -153 -329 -225 72 -184 93 -173 -253 134 -29 -100 -140 164 59 -252 92 59 -59 26 37 -163 85 -4
7701 -4 55 14 -101 172 -382 -83 -84 -157 -97 101 39 158 -24 32 173 83 -63 377 227 97 153 48 126 243
7725 243 30 -254 290 -126 304 254 -289 129 102 212 -150 -161 -134 -321 -106 -116 9 141 -128 -136 397 24
7747B4q8j33J57p3N6L33l08L9q4m2R9M9k18M3K42K25l98j69L36l56j0K40J3K10
7771A87m13O8N36m59J19J46j45j36J70K9l30N67j03l24J24L8j34J06O3k1k14r7
7793b23J25J16j77L09L9q5m25j2M20j21j83L46j30J85k69m3K95l01K57j70N4k8
7815b1P0l41K57J19K6K2j26r2r0j08Q2N10k01K4K4M2j93J34k87j12J58N37l22
7838A12j68O6j70L22k31M4K49k94M5n5K33r2k6Mj83K52j75K10j79j3j56Q7K67
7861A49k60L53l1k5k12j6J48k14n4N96l68k69m0j1L22Q5j69K2M1q0J84q7j05k12
7885b53N3j02J28r4L28j47L15j61o1j63n0L19r9m6p6L23l20J17q6K96k97J90K51
7908C65l54N4O9q5Q9Q2j18k95M16k51j6RN4j84K14J44k87R9o5l30K47K46q8J26
$$ plain form
7747 24 -64 -197 -40 -113 -57 276 -32 7 -77 -119 -20 29 -189 -146 96 321 -77 -246 90 -266 -276 -36 -23 187
7771 187 -226 -158 378 -81 38 184 39 -97 73 102 -228 339 236 -88 36 74 -60 46 109 88 -126 -223
7793 -223 -98 18 -159 150 189 104 -321 -333 87 -34 -217 129 -1 184 -85 -128 167 -134 123 -47 7 -21
7815 -21 49 -292 -35 84 110 132 6 -86 -176 -284 -202 308 107 131 155 197 4 138 -149 -261 -103 434 112
7838 112 -56 10 -160 162 -69 -25 224 -70 -25 -80 153 61 35 39 -144 108 -67 143 -36 -49 -205 -118 149
7861 149 -111 242 211 186 -26 -42 106 -108 -162 434 66 -203 -243 -254 68 153 -16 6 47 -33 151 64 -41 -253
7885 -253 -200 -302 -174 -268 60 -87 228 67 6 -157 -207 112 13 -33 -109 214 -106 11 -75 221 -76 114 365
7908 365 11 65 134 49 138 220 102 -193 223 -28 -44 -35 19 -165 49 193 -94 5 -60 -390 -143 103 15 141
7932A41k78J48k59L27k61K91jKp3Po4k22M02m64L71q8M09k52k12r3N2J87n6j31
7956a17o8L34l84K86J8k7J89l25k4J93J67l61K10K17l29k8M25k97J66j96J22n17
7978c46M89j05k45J96j58qj0O4O1l7K47l49P2M12k32k12K19q9K3N1k87K92K90
8001C38n97O3J25o9j19L29j31R2R6k82K62P5k1k39K27m2K7j63M7L02k10n5J23
8024A78L7j26j26j39L54j65j84J08J29O5l23K72j80J26J05jJ29m38J27p2J47j70
8046a47M61j45k94K63j88J81j39J87l31r7K51k8J01j36L4J51j25k21p8M44m82
8067c38K11J61j43n9M1J06J21j65J48l8M5J37o43P21l40l17L11Mn2P2O7l64L48
8090C4k7j49M17l43q8P5R1j82j30Q36o05K05P3k63r2J52j66j50J70L37k61K01
$$ plain form
7932 141 -137 11 -248 79 -182 109 108 110 37 44 -20 -242 160 -304 67 -21 388 136 -76 -169 -117 70 14 -117
7956 -117 -185 149 -235 51 69 42 231 -94 -118 75 242 -119 91 308 -21 -49 376 79 245 49 171 -346
7978 -346 143 38 -207 -11 -169 -177 -187 -123 -62 -99 148 -201 -129 283 51 -161 58 -31 -8 43 -244 48 338
8001 338 -259 -196 -71 -140 -259 70 -61 31 127 -155 107 182 161 -78 149 107 134 -29 18 320 110 55 178
8024 178 215 89 -37 -176 178 13 -171 -63 66 131 -192 80 -100 26 131 130 259 -179 -52 -124 23 -147
8046 -147 314 169 -125 138 -50 131 -8 179 -152 -249 2 -26 75 -61 -27 124 -1 -222 -300 144 -338
8067 -338 -127 34 -109 -168 -127 -21 100 -65 83 45 90 227 -416 305 -35 -352 -41 -37 -89 -17 50 -314 34
8090 34 7 -142 275 -68 -156 -81 10 -172 -302 534 -71 134 207 -56 -148 4 -162 -312 -142 195 -66 135
8112A35j64j28J08K53j78L07m73j10M45o2m38L06J28k41J41j99p1J66J31m1o9
8133e4N9J29j60j24K68J08n18K91L1nl90K69n6K16j40k7L12l38k26M66j74K38
8155A75J64k77k47J04J05j14L71k27J5r0J31J4k85j4N2K77M6k33j77K32j11J03
8177A4M4q0K50o0k64J26J31l33L77p2o8pK18l92
$$ plain form
8112 135 -29 -157 -49 204 26 333 -140 -250 195 133 -305 1 129 -112 29 -170 -241 -75 56 15 -54
8133 -54 5 134 -26 -150 118 226 -292 -1 30 25 -365 -96 -152 64 -76 -103 209 -129 -355 111 -63 175
8155 175 339 62 -185 -81 24 -90 281 54 69 -21 110 124 -161 -175 -123 154 200 -33 -210 22 -89 14
8177 14 58 -22 228 168 -96 30 161 -172 205 133 65 58 276 -116
8191a16
$$ Imaginary data points
##PAGE= N=2
##DATA TABLE= (X++(I..I)), XYDATA
0@%%%%%%%%%%%%%nJ3j6J6j6J7k5L2l2M0m8N6o7P5q8J01j13J28j47J70j92K16k43
36a28K71l03L38l78M23m69N21n74O32o99P73q55R38j031J136j252J383j527J687
55H86j868K075k315K594k924L321l812M436n255O380q022J0639j5441K6878r9540
70h1968n2207K84991j32398p6655K09915j15555j15232K13283j23997j69927K36457
81G6707k4857k11901J85415K5566j87231J69719N5273k03250J62206R5971k55008
92a11390P6545J57037j93800M7099J53334k01376P298J82101j90114l0854K34374
103A30254j32842j04824J90603r6338r1280K22672p1721j53093K06045k8197k00844
114a29565J64623L3150j79758J41334L7536k10942J35714J12503k14621P9973
$$ plain form
0 0 0 0 0 0 0 0 0 0 0 0 0 0 0 -5 8 -8 8 -8 9 -16 16 -16 24 -24 32 -35 40 -48 53 -60 68 -79 91 -101 115 -128
36 -128 143 -160 178 -200 223 -246 275 -299 333 -366 407 -448 490 -541 595 -657 726 -801 886
55 886 -982 1093 -1222 1372 -1552 1769 -2043 2393 -2862 3518 -4504 6135 -9306 17572 -81968
70 -81968 -134175 150816 18418 -58237 151678 36123 -79109 134174 10177 -159750 76707
81 76707 51850 -160051 25364 50930 -136301 33418 88691 -114559 47647 143618 -111390
92 -111390 -34845 122192 -71608 -24509 128825 -72551 -65253 116848 -73266 -104120 130254
103 130254 -2588 -107412 83191 -13147 -104427 118245 46524 -106569 99476 71279 -129565
114 -129565 35058 68208 -111550 29784 67320 -143622 -7908 104595 -110026 -30053
124c0053J58263j79814K8661J41832j80572J7515J86718j77327n1220K06940j32717
135a1774j10261J83086p5524q7770J97135p6645j51892K03831k716j76249J65716
146E6937M5252j79524J08311L2226j88277J30599J05213k09371N9405J40871j73838
157g2196K1766J51864j44282J0592J58552j68573n0760J96677j07043r3045J77216
168H0768o8509j05181J64093n9713j29917J85899k118j69813J40675L9131j65651
179i0336J10383N8287j63412J08016Q8877k02221M4047J34416j54868J8711J41822
190I3722j43279n647J53649j41447m0684J97055r2326j00973J51898o8570r9615
201i6217J65607m1676j26059J67977n138j73042J28575N1997j48704R8035M8630
$$ plain form
124 -30053 128210 -51604 -22943 118889 -61683 -44168 142550 -34777 -85997 120943 -11774
135 -11774 -122035 61051 -14473 -102243 94892 18247 -133645 70186 67470 -108779 56937
146 56937 102189 -77335 30976 63202 -125075 5524 110737 -98634 -39229 101642 -72196
157 -72196 -50430 101434 -42848 -32256 126296 -42277 -93037 103640 -3403 -96448 80768
168 80768 12259 -92922 71171 11458 -118459 67440 65322 -104491 36184 75315 -90336
179 -90336 20047 78334 -85078 22938 111815 -90406 -46359 88057 -66811 -48100 93722
190 93722 -49557 -55204 98445 -43002 -83686 113369 21043 -79930 71968 3398 -96217
201 -96217 69390 27714 -98345 69632 64494 -108548 20027 72024 -76680 21355 69985
212F9985j65766R0599Q9973j76913N4555J44185j43267j858J24565j27527o380
223d7849J44183j27818m4297J72718r3482j00666J52106l8100q6211J45022m1334
234C4272j24125J42656m910j53130J24477N3721j46537P6507M9950j41777Q7217
245a679R3103j54366M3254J19441j45164n899J28141j06841r009J31584j19996
256b7431n0380J57470p8337q5654J48469l9322r7554J26152l5858j13448J43647
267D7754Q970j43645J07899M4822j40442P5965N8328j28780P8196Q3284j56255
278f3904K9000J18404j24811k553J22408j02459k0093J17474j08609m1758J57773
289H0872o5864q8489J28634l6324r3129J16900j9394r7887J27196J120j42766
$$ plain form
212 69985 -95781 -5182 84791 -92122 -37567 106618 -36649 -38507 86058 -41469 -47849
223 -47849 96334 -31484 -75781 96937 3455 -97211 54895 16795 -69416 75606 34272
234 34272 -89853 52803 47893 -105237 19240 72961 -73576 2931 52881 -88896 -1679
245 -1679 91424 -62942 -19688 99753 -45411 -51310 76831 -30010 -39019 92565 -27431
256 -27431 -77811 79659 1322 -84332 64137 24815 -72739 53413 17555 -95893 47754
267 47754 56724 -86921 20978 65800 -74642 1323 59651 -69129 9067 92351 -63904
278 -63904 -34904 83500 -41311 -43864 78544 -23915 -44008 73466 -35143 -76901 80872
289 80872 15008 -73481 55153 18829 -74300 42600 23206 -74681 52515 53635 -89131
300h9131R6459N4963j22041O6661N8183j21127N5471P1059j37519L3908J18015
311H4901j15154j5581J09942r1721k3478J15839q4477l9111J37422o7597q9693
322g8708J23382k2025q5638J11205j3425j02328J06004M724j26840R5021N5734
333F7106j21686N2868N3559j17001N2204Q0893j20204K6765J07291j12756j9375
344e0336J08846p7444j9695J10846q3264n0909J25005n5590q0225J19699j5239
355C1694q6912R2871j4889r4970J03376J6044j17390Q0988M9613j17335M3308
366a3602N9498r5824M7317P1816j16130J6707J00052r8253j7067J07164o6089
377d411l0805R1532p3425m2845J20701m5325p7931J05888j6426q9966Q4450j38
$$ plain form
300 -89131 7328 62291 -59750 6911 65094 -56033 -562 70497 -67022 -33114 84901
311 84901 -30253 -45834 64108 -27613 -51091 64748 -19729 -58840 78582 10985 -78708
322 -78708 44674 22649 -62989 48216 34791 -67537 38467 43191 -83649 11372 67106
333 67106 -54580 -1712 51847 -65154 -12950 67943 -52261 -25496 81795 -30961 -50336
344 -50336 58510 -18934 -38629 72217 -11047 -61956 63049 7459 -72766 46933 31694
355 31694 -55218 37653 22764 -72206 31170 47214 -70176 10812 60425 -56910 -13602
366 -13602 45896 -49928 -2611 69205 -46925 -30218 69834 -28419 -45486 61678 -4411
377 -4411 -35216 56316 -17109 -59954 60747 15422 -62509 43379 26953 -63013 21437 21299
389B1299q1623R2426J2915j14434P1894N1485j05649M6459O4677r5034L0224O4363
401E9002j05797J6668R8933r0564k0251R7648o8908l4283R5079n6802m0441J10509
413F0793m5141p9595R7215r942p9886Q4073K475q5084P8349J3515j04494P0130
425B408N5983r6137L5219N5146r1060K6725O6388r1787J3372Q9113q8093k8123
437e0846R1395n3560k8286Q9062n0548m2687R6443m0240p1167R6485j160p9719
449d4828O7599J492p8604P1791J8732r2585O4203M9154r9695K6698N9208p8123
461c4958K4400O3344q6228O873Q2279p9979k0755R5482m9039l6243P9036m9016
473d804m4786R2303l0939o5319Q9084n884q1079O6812J1047p1141O7543J9530
$$ plain form
389 21299 -60324 32102 45017 -69417 2477 53962 -51687 -5228 59449 -35585 -5361 59002
401 59002 -46795 -30127 68806 -21758 -42009 55639 -13269 -47552 47527 -9275 -49716 60793
413 60793 15652 -63943 33272 23330 -56556 27517 29992 -55092 23257 36772 -67722 2408
425 2408 58391 -37746 -2527 52619 -38441 -11716 54672 -37115 -23743 65370 -22723 -50846
437 -50846 40549 -13011 -41297 47765 -2783 -45470 50973 10733 -60434 36051 34891 -44828
449 -44828 22771 24263 -54341 17450 36182 -56403 7800 56954 -42741 -16043 43165 -34958
461 -34958 -10558 52786 -33442 -26569 55710 -24269 -45024 50458 1419 -34824 44212 -4804
473 -4804 -49590 42713 11774 -53545 35539 29655 -51424 15388 26435 -44706 22837 42367
485D2367r2434N0854M4015r0703K8555O1224p3877J5470N8714p9303O745Q4325
497E5952o6312k2320Q4053m8205l9544P3250l8743l9990Q4873k9512o9730P6792
509B0564N83p1896O3338J6405o7188N5660J7695q4648M9829N0305q2451K0405
521a1399N5780p1444P260N7571o6975O380P8735o6978k8966Q1043m0313l7259
533c6565P3276l1242m3749P4218k7948o4808P8739O735p1154N6470J5342p0080
545d0766M9855K3933p5501M6285M6277q3373J5860N7129o4965Q754N9873o2294
557a8933k915O8925o2331k6438Q0189l4740l8959O5896k9800m4211P1478j6669
569A1492n7156P2235N771p0993M8640J7465o1450M7050K4414p4621L4825M2556
$$ plain form
485 42367 -50067 787 44802 -45901 -17346 43878 -29999 -14529 44185 -35118 -28373 55952
497 55952 -10360 -32680 51373 3168 -36376 36874 -1869 -41859 43014 13502 -56228 20564
509 20564 21147 -50749 12589 28994 -38194 17466 35161 -49487 342 50647 -31804 -11399
521 -11399 44381 -27063 -19803 37768 -29207 -22827 55908 -11070 -40036 41007 694 -36565
533 -36565 36711 5469 -38280 35938 7990 -56818 21921 28656 -42498 13972 29314 -40766
545 -40766 9089 33022 -42479 3806 50083 -33290 -17430 39699 -25266 -16512 43361 -18933
557 -18933 -21848 47077 -15254 -41692 38497 3757 -35202 30694 894 -43317 28161 11492
569 11492 -45664 26571 32342 -38651 9989 27454 -33996 13054 37468 -37153 -2328 40228
581D0228p6597J4550N8540n6590L066N3726n9559l918P0136n1195k5505P5086
593D1968l3965m3827O1036k2326l9534O8336j6002o0047O4366O401o8987M8741
605F160K3948n9809L8373K1965p0998L4969M6203o9425J3636N6884n8705m331
617b1130N2839n1203m446O6551m9932k9206O9755k9721l9605O3908j4068m1828
629b8086N8797j4610n8472N8821R908o4597M2303K1139o1383L2407K7665o0017
641c6125L3024M6913o5485P330N3759n2077l930N3540m6812j1401N8453m7816
653a0627l0344O7994k1719l9294N7642j4286m2875N5818p173n2355N7718J1213
665C1712o5866L5937K3157n6812L1654K9188n9084K6077M1383o4790P826N7744
$$ plain form
581 40228 -36369 -21819 36721 -19869 -16803 36923 -22636 -26554 43582 -7613 -33118 41968
593 41968 8003 -35824 25212 2886 -36648 31688 15686 -44361 20005 26406 -42581 6160
605 6160 30108 -29701 8672 30637 -40361 -5392 40811 -28614 -14978 41906 -16799 -21130
617 -21130 31709 -19494 -23940 42611 -7321 -36527 33228 3507 -36098 27810 13742 -28086
629 -28086 30711 16101 -42371 16450 26358 -38239 4064 25203 -36180 -3773 23892 -36125
641 -36125 -3101 43812 -21673 -14343 39416 -12661 -16591 36949 -9863 -21264 37189 -10627
653 -10627 -40971 27023 5304 -33990 23652 9366 -33509 22309 15136 -37219 20499 31712
665 31712 -34154 1783 24940 -31872 -218 28970 -30114 -4037 37346 -27444 -19618 38126
677C8126m7168o635N0423m5675j3052N7699m1500k6530O6661k3749m4740N2881
689A6741r889m0228N4415m258n1303N1287R840o2424L7772K8708n3264K5235K7167
702B9799n7905K0180M1125n7125O288N3327m7308j1814M9080l7545j1683N6755
714C3174l4345k8648N8883k0889m1807N2471n034m0642M6990m797n2050M6841
726A0147J5088n6702L4157K7698n3733K0141K8665n2760K0458M2748n5807M39
738a9461N0468m4001j1192N1513l2760j4005N2285l4986l0032N9194j6023m1304
750c0304M9792m593m3476M1719p90m7220M7482J4957n8062K9098K7942n1309J9013
763e751L2122m7206J5650L7939n3711L79N1901l8546j2522M7771l1583j8616M8575
$$ plain form
677 38126 -9042 -15677 34746 -10929 -23981 33718 -7782 -34312 32349 8600 -36140 16741
689 16741 6852 -33376 21039 16781 -34522 16765 26605 -35819 1953 30661 -22603 2632 29799
702 29799 -28106 -7926 33199 -23926 -17638 35689 -11619 -23433 25647 -11898 -23581 33174
714 33174 -1171 -29819 29064 8175 -33632 18839 13805 -26837 20153 15356 -36694 10147
726 10147 25235 -31467 2690 30388 -23345 -3204 25461 -27299 -6841 35907 -19900 -19461
738 -19461 31007 -12994 -24186 27327 -5433 -19438 32847 -2139 -32171 27023 11000 -30304
750 -30304 19488 14895 -28581 13138 12348 -34872 12610 27567 -30495 -1397 26545 -24764 -5751
763 -5751 26371 -20835 -5185 32754 -20957 -20578 31323 -7223 -19745 28026 -3557 -22173 26402
776B6402k8241k6738N6172j4968m2139M4357l055m1478M1098M023m5674L9335
788I094J4105n5301K8454L0743m6477J7147L1047m7725J0712L8516m7722q4N0492
801C3001l8529j6808M5062k9288j7097M9590k5007k8901N2027j4072m2093M4882
813A2767J851l9008L8420K708m6947L6849J6177n1584K7645L0815m7754J1787
825f274K9967m3099J1558L9350m5242l077M6281l7389j7382M6035k2924j8328
837b0524M4113k3571k8977M9170r577l8911M3417L169m1408L2368N855m2155L4688
850G657J7853m9716K2038K7878m6288J0692L2946l9210P213L6573m2896m767M6786
863B6759l1434j5769M5446k2880k2720M1459k0131k8153M7926p815m0359L9332
$$ plain form
776 26402 -1839 -28577 27595 12627 -29512 14845 11790 -29688 11410 15433 -30241 9094
788 9094 23199 -32102 -3648 27095 -19382 -2235 28812 -18913 -8201 30315 -17407 -17491 33001
801 33001 -5528 -22336 22726 -6562 -23659 25931 924 -27977 24050 9978 -32115 12767
813 12767 14618 -24390 14030 16738 -30209 6640 22817 -28767 -1122 29693 -18061 -6274
825 -6274 23693 -19406 -7848 31502 -13740 -16817 29464 -7925 -25307 20728 -2196 -20524
837 -20524 23589 18 -28959 20211 10634 -28277 15140 18309 -23099 9269 15124 -27031 7657
850 7657 25510 -24206 -2168 25710 -20578 -9886 23060 -16150 -8937 27636 -15260 -20027 26759
863 26759 -4675 -20444 25002 2122 -20598 20861 730 -27423 20503 12688 -27671 11661
875A1661L233m0086L3126R357m0653L1448J6199n0180J9847L0291m2475J0062
887h170L1954l9436M520L5858l8941l840M7037l0234j9100M1834k1289k1186M1738
900B0745j6034k7702M3509r222m0736L7142O804l8056K9613J0132m0445K7009
912B759J7711m4200K0239L1628m1301M992L0654l6316K834L5470l4288o402M2248
925B6028k9517j9600M2259j6614k1617L9091j5190k9331M0015o127l6696L6837
937I538P684l9213K6326J0755l8346K6516J9467m2442J6876K8766m1271M531L2904
950B2091l3041J451L4386l4879q957M1692k6088j8774M1478j5803k3766L6012
962A5802j2928k7768M0921l307l6373L2907P599l7960K4565J3241l5256K3035
$$ plain form
875 11661 14894 -25192 7934 17291 -23362 8086 24285 -25895 -6048 24243 -18232 -8170
887 -8170 23784 -15652 -11132 24726 -14215 -18055 28982 -1252 -20352 21482 193 -20993 20745
900 20745 4711 -22991 20518 11296 -29440 7702 14506 -23550 6063 16195 -24250 2759
912 2759 20470 -23730 -3491 28137 -13164 -8172 22482 -13834 -11000 24470 -9818 -16220 26028
925 26028 -3489 -23089 19170 2556 -19061 20030 4840 -24491 15524 9397 -27299 9538
937 9538 17222 -21991 4335 15090 -23256 3260 22727 -19715 -2839 25927 -15344 -10813 22091
950 22091 -10950 -9499 24887 -9992 -18949 22743 -3345 -22119 19359 3556 -20210 15802
962 15802 2874 -24894 16027 12720 -23653 9254 16853 -21107 3458 16699 -18557 4478
974D478J7686m2610J3804K8979l7019L819L2269l0516k220L1744l0476o841M0706
987B3803k3694k0339L7661j4482k4414L4897q662k5565L6592l337l6093L1293
999G660R662l5983K3406J3461l6250J8336J7000l8981J4222K9866l6262K886L0987
1012B0010k9871k135L3683k7315q175L8101k4525k0644L6968j2336k3129L4028
1024A4660q842k7135L3428k499l3577L1107J0570l5382K0290J3041l4209J8182
1036c66J9207l6063J2108K7238l4779O3L0446k5910k181L1150k5926j0001L5547
1049B0533k0550j9131L6155r973k4021K9137p417k6285L1906l7l2383K7892R307
1062A5133l4917J8730J6274l0666J7080J8610l4950J0202K6571l3083Q48L0781
$$ plain form
974 4478 22164 -20446 -6642 22337 -14682 -10863 21406 -9110 -11330 20414 -10062 -16903 23803
987 23803 109 -20230 17431 2949 -21465 13432 4770 -20795 15797 12460 -23633 7660
999 7660 17322 -18661 4745 18206 -18044 292 17292 -21689 -7467 22399 -13863 -10977 20010
1012 20010 -9861 -11996 21687 -5628 -13803 24298 -227 -20871 16097 3761 -19368 14660
1024 14660 5818 -21317 12111 9612 -23965 7142 17712 -17670 2620 15661 -18548 -366
1036 -366 18841 -17222 -5114 22124 -12655 -12592 17854 -8056 -10237 20913 -5013 -15014 20533
1049 20533 -17 -19148 17007 7034 -16987 12150 4733 -21552 10354 10317 -22066 5826 15133
1062 15133 -19784 -1054 15220 -15446 1634 20244 -14706 -4504 22067 -11016 -10168 20613
1074B0613k6407n772K8410k4736r489L5389j8302j8684L4445r739k4431L0460
1086A1757m659k4419L0061q00l2590K4834R851l3037J8932J6066l0755J3828J8017
1099A7086l2352R698K7246k9817j125K7998k4953o536K8198k1059r633L2650j7724
1112c23j9554L1930p039k1829K8604k838k5079K6462K48l0453K4706J1386l1712
1125a5491J5546J4504k9348J1739J8415k9386Q614K5336k9764k357K8574k1399
1137e017o099K8152j9450j0631K9850j6527j8676L1997o554k3268K5630k575k4032
1150a7200K5320K663k8136K2616J0609l2037J4067J5463k7045J1007J8564k8729
1162a2838N961K4287k6707j423K8792k0321p826K5688j8291j1293K8884j3222
$$ plain form
1074 20613 -5794 -11566 16844 -7892 -17381 18008 -294 -18978 15467 5728 -18703 11757
1086 11757 7098 -17321 12740 11940 -20650 4184 14035 -19002 -70 15996 -14759 -931 17086
1099 17086 -15266 -5568 21678 -8139 -9264 18734 -6219 -12755 15443 -5616 -15249 17401 -323
1112 -323 -19877 12053 5014 -16815 11789 8951 -16128 10334 10582 -19871 4835 16221 -15491
1125 -15491 55 14559 -14789 -3050 15365 -14021 -5407 19929 -9835 -12192 16382 -5017
1137 -5017 -11116 17036 -2414 -13045 16805 278 -18398 13599 7045 -16223 9407 6832 -17200
1150 -17200 8120 10783 -17353 5263 15872 -16165 -2098 13365 -13680 -2673 15891 -12838
1162 -12838 -6877 17410 -9297 -10720 18072 -2249 -10075 15613 -2678 -13971 14913 1691
1174A691j8213K9227o369k3083K3701k77k2470K3498K927k7802J9546J1204k8651
1187a5071J3741J6635k5611Q050J7407k6854M551K4294k4434l101K6277j8874
1199b990q762K5047j4810j0436K7454j2864j8683K7019n479k1781K2989Q04k2387
1212a4879K0514L274k5959J9459J2205k7092J1887J6051k5154O790J7135k3906
1224i675M336K2204k4149m428K4899j7432q320K4944j3430j1359K5654j1355j7217
1237a5328K6518l417k0985K0979M82k2473J8717M671k3931J7599J0814k6252R914
1250b692J5298k2491O359J7353k2039K370K0960k1992m027K4947j5238r019K2266
1263A2055j3038j1749K3701r685j6080K4532k590k1006J9547K459j9680J7824
$$ plain form
1174 1691 -16522 12705 6336 -16747 6954 6677 -15793 7705 10632 -17170 2376 13580 -15071
1187 -15071 -1330 15305 -10306 -2256 15151 -11703 -7152 17142 -7292 -10393 15884 -2990
1199 -2990 -11752 13295 -1515 -11951 15503 2639 -16044 10975 5496 -16285 6704 7508 -14879
1212 -14879 5635 8909 -17050 2409 14614 -12478 -591 15460 -9694 -2904 14231 -9675
1224 -9675 -5339 16865 -7284 -11712 13187 -4245 -12565 12379 -1051 -12410 13244 1889 -15328
1237 -15328 11190 7773 -13212 7767 8249 -14224 4493 9164 -14767 2832 13646 -12606 -2692
1250 -2692 12606 -9885 -3526 13827 -8212 -5842 15118 -6874 -10901 14046 -1192 -10211 12055
1263 12055 -983 -12732 10969 1284 -14796 9736 7146 -13860 5687 8146 -11534 6290
1275F290M801k3599J4675R763k5487R327J5899k1562N118J6492k0465K126K1114
1288A4492j9155l754K3382j5296j0259K1281j0798j1071K2625q648j6391K1685
1300H093k390k0097J8610L559j9508J5235N045k1555J3725J1367k2339Q602J5111
1313A3458k0792K908J5665j8623J225J9476j8254n026K1175j2511q985K0945q843
1326A818j1294J9914p597j5981K0294p69j9149J6780K753j8606J3665O025j9589
1339a1736J3050J1097k1523O657J4691j9121L201J5658j7399%J7340j7074m921
1352a0080K0893j1964r005J9001q349j1118J8931n602j4099J9429q01j8593J5338
1365C981L542j7921J2825O121j8502J0571R548j9936N901J4680j7050K135J4492
$$ plain form
1275 6290 11091 -12508 2167 11930 -13557 -4230 11669 -9893 -4775 11717 -8748 -6622 14492
1288 14492 -4663 -8417 14965 -331 -10590 10691 -107 -11178 11447 2799 -13592 8093
1300 8093 5703 -14394 4216 7775 -11733 3502 8547 -13008 717 12084 -10255 -1653 13458
1313 13458 -7334 -4426 11239 -7384 -6159 13317 -4937 -9963 11212 -1299 -10284 10661 1818
1326 1818 -9476 10438 2841 -13140 7154 6385 -12764 4016 6769 -11837 1828 7853 -11736
1339 -11736 1314 12411 -9112 -2455 12236 -6885 -3684 11974 -5425 -5425 11915 -5159 -10080
1352 -10080 10813 -1151 -10156 8845 496 -10622 8309 2707 -11392 8037 7236 -11357 3981
1365 3981 7523 -10398 2427 8548 -9954 617 10165 -9771 -3870 10810 -6240 -4105 10387
1378A0387j5687p40J7133j4820m243J9086j1243r718J7244p180j0189J7383m654
1391B759j3607J7171l89j6551J4402M589j6142J0940N056j7774R058R044j7639
1404i083N485J3916j6528Q46J4309j3808o54J6474j3273m972J7520j0309r209
1417i286J6880n091j0804J5712m755j3211J5849K18j5971J3350M595j6275R195
1430D06O504j5637R262R275j6928M374J2385j5023M61J3648j2564j225J4551j2585
1444c096m603J6790q279q530J5371m882j0971J3967l432j1902J4641K32j4929
1457i623J1525L955j4248Q977O627j4714P494Q902j5433L789J2088j3366Q5J2451
1471H509j1640k474J3678j0637m676J5394p483r244J4268m243r616J3500k405
$$ plain form
1378 10387 -5300 -6040 11093 -3727 -7970 11116 -127 -9845 7399 219 -9970 7413 2759
1391 2759 -10848 6323 5934 -10617 3785 8374 -7768 3172 8228 -9546 -488 8556 -9083
1404 -9083 -3598 10318 -6210 -5364 8945 -4863 -5517 10957 -2316 -7288 10232 -77 -9286
1417 -9286 7594 2503 -8301 7411 2656 -10555 5294 5512 -10459 2891 7486 -8789 406
1430 406 6910 -8727 535 9810 -7118 -2744 9641 -5382 -4921 8727 -3837 -5062 9489 -3096
1444 -3096 -7699 9091 812 -7718 7653 2771 -8200 5767 2335 -9567 5074 5306 -9623
1457 -9623 1902 5857 -8391 586 7213 -7501 -7 8895 -6538 -2749 9339 -4027 -3942 8509
1471 8509 -3131 -5605 8073 -2564 -7240 8154 671 -8573 5695 1452 -8164 5336 2931
1484B931j1201J2750N49j3948J0867M525j3272P865O097j4308O615Q213j4203
1497f520M027J1578j2817m82J1589j0386j950J2535r386m960J4111p294q235J3305
1511E115l029q727J1460j771j0788J1815Q62j2570R980M531j2951O093N640j2308
1525f648N719Q111j2598K382J0511j1450n34J1128q875k268J1630q879m421J2455
1539F263n725p262J2192l059q882J0768j653r366J0529R21j1714Q560L951j1924
1553f401O095O116j1307M486P513j2327K856R766j0060k52J0234q606k070J0445
1567F488p623m343J2455n747p476J0791l050q027R821q84r092R904O03j0981Q052
1582H91M155j0506N638N361j0069L736O663j0401K305Q964r515r27R372p670k449
$$ plain form
1484 2931 -8270 4480 5029 -8919 1948 6473 -6799 1066 7163 -7145 -530 7683 -6520
1497 -6520 -2493 9085 -3732 -4214 7375 -3011 -4961 7574 -1812 -6772 7339 45 -8190 5115
1511 5115 2086 -6641 4819 3048 -7740 4075 4937 -7633 2347 6878 -6073 20 5660 -6648
1525 -6648 -929 7182 -5416 -3034 7477 -3973 -4507 6621 -2254 -4522 7108 -1771 -6192 6263
1539 6263 538 -6724 5468 2409 -6473 4295 2642 -6724 3805 4726 -6988 1572 5523 -6401
1553 -6401 -306 5810 -5497 -1011 6502 -5825 -2969 6797 -3263 -3515 6719 -1887 -3957 6488
1567 6488 -1135 -5478 6977 1230 -6246 4545 1495 -6532 3289 2405 -6687 3217 3820 -7161 891
1582 891 5046 -5460 178 5539 -4530 -794 5869 -4532 -2227 6737 -2778 -3705 5667 -2003 -4452
1597d452J0085o493l925J0582n327o492R920j632p891Q898o97q552Q316Q92r630
1612f398P501M390j0229M779M797r351L805O826r747J838Q036r030j141Q865o301
1627a360k581Q866o124m085R950m186o232R889k103o817P849q69p395Q018R07
1642C727r160O466L726r588M251M924q233L297N237q809J843P546p734r73Q747
1657E267o268k580Q298n803l201R012l967n405Q300j938o724P494r3o818P147
1672B721P50q567N784L832q755L871M625p814K332N290p852J645P579p607q96
1687c062P678n875k257P643m738l068Q182l695n797Q244j642n852O756l26o590
1702d399N906J124p461N657L125q123L642M647p227K197N298p275J397O260o825
$$ plain form
1597 -4452 5633 -860 -4785 5797 470 -6022 3898 2266 -5625 3273 2576 -5976 2340 3232 -6398
1612 -6398 1103 5493 -4736 43 4840 -4511 -706 6120 -3627 -1789 6247 -2783 -3924 4941 -1360
1627 -1360 -3941 4925 -1199 -5284 4666 480 -5752 4137 2034 -4783 3066 2197 -5198 2820 3727
1642 3727 -5433 1033 4759 -4829 -578 4346 -3887 -590 4647 -4162 -2319 5227 -2507 -3480 5267
1657 5267 -1001 -3581 4717 -1086 -4287 4725 758 -4647 3653 1715 -5009 2485 2392 -4426 2721
1672 2721 3471 -5096 688 4520 -4235 -364 4261 -3553 -1221 4069 -3783 -2138 5441 -2166 -3062
1687 -3062 4616 -1259 -3516 4127 -611 -3679 4503 808 -4989 3255 1613 -4239 2517 2191 -4399
1702 -4399 1507 2631 -4830 827 3952 -4171 -529 4118 -3109 -912 4386 -2889 -1492 4768 -2057
1717b057q48P026m622k357O788m396l187P114k784n211P594j291n820N812J95
1732A956o100N799J298o983M856K854p182L004M260o554J987M699o396P07N753
1747C958n805j046O798m381k460O231m008k592O767l004m599P027j631n367N692
1762A580L44n429N300P98o365M461K932o907L097M044o221J531M095n852R25N557
1778C890n408j193O170l978k503N680k960k533N746k296m438O497j195n141N326
1793A664O96n361M096J230n879L930K738o048K371L774n819J322M349n384N54
1808a767N176m897r58N805l533k227N410l057k766N890k387m095O032j130m643
1823c147M367N65n099M286J202n197L574K264n550K033L599n112J214L892m863
$$ plain form
1717 -2057 -2905 4121 -501 -2858 3930 -466 -3653 3461 677 -4534 3060 1769 -4051 1761 1956
1732 1956 -4144 1655 2953 -4030 826 3680 -3502 -498 3762 -2792 -805 3894 -2502 -1795 3958
1747 3958 -1847 -2893 3905 -476 -2936 3295 -713 -3305 3462 458 -4141 2886 1255 -4112 1580
1762 1580 1924 -3505 1795 2593 -3772 689 3621 -3286 -189 3855 -2366 -835 3260 -2592 -1667 3890
1778 3890 -1518 -2711 3459 -519 -3022 2658 -302 -2835 2911 615 -3823 2674 1479 -3662 1664
1793 1664 2360 -3001 1095 2325 -3554 376 3114 -2934 -563 3211 -2608 -1286 3063 -2321 -1767
1808 -1767 3409 -1488 -2446 3359 -174 -2401 3009 -48 -2814 3076 689 -3406 2626 1496 -3147
1823 -3147 1220 1785 -3314 972 2174 -3023 551 2815 -2735 -702 2897 -2215 -1001 2891 -1972
1838a972Q49M609m721q94N578l638k013M901k641l018N603j952l643N106o03m778
1854c227M302M98m665L882J440n469L390K365m969J955L502m770R99L632m481
1869a616K06M601m383r27N069l484j996M543k164k460M949j897l348M917o79m117
1885b786M026Q54m475L235J041m786K980K517m800J772L333m716N74M029m447
1900a649M65M023m237o93M684l211j518M272k085k406M497j611l297M454j71l964
1916b447L343Q47m140K865J480m288K493K298m607J494L061m041L09L791l885
1931a427k6M173l654j061M618k595k034M099j702k721M309j229l370M191m13l874
1947b716L519Q61m008K683J780m256K366J833m371J265L499l811K95L550l768
$$ plain form
1838 -1972 -1123 3486 -1235 -2129 3449 -189 -2202 2699 58 -2960 2643 691 -2952 2154 1551 -3227
1854 -3227 1075 1573 -3092 790 2230 -3239 151 2516 -2453 -498 3004 -1766 -767 2865 -1616
1869 -1616 -1410 3191 -1192 -2119 2950 -534 -2530 2013 -151 -2611 2338 441 -2907 2010 1331 -2786
1885 -2786 1240 2094 -2381 854 1895 -2891 89 2606 -2194 -422 2911 -1805 -1231 2798 -1649
1900 -1649 -1184 2839 -1398 -2091 2593 -618 -2136 2136 51 -2355 2142 531 -2766 1688 1517 -2447
1916 -2447 896 1743 -2397 468 1948 -2340 153 2451 -2156 -662 2399 -1642 -1333 2458 -1427
1931 -1427 -1453 2720 -934 -1995 2623 28 -2006 2093 391 -2330 1979 750 -2620 1571 1158 -2716
1947 -2716 803 1664 -2344 339 2119 -2137 229 2062 -2309 -1044 2455 -1356 -1061 2489 -1279
1962a279j74L745l151o86M073k808j940L975j622k130L873j398k913M059n62l583
1978b521L537Q34m133K822R51l745K322K028l886J299K920l952Q49K823l143j93
1994a188L524l121q36L885k332j909L661j440k299L307r94k715L636j41l426L085
2010F97R57l678K310J344l394J862J798l645J179K532l467O19K879l265J09L016
2026A853k732q84L792k173j604L579j715j958K990q21k297L242k77l206K905P49
2042A443l174K306J126l536J720K104l595R98K608l392N68K783l025P6K817k464
2058f37q32L359k221j350L390j388j839K983p38k416K900l74k578K534M37k955
2074a725J982J059l220J810J867l471J164K461l131K65K903k799r2K624k339o90
$$ plain form
1962 -1279 -1453 2292 -859 -1545 2528 -280 -2220 1755 133 -1997 1876 478 -2435 1624 1062 -2521
1978 -2521 1016 1850 -2283 539 1490 -2255 67 2095 -1791 -492 2428 -1524 -675 2148 -995 -1188
1994 -1188 2336 -785 -1621 2264 -68 -1977 1684 244 -2055 1252 258 -2457 1179 1038 -2388 697
2010 697 1654 -2024 286 1630 -1764 98 1896 -1749 -570 1962 -1505 -886 1993 -1272 -1163 1853
2026 1853 -879 -1763 2029 -144 -1748 1831 116 -1842 1148 327 -1970 1272 995 -2211 694 1443
2042 1443 -1731 575 1701 -1835 -115 1989 -1606 -608 2000 -1392 -824 1959 -1066 -990 1827 -637
2058 -637 -1469 1890 -331 -1681 1709 321 -1518 1465 727 -1689 1211 837 -1741 793 1230 -1725
2074 -1725 257 1316 -1904 -94 1773 -1698 -534 1927 -1204 -939 1964 -835 -927 1697 -642 -1332
2090a332K900j792j255K904j130j925L398q07k878K921j9k928K610O98k979J938
2106C24P81k539J345J744l180J159J916k528J75K830k409n28K624k397m33K913
2122A797k211j168L154j398j900K433l22k480K836J80k764K525N50l034K264J150
2138A612k877J683Q57k726R93K022k656L33K456k575J2K504k172o69K788j682
2154i7j403L100j517j672K660o05k091K484j81k497K497L26k192J796M84k626
2170a534J854J146k642J107J901k938N42K048k388j59K740k426m26K751j929q16
2186a169K551j013j770K576m81k061K229q3k177K025K85k549J876J082l173J820
2202c2J403k549R61J729k588N21K367k516l33K318j678p10K563k069l18K152r89
$$ plain form
2090 -1332 1568 -224 -1479 1425 295 -1630 1768 961 -1917 1004 985 -1943 667 1365 -1614 324
2106 324 1105 -1434 -89 1655 -1525 -366 1550 -978 -803 2027 -382 -910 1714 -683 -1116 1797
2122 1797 -414 -1582 1572 174 -1726 707 385 -2095 741 921 -1843 682 1232 -1802 462 1612
2138 1612 -1265 418 1275 -1451 -458 1564 -1092 -759 1697 -878 -866 1638 -534 -1203 1585 -97
2154 -97 -1500 1600 83 -1589 1071 466 -1625 859 678 -1819 678 1004 -1188 608 1092 -1534
2170 -1534 320 1466 -1176 -69 1832 -1106 -564 1484 -904 -1063 1677 -749 -1175 1576 -353 -1169
2186 -1169 1382 369 -1401 1175 694 -1367 862 779 -1398 627 912 -1637 239 1321 -1852 -32
2202 -32 1371 -1178 -217 1512 -1076 -555 1812 -704 -1037 1281 -397 -1107 1456 -613 -931 1221 232
2219B32j624K341n40j771K303m6k161J944L62k403J734O90k369J518R57k384R35
2236b82J609k234N46K103k715L66K206k315o9K231j791j123K540j171j132K349
2252A118p58j661K094j51k081K006J90k250K037L36k284J547J116k663J529J143
2268A268k595J010J666k028mJ992k201j1K163j725m29J979j173j060K051q45j308
2285a250K222l12j793J828q7j863K013K63k686K062P48k452J204J229k221N58
2301e37J740k147K58J911j721r0J731j762l91K218j128j305K679j594r99K286
2317A149o45j577J765J56k229J638N36k058J601P26k258J170J149k323J106J330
2333A236j836J09K016k202j61K215j685q02K370j411p37K400j437j376K130n86
$$ plain form
2219 232 -1392 949 409 -1362 941 895 -1266 678 1040 -1363 371 1061 -1308 210 1167 -1217 -282
2236 -282 1327 -907 -361 1742 -973 -607 1599 -716 -785 1446 -345 -1468 1072 -99 -1231 1118
2252 1118 360 -1301 793 642 -1439 567 757 -1493 544 880 -1404 143 1259 -1404 125 1268
2268 1268 -1327 -317 1349 -679 -683 1309 -892 -903 1260 -465 -894 1085 -88 -1148 903 58 -1250
2285 -1250 972 660 -1133 695 608 -1255 758 1021 -1665 397 1145 -1307 -103 1126 -1095 -537
2301 -537 1203 -944 -686 1225 -496 -586 1145 -617 -1008 1210 82 -1223 1456 -138 -1137 1149
2317 1149 504 -1073 692 848 -1381 257 793 -1265 336 1062 -1196 -26 1123 -1200 -94 1236
2333 1236 -600 -491 1525 -677 -838 1377 -308 -1110 1260 -151 -888 1512 75 -1301 829 243
2349B43j671K435m24j724J915L0k233J744P13k333J280J656k622Q23J420k346
2365a094O40K007k108O2J742j741l65K442j889o96K393j630j032K000p27j354
2381a350K221m43j821J964L04k177J617O01k050J498P82j969P73J477k506O41
2397d38J751j903l44K035j677m93K455j637r83K539j397j328K489q89j334J653
2413D99k54j915K251M56k400J639P09j947J325P03k137J346J132k347Q23J169
2429A052k173P39J749k186L35J662j578m86K199j484q17K257j094j138K109l74
2445G72j993K027J77k433J953J09j796J393O83j903J056J221k509R99J546j828
2461e26k36K176k129J5J972j493r84K234j135j177K707j471j250K027l48j709
$$ plain form
2349 243 -1428 1007 583 -1141 774 804 -1429 315 1028 -1305 -25 1631 -991 -168 1252 -1094
2365 -1094 -454 1553 -555 -493 1249 -492 -857 1585 -304 -1000 1393 -237 -1269 731 4 -1350
2381 -1350 871 428 -1393 571 875 -1302 315 916 -1134 364 1146 -823 -50 1427 -1079 -438
2397 -438 1313 -590 -934 1101 -576 -1069 1386 -251 -1234 1305 -92 -1420 1069 180 -1154 499
2413 499 245 -1670 581 1037 -1363 276 985 -962 363 1066 -1071 275 1407 -940 -117 1052
2429 1052 -1121 -382 1367 -819 -484 1178 -400 -886 1313 -171 -988 1269 175 -963 1146 772
2445 772 -1221 806 983 -1450 503 612 -1184 209 892 -1011 45 1266 -1243 -244 1302 -526
2461 -526 -762 1414 -715 -700 1272 -221 -1205 1029 -106 -1283 1424 -47 -1297 730 382 -1327
2477a327K037J00k289K116J93k050J271J051k232J015R32j918L88K010k031J12
2493f22K007j914j57J765j635n24K153j323r34K029p90j426K182m58j896K364
2509H21k83j947K372L5k350J547J017k301J288J171k574Q79J618k194J52J819
2525A070j698j29J955j496o52K200j312r25K124p54j637K162k86k064K446k87
2541G17k390K276L69k046J542P32k424J379P60j864N11J709k045N13J422j844
2557f83j33J998j521o26K244j237q30J846p88j609K471o96j793K123l93k129K102
2574C46L07j835J485P67k252J324R11k136Q40J634k249K27J949k028R1K045j845
2591d19o49K095j187p10K114j052j546K117n63j330J893k23j773J850P5j970J327
$$ plain form
2477 -1327 710 810 -1479 637 830 -1220 51 1102 -1130 -115 817 -1101 -713 1297 -734 -622
2493 -622 1385 -529 -686 1079 -556 -1080 1073 -250 -1184 845 55 -1371 811 353 -1543 821
2509 821 538 -1409 963 998 -1352 195 1212 -1089 199 1370 -1204 -325 1293 -901 -749 1070
2525 1070 -628 -757 1198 -298 -950 1250 -62 -987 1137 383 -1254 908 622 -1442 1004 717
2541 717 -1673 603 972 -1074 468 1200 -1224 155 915 -949 -438 1271 -774 -261 1161 -683
2557 -683 -816 1182 -339 -965 1279 42 -788 1058 270 -1339 1132 436 -1357 766 373 -1756 346
2574 346 653 -1182 303 1070 -1182 142 1053 -1083 -243 1391 -858 -631 1318 -710 -619 1426 -419
2591 -419 -1068 1027 -160 -870 1244 192 -1354 763 200 -1130 763 540 -1233 617 692 -1278 49
2608D9J010k320J263J251k380R31J444k051K45J670j555k64J945j537p22K046
2624A025j207q81K311j181j227K020l85j651J973r9j937J782K45j969J447P64
2640A030k159J216R60k200J124J300k173M53J809k077j48K249j683o16K118j240
2656c7j110K239j089j232K234n49j546J705R8k043J899J96k075J590O37j900J083
2673A00P99j702O03J434j859P1J545j665J1J893j460p53K304j370j054K083q69
2690A11r69J562l37j358J751j89k007J860M21k272K036L69k138J091R18j895O46
2707d00J536j909K69J547j791j8J862j242q55K300j576q08K084q50j507K214l42
2724E14j571J723O2j777J496K00j910J341J083k311P98J330k327Q42J528j608
$$ plain form
2608 49 1059 -1261 2 1253 -1127 -196 1248 -803 -558 1112 -443 -707 1238 -299 -1021 1025
2624 1025 -182 -1063 1248 67 -1160 860 475 -1176 797 698 -1239 543 788 -1181 266 1030
2640 1030 -1129 87 1047 -1153 -29 1271 -902 -449 1360 -717 -865 1384 -299 -915 1203 -37
2656 -37 -1147 1092 3 -1229 1005 456 -1090 615 713 -1330 569 765 -1310 280 917 -983 100
2673 100 899 -803 -200 1234 -625 -554 991 -674 -663 1230 -230 -983 1321 -49 -1103 980 111
2690 111 -858 704 367 -991 760 571 -1436 424 845 -1427 609 978 -1160 -69 849 -1046 -400
2707 -400 1136 -773 -504 1043 -748 -766 1096 -146 -1001 1299 -277 -1085 999 149 -1358 856 514
2724 514 -1057 666 728 -1049 447 647 -1263 78 1161 -1150 -352 978 -1349 -507 1021 -587
2740e87J07J671j670l42J912j323n26J714j071j221K267r19j423J994J0j504J479
2757E68q6j517J442O31j871P83J195k315R94J105j761Q53J015j745J00J549j561
2774f21L8J671j372l45J762j060j142J783m50j348J960k66j512J466J12j958J626
2791C44M73j804J366O24k049Q69J288k074O43J379j705k23K089j804k14J741j291
2808c48l11J555j010q62K136p32j608J524J59j840K029n5j830J489L49j819J076
2825i8J371k244R39J168k011M63J679j754j93J656j379m47J583p14p65J820p92
2842B82j226J786k69j580J582o7j443J215L29k113J684N26j905J080Q40j453K51
2859d81J460k069O85J643j868r0J716j312o23J954j063r43J902q25j165J945m84
$$ plain form
2740 -587 -480 1191 -479 -821 1091 -232 -758 956 -115 -1336 931 12 -1411 583 593 -911 568
2757 568 482 -1035 407 1038 -833 -50 1145 -1170 -176 929 -832 21 1036 -709 -609 940 -621
2774 -621 -583 1088 -284 -629 1133 73 -1069 714 264 -1084 876 610 -902 564 676 -1282 344
2791 344 817 -987 379 1003 -1046 -177 1111 -963 -320 1059 -646 -869 1220 -584 -798 943 -348
2808 -348 -659 896 -114 -976 1160 428 -1180 344 503 -1337 692 637 -1193 296 645 -1174 -98
2825 -98 1273 -971 -32 1136 -875 -412 1267 -487 -680 976 -403 -850 733 19 -746 1074 282
2842 282 -944 842 573 -1007 575 508 -935 280 609 -1504 180 706 -1199 -119 721 -732 -481
2859 -481 979 -1090 -405 1238 -630 -720 996 -316 -939 1015 -48 -991 911 86 -1079 866 382
2876C82j448J546r5j711J645L02j712J734L13j901R73J023j898O18J118j207j45
2893d63J316j560J65J617j375n53J932j041j065K029p22j159J472m59j324J595
2909D05L1j480J466L87j940J266Q66j985J015J067j871N31J125j437J13J419j629
2926f51L8J644j444m07J481o29r93J961j000r14J623k92j480J715j13j643J304
2943B00O95j837R63P61j745P32J343j758K94J294j414j18J472j078m40J845j338
2960a29o64J659q52q43J483o66j068J711m50j308J648j14j232R62L67j209Q36
2977A31O17j744O31J243j508J80J557j681j17J642j496m66J893j005l69J339q32
2994A5r04J344q9j358J498j56j326J354J40j648J432N28j589J074M90j409P30
$$ plain form
2876 382 -1066 480 385 -1326 319 621 -1091 643 956 -945 28 1051 -847 -229 889 -318 -463
2893 -463 853 -707 -542 1075 -300 -853 1079 38 -1027 1002 280 -879 593 134 -1190 405
2909 405 436 -1044 422 809 -1131 135 1001 -984 31 1098 -773 -242 883 -554 -441 978 -651
2926 -651 -613 1031 -413 -820 661 32 -961 1000 0 -914 709 417 -1063 652 539 -1104 200
2943 200 895 -942 21 782 -963 -231 1112 -646 -352 942 -472 -590 882 -196 -636 1209 -129
2960 -129 -793 866 14 -829 654 -12 -1080 631 181 -1127 521 407 -825 137 504 -705 131
2977 131 748 -996 -365 878 -630 -450 1107 -574 -691 951 -545 -1011 882 -123 -492 847 15
2994 15 -889 455 366 -992 506 350 -976 378 518 -1130 302 830 -759 315 805 -604 126
3011A26J038j999M21J523j704j1J542j408j92J615j275l45J485q04p15J198m24
3028G1j005J573j29j293J298K36j787R95P71j247N03J117j977O68J033j463J10
3045e26J316j012j20J137j179j65J529j059p53J564p42j021J679m65j350J556
3061C89K41j373J045N53j975J434L34j571R09Q99j421N22R53j100l79J513j292
3078c19q8J599j394m67J553j221p04J827l60j241J473l74j215J487l4j157Q52
3095B17L95j506O35J012j458O98P91j570M35J087j352L73J144j379j38J548j204
3112b72r9J286j001p16J394j61j442J793m92j157J219P3j845J879L39j759R18
3129d3O69j370O56J044j621O65J191j726Q2J325j048k71J157r64n26J445p51p33
$$ plain form
3011 126 1164 -835 -414 1109 -595 -606 936 -472 -664 951 -324 -669 816 12 -703 495 71
3028 71 -934 639 510 -783 515 751 -1036 -41 730 -517 -14 1103 -874 -206 827 -636 -526
3045 -526 790 -222 -342 795 -384 -549 980 -79 -832 732 -10 -1031 648 183 -1167 389
3061 389 630 -743 302 855 -1120 314 648 -923 -14 885 -536 -14 939 -161 -540 973 -319
3078 -319 -407 1192 -202 -669 884 -337 -1041 786 426 -815 658 284 -931 556 522 -635 217
3095 217 612 -894 -259 753 -705 -7 784 -786 -351 736 -616 -243 901 -478 -616 932 -272
3112 -272 -371 915 -86 -802 592 431 -1011 782 290 -867 352 425 -1420 459 798 -961 -43
3129 -43 626 -744 -88 956 -665 0 1191 -535 -453 872 -176 -447 710 -254 -780 665 -86 -819
3147h19J354l91r31J175J26j304J034M35j897J393N78j775Q90P49j163M78J078
3164A010j587J15J499j355k78J720j433k55J469q87n41J179p15r89J526k17r17
3181f56Q71J27j024J127K45j564J204L73j553O53J114j704P86O81j287K19J012
3198F24j155j05J254r94l4J135n46r11J660q42q22J375k89j198J226J60j318J126
3216C46L56j245P30O15j513O41R98j904R15Q00j271L48J188j288k30J679j417
3233b52k05J168p36p24J661q87q01J378n48j035J675l27j190J033N57j733J510
3250E44J97j436O02R46j510M49J019j409M32J316j746K53J108q64o92J504q68
3267a55n07J464j011p74J581m38r68J132j38j012J102K84j410R29R43j825P12
$$ plain form
3147 -819 535 144 -787 388 514 -790 244 679 -1218 175 753 -1022 -132 617 -546 -68 1010
3164 1010 -577 -462 1037 -318 -596 1124 -309 -564 905 18 -523 656 -59 -1048 478 261 -656
3181 -656 215 342 -682 445 690 -874 330 703 -850 -197 917 -787 -1 680 -607 -388 624
3198 624 -531 -636 618 -376 -410 725 179 -732 928 86 -736 639 350 -848 378 538 -780 346
3216 346 702 -543 187 802 -711 -70 928 -976 -61 739 -532 -184 1004 -284 -514 1165 -252
3233 -252 -457 711 -25 -749 912 25 -776 602 54 -981 694 367 -823 210 767 -966 544
3250 544 741 -695 -93 853 -657 -208 811 -598 -166 1150 -596 -343 765 -99 -791 713 -155
3267 -155 -662 802 -209 -983 598 160 -808 324 186 -826 276 560 -850 79 1022 -803 -91
3284i1R68j512K81J131j434K09J231j407k51J461o65o88J501l76j094J773q33
3301B04r59J488m21j050J032K68j054O78M30j521R52P80j503M64J034j379N62
3318EP47j109R8J255j201o44J647r59n85J076l69p57J230n19p65J584l01j000
3336e67R57Q9j389R61O61j573Q01J002j659N79J114j612L78J227j375j27J412
3353H79j609l4J496r44n81J605p42r71J497l62j148J390L4j453J079N15j312Q08
3371A47M69j383R22M32j480O91R19j279L97J062j421K73J189j264k26J310o24
3388A34n59J058m78j000J310l32j134J725k98j119J002K62j429R15N06j507J120
3405A76Q67j828Q53R37j585K83J233j421j55J735j078o88J449q31p58J435n61
$$ plain form
3284 -91 877 -635 -354 777 -657 -448 783 -624 -875 586 -79 -767 734 358 -736 1037 204
3301 204 -755 733 312 -738 294 562 -492 186 616 -905 47 827 -676 -212 822 -557 5
3318 5 752 -357 -259 996 -205 -849 798 -161 -746 330 -39 -796 434 -85 -850 734 433 -567
3336 -567 390 479 -910 51 712 -861 -60 942 -717 -138 976 -636 -258 969 -406 -533 879
3353 879 -730 -764 732 -212 -793 812 70 -901 596 234 -914 476 510 -943 136 651 -661 147
3371 147 616 -767 155 587 -893 -202 717 -562 -165 897 -524 -251 938 -326 -552 758 134
3388 134 -425 633 155 -845 465 133 -1001 724 426 -693 309 571 -858 57 563 -944 176
3405 176 1043 -785 68 1005 -580 -297 936 -485 -640 1095 17 -671 778 -53 -811 624 63
3422F3r94J412k35j019J284j30j250J192O6j095O68Q78j532O56Q21j406M66J368
3440A213j794q1J823j790R5J590j292l90J125n09o33J712q66j136J512k03r54
3457e78Q85J46j120J113L74j562R14M48j594J031O51j290M80R84j305o5J433j450
3475e05n9J414j142l37J656r04r00J379l78r92J259k60r12J251k32j226J238J83
3493E33j449Q78P51j199K12Q80j270J10J498j463J26J472j518m6J257r57j80J033
3511F68o04p28J483m89j368J447j60j077J265K72j504R36N23j408Q11O15j180
3528d98K63J251j614M84J207j335m7J217j175j91J321q91q05J670o57j137J455
3545E18n08o45P89J39j271J496L4j597J271L52j431J022O59j607Q14R17j455M19
$$ plain form
3422 63 -931 481 246 -773 511 381 -869 323 389 -706 -38 840 -692 -36 785 -621 -155 1213
3440 1213 -581 -662 1161 -629 -534 1056 -236 -626 499 -10 -643 1069 203 -933 579 376 -578
3457 -578 307 453 -667 446 820 -742 172 620 -974 57 708 -582 -102 882 -423 -488 945 -505
3475 -505 -564 850 -292 -629 1027 123 -777 602 224 -768 491 231 -681 570 338 -888 350 533
3493 533 -916 -38 713 -486 -274 606 -664 -554 944 -519 -393 1079 -439 -485 772 -185 -365 668
3511 668 64 -664 819 330 -1038 409 249 -828 437 709 -795 141 664 -744 67 682 -498
3528 -498 -235 1016 -598 -114 1093 -242 -289 928 -247 -438 883 -8 -813 857 200 -937 518
3545 518 10 -635 154 293 -978 518 552 -1045 226 578 -853 169 828 -779 35 952 -503 -84
3563h4P97j208P2J227j013m24J401r30n14J325n90r45J567n26p93J133l35q43
3581f83J179P2j489J162J27j207J034O75j624N70R97j483M49J101j340j27J586
3598I99j180m13J476j043o05J675q16j040J771m74r16J099L1j286J263J25j236
3615e70P10N75j421N96R66j784N84R03j136L95J064j476q6J432q51o52J619r35
3633f7p07J410m37q55J182m3j104R06l3r24Q48M34j381O65O72j338M80J022j339
3652f09L04Q32j192N10Q62p81m18J210p42l80J120p81o94J360n11p66J127l04
3670A47q42R41K71j203J060Jj105O98Q20j494N09J255j584L03J093j475K21R20
3688E36q09m52J677j182k61J084o06p04J395n90r74J527k81j294J212L42j579
$$ plain form
3563 -84 713 -495 -423 804 -209 -633 768 -162 -676 649 59 -886 681 155 -638 495 160 -683
3581 -683 496 568 -921 241 368 -839 195 870 -754 -184 813 -670 -221 880 -460 -587 999
3598 999 -181 -594 882 -161 -766 909 93 -947 824 350 -566 533 564 -722 541 666 -570
3615 -570 140 715 -706 -110 856 -928 -344 559 -577 -182 882 -594 -680 752 -99 -751 868 -67
3633 -67 -774 636 199 -656 526 483 -621 285 252 -672 176 610 -771 -106 566 -772 -292 730 -609
3652 -609 -305 527 -665 -155 707 -74 -492 718 -24 -404 716 -65 -759 601 90 -676 451 147
3670 147 -695 246 517 -686 374 375 -730 -32 788 -706 -197 1058 -526 -223 870 -605 -384 536
3688 536 -273 -725 952 -230 -491 593 -13 -717 678 88 -886 641 360 -934 278 620 -959
3705i59J386J17j282R29M38j343N30J066j305L22O27p74P4R97j171j26J273j181
3723c82j54Q23j34q95J141o1q21R67j71j110J006L04j216R17N72j491N58Q74j374
3742f47K96Q06r19N9J050j248J30J360j242m15J436n31o68R43k30r69J220j5j099
3761f83J120l10q84J036L68j334Q06N63j366N99P33j338L06J243j139k33J298
3778G85j154K13P90j044j63J177m90q25J266l78r15P64K91j199J322j24j264Q06
3796a42M54r76R05J27o58K04P77j055O7P90p40j82R89o78k83R10o65l35J217q23
3816i7n60J225o73n36R84j97p02N58N30r92L11O47j199N83O38q84M68P80r54N1
3836a9O42o60k85J171j055K4N45l50p54J331o40q25J164k88l97P04p5n48O58K1
$$ plain form
3705 -959 427 544 -738 191 629 -714 -184 882 -423 -101 526 -248 -174 823 -348 -474 799 -382
3723 -382 -536 287 153 -742 399 338 -483 484 313 -797 209 513 -703 214 786 -705 -147 727 -647
3742 -647 -351 455 -464 -405 645 -603 -473 887 -355 -770 666 135 -533 410 180 -789 431 416 -683
3761 -683 437 127 -757 279 647 -687 119 682 -684 -85 648 -690 -384 859 -280 -513 785
3778 785 -369 -156 634 -410 -573 604 114 -711 555 177 -738 26 317 -882 440 316 -948 -142
3796 -142 312 -664 241 368 -290 -86 691 -364 -297 493 -247 -429 560 -118 -401 509 -156 -491 726 -97
3816 -97 -657 568 -105 -641 343 146 -556 2 532 -460 -149 498 -701 -118 520 -364 104 884 -70 -19
3836 -19 623 -37 -322 849 -206 -182 363 13 -741 590 -50 -875 289 1 -396 308 233 -315 343 364
3856C64j192J007J16p15K93P07j227M82Q79j570O90O70q83J07R67n60l61P09o15
3875a32n07J107j41q31Q64k29o84Q70Qr89R50K56j216R53L94j103K18O97r60J28
3895c47P04p61K97O27r71K0O44m31j54R88q39m95J091j78o69Q58k05o23Q13J59
3915E28j062P50P4j017P18P11j298O45O76j133J96R41q45j30O95o19J27L65m16
3934i4k51R08n56p45J189m27o29P71K46j043P91Q6p92P19M65j269N76J62n62O62
3954B07L79j106L97N07l72j67O84o48l21R34n55m38Q93n15k46P06k89p78J196
3973D68j13p07N71j90m55Q32j72q62R56j49q49O06P03q68n8Q92n75l85J118r94
3993b31nO70m57n31J156m51q34J058l25k66L96P7p78M96L98n69J21M16j048O08
$$ plain form
3856 364 -828 179 295 -420 -127 580 -647 -165 714 -856 -166 504 -379 -272 695 135 -226 483 -132
3875 -132 -639 468 327 -504 360 131 -553 317 325 -664 286 542 -674 279 673 -430 -212 485 -475 -347
3895 -347 357 -404 -107 520 -451 -431 213 -218 -372 616 -223 -718 373 195 -474 384 179 -444 369 528
3915 528 -534 216 290 -727 -9 702 -596 49 725 -408 -212 729 -116 -246 449 -170 -43 322 -94
3934 -94 -345 563 7 -738 451 24 -605 166 412 -631 160 246 -546 173 638 -631 -55 107 -455 207
3954 207 586 -520 -123 384 12 -155 529 -119 -440 494 -61 -499 394 -121 -367 339 50 -728 468
3973 468 355 -352 219 29 -426 406 234 -628 328 179 -670 -64 639 -229 -287 605 30 -355 763 -231
3993 -231 -236 434 -23 -554 602 151 -683 375 50 -216 180 257 -521 -25 373 -196 -75 341 -707 -99
4013i9M92p70K83O00q07K57O55j001M56M49o12k60N62k26m92R28l62n11Q46k13
4033A75o12P74j7q21O14on69O23K23q76L90Q65j358K48P11m59j8N23n68L6P17
4054E95o26l11R78o69j19M93j75o74J212m23p31O20J90n47Q3L70p20P52O9o74
4074c07K44M81n18K76K65o44P4M63n16p0Q18q41N2N12l18k92Q96n34n84J234l96
4095B95l30L84l91j46K25N43r39N00K35l57O9L06n39m8P15o40O3M47p88m3Q58
4116D19m54j70L67K5q52Q64p5j33N48l24q01O35M94j050Q21M5p60L60M24q02L94
4137b5M66n93j43N80p09Q2N89k64k35Q03n85l87M69K3j27O60n95m41O11Mm05N22
4159C00k04o34N16O7l31J7L56j62J3N77p18K29N23r73J20N06j32k53K38O3j97
$$ plain form
4013 -99 393 -377 -94 506 -301 -44 611 -390 66 515 -97 -357 205 -21 -513 415 53 -458 388 175
4033 175 -437 337 320 -501 113 107 -462 161 384 -492 -102 763 -595 -347 364 -95 -113 410 -158 -122 595
4054 595 -31 -342 636 -33 -152 341 166 -508 704 281 -450 170 360 -187 -104 266 -454 298 367 -307
4074 -307 -63 418 -100 176 441 -203 -129 334 -182 -252 566 -275 -223 289 -29 -321 575 41 -543 691 295
4095 295 -35 349 -42 -188 37 580 -359 141 376 19 88 394 -145 -193 522 -118 -55 392 -396 -439 419
4116 419 -35 -205 162 187 -665 199 124 -9 539 215 -586 49 543 -507 314 359 -401 -41 383 -419 -25
4137 -25 441 -152 -295 285 -424 -342 247 -17 -252 551 -34 -421 48 71 -56 604 9 -432 179 183 -222 300
4159 300 96 -538 -22 45 -286 -269 87 -75 -62 515 -203 26 549 -424 -304 202 70 -183 55 118 -79
4180g9O00k92o14O10j67m40M45K22o12N81J3q03M08N93o00k14N92k3k49M90j021
4201e60L48P74p72j54P65p00q3O11l63j83Q74m41l86M70k60l06N93K12q87N15
4221F7R8n16N97R5n77L23J99l95o7N25p02K46M64p32Q5N11j92k80N88m50l43O48
4243A92k00n86Q37j99j74K85k75J35J64J89q82N95J00m62L87K92o44J85L96n89
4263b54K66N69q13J38M01l86k50N61k99j93M54k27k96M09j6m93M98K93o59N07
4283B10K5n04L29L94o82K08J89m04N1K89n81N60L45n65K20K27l24j53M82r9m65
4304b48L60N4l65Q7J06j59M30P5p00K61J77o47Q67m1m15K19J54l73J60N98p30
4325a30%K98n2n17P52l89l7N68n35l41N90k31k03N29j47n20M86Q4m78K78J48m20
$$ plain form
4180 -79 521 229 -385 225 58 -382 63 285 -327 254 267 -536 -128 465 -135 -349 243 220 -29 461 -560
4201 -560 -212 562 -210 -364 401 -299 -382 229 -134 -317 557 116 -270 200 -60 -366 227 439 -448 67
4221 67 165 -351 246 341 -236 87 286 -109 -176 349 -353 -107 357 -375 -290 221 29 -251 337 -113 -456 192
4243 192 -8 -594 243 44 -130 155 -120 15 179 368 -514 81 181 -281 106 398 -246 -61 335 -254
4263 -254 12 581 -232 -94 307 -79 -329 232 -67 -260 194 -33 -329 80 64 -429 69 362 -297 210
4283 210 235 -269 60 454 -228 -20 169 -235 -184 105 -476 84 429 -136 84 311 -13 -166 316 217 -248
4304 -248 112 166 -199 -112 -6 -165 265 340 -360 -99 78 -569 298 257 -158 61 215 -158 2 600 -130
4325 -130 -130 168 116 -401 351 -38 -75 493 -42 -383 207 -24 -227 302 155 -365 121 205 -273 5 153 -267
4347b67K40K50n79L36L42p21N18K98p20j96P89n37j35P15m75q1O09n17P8L23j58
4368A12m00N48j66j39K29M05p23K96K70p73K91K45n69L94J59k86J54j7l61K93
4388c8N43o23N6N67k89n23N38k53m46L79L92o41M33j47j94J03M02n38L49O76p37
4409Io0L70n61L45L82o95j08Q09p31J86K59l44m9K43n3j91K56j92k46M98o5o01
4431e39R97m09k21K26J28m98M87R1n38K31K07n96J49M42k45j71P83o37L7P87q94
4452a83J10J86l19J39N29m11l10L88O2l88J71K78p91N57J77l09J92J29p10K52
4472b51N11n38M58L27p48L67J10l74K80L66n43j83N21j94m04O89k49l68K29j04
4492i8l69P50j99m70M70O3n60M21K51k45r1N26n07k00N84m21J10L57q39K22O58
$$ plain form
4347 -267 -27 223 -356 -20 322 -399 119 417 -303 -499 290 -247 -382 333 -142 -223 386 -131 -53 270 112
4368 112 -288 260 94 -45 184 589 -134 162 432 -341 -50 195 -374 20 179 -107 47 30 -331 -38
4388 -38 505 -118 -62 505 216 -307 231 -22 -468 -89 303 -338 95 -52 -246 -143 259 -279 70 746 9
4409 9 -51 319 -242 103 485 -210 -318 491 -240 -54 205 -139 -188 55 2 -189 67 -125 -371 127 62 -539
4431 -539 458 49 -172 54 182 -316 171 262 -276 -45 162 -434 -285 157 -88 -259 524 -113 -76 711 -183
4452 -183 -73 113 -206 -67 462 51 -259 129 191 -197 -26 252 -539 18 195 -114 78 207 -503 -251
4472 -251 260 -278 180 507 -241 126 236 -138 142 508 -35 -218 303 109 -295 394 145 -223 6 -98
4492 -98 -467 283 84 -386 84 147 -413 8 259 14 -77 449 -58 -258 326 -95 15 372 -467 -245 413
4513D13l89k58L38j60kL00k51k03L45R5n01L99k23l00N33K7m61L32J78n35J35
4534a88J85r8N2J58k00k22Q13n28j58N63m29k62N50k46m41O65j90j08K41m6j83
4555g2J50K1j69K95j46k19K57P3l11J78J96m81L05L09m65k09Q06n56N0L23m03
4576f8k73M86k33jM36k62n51R74n09j51M53m07k60K21L91o05N84j91j72P1N20
4597D53q36L41J32j53j85M57n75N2N66m85P5L79m02r7M32l30L6P3J94n22O47k6
4619B26n15N64j60o28O17O2m47K34J91n36M53R1k89l52Q11k67m52O40k98j42K81
$$ plain form
4513 413 24 -234 104 -56 -58 242 -9 -212 133 228 -273 126 -97 -397 136 163 -298 34 212 -323 -188
4534 -188 -3 -101 -49 109 -91 -313 500 -28 -186 377 -52 -314 236 -10 -451 214 24 -84 157 111 -72
4555 -72 78 99 -70 225 79 -140 117 190 -121 57 253 -228 77 386 -79 -288 518 -38 12 335 -68
4576 -68 -341 145 -88 -89 347 85 -466 508 -1 -152 301 -106 -366 -145 246 -359 225 34 -138 -67 453
4597 453 -383 -42 90 -63 -248 209 -366 -314 252 -233 -158 221 -181 -278 154 -176 -140 -67 127 -395 252 226
4619 226 -289 275 115 -513 104 166 -281 -47 144 -392 61 152 -137 -489 322 55 -397 243 -55 -197 84
$$ [...]
8191b50
##END NTUPLES=NMR FID
##END=
