##TITLE=1H_Pr 4890
 CDCl3, 8 sc, 
 5.2.2019
##JCAMPDX= 6.0         $$ Bruker NMR JCAMP-DX V2.0
##DATA TYPE= NMR FID
##DATA CLASS= NTUPLES
##ORIGIN= UXNMR, Bruker Analytische Messtechnik GmbH
##OWNER= root
$$ XWIN-NMR		Version 3.5
$$ Tue Feb  5 15:45:51 2019 Russian Standard Time (UT+4h)  she@DPX200
##.OBSERVE FREQUENCY= 200.1313
##.OBSERVE NUCLEUS= ^1H
##.DELAY= (6, 6)
##.ACQUISITION MODE= SIMULTANEOUS
##.ACQUISITION SCHEME= undefined
##.AVERAGES= 8
##.DIGITISER RES= 18
##SPECTROMETER/DATA SYSTEM= spect
##.PULSE SEQUENCE= zg30
##.SOLVENT NAME= CDCl3
##.SHIFT REFERENCE= (INTERNAL, CDCl3, 0, 15.7039)
##AUDIT TRAIL= $$ (NUMBER, WHEN, WHO, WHERE, WHAT)
$$ ##TITLE= Audit trail, XWIN-NMR		Version 3.5
$$ ##JCAMPDX= 5.01
$$ ##ORIGIN= Bruker BioSpin GmbH
$$ ##OWNER= she
$$ F:/spectra/data/she/nmr/H-F/1/audita.txt
$$ ##AUDIT TRAIL=  $$ (NUMBER, WHEN, WHO, WHERE, WHAT)
(   1,<2019-02-05 15:45:00.54 +0400>,<she>,<DPX200>,
      <created by zg, POWCHK disabled, PULCHK disabled
       configuration hash MD5:
       00 E9 B6 7A A2 85 ED C7 34 08 36 98 17 FE 4E 26
       data hash MD5: 16K
       31 E9 81 C5 6E 66 45 6E C0 C9 D2 2A DA 12 BD C0>)
$$ ##END=
$$ 
$$ hash MD5
$$ 91 FD FE D7 16 C0 FA 0C 9D 50 99 33 2A 7D 17 F4
##$RELAX= 
##$RELAX= 
##$RELAX= 
##$RELAX= 
##$RELAX= 
##$RELAX= 
$$ Bruker specific parameters
$$ --------------------------
##$DU= <F:/spectra>
##$EXPNO= 1
##$NAME= <H-F>
##$PROCNO= 1
##$TYPE= <nmr>
##$USER= <she>
##$AMP= (0..31)
100 100 100 100 100 100 100 100 100 100 100 100 100 100 100 100 100 100 
100 100 100 100 100 100 100 100 100 100 100 100 100 100 
##$AQSEQ= 0
##$AQ_mod= 1
##$AUNM= <au_zg>
##$AUTOPOS= <>
##$BF1= 200.13
##$BF2= 200.13
##$BF3= 200.13
##$BF4= 200.13
##$BF5= 200.13
##$BF6= 200.13
##$BF7= 200.13
##$BF8= 200.13
##$BYTORDA= 1
##$CFDGTYP= 0
##$CFRGTYP= 5
##$CHEMSTR= <none>
##$CNST= (0..31)
1 1 145 1 1 1 1 1 1 1 1 1 1 1 1 1 1 1 1 1 1 1 1 1 1 1 1 1 1 1 1 1 
##$CPDPRG= <>
##$CPDPRG1= <>
##$CPDPRG2= <>
##$CPDPRG3= <>
##$CPDPRG4= <mlev>
##$CPDPRG5= <mlev>
##$CPDPRG6= <mlev>
##$CPDPRG7= <mlev>
##$CPDPRG8= <mlev>
##$CPDPRGB= <>
##$CPDPRGT= <>
##$D= (0..31)
0 1.2 0 0 0 0 0 0 0 0 0 0.03 0 0 0 0 0 0 0 0 0 0 0 0 0 0 0 0 0 0 0 0 
##$DATE= 1549367100
##$DBL= (0..7)
120 120 120 120 120 120 120 120 
##$DBP= (0..7)
150 150 150 150 150 150 150 150 
##$DBP07= 0
##$DBPNAM0= <>
##$DBPNAM1= <>
##$DBPNAM2= <>
##$DBPNAM3= <>
##$DBPNAM4= <>
##$DBPNAM5= <>
##$DBPNAM6= <>
##$DBPNAM7= <>
##$DBPOAL= (0..7)
0.5 0.5 0.5 0.5 0.5 0.5 0.5 0.5 
##$DBPOFFS= (0..7)
0 0 0 0 0 0 0 0 
##$DE= 6
##$DECBNUC= <off>
##$DECIM= 32
##$DECNUC= <off>
##$DECSTAT= 4
##$DIGMOD= 1
##$DIGTYP= 9
##$DL= (0..7)
0 120 120 120 120 120 120 120 
##$DP= (0..7)
150 150 150 150 150 150 150 150 
##$DP07= 0
##$DPNAME0= <>
##$DPNAME1= <>
##$DPNAME2= <>
##$DPNAME3= <>
##$DPNAME4= <>
##$DPNAME5= <>
##$DPNAME6= <>
##$DPNAME7= <>
##$DPOAL= (0..7)
0.5 0.5 0.5 0.5 0.5 0.5 0.5 0.5 
##$DPOFFS= (0..7)
0 0 0 0 0 0 0 0 
##$DQDMODE= 0
##$DR= 18
##$DS= 0
##$DSLIST= <SSSSSSSSSSSSSSS>
##$DSPFIRM= 0
$$ [...]
##$SUBNAM2= <"">
##$SUBNAM3= <"">
##$SUBNAM4= <"">
##$SUBNAM5= <"">
##$SUBNAM6= <"">
##$SUBNAM7= <"">
##$SUBNAM8= <"">
##$SUBNAM9= <"">
##$SW= 20.0189088683792
##$SWIBOX= (0..15)
0 0 2 0 0 0 0 0 0 0 0 0 0 0 0 0 
##$SW_h= 4006.41025641026
##$TD= 16384
##$TD0= 1
##$TE= 0
##$TE2= 300
##$TE3= 300
##$TEG= 300
##$TL= (0..7)
0 120 120 120 120 120 120 120 
##$TP= (0..7)
150 150 150 150 150 150 150 150 
##$TP07= 0
##$TPNAME0= <>
##$TPNAME1= <>
##$TPNAME2= <>
##$TPNAME3= <>
##$TPNAME4= <>
##$TPNAME5= <>
##$TPNAME6= <>
##$TPNAME7= <>
##$TPOAL= (0..7)
0.5 0.5 0.5 0.5 0.5 0.5 0.5 0.5 
##$TPOFFS= (0..7)
0 0 0 0 0 0 0 0 
##$TUNHIN= 0
##$TUNHOUT= 0
##$TUNXOUT= 0
##$USERA1= <user>
##$USERA2= <user>
##$USERA3= <user>
##$USERA4= <user>
##$USERA5= <user>
##$V9= 5
##$VALIST= <valist>
##$VCLIST= <CCCCCCCCCCCCCCC>
##$VD= 0
##$VDLIST= <DDDDDDDDDDDDDDD>
##$VPLIST= <PPPPPPPPPPPPPPP>
##$VTLIST= <TTTTTTTTTTTTTTT>
##$WBST= 1024
##$WBSW= 4
##$XGAIN= (0..3)
0 0 0 0 
##$XL= 0
##$YL= 0
##$YMAX_a= 285364
##$YMIN_a= -233446
##$ZGOPTNS= <>
##$ZL1= 120
##$ZL2= 120
##$ZL3= 120
##$ZL4= 120
##$ABSF1= 10
##$ABSF2= 0
##$ABSG= 5
##$ABSL= 3
##$ALPHA= 0
##$AQORDER= 0
##$ASSFAC= 0
##$ASSFACI= 0
##$ASSFACX= 0
##$ASSWID= 0
##$AUNMP= <proc_1d>
##$AZFE= 0.1
##$AZFW= 0.1
##$BCFW= 1
##$BC_mod= 2
##$BYTORDP= 1
##$COROFFS= 0
##$CY= 11.3945322036743
##$DATMOD= 1
##$DC= 2
##$DFILT= <>
##$DTYPP= 0
##$F1P= 18.9103706918063
##$F2P= -1.10871071338519
##$FCOR= 0.5
##$FTSIZE= 0
##$FT_mod= 4
##$GAMMA= 1
##$GB= 0.15
##$INTBC= 1
##$INTSCL= 1
##$ISEN= 128
##$LB= 0.24
##$LEV0= 0
##$LPBIN= 0
##$MAXI= 10000
##$MC2= 0
##$MEAN= 0
##$ME_mod= 0
##$MI= 1.114404
##$NCOEF= 0
##$NC_proc= 0
##$NLEV= 6
##$NOISF1= 3.799351
##$NOISF2= 2.8
##$NSP= 1
##$NTH_PI= 0
##$NZP= 0
##$OFFSET= 15.70392
##$PC= 1
##$PHC0= -9037.462
##$PHC1= 9.400043
##$PH_mod= 1
##$PKNL= yes
##$PPARMOD= 0
##$PSCAL= 0
##$PSIGN= 0
##$REVERSE= no
##$SF= 200.130013532006
##$SI= 16384
##$SIGF1= 3
##$SIGF2= 2
##$SINO= 400
##$SIOLD= 16384
##$SREGLST= <1H.CDCl3>
##$SSB= 0
##$STSI= 0
##$STSR= 0
##$SW_p= 3612.71676300578
##$SYMM= 0
##$S_DEV= 0
##$TDeff= 0
##$TDoff= 0
##$TI= <>
##$TILT= no
##$TM1= 0
##$TM2= 0
##$TOPLEV= 0
##$USERP1= <user>
##$USERP2= <user>
##$USERP3= <user>
##$USERP4= <user>
##$USERP5= <user>
##$WDW= 1
##$XDIM= 8192
##$YMAX_p= 0
##$YMIN_p= 0
$$ End of Bruker specific parameters
$$ ---------------------------------
##NTUPLES= NMR FID
##VAR_NAME=  TIME,          FID/REAL,        FID/IMAG
##SYMBOL=    X,             R,               I
##VAR_TYPE=  INDEPENDENT,   DEPENDENT,       DEPENDENT
##VAR_FORM=  AFFN,          ASDF,            ASDF
##VAR_DIM=   8192,          8192,            8192
##UNITS=     SECONDS,       ARBITRARY UNITS, ARBITRARY UNITS
##FACTOR=    0.0002496,     1,               1
##FIRST=     0,             0,               0
##LAST=      2.0444736,     0,               0
##MIN=       0,             -233446,         0
##MAX=       2.0444736,     285364,          0
$$ Real data points
##PAGE= N=1
##DATA TABLE= (X++(R..R)), XYDATA
$$ [...]
2624b352K439K187m270J382L112m233P46L711l990j27L911l054j435M232k580
2639c21k026M524k037k632M062p19l247L932P3l928L248Q98m455K843J754m075
2655b106J671K662l904O49L481l647J31L656l282j051M171k824j811M168j465
2670D99k840M003r76l083L769n1l673K875J265l877K464J796l871J391K755l766
2686a320Q25K809l627K77L395l144q80L777k643j678L969j863j902L376q42k633
2702b104L737k60l276L136Q26l767K107J523m150J992K325m004Q72K582k763m
2718a228L455l041n92L887k326j918L852j461k566L747j011k875L414r9l384K937
2734G91P56l776K287J315l660K047K002l000N34L198l370J98K972k933o61L136
$$ y = [-2352, 87, 2274, -1996, -614, 2498, -1735, -989, 2722, -1268, -1395, 2516, -538, -1973, 2259, -321, -2347, 2177, 140, -2492, 1570, 851, -2396, 1536, 1609, -2319, 929, 1827, -2628, 215, 1969, -2106, -435, 2227, -1677, -1028, 2453, -1194, -1063, 2593, -689, -1740, 2431, -393, -2204, 1964, 499, -2341, 1662, 686, -2397, 1372, 1321, -2352, 523, 1788, -2089, 375, 2171, -1700, -309, 2446, -1320, -495, 2314, -1313, -1036, 2359, -785, -1665, 2112, -531, -2209, 1760, -103, -2005, 1371, 529, -2104, 1633, 1373, -1903, 1233, 2059, -1708, 399, 1922, -2228, -236, 2089, -1915, -1043, 1539, -1224, -1228, 2227, -814, -1406, 2481, 155, -1763, 2089, 628, -1938, 1809, 798, -2077, 1337, 1238, -2146, 791, 1547, -2229, 58, 1373, -2287, -240, 1762, -1238, -704, 2494, -876, -678, 2294, -639, -1300, 1836]
2750A836k258j367L452j665k019L394j193k035L111m14k820K521J040l646K519
2765D56J154l342J761J911l547J204K346l200N24K585k722m87L175k350j041L414
2781A841j682j789L203j118k221L088l25k676K647N73l373K162J241l419J608
2796b40J816l071R54K174k717N7K889k466l00K815j870j107K762j563j592L161
2812A702j278k350K843l13k621K459K84k697J815J432k962J515J849k597J091
2827A72K070k852L04K572k547o26K375k111r03K585j584j273K560o00j879K695
2843I58k1k372K442P7k326J743J236l120J277J758k895J023J647k875M54K594
2859A600k486o17K927j876j111L117j594j355K810r28j794K442k31k308K047J90
$$ y = [1836, -422, -1789, 1663, -2, -2021, 1373, 180, -1855, 1256, 842, -1978, 543, 1583, -2063, 456, 1610, -1732, 29, 1940, -1607, -403, 1943, -1257, -733, 1852, -870, -1357, 1818, -532, -1573, 1841, 159, -1630, 1573, 455, -1766, 1322, 997, -1679, 968, 1541, -1832, 330, 1571, -1848, -240, 1576, -1495, -541, 1633, -1084, -1027, 1862, -604, -904, 1911, 41, -1066, 1696, 133, -1459, 1702, 424, -1926, 917, 604, -2017, 442, 726, -1971, -156, 1276, -1686, -171, 1678, -919, 172, 2242, -610, -306, 2266, -281, -907, 1468, -643, -1546, 1039, -545, -1818, 742, 142, -1737, 958, 937, -1435, 1007, 1084, -1242, 501, 1737, -1383, -106, 1652, -1243, -220, 1427, -1448, -994, 1600, -886, -1503, 1424, -452, -1563, 1554, -40, -1395, 1415, 487, -1307, 1135, 904, -1404, 643, 833]
2875H33k365J853N46k552J313J734k502J138J420k364N10K216k286m78K629j815
2891a70r08K662j724j359K878j194j959K888n19k311K426K1k586K339O06k633
2907a543J559J509k581Q31J644k267O21J881k099k18K212k064r14K527j576j035
2923a513K349o19j490K184m19j925K516p3k073J766N34k615J440J021k450J165
2939b02J316k444N04K155k099j13K144j356q25K356j141j129K031p17j486K296
2955A290m67j960J801q0k202J849M78k441J661J148k408R69J612k184N60J816
2971A442j753k80J983j622l29J863j504r32J890r68j416K337n02j612J844L81
2987H22k250J490J238k547J421J315k467R09J541k457M15J839j833j88K006j827
$$ y = [833, -1532, 321, 867, -1685, -372, 1362, -1140, -2, 1418, -946, -436, 1780, -506, -984, 1645, -170, -1078, 1584, -140, -1499, 1379, 185, -1774, 1114, 595, -1716, 710, 731, -1855, 484, 1090, -1543, 16, 1525, -1056, -225, 1419, -848, -227, 1654, -445, -663, 1549, -515, -1429, 1098, -478, -1513, 836, 217, -1273, 911, 492, -1433, 1083, 1010, -1063, 703, 1237, -1378, 62, 1083, -1367, -202, 1114, -1330, -826, 1329, -770, -883, 1261, -95, -920, 1436, 295, -834, 1197, 480, -1006, 1290, 823, -1137, 664, 584, -1618, 231, 709, -1732, -71, 1077, -1331, -362, 1250, -934, -374, 1442, -311, -591, 1392, -230, -559, 1304, -200, -1132, 758, -210, -1626, 711, 209, -1403, 441, 822, -1428, 62, 1300, -1247, 174, 1489, -978, -69, 1472, -985, -570, 1269, -564, -752, 1254, -573]
3003e73p33K086j269o74K210q23j771K391j64j410J764K15k064J306N65k190J067
3020f7J227k287N02J593k036M11J807k103K53K479j767p57K159j403r00J871n32
3037D50j581J691l52j471J492L83j919J141J092j781J047J272k156Q92J322k316
3053g94P17J537k024l99K185j590p72K181j021q71J762p35j232J541k85j288J697
3070F09K00j709R77J050k140J254Q70k103Q34J341j997L35J611j620k28J692j611
3087f35n09K140j284q97J912l26j589K182p07j402J964L8k010J795K22k082J105
3104h3Q49j838M15J377j661Q1J895j564j26J846j554l86J800q45j032K024j002
3121A96j555K182n07j675J718J33j791J511M67j904J311Q41j591N96J259j773
$$ y = [-573, -1306, 780, -489, -1163, 1047, 224, -1547, 844, 680, -730, 1034, 1249, -815, 491, 1056, -1134, -67, 1160, -1127, -625, 968, -1068, -657, 1150, -953, -700, 1779, 12, -745, 1414, 11, -889, 982, 450, -1131, 560, 208, -1263, 229, 612, -1307, -166, 926, -855, 192, 1464, -692, 200, 1522, -794, -77, 1460, -564, -963, 1222, -368, -1140, 1041, 20, -851, 911, 176, -1056, 485, 200, -1088, 609, 809, -900, 77, 1127, -1013, 241, 1111, -992, -158, 1183, -814, -479, 1132, -488, -716, 976, -635, -1144, 996, -288, -1185, 727, 401, -1188, 994, 287, -1115, 849, 887, -1123, 672, 894, -1188, -83, 766, -1072, -657, 720, -941, -860, 1035, -529, -655, 1191, -363, -749, 1051, 206, -826, 1198, 196, -1359, 823, 316, -1359, 359, 492, -1299, 212, 679, -1225, 86, 927, -664, -68, 1191, -582]
3137e82O5J567j521N4J386j447n40J583j165o16J861p79q80J519j50j345J610
3154F20O3j685J733L75k071J114P61j730P81J123k197N83J674j723o8J777j701
3171e71p5J914j325o12J547l62j260J597k09j384J170J94j796J590J67j856J126
3188a45Q68j881R70J187j823L49J566j544J89J476j348o10J861j070n99J441j062
3205a75j053J621j98j316J810k13j639J482M61j368R16J009j947O65R42j463J95
3222b71J225j756J46J569j131n93J834j162q96J699p25j085K212o60j578J706
3238E34J00j501J250L39j895J198R43j739M05J433k043N13J365j692L28J564j307
3255b05n71J854j201q33J902j062o21J484m12j046J499q4j712J292M17j905J262
$$ y = [-582, -517, 1050, -471, -417, 969, -478, -1018, 565, -600, -1216, 645, -134, -1014, 505, 355, -990, 620, 683, -1002, 731, 1106, -965, 149, 910, -820, -39, 1084, -1113, -530, 1144, -579, -647, 1130, -571, -646, 1268, -57, -669, 878, 516, -744, 853, 644, -740, 430, 624, -1172, 418, 585, -1271, -145, 723, -1158, -188, 999, -824, -475, 1091, -453, -264, 1212, -136, -746, 1115, 45, -554, 887, -175, -1228, 393, 195, -1121, 689, 476, -1163, 319, 780, -588, 328, 1337, -610, 55, 997, -466, -271, 954, -802, -656, 913, -218, -811, 1023, -139, -1035, 664, -61, -1146, 1066, 406, -1172, 534, 634, -867, 383, 722, -1173, 25, 968, -771, -366, 1067, -976, -463, 902, -790, -462, 1102, -205, -776, 1078, -123, -956, 946, -116, -737, 747, 335, -711, 788, 704, -1008, 284, 701, -1204, 58]
3272E8N33j389P01J143j456K91J311j528j17J545j681L9J554j152p15J762p82
3289A17j148J596n10j273J651R6j363J616L8j839J259O20j339L70J186j999O07
3306c15J476j944J20J577j491k30J435j003m88J839p88q48J772q35j150J702Q5
3323I14k067J466L55j864J413L93j653O59P50j150M67J368j455J24J250j398k10
3340f38J512o90q67J510q75q71J508n34j110J532l05j305J551k13j021J139M92
3357H15j221O54Q22j744M99J175j634L5J510j397k69J376p30m22J167o94n87J556
3375I11n79j328J560k45j211J398K19j564Q70O97j760J127Q03j634O00R18j563
3392g81N64J337j566l12J590j129k87J356q63r61J986r40j010J753m01j077J158
$$ y = [58, 591, -798, -97, 1046, -410, -119, 1192, -336, -453, 1092, -589, -550, 1004, -148, -863, 899, 117, -1031, 565, 55, -1218, 433, 529, -834, 782, 820, -1019, 240, 860, -479, -109, 1077, -922, -315, 1161, -783, -663, 914, -577, -807, 628, -375, -863, 976, 188, -660, 1112, 277, -873, 829, 914, -1153, 313, 668, -1196, 217, 610, -1043, -384, 366, -784, -317, 1051, -404, -280, 970, -428, -638, 874, 184, -683, 827, -48, -919, 589, 55, -1055, 477, 172, -1133, 418, 205, -816, 323, 815, -406, 248, 1070, -674, -175, 1000, -634, -599, 911, -486, -755, 621, -109, -531, 636, -58, -645, 911, 332, -996, 564, 319, -892, 506, 725, -839, 31, 728, -1032, 95, 898, -736, -136, 782, -781, -217, 1120, -446, -758, 832, -297, -584, 772, -91, -1052, 934, -6, -1016, 737, 336, -741, 417]
3409D17k5j220R27M61j646R65R61j626M57J243j285J33J095j003J01J070j394
3426c69j92J652j104n57Q64k22j014J280k76j101J365K57j172Q80Q10j908J158
3443C51N32j598Q19R36j631L14J070j359l6J110j019j23J132o73o32J923r73p92
3461f49J334l21j054J116Qj101R26L16j476J133K96j374P87N88r58K08J244j451
3479d28p2J540j383J34J127j174m68J267p22q84J549l73r42J314J32j560J436
3496D93K32j372R07Q40j509O27O64j331J20J120j316RJ517j662kJ185p47m03J252
3515F24o94n92J330l18j021J275j88j231J222n0j088R54M35j784R39R46j698O54
3533b85J018j483L37J144r48j56J227j324l75J531q59m49J232n44o88J349k03
$$ y = [417, 392, -828, 99, 560, -1086, -121, 840, -786, -329, 914, -371, -238, 857, -146, -45, 1025, -369, -561, 1091, -13, -570, 294, 72, -942, 338, 62, -1039, 326, 583, -589, 291, 1101, -807, 351, 883, -715, 104, 1040, -591, -277, 793, -566, -602, 508, -511, -634, 498, -175, -807, 1116, 143, -649, 685, 364, -690, 426, 434, -667, 259, 575, -901, 232, 528, -846, -59, 529, -429, -221, 1023, -428, -500, 1040, -343, -209, 918, -256, -724, 543, -179, -1063, 486, 113, -829, 485, 617, -943, 493, 725, -647, 260, 1100, -409, 218, 882, -449, -329, 791, -525, -516, 1001, -661, -663, 522, -225, -628, 624, -70, -662, 668, 350, -671, 604, 416, -815, 407, 357, -731, 223, 658, -1126, -187, 759, -939, -285, 733, -750, -413, 731, -217, -373, 854, -470, -845, 686, -173, -622, 610, 66, -622, 727, 524]
3550E24j285J097j50r94P88O34j511Q77O27j276K20J082j212M56J121j192J13
3567h1J164j168m48J264j112l82J100l99j225J746j18j126J138l8r40J090K70
3584G35j251P81P03j617O29Q21j432L65R33j526R0J388j027j64J186o96n94J393
3602G17k66r79J399n48p05P89q1j413J478k3j381Q91M50j195M66J174j554Q14
3620C3Q70j086J18J220j168k38R38p87n92J398q50o28J380o81q54J250j57q53
3638f87J075N0j331R15O96j284O10P28j195J90J050j408K22R19q81j91J135q78
3656b65n31J154m09p15J321k93j036J423o0j176J181J48j366R95M33j302M04R00
3674H06j359L44P02r16J06R27j140o6J214q62P2R27q31l10J255o67q77J249Lj179
$$ y = [524, -761, 336, 186, -808, -20, 614, -897, -20, 607, -669, -449, 633, -579, -123, 998, -194, -81, 1083, -85, -533, 731, -381, -763, 337, -62, -1287, 459, 341, -785, 353, 315, -625, 465, 735, -516, 265, 968, -649, -20, 801, -631, -266, 667, -859, -769, 619, -408, -572, 614, -82, -676, 717, 451, -528, 871, 323, -382, 407, 326, -1087, 391, 368, -1013, -122, 328, -867, -401, 773, -781, 33, 903, -183, -65, 1155, -13, -251, 687, -100, -692, 706, -144, -772, 608, -73, -927, 323, 166, -687, 388, 438, -893, 22, 718, -566, 44, 772, -423, -233, 817, -591, -369, 550, -331, -522, 613, -265, -796, 358, -51, -766, 555, 262, -774, 649, 589, -587, 594, 742, -624, 371, 804, -498, -94, 806, -553, -209, 493, -423, -317, 610, -530, -596, 618, -244, -172, 755, -76, -386, 869, 202, -675, 574, 577, -602]
3694f02P77nq65M73Q42j795J057O00j344R29P87j068k2J130j032k0J191r72m26
3713c65J293j028o94J290p03q52J398j48q30J168j04j100J180J00j080J058J32
3730G15j247N71Q21j497M10J005j395o4J245o88m17J624j215n37J444n66o53J230
3748G86o84n79J001j36j067R89m1j178R62M57j297N29J138j225J73N43o49K75
3766cP37j076j3J504j178m48J362r67n39Q46j30q92J347n14o46P98K14j139R89
3785B52L24j240R57L80j007L26R83j422M79P44q36l17J034q71m58J186o61p08
3803h55J614p58p91J210l87q83J375K36j212N80N50j417Q00N59j126M28O24j006
3821d59K62O49q92k89J504j060o9J257p78o89J267m19j100J334l08p87P72j28
$$ y = [-602, 175, 170, -695, -222, 620, -1175, -118, 482, -862, 67, 854, -214, -236, 894, -138, -158, 1033, 61, -365, 928, -100, -794, 496, -207, -1059, 339, 191, -639, 529, 425, -675, 505, 605, -475, 583, 715, -532, 39, 860, -637, -227, 778, -617, -681, 564, -124, -541, 1083, -132, -669, 775, 209, -444, 786, 102, -477, 524, 388, -679, 310, 269, -909, 53, 510, -787, -258, 880, -345, -172, 371, -278, -3, 734, -342, -355, 1149, -29, -477, 885, -82, -621, 225, 95, -797, 550, 36, -610, 188, 402, -737, 252, 576, -664, 293, 673, -334, -8, 975, -447, 32, 776, -60, -377, 657, -214, -672, 514, -147, -855, 759, 1, -790, 420, 33, -850, 525, 761, -451, 129, 679, -738, 62, 621, -505, -77, 547, -459, -197, 452, -440, -729, 775, -285, -354, 903, 125, -564, 703, 284, -816, 518, 210, -577, 195, 67]
3839F7r71R66J27q15R46K52j109Q01M49j194L52O39q95q7R40m91o67J080m76m91
3859e77J115o03r14J433l38n27N94J83q11R61L5r76N00M16q97K98O68q55J08J083
3879H96j432M87O39q76j60J097o95n39J390p11o84J234m34p13J075M0j395R57
3897A76L19j224O12N59r48O24N31j055K37R65j356J94O66o13j92R15o38R9P69
3916F40l75q51R29k61j005J277k16j002J305J40j234R92K58j463Q64P08j255N71
3934B2N06p60j56J034j088Q4J253r32n80R14j89k99O85j68p86Q77q6j112J183
3953D02K9r56P80J13j088M59Q01j230M33P00n93RP88m63k91Q20q18n02J307r08
3973b08j55Q75n46l69R50m78p12P88J10q21M04N17r13M68Q39j136N28N75r09m
$$ y = [67, -904, 62, 189, -626, 320, 572, -537, 264, 713, -481, -129, 510, -385, -472, 468, -23, -690, 390, -86, -577, 538, -65, -979, 454, 116, -411, 183, 366, -445, 516, 551, -425, 75, 491, -406, -108, 560, -295, -187, 896, -536, -49, 590, -286, -446, 651, -44, -583, 807, 96, -588, 646, 212, -501, 574, 614, -781, 176, 495, -729, -117, 442, -506, 118, 649, -406, -169, 796, -560, -366, 300, -313, -505, 410, -228, -129, 640, 265, -586, 343, 82, -923, 354, 138, -864, 441, 581, -653, 339, 597, -866, -2, 706, -549, 22, 528, -232, -388, 646, -442, -358, 895, -37, -617, 297, 108, -191, 494, 326, -460, 417, 331, -781, 402, 431, -525, 255, 368, -720, -261, 540, -690, -257, 443, -150, -141, 647, 184, -107, 713, -105, -607, 700, -208, -363, 512, -34, -403, 547, 69, -643, 145, 255, -566, -162, 355, -558, -90, 749, -387, 141, 716, -193, -197]
3993a97J045j115O4Q69o74o07R69k44q62J075j96q95Q00q2o48J093j92n61Q50
4012D92O1q33N70J98q95K36N29q88L19O77q19J58O63n37k97J115q46k37J212m41
4032D37o39P01j66p21P47k16o42P45Q2j103P39M59q79K97Q83j271L05R01p18J09
4052E0P73q94l69Q55o58m78J169o47m87J039m61o90J187M0j071Q66J83j123P79
4071F3N88r45J50R10j009OR79q98k78J078j164RQ25m10p6P02m52p61J183l59o85
4092e44Q19N7o22O11Pq74P73O3o48K66L72r65L42O10o57J57N71p90J32R38q02
4113a84j69R71n36l47R68m10n14M17j7n77M34K0p09N21K81p55N85N34r73O68N24
4134G32p63j38J135j102n7Q07q72j8M77k09o82Q23n90j54J086l00r56R55J50q18
$$ y = [-197, 848, -267, -203, 666, -8, -615, 354, 110, -752, 323, 127, -768, 32, -50, -698, 395, 203, -358, 492, 553, -280, 290, 488, -407, -171, 358, -530, -211, 466, -353, -195, 468, -69, -366, 749, -97, -334, 878, 437, -202, 499, 333, -388, 359, 143, -499, 246, 328, -775, -36, 423, -456, -159, 724, -547, -242, 659, -59, 50, 823, -71, -440, 415, -243, -721, 448, -199, -686, 353, -108, -798, 389, 429, -642, 224, 407, -716, 63, 651, -294, -144, 766, -243, -237, 742, -156, -434, 644, -520, -511, 314, -96, -172, 530, 78, -683, 500, 141, -544, 275, 332, -290, 321, 328, -546, 227, 290, -358, -92, 280, -685, -343, 267, -390, -233, 338, -452, -320, 618, -184, -353, 618, 82, -265, 703, 293, -221, 196, 179, -398, 36, 56, -653, -132, 149, -606, -21, 513, -460, 208, 732, -31, -169, 966, -136, -193, 614, -258, -276, 201, -8, -690, 133, -457, -611, 475, 175, -781, 174, 324, -494]
4154d94O44L08p43M45K69n05J02L14o84j28O58o18j62J142q83l3R45n40l53M41
4174A25k3m19Q80l69n48O38l2p67Q52R7q82K19Q10j218M86M84p75M26O61j029
4194c84K35P77n40l04J046r08l86O46J51j075J023l63m76O13k26k36M64M04q32
4213c71L96N77q25L69K30n89L00M92q47J52P35r25lM80l71l59O46l08n12Q42J54
4234B63p59R32j1o17Q08l08o89O49J40q13M42L73n24l01N39n05K7N08o00J08J043
4255G05m99k48R05q40k33P26k18n40Q53L2j150N67J6l58K47K49q64N94L87r76
4275f45L78O71n06L4R42r54k1P52n32k90Q12o83l73O67j40p96M97L1n85P38J25
4296A22m56J69M12n40M09O88r18J73M75r89P2P79m99l63Q31o54m02R41l86l12
$$ y = [-494, 150, 458, -285, 160, 429, -76, 26, 340, -344, -472, 186, -432, -594, 548, -335, -368, 577, 37, -316, 125, 102, -317, 563, 194, -354, 284, 252, -515, 337, 434, -448, -229, 581, -637, -151, 333, -442, -16, 645, -384, -149, 628, 88, -216, 830, -78, -464, 182, 333, -742, 281, -82, -558, 55, -171, -407, 57, 461, -371, 25, 602, -223, 146, 376, -213, 87, 579, -268, -116, 619, -306, -309, 171, -200, -559, 87, -221, -733, 109, 263, -496, 436, 425, -192, 616, 308, -381, 268, 408, -405, 37, 410, -114, -415, 124, -381, -354, 154, -446, -338, 705, 206, -42, 863, 23, -210, 516, 298, -242, 611, 643, -507, 60, 76, -282, -35, 214, -650, -56, 331, -645, -267, 404, -102, -68, 874, -80, -101, 651, 119, -171, 641, -42, -415, 252, 112, -684, -187, -156, -741, -3, 122, -334, -165, 247, -293, 116, 804, -114, 59, 534, -455, -383, 396, -103, -466, 365, -289, -691, 250, -136, -448]
4316d48P74Op21J059j29o55K71K54q65L80L00o46R7L95m11J67M17p99K75O57p35
4337c57J97R54p38k74P15k44m59N95k1p54P74l12p60N75O2o50P87J02p17N17O36
4358F28p59J32P42q33K11L13l80l36R00p84J02N68o09m77Q08j95o83J003l89m42
4378d80Q12j57n95P55j52l28N44K03q92M95K64q33K37L82n16o5N66n90J07N72
4398C29n13p6N72n78r7Q06k55k47P22l44p46O08mr50L25O86m44q9N66n70N5P34
4420D90m44j86N73m47QM72p47O7O69j99p50O79l16m88P25j09n26M64L54n53O37
4441C73J8m69K64M78j092M74M45o32j42O97m27l47N00j43l68N45k75m44P79j28
4461A06n88R29l77j13L55J15o58L47M00o63K4L94n83M0O06q04P5Q43p73J63O79
$$ y = [-448, 326, 332, -389, 670, 541, -114, 157, 411, -454, -74, 226, -420, -323, 72, -339, -172, 245, -554, -279, 378, -357, -160, 794, 56, -218, 497, 253, -206, 389, 368, -386, 388, 76, -684, -109, -47, -697, 90, 192, -525, -8, 628, -131, 1, 743, -90, 121, 434, 54, -282, 618, -166, -64, 504, -105, -582, 226, 31, -652, 351, -38, -480, 332, 175, -420, 335, 183, -145, 399, 602, -290, 205, 469, -364, -127, 255, -261, -326, 240, -350, -243, 329, -184, -260, 312, -266, -363, 443, 188, -59, 663, 319, -427, 181, 177, -773, -448, 238, -206, -295, 271, -299, -244, 490, 46, -140, 433, -14, -6, 466, -281, -214, 455, 256, -494, 185, -131, -619, 106, -3, -529, -65, 289, -264, 373, 391, -78, 186, 664, -428, 46, 491, -141, -283, 414, -13, -360, 140, -3, -371, 174, -101, -545, 234, 106, -482, 447, 70, -43, 312, 427, -231, 116, 516, -147, -123, 271, -312, -272, 334, -470, -395, 448, -325, -162, 517]
4482E17q22M6N22l85r3M55R4l78M99l19m49N75Q7j034M65M68q07M65J06n59K90
4503b57N54o10J71Q12q24r5P47m10k97P76l69m71O97l20o28M67Np05P22O6m00
4524c69O23M2l35N60O3o64J51K27r50K89N08o14L46N28o77R7M84m26j85L09J30
4545A37l90L67K39n99N38J65q90M21L15n92j5O11n31K47M51n41L4L34n60J48N75
4566D64q35K03K21j68k80P76k50k40M12l10n47Q36l24k71O06j43o18M25K15m18
4586b46N07J5l26q2M85m85P4K46k88j10O21n40P7K89m68m19O08j22n18P16j14
4607h0l67O95J26l70K33J18n82M19J51m12q4K75o57L78M59o48J79M95o27q2Q66
4628D85m62k39L43L20o18P00k01o16M39j96m90N45j75k94L74P8q5K31L55m18r5
$$ y = [517, -305, -259, 263, -122, -215, 240, 334, -44, 455, 136, -313, 262, 349, -685, -220, 248, -559, -94, 12, -547, -257, 297, -313, -142, 670, -154, -249, 498, 88, -209, 567, 198, -273, 424, 104, -524, -57, -52, -757, -35, 31, -369, 254, 296, -39, 521, 584, -80, 71, 298, -652, -363, 145, -469, -123, 405, -272, -175, 309, -117, -302, 7, 137, -253, 114, 353, -246, 292, 457, -433, -12, 303, -289, -304, 307, -224, 23, 474, -67, -33, 301, -259, -111, 464, -371, -168, 53, -115, -395, 381, 131, -109, 303, -7, -554, 282, -42, -313, 293, 150, -468, -43, 172, -246, 261, 276, -50, -132, 353, -132, -58, 188, -100, -210, 411, -129, -52, 237, -231, -650, -42, -164, -682, 34, -80, -447, 248, 374, 4, 237, 355, -227, 192, 343, -69, -153, 122, -535, -157, 302, -346, -167, 328, -299, -381, 485, 23, -216, 127, 447, -171, 529, 328, -288, 151, -45, -535, 10, -165, -459, -85, -7, -92, 139, 494, 76, -19]
4649a9K19m69j56O33n81o7P52m12j65R91o24k80M51k64k83M05o7k94O64m05m35
4670d06Q09k3q21M05K54n56mL76n32M93L10m41J76O92n39n60O79l48l05O22j40
4691A41o07M39K77p33O42k92p3K3N66o98K83M46o62J86K59j77o5K62k92p0M04
4712B59l46q5M14l69K52Q2j24m20Q81o51k62O33k02n88N01K40o21K26O31n10j29
4733a88M07m3j16K75n56K85K23k01m05M81l36j02N72k81k6P1J51n84M95Q4n96
4754c90N30N0m33K98J89m82J76L22n07L72L33l99j15O35p71J03L58o44J91L45
4774A61l9n30O02k75k36L08K1j64M20M2m81J13L51o80K22L95l95P4L00m24Q5K94
4796A64l87j47N08o31Q5L95k60j45P86k64m57N75J41m46M55K08r61M00j26l19
$$ y = [-19, 200, -269, -425, 208, -373, -440, 312, -100, -265, 726, 102, -178, 273, 9, -274, 131, 64, -230, 434, 29, -406, 403, 380, -441, -36, 218, -338, -342, 34, -498, -5, 305, -136, 40, 732, 193, -367, 312, -36, -341, 281, 141, -466, -27, 250, -483, 159, -133, -206, -183, 383, -315, -32, 414, -248, -62, 197, 20, -45, 217, -75, -145, 259, -87, -172, 242, -127, 125, 207, 83, -337, 544, -107, -369, 264, 62, -526, -25, 215, -406, -180, 451, -59, -188, 219, 176, 60, 335, -221, 64, 287, 86, -319, 162, -174, -276, 296, 15, -11, 60, 211, -373, 122, 206, -390, 140, 190, -243, 55, 244, -238, -62, 260, -247, 125, 458, 59, -56, 579, -192, -89, 269, -375, -184, 161, 122, -408, 194, -81, -317, -9, 12, -152, 268, 310, -171, -58, 293, -387, -165, 230, -165, -91, 209, -215, -130, 164, -223, -370, 138, -493, -408, -13, -273, -418, 368, 104, -353, 222, 363, -83, 372, 580, -381, 19, -107, -426]
4816d26M49K67n67K2L66l93K17O34p52J80Q0K7m19M85r7l65N12k92m35O55j0n50
4838d12L05J73k71L77J57o69L05M50o97L87M35o40J31O9ql0L10l77j44N38p11
4859c22M4N48l38l68O64J77o74L70K05l82K00P1n97Q3O22p80Q8O50o30L40M68
4880D39o18l0N13m52K8N0l55L40L61L3n52P18k43n25O47j77o03L35J74Qr5J74
4902A70m89N93Nk58m3L71k48p5K97k45j58L53k98l5L90n75J26K86l42k44L36j32
4924b15N2N8L00o65Q20k5m69N76J2n49J41R0j91J23L11n49K69K43o51k61N54j98
4946b24m43O38P9j22J16K86k19K07j00l08K53Om98M19p7l11%M96k02k9J45q4j55
4969a27L32k30m1K64j96j15L50m5k38O4L1k72K00Kk90J09L92n51P60j32o32M12
$$ y = [-426, 23, 290, -277, -255, 111, -282, -65, 569, -183, -3, 77, 104, -315, 170, 73, -292, 220, -72, -507, 148, 138, -412, -107, 66, -205, 172, 329, -340, -35, 415, -282, 105, 540, -100, 31, 100, 92, 62, 372, -5, -149, 389, -322, -278, 270, -68, -436, 228, 405, -269, 101, 306, -76, 124, 195, -402, -319, 303, -477, -389, 261, -369, -29, 439, -179, -209, 304, -148, -120, -70, -425, -85, 276, 309, -243, 475, 232, -293, 354, 177, -426, -91, 83, 91, -4, 170, -319, 274, 279, 21, -22, 349, 101, 26, 323, 78, -80, 273, -25, -60, 330, -245, -119, 167, -175, -419, -83, -215, -163, -105, 195, -470, 350, 325, -144, 432, 444, -105, 36, 126, -65, 58, 369, -180, 89, 332, -319, -580, -26, -224, -667, -29, 50, -72, 44, 330, 111, 318, 218, -90, 163, 169, -329, 90, 13, -298, -298, 198, -4, -33, 112, 28, -127, 205, -25, -66, 198, 2, -113, 237, 192, -46, 18, 49, -223, -23, -21, -311, -202, 190, -361, 399, 267, -365, 47]
4991D7L02n33K86N7n11K20J17J11j73N65m98k04K19p8l33J67L31n03P44j63j92
5012b2M14l11j98J96R9k72j54j18n4O9N48k81j50K90j97K06j03k30k05O15j62
5033b0K5K53K3j24L8K5l03M45l10n20L46O1q4j51N92n03J03L34l56l8L51j90k84
5056b87M93l39p9N41p7k61O28o23n09M08R0k87J06J43p3K40P8j84M5R5j39p1K08
5079A46l69j52P16k45k21M36k22k45M18m27K56k16K06l33K91J69m34M38J40m84
5099a32M17N8o23K54p2k96M0P21l53j50L93l83j74M07j94k16O53l49qL40L6l24
5121D5M0J35m71L42j43l16J49oK74j27L8O4R2L5J52n32L66k27j34L45m34O7L41
5144I5N1MJ1L0m31n4K20k35J1K93M2L14j89j59k6K57O5l99J63j19k13L16j69j84
$$ y = [47, 349, -184, 102, 159, -352, -132, -15, 96, -77, 488, -10, -214, 5, -73, -406, -239, 92, -411, 333, 170, -22, 392, 81, -117, 79, 178, -94, -248, -366, -420, -351, 197, -84, -234, 56, -141, 65, -38, -268, -473, 142, -20, 5, 258, 281, 157, 195, 220, -83, 362, 52, -468, -122, -61, -145, -296, 296, -207, -104, 230, -126, -164, 187, -3, -287, 206, -133, -212, 329, 252, -9, 619, -4, -513, -105, -15, -302, -196, -53, -126, 114, 192, 8, 53, 148, 9, -62, 146, -223, -375, 341, 96, -125, 311, 89, -156, 262, -165, 91, -125, 81, -252, 39, 208, -226, 212, 352, -132, 285, 343, -280, -26, -98, -394, -354, 367, 14, -136, 257, -126, -300, 107, -87, -303, 350, 1, -7, 333, 369, 45, 85, 220, -251, 91, -52, -368, -219, -225, 49, -78, -40, 24, 116, 151, 303, -229, 137, -90, -224, 121, -313, -246, 95, 146, 150, 161, 191, -240, -294, -74, -309, -298, -5, 37, 351, 162, 3, -23, 234, 299, -100, 63, -56, -269, 47, -122, -306]
5168c06P79p73L26%l50Q1K30o1K89l0q1j72K73k16k31L16J37k52nL8k88N09J57
5191C70m03r2K73n6l48L1j2N8L91j51j33K52j34k26L53K0k75L32l10j66J80j67
5213b13J38j24K60l58K43K23m44K36K37l65o8N01l31k74M90o7q5J89l26j62K69
5234c1N3r6J11q7K16k31L31k89J85K14l54j47L07j72l9j9P8k76M14j47j88M91
5256C24n58J61K03J07j90Q1K26l45M57k06l71N62k48m31J96M6k15n1M10n34J42
5277b34N33m65J79J9J53p3Q5j22j01j83K56k52J94m8J87r0j62j56M3L68k87J34
5299b2j2J8O6K04k05j35J08k05PN99m67K28l19m3r7L18J30l74J49k3j01J90p3
5322e9j2L71k87j23p1M02k86nK10n6k41K07k8j98J71k82J92J4q6k75N93p5j59
$$ y = [-306, 473, -300, 26, 26, -324, -243, -13, -74, 215, 185, 104, -68, 205, -11, -242, 74, 211, -41, -46, -8, -296, 213, 370, -33, -125, 148, 92, -256, -225, -237, -179, 212, 61, -72, 180, 46, -180, 173, 193, -82, 250, -60, -226, -46, -213, -75, -199, 61, -297, -54, 169, -275, -39, 198, -167, -235, 266, -65, -339, 151, 84, -1, 188, -138, -300, -31, 22, -74, 37, -50, 166, -65, 266, -23, 162, 376, 22, -125, 182, 10, -29, -48, 30, -246, 168, 21, -167, 324, -234, -73, 130, 237, 47, 128, 354, 9, 466, 260, -111, 451, 203, -228, -32, 14, -201, -252, 158, -376, -234, 299, -166, 13, 32, 185, 112, 197, 75, -26, -209, 47, -205, -11, -59, 128, 38, -124, -280, -237, 131, -156, -22, -34, -16, 50, 254, 49, -86, 22, -183, -176, 423, -44, 184, -135, -178, -275, 43, 173, -201, -52, -75, -176, 14, -59, -71, 300, 13, -110, -181, 221, -65, -70, 140, 84, -157, 50, 22, -176, -5, -287, -95, -81, -167, -442, 151, 76, -83]
5345h3M15j86j28L40l47k15k3J56k12K69K6k54J64K18n91P1N85k88K20N6m90K96
5367aJ89j4k03N6M9k21J4k1J53r7L25n20J72J15o3o9j81J86K00r5J29l47K48p2
5391f8J41J38k58j77L11j20k70K03j7l7m3L44l39J32J98l01J52J98k03J38q7P7
5413A12q6K89m95L4L79m75K06P1j17j07J73l3rQ2M18n61J31q3k57J96Q6l9J71
5436H6K1k91m9J83M0j03L05k19j8k7K58j06k3J23j86J09j40j9j11L88l72k3L44
5459A70k45j03O3P3L20j68j65r4J64j97j5N02n31K68P6k0k35M45m21K50qn9k76
5482b06L98l80J74J28j1k19K2M6Lj16J83j69K2K16n8P1J6k11mK15j8m04L17N4
5506F9k27K06l3j04J17L1k57K3L4O6k51K16j58J56J11l7J2K02k36J08p0j8N1m2
$$ y = [-83, 332, 146, 18, 358, 11, -204, -227, -71, -283, -14, 12, -242, -78, 140, -451, -380, 205, -83, 137, 193, -297, -1, 188, 174, -29, 27, 76, -145, -131, -152, 1, -96, 229, -291, -119, -4, -67, -136, -317, -131, 69, -26, 103, -244, 4, -68, 73, 211, -47, -224, 87, -33, -303, -100, -117, -154, -197, 147, -192, -60, 138, -163, -11, 187, -16, 122, 35, 112, 26, 315, -180, -146, 233, -242, -36, 35, -82, -189, -16, -49, -58, 24, 442, -119, 12, -71, -328, -132, -46, -85, 86, 107, -184, -233, -50, -10, -113, 192, -27, -45, -72, 186, 80, 57, 180, -6, 103, -37, -56, -167, 221, -151, -174, 170, -75, -178, -115, -42, 278, 110, -55, -149, 15, -182, -197, 305, -226, 42, 118, 98, -137, 308, -113, 137, 129, 70, -206, 192, -188, -14, 114, 103, -116, -94, -48, -45, -161, 22, -147, -125, 91, 33, 104, 120, -91, -95, 120, 102, -302, 15, 69, -158, 48, 15, -89, 28, 59, -198, -175, -141, -75, -326, -110, -268, -112, -1, -38, -26, 176, -60, 48, -22, -40, 11, -31]
5530c1P8k48K87k58K34RP2o71O82M0m24L39j14j09Q5j7nL2L67m59o8M33l39o0
5554a45L53l08K41M3j12j57K31pl26J16N4j07o1J47N7k0J34Lr5j8k55L29k29j41
5578b73L53j8j2j53K15k4n7L91n06l19M46R5k73J29q3J57r6l9MJ12J6l07J7L05
5602H0j95J63K25l39Q4L35j15q1k2n2l35K12n8j20J12Q3p8L09j63l91O58j58k46
5625i2p2K42k84L00n2j13J24J75n26R2J57L29k98pk74K3L40j56j9M56l43j45J04
5648c9r2n8K46J94k17K65n5k69n0K26m82K64L93o35K96n5J28j36L25q9l94M04
5670A70l9k87L30p0n2J29j85j32J25L76k11J4j17p8J94K31m77K91k64j79K16L92
5692C77k6m14L39k20j44O2P3r7J86l12J12K73j6k38R8L5l24Q7M64l08j57M60k94
$$ y = [-31, 47, -201, 86, -172, 62, 71, 143, -528, 154, 194, -230, 109, -5, -114, -29, -46, -51, -19, 348, -111, -179, 254, -85, -145, 208, -100, 141, 184, 72, -85, 146, 139, -187, -71, -17, -124, -185, -38, 19, -1, 133, 136, 41, 23, -232, 97, -132, -273, 80, 62, 50, -103, 112, 88, 31, 422, -84, -403, 43, 138, -135, -6, -89, 68, -28, -67, -63, 49, 65, -242, -225, 80, -115, 48, 273, -66, 18, 353, 238, 157, 135, 83, -252, -40, -98, -218, -106, -23, -101, 208, 45, -346, 312, 154, -92, -164, 78, -206, 94, 42, -71, 53, 228, -298, -206, -49, 280, -18, -25, -299, -276, 64, -92, -111, 345, 2, -143, -39, -131, -189, 57, 251, 34, 299, 244, -25, -75, 151, -331, -67, 326, -309, -13, -68, 60, -76, 249, 160, -234, 170, 131, -156, 174, 104, 52, 181, -4, -136, -11, 365, 154, 168, 51, -27, 167, 398, -79, 212, -52, -231, -15, 377, 351, -63, 276, 56, -88, -26, 47, -50, 136, -176, -64, 209, 193, -45, 53, 88, -236, -149, 315, 7, -150, 310, 16]
5715A6K11ok53j53L94n2j06N1j67k3M13k25Q2J34j53l16Q4J56k07M58l97J91N6
5738A88R5n05K15K54l00J04J33j92k04L84k26l8L32l69Q9L13l78J92Q7k50p4O56
5760E06n5o19J91j06k93N19l08l5J01M49k54m4K61l49p2L15n0l28J19Q0k02L52
5782A78j75l79M78j16k46N25l03l19N45j16m22L51R2m11L4N96l65Q4j42n6L86
5803B19l30N7o1M20n89K6N08m28j5L14k24p4L53k15k96L75J90l78J19L23o25L18
5825a3K25l22J57J47l13p2K77n8k10L24k14m3J91j01j19J64J63o5R5l73o7L00
5847G3k34k3J36N1l95N37N6l90K62K41m41K28K8j00o0J55m4k40M30m18J02K47
5869B01l83MN02k45j89K08j31j70K82Q4k92K58j46O5j94K88n56M55L05m69l7L56
$$ y = [16, 227, 221, -32, -185, 209, 157, 51, 102, -65, -88, 325, 100, 182, 316, 163, -153, -69, 87, -120, 338, -59, 132, 188, 283, -222, -7, 247, -53, 51, 184, -8, -212, 172, -54, -92, 240, -129, -40, 273, -105, 87, 174, -76, -150, 506, 451, -168, 23, -83, -376, 143, -165, -200, -99, 350, 96, 52, 313, -36, -108, 207, 157, -171, -52, 28, -174, 178, 3, -376, 102, -14, -260, 265, -38, -357, 188, 72, -350, 1, 93, -318, -284, 312, -53, 31, -111, -167, 219, -111, -54, -115, 305, -284, -258, 250, -178, -193, 121, -103, -177, 176, -39, -335, 40, 230, -148, -29, 294, -331, -13, 212, -110, 47, 194, -119, -191, 86, 28, -182, 142, -72, -115, 76, -25, -144, 20, 183, 118, 213, -160, -227, 73, -161, -184, -48, 3, -392, 145, 201, -189, 73, 314, -127, 101, 129, 29, -31, 124, 80, -160, 270, -148, -46, 201, -182, -178, 324, 79, -110, 98, -33, -203, 79, 163, -129, 129, -17, 48, -146, 142, -414, 41, 346, -123, -160, 196]
5891A96m8j70N13m03k99N91n33o4L01mq1M9J1k98M71j04m94M85N0l83K89l7l10
5914b72J46N28n77K99K41l50j84L86m73J34L61k84K06PK1k77q2K19k39N44j54
5935B00m03L33Ql08K62k8l60L17J67l38P1Q2j17J32J20n1k98M45k83j76N90j72
5957A93l08K78m5m60M76j85j30M09j54k32Q8K16k13M5K17m65N09J4n82J73L28
5978A72l99Q7L68l04p5K73%m82L59M49p42K24R6n23M50J53m18J98K36k89K85L
6000A21m50L67K94n61K50O2j80r9J57m6m1L71r3m78K05J1j48N05l6n48O58R1o20
6023b08J07L72k85j91M26m62J85O31o78q5K77ml38M56m04k06O19j95o3M45l79
6044B0l09M22M7l32K20j71m9N95J9p05J14M59n09J17L36k17j80M19n86jM75l62
$$ y = [196, 148, -22, 491, 88, -211, 380, -153, -217, 84, 80, -1, 48, 59, -239, 232, 128, -366, 119, 169, -214, 75, 38, -272, -126, 402, -175, 124, 365, 15, -169, 217, -256, -122, 239, -45, 161, 168, 189, -88, -170, 49, -190, 354, 200, -203, 130, 138, -170, 92, 64, -296, 21, 188, -150, -79, 3, -114, 18, 138, 87, -211, 234, -49, -225, 365, 193, -115, 163, 118, -342, 134, -51, -181, 228, 74, -158, -70, 146, -67, -22, 195, -270, 239, 253, -329, -156, 172, -227, -140, 228, -76, -151, 122, 122, -360, -1, 448, -294, -70, 26, -497, -47, 106, -312, -114, 122, -167, 118, 121, -329, 38, 332, -229, 21, 83, -97, -196, -39, -85, -126, 245, 152, -326, -121, -110, -258, 247, 211, -337, 321, 412, -208, -101, 271, -14, -205, 221, -241, -56, 575, -103, -188, 89, 85, -253, 203, -201, -407, 212, 17, -46, 399, 20, -289, 133, 180, -152, 68, -103, -152, 443, 462, -243, -129, 330, -179, -62, 274, 57, -123, 296, -290, -291, 184, -178]
6066a78L1L81l05J65Q7j7j80M6L54o38O7M34l06Q7J08k50K11p8l22J23O91o76
6088a65J97J70n07j0K63N6J28j41j1k02O31m24l42N39K0n48M99O6o64M34K71o09
6110c49M65J82o03J49L10j46j57L89m67o0L62j07P6L98l51m32O88l30k18L82N6
6131B37n21M29l9m5m2rj00K36K09p45K56J49j18j8M26l85r6K80l57O7K94m3j78
6154a13M15l18j82M59k73l64N46r4P2P7L9l69J87j07m52M98N8l12K21K54m35J00
6176i3K41l91j9M44k43l4L64J27p90N11J96n14L21o4m06M42J77m99J6L12j87j54
6198b43L81l14J92J75k69Q5J97k66k34L68m5l81P53p17O8K58m8m4L48j82k34K25
6220G3K7l53M56k2m04QN93n29J65L27m74J54N45p69q5O03n45k60N93k88j56M78
$$ y = [-178, -147, 234, -71, 94, 181, 164, -16, 30, 384, -254, -187, 247, -59, 28, 136, -114, 97, 19, -303, -180, 511, -165, 32, 202, -305, -315, -52, 4, 132, -9, -20, -222, 409, -15, -357, 182, 202, -346, 153, 219, -445, -11, 260, -349, 116, 298, -305, -156, 154, 8, -149, 240, -227, -287, 75, -32, 44, 442, 91, -341, 347, 17, -201, 181, 237, -284, 145, 106, 61, 19, 10, -90, 146, 355, -390, -134, 15, -103, -121, 305, -80, -176, 104, -253, -186, 108, 65, -113, 302, -16, -198, 261, -12, -376, 170, 76, 148, 225, 264, -105, 82, -25, -477, 21, 79, -233, -12, 242, -193, -93, 148, -243, -262, 182, -61, -95, 269, 396, -394, 117, 313, -201, 120, 56, -350, 92, 269, -230, -214, 98, -89, -243, 138, -176, 16, 191, -78, 7, 204, -62, -296, 72, 27, -354, 399, -318, -250, 8, -40, -84, 264, 82, -152, 73, 100, -253, 203, 181, -223, -215, 378, -151, 14, 341, -133, 21, 566, -203, -288, 315, -230, -490, 103, -185, -341, 137]
6242A37j35q1M11j74m84N08j42k9q2J61j08l4K72m21k3M85k28j49L06k39j43M99
6264C07l97j6O28m90k95N84l25l98Q06k60l90K43L53o43L91L2m7qJ48n07N0K96
6286F2r1K2M11n93Q8M48l82j96M93l71m5N10l88j79O39j85n92P51l06k73L18j81
6308d0n56L97O33q55L39L35n14r8N55k85k49Q46q06nM29k49%L18k18l90N44J93
6330C24o83N08j41k08N20k72k67J13J52l34K96K07l59J46M90o34M7Q69r20j29
6350b75N67l41j75J9J63k05L87J0n16M71L1n55M72q0n92Q46O6n62J00L20l10R3
6372f6M49n08l8L73m39J1M92k30l92M91l67J4L02j15n3K55M7o15M39Q1m86M51
6394I6J20p66M91L39o07L12J96o06L83M70m13n2J03j88k39P85l02k96J79Ok10
$$ y = [137, 2, -79, 332, 158, -326, 182, 40, 11, -71, 90, -18, -52, 220, -201, -224, 261, 33, -116, 190, -49, -192, 307, -90, -106, 522, 32, -263, 321, -4, -402, 404, 144, -246, -3, 350, -293, 98, 130, 83, 75, 223, -284, -234, 62, -29, -7, 404, -189, -101, 347, -35, -231, 262, -109, -154, 356, -32, -211, 428, 243, -349, 402, 96, -177, 141, -40, -596, -199, 434, -421, -82, 253, -261, -359, 196, -89, -338, 508, -298, -303, 126, -123, -123, 195, -23, -413, 131, 324, -359, 149, 8, -200, 320, 48, -219, -106, 46, -288, 8, 215, -144, 2, 492, -142, -95, 774, -146, -275, 292, -49, -224, -205, -42, -247, 140, 150, -366, 105, 136, -419, 53, -27, -619, 227, 293, -269, -169, 151, -159, -66, 383, -125, -163, 210, -229, -218, 274, 44, -348, 143, -224, -210, 92, -23, -76, 179, 226, -389, 50, 131, -355, 96, 216, -550, -59, 280, -327, -15, 181, -425, -42, 428, 15, -37, 66, -122, -361, 424, 122, -174, 5, 11, -199]
6415a99J43J05m72L84M0l21L18q0q4JP06n22K30L21p17N3M22o53J78L82n06j97
6437d68N56jk16L87j83l18M80j19l38K47J5k56J90J0k35K44J72k93K82K58n84
6458a70L6N45p71K28L96k88P3L56l95p7K81p5l02M63q4o05O86l84l27M08L88n03
6480a21K49O9l95K64L78p08L86M13r00J88L66k21k11N37m83j14N90n28J00M77
6500C36m5p41P43j67n72N32J42o8m8O6n17L10L92l11N1N85j012J51M13m21o5M68
6522B22o55O2O18j65l22M36K4k76L95j97k94J99o4n41O76J02p47N01K72q15M31
6543a38M43n35K64ol52K50M83m43l0N89o80r2K86l4j23N8J21o22P13O1n36M26
6565A03K12o31N73K04o89K38K31k09k12M03o13L69J72j70l22P95m97j81M32j98
$$ y = [-199, -56, 49, -423, -39, 1, -320, -2, -82, -166, -165, 541, 19, 249, 570, -147, -94, 328, -325, -147, 235, -271, -468, 88, 87, -129, 258, 75, -243, 237, 118, -220, 27, 42, -214, -24, -14, -249, -5, 167, -126, 156, 414, -170, -134, 411, -360, -132, 264, -24, 49, 405, 10, -67, 214, 139, -163, 300, 216, -389, 297, -87, -414, -6, 382, -121, 128, 197, -198, 66, 444, -264, 122, 535, -365, -177, 189, -32, -243, 294, -189, -303, 287, -241, -141, 336, 291, -450, 293, 126, -446, 86, 228, 160, 112, 178, -339, -29, 363, 52, 103, 688, -324, -173, 240, -181, -246, 222, -433, -371, 247, 82, -240, 196, 220, -56, 339, 142, -152, 47, -17, -558, 118, 220, -527, -26, 246, -569, -138, 305, -230, 34, 28, -324, -74, 409, -34, -64, 525, -155, -247, 39, 5, -118, -60, 61, -561, 152, 213, -323, 103, 315, -316, 257, 461, -228, 10, 241, 32, -180, 223, -390, -21, 151, -19, -341, 454, -43, -224, 208, 10]
6585A0n47P56q8m99O38k82l75M46J82o53M84J41m19J95K59m24K29K95n57J22M60
6606C73k59l4L42m52k46O38k92l02N58l92l93O81jk34K10r5l10L67K40o07P6K66
6628A34n55K08N98p03M32L81n18l02O57m62Q7M17l89l76O28k12k06L71J78n46
6648a78K56J00o50K89L95l80K33J42m02J51K12n09P9N53n74K86K34m74M7L43N3
6669B06o42Q14l4m34M90l57n5L62l02l02J80M44p81K77L17n15R4N56o57K37M69
6690C67o62p6M86n10J63N03n51J7O37m50j92M48j47m11N15j6n78M90nl85L71K72
6712B86o89L12N30j073O52M67p50q0R17n95j4J03l26J53L12k12k53L81j34l09
6732c22N66L16q80N32ml77L34K80n69K45J38k45jN05o92J74L07m31l79O37j85
$$ y = [10, -537, 219, 131, -368, 270, -12, -387, 59, 241, -412, 72, 213, -206, -11, 248, -176, 53, 348, -209, -87, 373, 114, 80, 422, -30, -276, 362, 70, -232, 326, -66, -459, 222, 221, -13, 197, 102, -208, 159, 399, -208, -132, 134, -421, -213, 385, -318, 114, 495, -23, -325, 332, -130, -43, 374, -15, -391, 237, 25, -181, 190, 368, -178, 78, 178, -472, -183, 212, -168, 65, 207, -195, -44, 168, -341, -262, 291, -283, 3, 237, -237, -190, 153, 206, -436, 378, 344, -90, 400, 43, -12, 350, 48, -254, -74, 370, -411, -134, 183, -332, -238, 318, -339, -102, 367, -295, -371, 115, -395, -232, 271, -280, -263, 374, -76, -268, 180, 33, -378, 137, 121, -457, 33, 28, -357, 14, 286, -403, -91, 439, -634, 18, 485, -265, -345, 572, -23, -37, 66, -260, -107, 205, -7, -260, 121, -13, -322, 244, 560, -320, 212, 208, -169, 165, 445, -124, 121, 259, 14, 13, 518, -174, 0, 307, -124, -503, 134, -51]
6753e1n12R56k83k51O57m56l86K01J26n21N00m4m27L85K44n21L51L22n00j20N66
6774B36l30%O02n54k11O83m80M7Q6j06l56M31j06j97M31k70n4K59Jj97j5K70p17
6797e47P57K18q24N06J47m36J95J91l82j22N56m78lO11o87J39N01l05k52L15k17
6818a17m17Q06J36o54M82Pl48R8J22k74J97K21m65J24M77q35J96K85j99o4L13
6839I1j05j19M41j81n03P83l00p12O63J5k30J80K44n75L11L72o81M33K4k10J86
6860A27L41p64k4R21p25J37N13l04n44Q74l75m31M07j43k36N80j73o15N09j39
6880f4l12N40R9o55J21K47k94J66K73l54J34L10l11lL57l60J5L98m96o9P86l13
6902B15o48O30l72k43N52J99p17K92K63o88O94n1m01J89M58r89P17L23n90K71
$$ y = [-51, -563, 393, 110, -141, 516, 60, -326, -125, 1, -520, -20, -64, -491, -106, 138, -383, -32, 290, -210, -330, 236, -94, -94, 508, -46, -257, 426, -54, -7, 79, -27, -383, 48, -58, -255, 176, -94, -148, 111, 112, -85, -100, 170, -547, 210, 428, -396, 110, 257, -179, 16, 207, -175, -297, 259, -219, -222, 389, -298, -159, 342, 37, -215, 100, -117, -534, 272, 408, -246, 236, 243, -105, -7, 115, -159, 38, 259, -206, -82, 395, -440, -244, 41, -158, -222, 91, -14, -133, 308, 127, -376, 407, 107, -605, 58, 73, -157, 23, 267, -308, 3, 375, -306, 127, 151, -59, 127, 468, -296, -320, 601, -124, 13, 526, 222, -322, 552, 177, -254, 153, 10, -226, 354, 181, -434, 75, -64, -376, 164, 263, -392, -271, -24, -318, -152, 121, -233, -99, 211, -100, -103, 254, -106, -91, 307, -189, -258, 528, 215, -433, 197, -175, -418, 134, 333, -384, -92, 171, -517, 177, 126, -275, -86, 372, -617, 100, 423, -167, 104]
6922A04J47k38l64P00k98k67N67k23m23M46k38k31O49k86n59M51J91m93K23M13
6942B71l79J30M57o31k13P72p38L61J72l25J02K25l43l22R08m96j83L47M9m61
6962b97M43j55k68M99p4l24R0M01n73K73K58n64L66K49o67J17M60o13K59M81o70
6983c09J53P97p57j96P16m03l25O01l48l32P87j70n93J30O30n91J86M68o65J36
7003h5M67l86r6L70q53N17L19m70Q6M89o12n6P07m15J28J48k04l20N76l7o33K81
7025g9K15m95M42Q4m36K31L49m86N8L42n55j18O73k86LL09p18Q2O29m42JK99l7
7048F5o80O16L11n99N24K51p98N24J44p92L89L43m62L13K99o37NM44o20K85M26
7069C51n90k44O36J35m65M87q4m84N40Rn81M57J56o26N49O8r14O08K74m99j4M87
$$ y = [104, 251, 13, -351, 349, 51, -216, 351, 128, -295, 151, -87, -318, 331, 45, -514, -63, 128, -365, -142, 271, -108, 22, 479, -152, -365, 407, -331, 30, 202, -123, -21, 204, -139, -461, 447, -49, -232, 115, 164, -297, 146, -9, -277, 222, 148, -176, -86, 315, -258, 15, 273, -291, 75, 324, -343, -226, 234, -379, -120, 361, -309, -156, 641, -116, -312, 404, 1, -324, 277, -71, -403, 384, 214, -379, -249, 381, -210, -24, 444, -221, -85, 382, -4, -100, 270, -583, -66, 253, -217, -131, 358, -254, -310, 397, -18, 110, 258, 54, -266, 310, 273, -360, -79, 136, -359, 83, 167, -269, -38, 311, -175, -117, 225, -330, -448, 225, -61, -58, 251, -467, -385, 244, -198, -197, 102, 65, -615, 1, 312, -287, 237, 488, -310, 214, 358, -434, -45, 298, -164, 149, 448, -189, -184, 260, -360, -75, 351, -239, -483, 153, 288, -177, 310, 226, -258, 282, 291, -290, 167, 323, -303, 246, 314, -600, 8, 282, -217, -231, 256]
7091B56n33J09O00p49J97M00l15j46O96n38j69O24m67j25L72m5o64O41j86l95
7111d37N41K16p24N13K68o03M54r2l88J91L43l41j79L56l17oN99l94k17K51J18
7132A52m82L12J14m20N63m2n16L83kj45K6L54n58K00L2k21J55M45n39J21J16j74
7154a26q7L75M4l41M38o17j51P60k27k11K69l0k32K78Q4o29M55L20o72L88L7l82
7176b57K98K40l87j37N63n55mN72m34l03P27m37k16N39j68k29L11K5m00K57J52
7197A57o25M40K50m44Q4N46m42K21r0l19J86N96q87pP60n59j89O03l02k57N99
7218C21l00l26N42n4l51K71J9o82O78L08o20J60m0k58L80L44o09J87J67l03j93
7239c59L81l63O8M56j64j75L12k15j01M82m35j80N84k52j57J66L1l81M41K23q99
$$ y = [256, -277, -168, 432, -317, -120, 280, -35, -181, 515, -23, -192, 432, -35, -160, 212, 167, -497, 144, -42, -437, 104, 320, -404, 109, 377, -226, 228, 136, -252, -61, 282, -59, -238, 118, -199, -205, 394, 0, -217, 34, 152, -330, -18, 96, -324, 239, 197, -319, 64, 62, -83, -57, 297, -261, -61, -29, -250, -95, 350, -189, -68, 48, -126, -213, 162, 206, -135, 303, -314, -465, 295, 68, -143, 126, 96, -136, 142, 226, -403, 52, 372, -300, 88, 125, -257, 41, 281, -106, -243, 320, -235, -239, 333, -101, -404, 323, -114, -330, 209, 41, -188, 123, 148, -252, 5, 157, -468, -28, 222, -222, -138, 408, -34, 187, 97, -222, -36, 560, -327, -334, 426, -133, -322, 281, -21, -278, 321, 21, -305, 237, 183, -168, 103, 122, -560, 118, 426, -194, -34, -74, -332, 48, 392, -217, -30, 137, -166, -359, 22, -341, -273, 183, 19, -156, 156, -59, -160, 322, -113, -293, 291, 39, -118, 48, 79, -302, 139, 362, -537]
7260e37N98J90p74N69Q2k39K08N18n22j14K67l94j66P32m21k23M26j23n54O79
7280B02n5m55L28K90p05P61J09n95j8K98k73N0K88n96K76J02l91j19N95j49MK53
7302B00m77K91M16m89m42Q95l69m06P21j22p38P00O8o29O78R0p16L59L5j43J67
7323H9K90n85K50L56m63M8K85m14n4L26k85P5M05k01l37L44M3o80Q55k24p82O27
7345c2K24l59K5N11n37M01m3k81RL04l74j75N51l56p4L94j66k69N56j52k51M41
7367C47j99k96M57j27m76M20j71k82N00J21n83L25K65k81K9L75m18j33L33k79
7387g3j99P37n12l30O41l18o5K09R6n60O77o3r31R70j22o43N70J2o38L55N03p32
7409d16L98J52k95j09O09n02j78O27j26j31L31l49k3K01j09n02M43j72j02N38
$$ y = [-537, 61, 251, -523, 46, 128, -111, 97, 615, 93, -21, 246, -148, -314, 418, -3, -226, 200, 77, -477, 202, 147, -308, 20, 310, -395, 366, 475, -120, -138, 160, -113, -63, 225, -371, -95, 7, -384, -503, 92, -57, -53, 200, -277, 14, 430, -59, -501, 394, 25, -381, 340, 218, -520, 180, 248, -381, 297, 387, -329, 30, 65, -78, 89, 379, -206, 44, 400, -63, -15, 270, -144, -198, 128, -157, -82, 323, 122, -215, 129, 172, -508, 347, 123, -659, -32, 192, -167, -142, 369, -168, 233, 190, -91, -82, 222, -152, -327, 224, -132, -206, 188, 22, -247, 309, 157, -94, 347, 148, -148, 309, 182, -294, 126, -45, -327, 173, 294, -289, 36, 301, 20, 49, 424, 6, -127, 206, -73, -272, 465, -47, -377, 264, -54, -119, 90, 186, -374, 303, 240, -691, 279, 157, -486, 84, 96, -542, -187, 316, -416, -18, 134, -161, -270, 339, -163, -341, 286, 160, 29, 360, 11, -12, 189, 80, -422, 21, -151, -253, 285]
7429B85K0p47L16K94m25K90K37m14J13K40o28N28m7j98qM98k49n9K50k73J3J47
7451A83k12l05K77N3k69M41Op21O92r8O0O7O8o90O10L20n48l26P83q64L09M52
7473B88m29k5N88q09K97M74k82m33N77k60q1J08J72n37M52J6k76K09J46k94j11
7494b10M66o26L07K97l42Q0J53j16j15K58k17j74M68l89k26O82k31j61J82j12
7514b6j96K26J62m28N32K4l44RL83m79J6K5N1M8J84l07J3J39o1j55O69l54l97
7537b66L95J57r52Q65n9n79N49m8m68M59l1k89K38J76n46L31K37n62L25J67j65
7558f6k20N00l94j87P81m41k62N44k97m1Q2j55m3L37j06o25O05O0k97J51K03l77
7580b48R1M65n41M12J04n31r0O21m55P9K61m7k57M23k46j27J93l13J08K07m9o2
$$ y = [285, 305, -442, -126, 168, -257, 33, 270, -144, -31, 209, -419, 109, 62, -136, -144, 354, 105, 46, 296, 23, 36, 183, -29, -334, -57, -4, -273, 168, 174, -547, 145, 47, 107, 174, 242, -448, 162, 482, -66, -392, 391, -473, -164, 288, -141, -166, 422, -387, -90, 384, 102, -331, 246, -14, -95, 13, 185, -352, 100, 116, -160, 49, 195, -99, -210, 256, -370, -63, 234, -108, -28, 125, 9, -106, 152, -65, -239, 229, -160, -386, 296, 65, -96, 86, -26, -222, 4, 166, -262, 270, 294, -50, -41, 342, -137, -121, -96, -45, 3, 187, -120, -107, 32, -29, -184, 485, 131, -266, 129, 286, -666, 199, 140, -439, 110, 62, -406, 53, 22, -267, -29, 147, -399, -68, 169, -393, -68, 99, -66, -286, 214, -180, -367, 414, -27, -289, 255, -42, -83, -1, -156, -199, 138, 32, -593, 12, 72, -225, -74, 129, -248, -157, 308, -233, 179, 283, -248, -338, 283, -172, -93, 168, 121, -136, 287, 41, -86, 107, -206, -98, 109, 60, -2]
7602bj7K02l43K79K39p88J92M23k10n2N95n83K23J65k13l79O04n66j76O73n14
7623b48n1M32j36k65N05Q1n48Q9M84q97O18%l71J98N05o29nN11l30r1M10k46j61
7646a45M66n78p5M70o7k09N56l82k38L85j38k39M34Q4o58M66l33j63L94Q0j56
7667d6J11o9j95K46L34o52L18J2j65j56M40k26l13L85J86l18J79N6m98L53l6l73
7689d27M97P6m24M61N0m56J58K46j15r1N63m23k67M57n33p1M95k20p1K05q7k57
7711b34M54m7m80N57R2m77K55K1k30K88R2n34L82J4m75M12Pl01J0M06j70o1L69
7734C50m09j90L34j24n1M83k00n59O58j82n30M96j85Q5k9K58n90M79J80l80q5
7755a91M45n36M55K88q54K42R9k62Q4M55k70J36K20k66k31M08l09rK78j29k34
$$ y = [-2, -19, 183, -160, 119, 358, -430, -238, 185, -25, -77, 518, -65, 158, 323, 110, -269, 335, -231, -407, 266, -248, -299, 133, -3, -268, 237, 318, -230, -141, 343, -554, 64, 64, -307, -109, 396, -233, -238, 273, -57, -148, 262, 16, -145, 321, -257, -332, 138, 71, -138, 418, 36, -202, 183, 45, -194, 240, 324, -334, 132, -201, -364, 30, 110, -46, 65, -4, -199, 47, 381, -271, 47, 59, -106, -262, 178, -48, -361, 24, 210, -108, 71, 127, -371, -18, -54, -427, 70, 146, -278, 183, 233, -223, -65, 181, 66, -25, 538, 115, -152, 305, -228, -299, 196, -24, -95, 110, 23, -234, 220, 173, -307, 250, 342, -135, 120, 141, -89, 199, 291, -243, 139, 153, -322, 90, 97, -204, -194, 212, 42, -19, 350, -59, -249, 85, -39, -90, 393, 193, -366, 292, 110, -420, 76, -109, -24, -53, 205, -385, 94, 274, -106, -191, 254, -282, 173, 461, -393, -151, -52, -314, -230, 225, -45, 91, 311, 45, -186, 222, -87, -96, 182, 53, -181]
7776a81M46j43k33K46M94p78J21L94n16L9M22l02R6K06n27J49K07K7p04Q56l94
7797g5PO7j57n7L76k43m34P77j80l90L42K04m54K65L45m93k3K54k19K77J06n53
7819b58J89L44l03j13M83l62n1K33l8p06O06j2l20M75j14l36N18km12L11n8l93
7841c19L66j0j69j22N68k75j68L80k27l95N31l72lL72n65L90J89o4m63M27M3l62
7863b48M13no25N50K38m92L17Q0l35P1M53n67L03q7%r3L5n9m95O44k88p3L90j00
7887B7l88L10K77m35K69K12n19K90J40m74J87J59k47J48L26l42K6N36n23j53L71
7908A97m16K8J58j08j55M70j28l25N50j77m71O09k0o60P28N5n76M47J73l31q3
7929c5L80m58K36Q9n69K12L68m26O7M40k85m7K24l36m65P49l30mL61r6l25P00
$$ y = [-181, 265, 122, -111, 135, 629, -149, -28, 366, -150, -111, 311, 9, 105, 311, -216, -67, 140, 167, -537, 319, -75, -68, -1, -158, -215, 161, -82, -516, 261, 81, -309, 33, 237, -217, 48, 393, -100, -123, 131, -88, 189, 295, -258, -69, 275, -28, -141, 342, -20, -71, 162, 124, -582, 24, 12, -308, 167, 53, -283, 235, 233, -179, 132, 74, -319, 47, 37, -132, -254, 314, 39, -129, 251, 24, -371, 160, -212, -215, 157, -408, -18, 171, 107, -356, 71, 114, -248, 165, 160, -465, 85, 323, -169, 148, 228, -107, -36, 417, -150, 153, 66, 66, -27, 8, -51, -546, 98, -190, -263, 127, 27, -361, -51, 226, -209, 60, 272, -247, 43, 183, -291, -104, 55, -192, -44, 282, -60, -34, 502, -21, -174, 197, -219, -191, -33, -141, -296, 174, 46, -279, 271, 94, -377, 232, 212, -448, 280, 335, -241, 206, 379, 48, -35, 345, -113, 123, 212, -357, -145, 223, -203, -136, 304, 19, -28, 196, -140, -605, 144, -186, -190, 171, 75, -250, 450]
7951D50m33k0J18J33n80M52J11k84L7N13o78n8N19l91j49N46k85j72L47l63l3
7972b20M57m9l01L10k04n47M38K85o04N10Q1n88K98N20m95j18L69k6k13M38l18
7993B3j80L22r6m24M19P5l04K19R8k49J81k27j45L80j3n25L26L90q14N71j27k56
8015c56K29O04p28M55J51n39J41J67n1j78O22o62J63J64j37l64L14j03l28N10
8035G4o0j16J95K98m37K63K5m94J81K63o19L73K24j83j50K18j73m4M25k88k81
8056c06Q69p85O1L67k79J02K9R2j90J92Rk72L39K1n34M00P1l06K19L36o59k5M27
8079A78l84O6M25k64k16N93m74k47M94j26j89M51p4n95O14l00k13O29k51k00J49
8100F6K81n08JN26n37R5L98n44J4P40p16mP34n68k0J50j06k69L51O4l35M71k42
$$ y = [450, 17, -3, 115, 248, -332, 120, 231, -53, -16, 497, -181, -239, 280, -111, -260, 286, 1, -171, 176, -187, -220, 237, 188, -113, 197, -7, -554, -116, 169, -435, 75, 156, -432, -134, 386, -109, -227, 142, 116, -97, 341, 23, -157, 165, 69, -355, 64, 139, -165, 54, 152, -97, 84, -143, -288, 92, 79, -446, -120, 270, -544, 27, -100, -356, -127, 477, -251, 204, 355, -184, -43, 124, 73, -105, 517, -145, 18, 182, 45, -319, -5, -108, -436, 74, 14, -102, 93, 391, -46, 217, 242, -252, -71, 192, -427, -54, 170, -13, -163, 55, -118, -162, 263, -25, -306, 563, -222, -161, 206, -73, 29, 58, 150, -40, 152, 161, -111, 228, 249, -285, 115, 186, -120, 99, 435, -224, -249, 178, -206, -140, 285, 21, -195, 398, -76, -323, 171, 45, -144, 307, 233, -362, 252, -48, -261, 368, 117, -83, 66, 347, -161, -160, 366, -171, -76, 322, -222, -208, 532, -184, -188, 546, -22, -42, 108, 2, -267, 84, 148, -187, 284, 42]
8123D2n33Q84l02o54O30P1m68M43J33o01L11N92o43k1L30n36J84K59l78J1M23
8144A77k65k75O33l18k35O09k74k55M50k19l55L39J25l68J98L52n70L43K21n75
8164b62J37M39m92o5N21l32j40M98l51l68O56j2o35N61J09p13M68K43l08J05J92
8185B51n58O17R3r25N22L06
$$ y = [42, -491, 393, 91, -563, 67, 138, -330, 113, 246, -355, -44, 548, -95, -116, 214, -322, -138, 121, -257, -246, 177, -88, -363, 270, -48, -283, 326, 52, -203, 247, 28, -327, 12, 137, -231, -33, 319, -251, 92, 313, -262, -125, 314, -178, -243, 278, -54, -194, 304, -47, -415, 241, 229, -406, 155, 264, -449, 19, 262, -46, 59, 251, -307, 310, 403, -522, 0, 306]
8191C06
$$ Imaginary data points
##PAGE= N=2
##DATA TABLE= (X++(I..I)), XYDATA
0@%%%%%%%%%%%%%qJ6j6J6j6K4l2L4m2N0n8P2q3R3j08J25j43J65j88K13k42K73
35A45l08L45l85M30m80N34n92O58p29Q04q89R83j084J193j313J446j593J756j939
54a018K142k372K636k937L286l699M193m801N571o571P936r916J3042j8702L1994
69B0784j16920l4271L09922j11016k9881K37879j15931j55468J83654j29620k04602
80a45470J70607n1071k07512J97240L9314j90274J77036R8411k02539J30692J21772
91A38206k10847P8785J55713k08144K8035J82104j90408l3172J93205j64658q0395
102a11576J99788j22382j10278K13910p1641j39256K10501k2618j74085J84680
112E7043K2084j92751J55566O7435j99219J24132J05960k10936P3033J30584k16133
$$ y = [0, 0, 0, 0, 0, 0, 0, 0, 0, 0, 0, 0, 0, 0, -8, 8, -8, 8, -8, 16, -16, 18, -24, 26, -32, 40, -43, 50, -58, 67, -76, 89, -99, 114, -128, 145, -163, 182, -203, 227, -253, 281, -311, 347, -382, 422, -467, 516, -568, 625, -688, 758, -835, 921, -1018, 1124, -1248, 1388, -1549, 1737, -1962, 2231, -2570, 3001, -3570, 4366, -5550, 7492, -11210, 20784, -96136, -130407, 179515, 68499, 38618, 276497, 160566, 5098, 188752, 59132, -145470, 25137, -25934, -233446, -36206, 3108, -187166, -10130, 88281, -114258, 16434, 138206, -72641, 6144, 161857, -46287, -18252, 163852, -26556, -59728, 133477, -31181, -111576, 88212, -34170, -144448, 69462, -2179, -141435, 69066, 46448, -127637, 57043, 79127, -113624, 41942, 109377, -89842, 34290, 140250, -70686, 2347, 132931, -83202]
123h3202J5779J58713j88914j6035J96107j39776l9387K18127j07927q9644K06668
134A30509q9159j49288J85019m6594j72527J78526J8017j69746J67793O4248j88137
145g1339J21423Q2450k18915N9541J08366k10569K6783J57300j62714J3716J98906
156A04948j25539k3651K03901j13853q7461J85255r4338j37501J70326n2346j59580
167a29839J59953n959j73188J43842L9307j81341J23991R1762j72736R9828J36055
178A31675j61319N6129J49434j67636p322J45177j71019o2633J55942j37117q8003
189a56692J82134p5321r8049J95282k5661j19682J80895M326j53394J49644L2567
200A16049j80053J11302O5134j90311P1160R4233j85758L7854J26055j66079J2340
$$ y = [-83202, -67423, 91290, -97624, -113659, 82448, -57328, -96715, 121412, 13485, -76159, 130509, 41350, -107938, 77081, 30487, -142040, 36486, 54503, -115243, 52550, 116798, -71339, 50084, 132534, -86381, -26840, 81526, -129043, -102260, 55040, -107674, -93958, 104948, -20591, -44242, 159659, 45806, -41655, 143600, 49262, -88239, 82087, 29741, -129839, 30114, 24155, -149033, -5191, 34116, -147225, -23234, 68528, -104208, -4380, 131675, -29644, 26485, 175919, 8283, 961, 146138, -24881, -87514, 68428, -68689, -156692, 25442, -49879, -147928, 47354, 21693, -97989, 82906, 87232, -66162, 83482, 116049, -64004, 47298, 112432, -77879, -6719, 87514, -98244, -60390, 65665, -100414, -88074]
211h8074J62164j34479j8559J83435j05485o1450J77045q3394j03496J62952n4583
222C6076j30306J56184j2790j47293J41761K6895j64596J08402N5938j73762P5114
233b8377Q8601j63113N4463J28809j41512K7689J55403j27474j9726J54426j18567
244A0622o9635J47251r5678r8729J53247n3009j13290J58165p579j30789J41568
255D2144K5176j49577J11006N2443j59908Q3024Q4074j57788N4831J14441j49615
266d9749J7888J32867j36713k2117J42187j15952n4251J51339q6192p9480J58494
277E8321m9622j02376J54402j2562j22759J35390J8401j41101J07064M1670j56032
288f9204P5539O5879j59394M5990R7449j44235K2149J28035j17966j510J45991
$$ y = [-88074, 74090, -60389, -78948, 104487, -998, -62448, 114597, 31203, -72293, 90659, 36076, -94230, 61954, 49164, -98129, 43632, 70527, -94069, 14333, 70271, -103491, -28377, 60224, -102889, -48426, 80383, -61129, -33440, 121963, -5511, -25237, 129189, 10622, -59013, 88238, -7440, -106169, 47078, -5931, -119221, 38944, 31365, -99424, 42144, 67320, -82257, 28749, 81192, -78716, 4308, 88382, -69406, -14575, 99866, -49749, -31861, 101006, -35707, -57824, 84363, -31589, -85840, 65499, -20693, -100173, 58321, 8699, -93677, 60725, 48163, -74596, 60794, 79195, -61906, 45158, 86828, -69204, 6335, 72214, -87180, -41190, 56259, -87976, -65827, 62208, -55758, -57268, 88723]
299H8723r6144l4088J47844q1237p3137J39766o0164j05830J29401k8750j23046
310i6662J19614O736j31124J06312M1138j36151Q6393P2728j37259N8522R8162
321H8409j31705K6484J14435j21934o916J25581j09206m0116J32706q8135p0079
332h0476J35119n7862r1702J33243k4072j06000J26763Q230j19230J10709L6851
343G1573j32025Q3283O0624j38323N1619Q1351j34161K4207J01706j20909r94
354e2049J20253j02155k8672J31057p9139n5859J32425n3327p8935J26445k7683
365C2361r9160J14711k442j17108R7973K5152j26219P7869N3968j25799N5693
376a3001P8344j20543L1045R6579j13138L070J11305r8520k4496J22113p6795
$$ y = [88723, -7421, -41509, 106335, 25098, -48039, 91727, 31563, -74267, 55134, 26384, -96662, 22952, 29688, -101436, 4876, 46014, -90137, -3744, 68984, -68275, -9753, 88409, -43296, -16812, 97623, -24311, -31227, 94354, -14852, -54968, 77738, -10397, -80476, 54643, -3219, -94921, 38322, 14250, -91750, 35013, 43243, -75987, 34722, 71573, -60452, 22831, 83455, -54868, -3249, 78102, -56059, -31852, 69854, -51055, -52049, 68204, -33951, -62623, 68434, -10705, -66564, 65861, 12534, -66401, 60044, 32361, -66799, 47912, 45470, -71638, 26335, 51487, -74732, 3137, 57105, -68694, -13001, 65343, -55200, -24155, 72424, -40714, -37644, 73661, -24859, -49355, 72758, -4037]
387d037m9781J24317n6069p5013J17626l5611r8489J08030p666j10576R9614K6453
399C8798j13291Q5355N5130j16645O0146P1604j21587K8912Q6235j16152J829
410c9666J04232r7851k0449J17064p6881m4199J17890n8445o9309J14651l4983
421A2054q7226J10638l682r7476R9686K2774j08132P7642L9959j17913N2192N8339
433E8855j17696L0355Q1644j05002J0346J00362q9162j3569J08723p4254l7982
444d7380J10836n6188o0690J09968l4111q1189J02224j2113r6955Q8793J1534
455C4729j05178P6529L8149j06158O1174O1862j06185L6594P7104j05153Q684
466b7849Q8487r4602j2718J03042p4667l0110J12082n5272n5127J06713m0043
$$ y = [-4037, -53818, 70499, 14430, -60583, 57043, 21432, -77057, 30973, 23307, -87269, 12345, 38798, -74493, 10862, 65992, -50653, 9493, 81097, -40490, -11578, 74657, -41495, -39666, 64566, -33285, -53734, 63330, -13551, -57750, 60140, 1695, -67614, 47037, 12054, -75172, 35466, 31784, -65692, 33994, 56768, -51364, 26278, 66237, -51676, 516, 58855, -58841, -28486, 53158, -51844, -41498, 58864, -30298, -43867, 64856, -9398, -47380, 63456, 7268, -53422, 56546, 22435, -58754, 43470, 31357, -65598, 23195, 34729, -70449, 6080, 44229, -61929, -755, 61107, -45078, -8484, 68620, -36533, -27849, 60638, -33964, -46682, 56360, -18307, -48417, 63665, 8393, -46734, 59979, 19936]
477A9936q0128R5731j8189r2184R0735J2013r4120Q3317L8399j00282O0286N2409
489F7923j08669K9960O5210j04574J0832Q5091q6407k234J01789o8714k5281J03441
501F8367n7563n3459R6113m1481p3244R3009j6688q1168Q9306R238q9769P5416
513A8077K8997r9126N5071M6589j00331L6840O6414r3352J8966Q2292q4859m304
525b8726R0852p4638k8117R6456n8451m7227R7900l8402o4450R3159k0037q0373
537f2054Q4631J533q9840P5019K7697r1540O3322M8933r2768M0769O0838r6645
549c0105J4674P0360r0736n444Q5360p2001j9999R6786n3286l8827R5219l9994
561A2007o0945Q7487k2882p4743Q3449L084q0011P6075K4701q7426N5678L6511
$$ y = [19936, -60192, 35539, 17350, -74834, 15901, 27914, -66206, 17111, 55510, -44772, 15514, 67923, -40746, -10786, 54424, -50150, -39318, 45773, -40634, -42868, 58921, -9793, -35074, 68367, 10804, -42655, 53458, 11977, -61267, 31742, 15054, -66114, 23192, 32430, -57339, 18077, 47074, -52052, 3019, 49608, -50723, -13883, 52531, -40821, -21855, 60437, -24422, -28726, 62126, -12512, -40629, 55827, -2624, -49851, 48049, 9647, -54803, 38356, 18319, -62054, 22577, 24110, -65730, 9289, 36986, -54554, 8768, 57701, -35067, 5702, 66540, -30105, -15431, 54929, -35807, -41251, 44109, -27892, -47891, 48895, -4391, -43218, 52001, 12007, -48938, 38549, 15667, -59076, 24373, 27457, -52554, 23521, 48222, -39204, 16474, 52985]
573E2985r6550L2561M9715r3694J8260P2268p6759P599R0087o2416j3063R0089
585G1082n6618m1601Q2909m8006o2050Q1132k5658p0748Q2199J163p5723P5119
597A3200K2292q2502O0091L8841q7522M1836N3732q7615K1269O5295q3843j487
609b6413P3973p4549j9257Q3113n7769l2507R0707l7719m7312Q9309k0558o4320
621d3302P9503n079p6704O8464J3666q2339N7169L2981q5547M0399M7057q5927
633c9659J9923O0185p9259M780P4067o5089q692Q3850n1923k8565Q3304m2393
645A0529m9984P7345k7742o2822P5557n233o7572P0967J4997p5155N7023K7424
657D5334q4763L6706L9794q5382K2180N8084p4134J2117P5352o1751m013Q1096
$$ y = [52985, -43565, -11004, 38711, -54983, -36723, 35545, -41214, -33615, 56472, -5944, -19007, 71082, 14464, -27137, 55772, 7766, -54284, 26848, 1190, -69558, 12641, 13804, -61919, 13200, 35492, -47010, 13081, 51922, -35600, 6236, 59968, -27647, -6378, 58917, -24926, -26413, 47560, -26989, -46246, 36867, -20902, -53409, 37298, -421, -47733, 41576, 21018, -43302, 36201, 31122, -45582, 22882, 36548, -45791, 11378, 44359, -41188, -789, 46268, -39659, -19736, 40449, -38810, -34030, 40037, -25052, -33744, 50106, -1817, -30382, 52922, 10529, -39455, 37890, 10148, -52674, 22883, 17650, -49922, 21045, 36042, -39113, 17910, 45334, -39429, -2723, 37071, -48311, -26131, 31953, -42181, -30064, 45288, -16463, -20476, 60620]
669F0620n4638k7280P8296m6194m8100P4966l1019o0908P3078j1304o7951O8449
681H015R981p3288O0564K9381p4694M7824M5071p5163K9011N4692p7127O351O0112
694E0730p3293j3392O7868n9576k5484P7973l9671l4650Q1816k1744m7549P7008
706D0036q281o2120O5587M625p3334N1725J8703p8952L7938L3692p7822K4983
718b3220N0355p0767J4569O5820n9500K72P4894n0634j9508P4058m4357l9982
730b8000P0052l3044n4372O8128j4593o1517O5304N365o7103N6977K1811p1730
742d2722M3904L6216p3054K9886N0746o9478J5139O1300o3698l542O6242n7721
754f782k1875O7640m6964l6999P0076l0197m6822P1194j1203n4614O6903N216
$$ y = [60620, 5982, -21298, 56998, 10804, -37296, 37670, 6651, -54257, 18821, 7517, -60434, 8015, 17996, -55292, 5272, 34653, -40041, 7783, 52854, -22309, 6702, 61394, -15733, -9382, 50730, -22563, -35955, 31913, -27663, -53147, 24826, -14845, -49495, 32321, 10577, -36972, 40036, 31755, -30365, 35222, 39847, -33487, 18238, 36941, -42011, -4073, 29619, -48203, -23220, 27135, -43632, -29063, 36757, -22743, -22471, 52423, 1789, -17719, 56339, 11982, -28000, 42052, 9008, -45364, 22764, 8171, -53346, 11958, 17323, -49780, 7197, 29008, -42722, 1182, 37398, -35656, -5770, 44976, -24502, -9363, 51937, -11761, -15303, 50939, -6782, -28657, 38983, -7981, -44980, 25096, -5101, -51923, 19271, 8068, -46546, 20357, 25573]
766B5573o2545N6176J8264o8319M2298L1240p1749K7847M3387o9708J2533N4057
778C9054o3955k769O1796n3787j6773O8005m2028k9029P0908k7577m1422O9660
790C2083j2373n2184O3103Q11o2041N2284J2410o9644L8995K5718p2276K7909
802a5205M0954o7345J7585N5907n8205N442O5857n0274j1013O7862m3926k9726
814b2087O5424l5241m5489O2749k0720n4676O0743j642n8763N6572J5987o1469
826c8612M6683K9484o4409L1789L9571o6079J5933M8316o2491J158N6537n3985
838a6105j2931O2856m3364k6529O4475l0587l8446O3540j6995m7055O1189r04
850A9144n3604N5066J3528o0068M3303K3969o5792K7895L2949o7415J4103M3870
$$ y = [25573, -36972, 19204, 37468, -30851, 11447, 42687, -29062, -1215, 42172, -27536, -15003, 39054, -24901, -27670, 34126, -19661, -36434, 31571, -10457, -39486, 31422, 3845, -37577, 32083, 19710, -32474, 30629, 31440, -30601, 21683, 34093, -35551, 3444, 29162, -43114, -15205, 25749, -41596, -24011, 31896, -26309, -20867, 44990, -5284, -16297, 51565, 7639, -22087, 43337, 8096, -37393, 25356, 4636, -50040, 10703, 9061, -49702, 6870, 22857, -38612, 8071, 37555, -26854, 4935, 44506, -21573, -5640, 42676, -19815, -18657, 37880, -16105, -29036, 33820, -9544, -36073, 28402, -2185, -40631, 22909, 5914, -41141, 20048, 19144, -34460, 20606, 34134, -25934, 17369, 41338, -24454, 3441, 36390, -31025, -16922, 26948]
862B6948o2135L626N5720n0845o252O5546l9225j8780O7806k9294l3706O3542
874D2951k0756m9139N6109j0026n9131M9440N050o2221M3668K2540o1280L5780
886g015L7454n9386K2787M6842n7783O883N3215n3222p951N8148m4174k0658O1124
899C6264l3557l4174N9676k2322m5756N5575r273n2675N1650P962n4357M6924
911E937K3434n5625L6228L3911n9090K0163L9545o0530L625M5755n5094q496N4207
924B3970m3737j7486O1008l0403k7451O2749j8409l8853N8549p509m9723N0938
936B3643K859n7113M1731J4735o0734L2228K8303n9985K2921M0224n5885J0875
948a6198M9612n0535k868N5522m3586j5437N8683l3663k7740N9688k2514l8870
$$ y = [26948, -35187, -31561, 24159, -26686, -32938, 32608, -6617, -25397, 42409, 13115, -20591, 42951, 22195, -26944, 29165, 19139, -39992, 9448, 14498, -47723, -4055, 18485, -42795, -7015, 30439, -28947, -6160, 40682, -17101, -10218, 42997, -10225, -18176, 39972, -4202, -24860, 36264, 2707, -31467, 28209, 5887, -39869, 15706, 6433, -46242, 5408, 13370, -40987, 5937, 29371, -26254, 9974, 43885, -15205, 4958, 44503, -16027, -12402, 33353, -21741, -30237, 23970, -19767, -37253, 23755, -6648, -34099, 28650, 10241, -28612, 29937, 22428, -27295, 23643, 26502, -30611, 11120, 25855, -34879, -2651, 25652, -34333, -11412, 28812, -27073, -16198, 33414, -17121, -19989, 35533, -8053, -23490, 35193, 1530, -26210, 33478, 10964, -27906]
960b7906N5297j1967m9460M8678m40n5781M1776J4430n6140L5782L0490n4006
972b9247K6917M1315n2322J2403M6190n1300l834M8719m6747j7915N2246l6793
984a0368k7363N4983k2411l5316N6392r220m1761N3057L560m8165M4767J4603
996C2758n4896L3818K3174n8080K1571L2540n6909J0398M2252n0621l03N1277
1008B6979m2828j1150N5620l3978k3067N7053k3700l3159N5146j1906m1634N0825
1020B4201p79m9809M2661Q982n5892L1948J9970n7192K3589L2367n2572J5562
1032a6964M4519m5840M920N1042m1050r042N2278l6188k3783N0881k7362l4782
1044c1371N0174j5139m1092M8572j773m5546M4127J1302m9434L6428K1861n1200
$$ y = [-27906, 27391, 15424, -34036, 14642, 14202, -41579, 197, 14627, -41513, -5731, 24759, -29247, -2330, 38985, -13337, -934, 45256, -6044, -9878, 38841, -7906, -25821, 26425, -10368, -37731, 17252, -5159, -40475, 15917, 6697, -35064, 17993, 21553, -26612, 18155, 32758, -22138, 11680, 34854, -23226, -1655, 30885, -26024, -15626, 26626, -23995, -24298, 26979, -15849, -26999, 28621, -5357, -28424, 28629, 4929, -28230, 26916, 15010, -26624, 24201, 23422, -26387, 16274, 25256, -30636, 1312, 21282, -35910, -12321, 20046, -32526, -16964, 27555, -18285, -13365, 37677, -3373, -12415, 39863, 3675, -20108, 30773, 3411, -31371, 18803, 3664, -37428, 11144, 9371, -36175, 7952, 19254, -30180, 6248, 28109, -23091]
1056b3091K5449L1220n1905J3646L8532m9712J476M4721m3593r852M9557l5537
1068i089j9682N2182k5251k9272N2263j4284l7278M9792k346m4219M4343Q231
1080B5390m9167L4976J7639n3489K4218K6483n3886J3926L6260m8990N670M5602
1092B4632m0634l932N1421l3043j5947N1681k6277k8281M8710j7486l8600M5931
1104A8175o848m4228M1206N252m7418L5136J7095m9100K7469K7820m8058J8166
1116e333L6374m5025O671M2441m1423o105M5152l6937j7904M6732k7911k7085
1128c0353M8023j6500l3620M6843m940l9815M2728N417m4685L5762J5719m7833
1140b3254K7000K5385m8403J7285L2505m7210O362L8546m3546n141M3945l6424
$$ y = [-23091, 2358, 33578, -18327, -4681, 33851, -15861, -14385, 30336, -13257, -23109, 26448, -9089, -28771, 23411, -1840, -31112, 21151, 6867, -30411, 19381, 17035, -27184, 17159, 25390, -23777, 11199, 28838, -24651, -433, 26050, -27836, -13910, 22350, -26640, -20970, 24632, -16002, -19934, 31487, -1556, -17503, 34178, 7901, -20380, 28330, 10844, -27756, 18175, 11327, -32901, 8305, 13557, -33861, 1275, 18370, -30730, -3261, 24559, -23499, -5333, 31041, -13984, -7313, 35128, -6295, -12400, 32752, -4185, -22089, 24643, -3268, -30353, 17670, 1170, -32450, 14393, 9453, -30362, 12366, 17783, -26902, 8860, 24579, -23254, 3746, 29131, -19272, -1987, 30518, -16692, -10330, 28216, -15330, -20471, 23474, -12950]
1152a2950j3742M8386k6225k2332M9565j6162l0537M7153o978l8879M0681K267
1164B0247m5053L3237J1745m8022K5717K1916m7251J7671L1611m3533R056L9894
1176B7235l9005p02M3987l3386j2970M4416k7554k3510M3517j9017l1939M3088
1188A4160q662l6566M0444K904m0887L5477J2465m3572K7464K1398m4058J8472
1200i61L0041m3342R125L5551m0742k394L9105l6123j3152M2142k8594k0065M5223
1213A5814j7597k5943M5641p442l2463M1568J081l9828L3702Q577m4664K5829
1225D275J7323m5464J8345K6114m3377R964L3908l9147J269L9655l3019p704M3490
1238B5632k6418j6504M3595j9066k6035M1000j1239l4231L6768k240l8703L2301
$$ y = [-12950, -26692, 21694, -4531, -26863, 22702, 6540, -23997, 23156, 16178, -22701, 17980, 20247, -24806, 8431, 20176, -27846, -2129, 19787, -27464, -9793, 21818, -21715, -12659, 27235, -11770, -12472, 31515, -1871, -14841, 29575, 2021, -21489, 22028, 3011, -28928, 14160, 5498, -31068, 9376, 12280, -28607, 6870, 19335, -24237, 3227, 24625, -19433, -961, 29080, -14262, -5137, 30414, -10328, -12722, 26383, -9740, -22892, 19250, -9344, -29409, 15814, -1783, -27726, 17915, 10473, -21990, 19578, 20659, -19169, 14533, 23110, -21554, 4275, 21598, -23866, -5521, 20593, -22784, -12820, 21088, -18059, -16790, 22865, -10154, -17858, 25632, -786, -17290, 26305, 7239, -18796, 22204, 10965, -23266, 13502, 11262, -27441, 4860]
1250D860Q274m0791K7143J8209m0994J9963K5976l9946J1180L2250l7021J366
1262i531L6798l3037q085L9120k7797j7195M0377k0486k4879M0033j1336l0762
1274b6780L8124j589l5300L4051P248l8327K7768J6272m0360K0697K3259l9689
1286a4626J1223K9374l8491J554L3108l4799p256L7258k7577j3747M1042j8029
1298i66k0079M1617j0060k7056L7004l735l4694L0690K605l8831K5092J2309l9397
1311b5501K0246K1420l7348J3235K8701l4947M730L3298l1378m146L6192k6211
1323a709j2571L7468j9847k0249L6371j3353k7753L3763n381l2863L0552L459
1335G887l4725K7514J2724l5032K1953K1418l5186J4963K5937l4640M917K9168
$$ y = [4860, 13134, -27657, -514, 17695, -23299, -3336, 22640, -17306, -6126, 26124, -10897, -9531, 27267, -5770, -13855, 25265, -2532, -19727, 20650, 164, -24715, 15318, 3982, -26780, 11344, 9755, -25545, 8506, 15754, -22573, 5195, 21467, -18893, 1804, 25063, -14626, -3403, 25971, -12520, -10966, 22142, -12657, -19913, 17345, -10232, -23979, 17063, -966, -21045, 20572, 10512, -16544, 20460, 16725, -17969, 12721, 15326, -23505, 1587, 13896, -25501, -5255, 16165, -21183, -7948, 20753, -14194, -9464, 23834, -7544, -11690, 24502, -1709, -14280, 23188, 3341, -16908, 19463, 6110, -21643, 12120, 6739, -26124, 4428, 7887, -26838, 676, 13400, -21632, 321, 21739, -13447, 1516, 27453, -7187, -2270, 26898]
1347B6898l3535n097L1991k8895j2741L4946k1156j8060L7258j1876k2197L7058
1359A4594l953k8018L2278K345l3325K5804Q660l6324J9687J6215l6060J3100
1371d997K3447l4320O379K8511l0529k480L2495k6260r033L4651j9333j5362L5304
1384A8473j2474k1848L2999o039k7839K8590R5l2292K4077Q194l3840J9434J6110
1397A3640l3301J4387K2976l1015P238K7776k8689o92L0216k5631q502L1610k1140
1410a127j5392L1640j4412k1339L1524p029k5935K9912Q74k9014K6327P911l1236
1423a7296K1040J4742l2012J4477J9949l1718P029K4118k9927r21K7446k6375
1435i448p619L0363k0238j2701L2373j2689j7478L2041n963k2750K9049l91k7973
$$ y = [26898, -6637, -11734, 20257, -8638, -21379, 13567, -7589, -25649, 11609, -267, -22464, 14594, 10641, -17377, 14901, 17246, -16079, 9725, 18385, -17939, 1748, 17963, -18097, -4997, 18450, -15870, -9491, 19020, -11509, -13989, 18506, -7754, -16787, 17864, -1469, -16831, 18473, 5999, -15849, 17150, 11111, -16728, 11862, 11957, -20335, 3742, 11936, -21904, -2470, 13640, -19661, -5274, 17702, -13313, -6075, 21701, -6988, -7680, 22536, -3095, -11597, 20013, -1127, -16519, 15121, 709, -20630, 10894, 3865, -22070, 7842, 8716, -20298, 6029, 13940, -17296, 3744, 18486, -13526, 951, 20900, -10818, -3789, 20329, -9598, -10519, 16927, -9448, -17067, 13296, -6942, -19643, 12730, 41, -17437, 14604, 8641, -14109, 14940, 14549, -13424]
1448a3424K3858N302l1528J7992J1024l1568J2852J7497k9808P633K3808k6426
1460a2788K451K7842k2461m264K9655j8803j1569K9562j4669j8425K7963r291
1472E203k3468K6019k121k6669K3755N117k8025K0327J2078k8176J5323J7895
1484A7258k7656Q523K2424k6926J549K4339k4591n572K6713k0819j1031K7990
1496A2201j4563j5548K8466p645k0090K7289j779k3922K3472L844k6391J9053
1508D387R647k7640J4068J5025k7463Q743J9393k6297K497K2850k3383l483K5897
1521A4241j9055r063K7181j3788j3941K7141p932j8720K5671k961k2180K2169
1533H763K633k5849J8261P912k7212J3312J3287k6250Q637J9091k4390M573K2892
$$ y = [-13424, 10434, 15736, -15792, 2200, 13224, -18344, -5492, 12005, -17803, -10170, 13638, -12788, -10337, 17505, -4956, -9220, 20435, 1632, -9937, 19625, 4956, -13469, 14494, 5203, -18265, 7754, 5633, -21036, 2719, 7836, -20189, 138, 12216, -15960, -637, 17258, -10398, -1875, 20549, -6377, -4828, 19511, -5080, -10652, 16061, -4758, -15789, 12201, -2362, -17910, 10556, 2911, -17179, 10110, 8331, -15591, 7881, 11725, -14666, 4387, 14034, -13606, 462, 15487, -11976, -3233, 16160, -10137, -7640, 15210, -8173, -11656, 14241, -4814, -13877, 13304, -484, -14425, 12716, 4784, -13936, 11735, 8774, -13406, 8763, 11396, -14453, 3808, 11720, -15492, -2180, 11107, -15143, -6506, 12585, -11805, -7232, 15660]
1546A5660k1329r66K5257j8562q121K5473j5660j4016K4670j0536j8594K4112
1558G388m874k1160K2309J682k2913J9439Q588k4230J5996J3474k4026J0310J6845
1571A8828k3941L469J9332k3801k950K1222k0140p731K3431j3910j0924K5681
1583H566p514j4556K5200k724j9215K1525J021k2446J6864N322k4336J2391J0310
1596A0408k4440Q765J5595k2885M709J9811k0190L58K2337j7009n451K3214j4051
1609A171j1320K2888j0343j5512K2040n074j8104K0600L43k0363J8126N516k2422
1622a2454J4373R795k3360R931J4050k2350N302J7910k0257L91K0183j7972m805
1635i263K1983j4131r664K2370r792j3098K1866n184j7379J9802j047k0310J6941
$$ y = [15660, -5669, -6635, 18622, 60, -8061, 17412, 1752, -12264, 12406, 1870, -16724, 7388, 2514, -18646, 3663, 5345, -17568, 1871, 10459, -13771, 2225, 15699, -8327, 1983, 18828, -5113, -1644, 17688, -6113, -9063, 12159, -7981, -15712, 7719, -6191, -17115, 8566, 1052, -13504, 11696, 8972, -10243, 11282, 12303, -10143, 6721, 12043, -12293, 98, 10408, -14032, -5267, 10328, -12557, -7848, 11963, -8227, -7869, 14468, -2541, -7992, 15222, 1171, -10149, 12739, 2396, -13116, 8924, 3850, -14254, 6346, 6689, -13674, 4452, 9968, -12454, 1919, 11714, -11646, -1715, 12335, -10015, -4713, 13197, -7060, -6669, 13514, -4458, -9263, 12720, -1411, -11075, 11295, 1503, -11595, 10271, 5087, -12292, 7510, 6463, -13847, 3094]
1648C094L524k0966J4002R602k0729J1194J3825k0096N823J6496j9893j27J7414
1661A3163j8682n282J9208j3944q574K1565r259j0983K2278m210j4654J9877m47
1674A0056j8489J6443K566k1285J2641O449k1464Q784J1510k0595O359J6014j7956
1687h967L128J8791j5478k199K0180j3899p658J9083j0702j2519J8855o857j5449
1700a3691J8364k096j6868J6706L037j8154J4355P327j8975J1059J1338j8846
1712f444O583J4203j8464J019J5625j7322l565J6981j3919o870J9076q973r493
1725a1563K0335n250j2347J8535j820j6258J5397R68j8874J2104N573j8726R485
1738b441J0395j7794O733J4124j6746K855J5662j5669j967J6682j3817o466J7723
$$ y = [3094, 6618, -14348, -346, 9256, -11473, -279, 13546, -6550, -727, 15769, -4124, -4251, 13163, -5519, -10801, 8407, -5537, -14111, 7454, -1805, -12788, 9490, 5280, -9374, 10503, 10056, -8433, 8010, 10576, -10709, 1932, 8381, -13083, -4299, 7211, -13384, -7025, 8989, -8967, -5839, 12952, -2526, -4725, 15455, 1556, -6102, 12981, 2279, -10240, 8615, 1758, -13691, 4673, 2577, -14291, 2415, 5452, -12702, 1653, 8980, -9995, 1064, 12402, -6444, 139, 14342, -4122, -3103, 12522, -4800, -8365, 8616, -5303, -12173, 6903, -2070, -11563, 8772, 3522, -8825, 9710, 7890, -8368, 7029, 7997, -10877, 1227, 6800, -11926, -2441, 7954, -9840, -3107, 11017, -5729, -2874, 12788, -2881, -4848, 11834, -1983, -8449, 9274]
1751I274j0768r566J8004o410j2255J7768k018j4588J6439J760j6524J3018N031
1764I165j8154R763Q387j8329O412J2018j6773L102J4595j4904r50J6474j3289
1777b483m841J6464j0003q385J6970o645j1292J7013l081j3377J4862O42j5667
1790i823J2633M319j6469R320Q512j6309O816J1481j5847K955J3187j5045j248
1803e518J4494j3147m657J6152r911p198J7054n945r726J6336k879j2717J4572
1816F910K09j5174J1988K996j6414R435O721j6318O770J0256j5107L568J3303
1829I143j3919K73J4962j2134l350J5293j0220o881J5202p316j0079J4896l978
1842A892j2216J4486o1j3920J2522L343j4761R952O675j5168O916R823j4822L612
$$ y = [9274, -1494, -11060, 6944, 534, -11721, 6047, 4029, -10559, 5880, 7640, -8884, 4134, 9165, -8989, 774, 9161, -9168, -2756, 9262, -7511, -4409, 10186, -4718, -5668, 10806, -2483, -7324, 9140, -863, -9248, 7722, 1077, -10215, 6798, 3717, -9660, 5202, 5844, -9823, 2810, 7129, -9340, -20, 8492, -7817, -1001, 10480, -5367, -2412, 10775, -4270, -5518, 8976, -4171, -8828, 7324, -2587, -9785, 7269, 1324, -8402, 7934, 5055, -7662, 6910, 7119, -8055, 3933, 6929, -9485, -50, 6671, -9647, -2877, 7379, -7728, -4160, 9143, -4776, -4503, 10459, -1675, -5025, 10268, 48, -6833, 8369, 1053, -9026, 5870, 1892, -10324, 4162, 4101, -9819, 2703, 6046, -8715, 1237, 7912, -7256, -340, 9483, -5339, -1727]
1856a727J1380j3911J47J2886j2768l498J4232r701o310J5549o215q170J4948
1869F842k811j0616J3419l75j3536J1372J859j4792R170N225j5053P092Q755j4258
1883g707M477J1367j3230J252J3025j1384k485J3759r720n438J4269o979q479
1896g273J3997m338j0459J2666j372j2570J1640J823j3124R657M974j3652P307
1909g24Q029j3030M412J0218j2107P32J2154j1884j795J2130r518n440J3093o804
1923e34q054J3576m194r317J2939p93j1357J1022J966j2785R409M751j3000P025
1937F54P247j3103M635R156j2537J366J0582j1863k261J1881r421m474J3428o763
1951a473o109J3650l706q488J2761j174j1086J1132N44j2499Q180L412j3261O625
$$ y = [-1727, 9653, -4258, -4111, 8775, -3993, -7491, 6741, -2960, -9270, 6279, 64, -8106, 6842, 4031, -6585, 6834, 6459, -7077, 4295, 6154, -8638, 532, 5757, -9296, -2204, 6551, -7707, -3230, 8137, -5093, -3841, 9184, -2200, -4685, 9074, -646, -6084, 8185, 1206, -7273, 6724, 2386, -8073, 4593, 3221, -9349, 2291, 4114, -9010, 647, 5621, -8031, -724, 7305, -5725, -1313, 8905, -3202, -2470, 9684, -2200, -3995, 8135, -1383, -6823, 6270, -534, -8588, 4988, 794, -8523, 4416, 3623, -7734, 3288, 5254, -7531, 1878, 6629, -6371, 654, 7901, -5202, -567, 8589, -3948, -2582, 8000, -3863, -6124, 5757, -3664, -8138, 5290, -1473, -7582, 6068, 2362, -6126, 6635, 5461, -5625, 5507, 6051, -6448, 1732, 5144, -8117, -1492]
1965a492O126j2778M847Q825j1208K654J0903j0183n94J2190r415l754J2130p551
1979G00o829J1893n117q799J1433k124r692J0470J227j0941R396L977j1705P363
1993A252N905j1547M477Q123j1618J832R228j1030j105J0585r478l483J1535o951
2007b275n323J2284m076p086J1936j635r559J0960K46j1204Q781K561j1738O487
2021C59M906j1460M606P355j1122K604Q949j0429o4J0393r060k294J1159o707
2035h05n066J2265m536o998J1502k784q875R965l37j0524Q307J678j1399O690
2049i17M877j1616N429P219j0121L004R009r462N24J0057q438k115J0123p046
2063E27m911J0204n715o823J0074k568q878R974J33r472Q910K485r815P248N103
$$ y = [-1492, 4634, -8144, -3297, 5528, -5680, -3026, 7877, -2306, -2900, 9290, -125, -3879, 8251, 700, -6129, 5764, 647, -8152, 3281, 1157, -8535, 1935, 3162, -7779, 1617, 5594, -6111, 1252, 7157, -4390, 87, 8210, -3408, -1576, 7652, -3378, -4483, 6102, -3376, -6859, 4676, -2275, -7598, 4686, 610, -6476, 5460, 3825, -5734, 5226, 5472, -5732, 3049, 5610, -6128, 359, 5265, -6195, -1589, 5766, -5356, -2752, 6197, -4232, -4296, 6097, -2963, -5257, 5902, -805, -5871, 6394, 1858, -5140, 6362, 3578, -5297, 4668, 4331, -6193, 2114, 3792, -7607, -917, 3960, -7656, -2227, 4992, -5129, -2125, 6884, -2578, -2054, 8003, -435, -2550, 7573, 527, -4384, 5820, 105, -6718, 3356, 788, -8090, 1884, 2017, -7455, 1455, 3940, -5875, 1373, 6476]
2078F476j0312N302O442j0643K476P592j0423j96Q508r262k309R630o858l653
2092g230J1350m433n248J1343k459o979R864j044r510Q018J027j0901O399L494
2106C691j1058N093O134r968L431Q133r303J333R306q225j472R964o982l700R706
2121F083n237n760R754l281p596R297j206q988Q290J356r454O895L724r538N437
2136b24N654r303L353P623r280J189Q261q576j702Q963p395l729R617n534n532
2151f615R488k878o466R336j039p768Q524J295q823O894L292r273N172N174r352
2166c039K869O292r311O41P741r173j283Q808o709l137R739m599l951R994k744
2181B138n528R085j056p739P524O5r160N845K059r600M824M319r668L934O666
$$ y = [6476, -3836, 1466, 7908, -2735, -259, 7333, -3090, -3286, 5222, -4040, -6349, 3281, -3577, -7230, 4120, -313, -5561, 5782, 3323, -3656, 6208, 5164, -4346, 3672, 4699, -6202, 197, 3691, -7367, -2274, 3860, -6108, -2677, 5456, -3847, -2514, 6792, -1433, -2905, 7059, 77, -3623, 6083, 846, -4914, 4840, 1559, -6037, 3260, 2054, -6934, 1356, 2712, -6742, 153, 3877, -5661, -224, 5430, -3873, -520, 7103, -2177, -988, 7273, -1303, -3005, 5958, -1437, -5166, 4451, -1083, -6615, 2873, -5, -6471, 2865, 1826, -5942, 2582, 3877, -4946, 1948, 5240, -4033, 1139, 6313, -3039, -170, 6122, -3189, -2548, 5193, -3980, -5263, 3545, -3164, -6301, 3438, -1161, -5112, 4882, 2138, -3390, 5695, 4639, -3100, 4424, 4489, -4671, 1174, 3233, -6367, -1543, 2776, -6892, -2958, 3708]
2196C708q103J790Q349p211j35Q884o907k502Q707n636m757Q230m176o065Q169
2211B345j742p366P804N82p505P262K625q407N601M690q652L458N622q816J598
2226i01O625q667n65P694p033k354Q419m758l878Q988l221m546Q528j555o760
2241c984P765K8p773O194J738q519M740L762q651L608N620q435J870O667p669
2256c039k38P744o283k072Q271m901l542Q728l325n077Q131j765o640P137q6p755
2272d712O222J544q690N369L240q415L976N204q086K509O823p002M69P889o455
2287a15j648P733n254l988P685m093n320P487k512o206P207o3o907O919J795p244
2303d524N805L508p630L941N004q050J676N415p561j44O421p091j556P485n031
$$ y = [3708, -4395, -2605, 5744, -1467, -1602, 7282, 375, -2127, 6580, 944, -3813, 4417, 241, -5824, 2345, 603, -6763, 1041, 1623, -5882, 1380, 4005, -4402, 1199, 5889, -2763, 695, 6317, -2499, -901, 5724, -2943, -3508, 4186, -2847, -5201, 3218, -1540, -5418, 3570, 349, -4197, 4331, 2776, -3984, 3781, 3809, -3964, 2230, 3968, -4551, 189, 3951, -4700, -1092, 4528, -3907, -2037, 4630, -3039, -3277, 4467, -1816, -3888, 4383, -518, -4060, 4668, 1343, -3734, 4397, 2632, -4008, 3129, 3043, -4712, 1510, 3054, -5636, -267, 2973, -5442, -1466, 3738, -4348, -1839, 4984, -2018, -1549, 6340, -115, -1763, 5970, 716, -3272, 4413, 320, -5000, 2487, -25, -6231, 976, 913, -5994, 925, 2720, -4524, 1281, 4789, -2841, 1100, 6104, -1946, -270, 5145, -2416, -2560, 3861, -3230, -4786, 2699, -2332]
2318b332k603P938l241l997Q048j555n419P105m14o782N799Q76p503M948K293
2333C161p806L410M371p282K277N480o641J031O540n944p58O627m630k626P082
2348D292l704m263O924k106n703O652m83o424O070O99o523N003K618o855L477
2363c26M590p378K621N287o661P90N841o060j147O739n428k554P026l966l879
2378d505P308k900m782P196p56n608O060Q69n984M753K301o703L363L585o917
2393b720J897M608o619N35N319n737j27O153m832j799P043l686l498O896j939
2408A494m676O237p03n970N831L24o415M578J725o323L493L158o549K807M480
2423C491o085J112N460n740j34N870m577j990O147l527l231O322k377l951N723
$$ y = [-2332, -4935, 3003, -238, -4235, 3813, 2258, -3161, 3944, 3530, -3252, 2547, 3423, -4080, 868, 3161, -4645, -1235, 3136, -4146, -1869, 3611, -3030, -1999, 4541, -1403, -2161, 4466, -164, -2790, 4292, 588, -3675, 3249, 1143, -4560, 2092, 1609, -4815, 1255, 1954, -4569, 434, 3052, -3803, -326, 4264, -3114, -493, 4794, -1867, -1077, 4764, -1296, -2443, 4296, -1132, -3686, 3340, -626, -4505, 2803, -97, -4879, 2317, 1561, -4047, 2013, 2882, -3102, 1651, 3952, -2751, 612, 4197, -2720, -823, 3785, -2834, -2299, 3020, -2717, -2844, 3309, -1523, -3322, 3721, 35, -3463, 3433, 1494, -3182, 3055, 2352, -3618, 2213, 2537, -3878, 700, 2425, -3898, -405, 2753, -3796, -989, 3491, -2594, -1482, 3978, -1762, -1896, 3974, -603, -2593, 3554, 27, -3204, 3118, 741, -3210, 2513]
2438B513q83n270N374M30o074M912J460o264L887K781o357K656M238n724J256
2453a065N018n499K3N588m868j555N428l600l034O025k540l595N477o06m383N164
2469A978K64n089M650J177n821L392K663o470K822L585o082J184M812n317J8N124
2485B890m241r15N594l495k347N987k625l231N306j620m556M894j59n172M587
2500H97R75n578L649K642n599K851L567n335J403M223m967pN089m672r21M788
2516C005l831k083N341k631l255N465j376l690M808k86m374M262J133n237L588
2531H39K120n760K566L187n506J619L797m686N84M315m200q23M907l586j886N058
2547B545k662k849N280j728l556M886n43m397M371M68m691L627J570m906K417
$$ y = [2513, 1630, -3640, 1734, 2164, -3910, 1002, 2462, -3802, 85, 2866, -3491, -835, 3403, -2321, -1065, 3953, -1546, -1523, 4065, -803, -2358, 3070, -530, -3564, 2461, -79, -3674, 1803, 1197, -3186, 1978, 2242, -2847, 1803, 2980, -2841, 551, 3214, -3256, -434, 3151, -2931, -1747, 3065, -2252, -2234, 2890, -1351, -2266, 3328, -167, -2514, 3473, 848, -2383, 2923, 1303, -3253, 1641, 1482, -3690, 897, 1872, -3706, -57, 2585, -3014, -163, 3404, -1931, -528, 3695, -1272, -1279, 3810, -862, -1783, 3005, -826, -2909, 2432, -199, -3454, 2011, 635, -3055, 1753, 1467, -2907, 1355, 2488, -2749, 839, 2959, -2801, -235, 2952, -2554, -935, 2862, -1824, -1240, 3075, -1125, -1948, 2959, -627, -2513, 2545, -117, -2966, 2314, 586, -2970, 1916, 1373, -3024, 1347, 1815, -2876, 751, 2321, -2585, -168]
2562a68K810m955J500L533m387K32M286m245p70M668l221j638M788k491k405M898
2578B435j653l395M431n06m158M147N30m469L499J046m369K660K368m839J787
2593d86L438m431L61L911l960o18M337l402j311M501k452k450M881j595l331M510
2609A903p77l503L910L66m531L087J664m645K721K084m664J680L071m047P58L609
2625B686l832k77M033l197j650M698k529j942M169j780k717M293j012l291L602
2640A254jl976L408R68m117K372J972l913J764K828m327R64L213l541k20L773
2656B421l344j062M099k468j839M441j876k645L931m86l374L604K80m037L046
2671F91J017l900K405J852m098J745K901m125P64K952l558N6L630l472n82M026
$$ y = [-168, 2642, -2313, -813, 2720, -1667, -1435, 2851, -1394, -2164, 2504, -717, -2355, 2433, -58, -2463, 2435, 782, -2613, 1818, 1312, -2846, 1301, 1831, -2638, 861, 1907, -2462, 198, 2566, -2273, -486, 2952, -1479, -1118, 2793, -1167, -1785, 2552, -850, -2161, 2340, -112, -2562, 2319, 724, -2607, 1903, 1126, -2377, 1533, 1899, -2632, 455, 2119, -2526, 195, 2279, -2385, -705, 2366, -1681, -923, 2686, -1146, -1423, 2610, -587, -2237, 2461, -68, -2010, 2159, 379, -2338, 1955, 943, -2348, 1254, 1253, -2723, 685, 1653, -2464, -92, 1880, -2033, -269, 2559, -1768, -804, 2409, -1132, -1352, 2421, -923, -1985, 2114, -354, -2193, 2248, 372, -2273, 1658, 1172, -2202, 1402, 1682, -2355, 691, 1708, -2192, 213, 2065, -2033, -288, 2613, -1512, -748, 2204, -1354, -1298, 2332, -1140, -1722, 2304]
2687B304k513j615M100j775k400L859j020k992L263j08l707L212O06l692K443
2702c5J588l855K134K673m082J199L002l443J42L337l092r68L419k398j572L627
2718A676j718k340L612o73k764K995J75l334L361N91l433K515J392l383J421K087
2734B180l594O99K610l176J37K863k730n41L078k007j192L685j803j834L350p47
2750I78l252L575m17k788K742K87k889K138J176l445J763J894l213Q89K623l318
2766a257K60L131k601q31L234k135j310L062j290j951L406r65k615L067l94k931
2782b120K797O18l233K253J267l481J772K135l164J202K285k989L0K533k572n62
2798a229K985k247j141L230k008j555L299r94k375L351n88k874K848L14k519K211
$$ y = [2304, -209, -1824, 2276, 501, -1899, 1960, 940, -2052, 1211, 1103, -2604, 608, 1214, -2478, -35, 1553, -2302, -168, 2505, -1577, -378, 2624, -819, -677, 2660, -432, -1400, 2019, -379, -1951, 1676, -42, -2382, 1230, 557, -2207, 788, 963, -2371, 990, 1581, -1852, 663, 2055, -1328, 93, 2180, -1414, -715, 1895, -1281, -1144, 1719, -1011, -1552, 1526, -481, -1673, 2012, 209, -1625, 1725, 978, -2274, 1301, 884, -1904, 838, 1125, -1764, 374, 1550, -1895, -132, 1762, -1451, -562, 2061, -1257, -997, 2134, -467, -1298, 1936, -199, -1509, 1553, 263, -1688, 1718, 753, -1862, 1205, 811, -2120, 677, 1295, -1938, 315, 1582, -1899, -127, 2008, -1156, 46, 2331, -658, -628, 1905, -667, -1229, 1756, -491, -1632, 1598, -410, -1965, 1334, 340, -2035, 1316, 728, -2146, 702, 1016, -1503, 708]
2814G08R54l087J612J582l171P85K119k649M5K399k614l90L251k020q84L012j293
2831C59j577L122j113k283K714l38k662K513j49k643J978P82k589J335K072k922
2847a401J094K083k869M76K463k253k05K664k163j225L241k177j275K714j078
2862H9j557K144k35k107K171L09k498K308M73k555J598J654k791Q81J632k395
2878h79L50K158k515o7K298j866q92K873j549j459K815r58j838K436N4k499K237
2895F99J86k214J888M41k508J485J450k855J099J874k611K73K140k605L50K267
2911A359k065l25K482j304j183K426p95j702K388n58k256K063J36k533J612J117
2927H62k549J829R77k394J113J581k136N12J881k001j92K138k029p63K574j570
$$ y = [708, 1662, -1425, 187, 1769, -1402, -617, 1502, -1147, -1102, 1297, -1317, -1707, 1544, -476, -1360, 1652, 359, -1218, 1904, 791, -1492, 1222, 884, -1778, 735, 586, -2057, -79, 703, -1886, -551, 1521, -1401, -307, 1776, -1093, -617, 1846, -407, -612, 2052, -111, -1336, 1905, -272, -1547, 1167, 89, -1468, 676, 441, -1666, 505, 814, -1684, 624, 1097, -1458, 140, 1794, -997, -116, 1516, -879, -529, 1629, -886, -953, 1345, -521, -1413, 1460, -89, -1548, 1267, 309, -1529, 907, 961, -1538, 699, 885, -1329, 559, 1000, -1508, -23, 1427, -1428, -329, 1545, -1066, -793, 1347, -1258, -908, 1359, -706, -1031, 1451, 147, -1036, 1390, 595, -1107, 1281, 723, -1533, 530, 666, -1867, -255, 862, -1687, 142, 1119, -1275, -162, 1419, -717, -205, 1676, -325, -517, 1621, -408, -1171, 1403, -167]
2943a67j038K126q25j690K256m24j777K016L30k093J594P53k094J161J475k450
2959h47P24J536k198K15J774k113k84K199j467j124K537j023j237K756j428j031
2975a011J939j0j969J949K87k270J603O74k433J195J166k433J068J160j747N8
2991g74J916j785l29K118j369n43K373j326j054K213j006j485J974l35k039J958
3007E07M7j991J529L88j917J477P54j831R95J481j903K59J767j848m40J790j230
3024a66q44K080j583q69K180r73j286K052j54j562J893K20j828J402N28k073J217
3041B34R73k194M99J227j941M26J688j739o4K204j744l05J984j033j193K360r45
3058D37j539J865p5j949J813K70k204J349P95k103J093J099k035O71J590j861
$$ y = [-167, -1205, 921, 96, -1594, 662, 238, -1539, 477, 807, -1286, 308, 1061, -1033, 128, 1603, -847, -123, 1413, -785, -570, 1204, -909, -1193, 1006, -461, -1585, 952, -71, -1308, 1448, 20, -1011, 928, 918, -1051, 898, 1185, -1085, 518, 1192, -1241, -46, 1120, -1313, -245, 915, -832, -774, 1142, -643, -972, 1146, -223, -766, 1607, 281, -773, 1440, 434, -1051, 923, 588, -1451, 507, 554, -1437, 92, 480, -1437, 40, 794, -1037, -42, 1439, -464, -205, 1562, -286, -726, 1064, -166, -1010, 1070, -513, -1382, 798, -175, -1461, 591, 437, -1125, 768, 988, -840, 562, 1090, -983, 234, 1207, -987, -488, 739, -1202, -776, 912, -827, -891, 1313, -431, -736, 1248, 215, -978, 1382, 437, -1102, 763, 688, -1261, 552, 822, -1382, -33, 762, -1341, -248, 851, -1184, -513, 1077, -784]
3074g84K53J793j922J10J781j350o86J960j200r10J932p04r99J574m95j641J906
3091F18l35j380J051M33j397Q41J052j743Q61J263k016O24J433j687k69J738j518
3108d31l82J917j391r46K044p81j123J803k55j722K258l9j853J254Q07k056J035
3125A39P96j670N59J054j810K52J674j824J52J576j251n92K085j104n95J785r21
3142C05r16J692p22j551J671Q5j621J203N19k047J185R96j708R35J170j513M55
3159A38J304j567o77J910j204r12J947j236p73J761p72j332K245l60j567J543
3175D48j66j426J411N29j776J232Q22j647N12J321j900M14J180j536lJ519j318
3192c84p86K158j022r93J907j036o90J713j23j832J810j22j399J236L40j614P40
$$ y = [-784, -531, 1262, -660, -550, 1231, -119, -805, 1155, -45, -955, 977, 273, -726, 848, 353, -1288, 618, 283, -1097, -46, 387, -1010, -169, 883, -860, 1, 1264, -752, -128, 1305, -382, -651, 1087, -431, -813, 1104, -287, -1233, 811, 30, -1093, 710, 455, -1267, 991, 952, -901, 353, 1160, -896, 139, 935, -735, -176, 878, -932, -680, 994, -830, -678, 898, -353, -945, 1140, 36, -559, 1226, 305, -611, 1081, 359, -1192, 479, 564, -1057, 146, 665, -1382, -197, 799, -909, 26, 1196, -317, 138, 1442, -125, -802, 1108, -96, -1008, 939, -297, -1070, 691, -81, -1413, 832, 472, -1095, 448, 282, -1144, 267, 796, -980, 252, 1074, -573, -61, 1260, -640, -226, 954, -582, -585, 934, -384, -1170, 988, -34, -1027, 880, -156, -846, 867, 744, -1088, 722, 600, -799, 437, 777, -837, -97]
3209i7R29j876O53J081j632L09J672j516p4J693j214o18J638r89o56J712q35j001
3227h21J390J3j640J747j46j610J466J67j720R87J081k109R36J328j499K12J379
3244A161j563J01J644j632n84J869j196r44K001p23j108J819n02j639K044l30
3260D18j552J652L00j914J151P96j442L62J207j558J60J177j559K77J157j165
3276e33j34J518j162n07J784q75o63J477n16j193J468J48j619J392K5j591J111
3293A30M63j675Q06R24j703O12J270j346K69J562j698j03J383r78p04J586o59
3310A39j019J211k82o59J062l75j072J238K46j511J114O62j377N43J033j676P66
3327D3J151j658p7J292j221m47J772j148q05J851o36j072J719p03j138J771r8
$$ y = [-97, 832, -1044, -391, 690, -942, -633, 1039, -477, -551, 1142, -72, -690, 948, -41, -697, 1015, 180, -821, 569, 582, -1058, 689, 543, -1067, 399, 566, -1154, -167, 914, -1195, -259, 1069, -430, -218, 1161, -402, -301, 1343, -289, -873, 996, -200, -1144, 857, 134, -974, 845, 343, -1296, 748, 418, -1134, 518, 818, -1096, 55, 851, -591, -229, 978, -580, -420, 757, -802, -525, 632, -533, -667, 851, -311, -818, 966, 91, -572, 905, 389, -804, 664, 812, -807, 585, 610, -981, 130, 593, -1082, -276, 648, -1055, -443, 827, -519, -250, 1312, -386, -489, 894, -84, -788, 798, 139, -880, 331, 49, -610, 452, 77, -995, 243, 489, -1022, 92, 754, -623, -80, 953, -723, 43, 1194, -464, -541, 751, -470, -917, 855, -293, -1098, 753, 117, -955, 764, 61, -1077, 694, 596]
3344E96j475J552J18j439J156K27j845J080M77j350M45J220j503K89J368j334
3360d18j83J682j290p59J640n45q90J404n08j242K179o97j307J383M50j818J070
3377A51L56j392Q04P73j312L68J024j316mJ369r72l77J291r27n33J278o59p91
3395h69J686p18q53J545l99j461J594P6j547J191N23j432P49Q20j803N78J145
3412H25j338J58J247j311p1J223j341j92J682p06j119J717q38p64J656n23r01
3429e96J272J28j652J234M18j545Q38N15j551N72J129j573N04R18r45n2J407j129
3447a08k48J370j078n48J325q58p64J264O2j563J391N2j480J416L14j348Q89P45
3465H33j385N91J007j485L23J142j285j89J128j093n33J523p92n67J628p83p63
$$ y = [596, -879, 673, 791, -648, 508, 735, -1110, -30, 447, -903, -458, 762, -741, -452, 916, -418, -601, 1081, -209, -968, 672, 127, -763, 641, 133, -1109, 1070, 373, -934, 449, 899, -919, 151, 507, -885, -81, 692, -620, -252, 772, -544, -548, 821, -151, -528, 763, -164, -697, 581, -78, -869, 817, 99, -754, 791, 392, -1069, 525, 601, -946, 245, 768, -664, 85, 905, -898, -320, 825, -513, -355, 892, -419, -490, 733, -608, -800, 882, 176, -943, 774, -64, -828, 828, 305, -596, 676, 804, -848, 386, 804, -741, 97, 612, -939, -367, 762, -811, -307, 611, -334, -386, 1021, -108, -356, 1014, -64, -612, 713, -145, -909, 355, 417, -1146, 245, 297, -1183, 233, 547, -801, 88, 833, -552, 39, 1046, -439, -116, 1026, -259, -448, 680, -413, -946, 577, -215, -782, 846, 63, -700]
3482g00J329k35r12R69J34j424R63O55j608Q13M20j179N51P02j455N84J425j641
3500f09M22J293j322j0J330j094l37J019p09k70Q63n09j173J476o9j168J200K6
3518C59j125Q87O59j683J004O60j156L79N98o25j92J398j661p1J517r82n12J160
3536F14o15o33J276m07j095J488m09j115J514r9j266J215M44j368Q24M93j358
3553d97L15R23j357K22J157j257k43J664j206p84J829p97q61J664l77r51J381
3570H25n09q60J568m89j268R60L74j339O45N63j581R03Q51j290K98J161j295K73
3588b10J195j303r1J246q42p90J687q62j008J341k56r80J174k72j076J221L57
3605E31j246R98O42j438P40K89o22J37O38j207M3J139j318l7J226q45k07J120
$$ y = [-700, 629, 394, -518, 451, 585, -839, 124, 779, -829, -16, 404, -775, -224, 478, -977, -393, 1032, -609, -187, 1106, -216, -226, 1104, 10, -327, 692, -17, -287, 576, 67, -1106, 370, 301, -867, 333, 359, -766, 121, 780, -903, 101, 761, -395, -16, 582, -43, -235, 1163, -498, -569, 948, -34, -546, 614, -1, -634, 642, 235, -860, 628, 219, -896, 618, 519, -747, 468, 912, -456, 368, 861, -497, -182, 741, -616, -394, 763, -494, -737, 927, -279, -1063, 766, -31, -892, 772, 395, -556, 825, 316, -544, 1024, 535, -733, 227, 601, -738, -93, 470, -1111, -208, 643, -647, -349, 812, -483, -210, 985, -318, -409, 837, -5, -795, 892, 30, -978, 363, 107, -873, 301, 29, -1047, 174, 531, -715, 283, 925, -513, 227, 516, -106, 31, 669, -538, -495, 644, -674, -711, 515, -330, -537, 583]
3623E83m61q20J471k47r81J091j77j081J207J49j497P14M65j106L88R52j514O37
3641b27R34j252P2J213r92l03J327r66l55J238n06o10J004l40q47Q96J60j734
3659a288J737J71j258P98L04j325Q60P83j373N05Q66j131N19N64j109J2J113r13
3677a65k29J108q56k55R87o36r87J253j3j015Q79L97j400J286K83j357R14M49
3695F43r85L39Q01j013l32J393j178j21P67p23m86J521r81l73J458n57l71R77
3713G79l10q80J033p8j364R22L21j248Q01O40j284M55P07j142M67J009p58L6P17
3732H23j040j62J112q94o29J503r35n97J185p24l45J474n03j209J390o3r22P52
3750B16O26j291P38M78j404M61Q76j270M8J152j047q9J010p13k03J101r19l48
$$ y = [583, 122, -698, 773, 526, -455, 636, 459, -622, 585, 734, -763, -49, 416, -690, -302, 650, -864, -227, 707, -545, -473, 740, -252, -555, 772, -194, -549, 689, 183, -427, 577, 237, -610, 286, 446, -1288, 449, 620, -638, 160, 464, -861, -1, 782, -591, -86, 780, -351, 168, 732, -377, -365, 748, -165, -394, 714, -142, -397, 590, -46, -1033, 220, 207, -808, 71, 468, -932, 354, 637, -720, 194, 643, -342, -3, 798, -215, -547, 846, -332, -453, 314, -409, -895, 626, -355, -728, 730, 173, -198, 779, 469, -411, 622, 544, -820, 102, 423, -825, -24, 616, -668, -213, 494, -648, -181, 828, 70, 106, 823, -217, -379, 733, -161, -790, 713, -222, -819, 366, -358, -703, 771, 268, -941, 449, 386, -536, 216, 842, -449, 289, 767, -637, -176, 700, -570, -522, 630, -417, -506, 504, -209, -412, 689, -230, -578]
3768e78R59l03p72J360j5j324J163J39j274N95O59j298N50P13j338Q72K29j025
3786f88L60Q28q05r1J059j024l7J231j010k06Q61Q7j055J040j41j164Q73J34r33
3805f81O28L85j196O46P98j025N09N16j104L23Q58j069Q7J015r90m64J330l18
3823B48p88J226q56n70J124r8j251J207K40j282J024P07j295M88P51j545M55P37
3841E22j235J03J062r91K95P22o10o82J475n03q44J224m58n95R05p3j188J232
3859C61J71j304Q36L76j014N11N17j013M74Q97j307L51P83r04j46J138r97J41
3877a29J008q90m78J120n07q74J120k18q56J010q6j207J112L93j477R88M59r70
3895d82P16L93j080M84R44j453J99Q82j182J77J114q13k61J118n84n19R42m40
$$ y = [-578, 381, 78, -694, 666, 651, -673, 490, 629, -645, -50, 609, -689, -139, 574, -764, 108, 337, -688, -328, 500, -305, -396, 663, -361, -398, 833, -177, -383, 478, 565, -490, 550, 409, -755, 118, 252, -681, -53, 332, -864, -218, 580, -445, 64, 580, -524, -201, 657, -412, -325, 690, -300, -764, 566, 248, -540, 686, -170, -740, 384, 286, -965, 242, 482, -800, 224, 931, -364, 124, 875, -670, -215, 522, -713, -610, 452, -539, -244, 478, -132, -814, 661, 158, -686, 538, 80, -515, 390, 317, -871, 361, 532, -772, 64, 440, -574, -63, 454, -559, -85, 812, -495, -144, 639, -265, -411, 727, -270, -129, 879, -11, -489, 631, 124, -750, 370, 152, -704, 306, 220, -987, 125, 518, -959, 29, 488, -482, 234, 627, -453, 31, 975, -478, -279, 603, -579, -402, 712, -101, -362, 756, 172, -347, 595, 155]
3913A55p03Q25Rq18R58rr94O78M14j032L34P71j129L40Q33q49o4Q09o28j34R88
3934G54q05l89J188j042k23P47K5o80R44k4j059Q58j92p90N94M32r37O16O51j075
3954d07J72R26r68J9R77j052j40R20o57o17J198m33p95J197k80p31J165j35r82
3973f23J064k32q84R11l1n06O11J93j057M47Q39j340L45N87r53L94O29n37k13
3992c56J218q50n10J018k87p87J114m20p14R80l7o87O55J6r14M70N34j080M43
4011a94M97p00K31Q06p41J3Q70q93j56R06p68n22R61l69o75J188o36n31P56J71
4031B14p21N86N40j141R31J39p44L6P03q56M2P84j318L36J105q20l80J035p47
4050b76l68J130l40o46R65j10r83R69o2o82N91L40j207Q39M51j365Q11L57j076
$$ y = [155, -548, 277, 286, -532, 426, 417, -577, 101, 515, -517, -183, 588, -541, -201, 632, -217, -281, 528, -100, -234, 754, -51, -440, 748, -294, -517, 230, 255, -425, 519, 495, -564, 294, 102, -688, -94, 338, -599, 17, 668, -407, -235, 691, -277, -258, 719, -333, -473, 447, -210, -827, 371, -62, -857, 340, 60, -671, 494, 359, -623, 441, 209, -675, 236, 205, -301, 310, 503, -554, -107, 732, -608, -263, 324, -629, -235, 394, -143, -356, 862, 12, -498, 520, 233, -554, 560, 140, -574, 406, 369, -318, 337, 353, -561, -91, 443, -637, -194, 303, -397, -166, 640, -101, -88, 782, -111, -267, 639, -129, -651, 310, -59, -734, 454, -182, -713, 43, 214, -507, 79, 619, -522, 409, 548, -196, -160, 543, -313, -271, 513, -805, -469, 636, -184, -564, 471, -276, -644, 486, 146, -500, 465, 355, -628, 341, 279, -403, 188, 528, -679, 160, 611, -754, 57, 414, -662]
4069f62O35O26p84n4J005o35m39P46j82o23Q18k77m16O19k06q11J033j76q91M65
4089b09O53j310P67L60j087O79N33o89K42P90j284M09Q08m26l26P75r58j86J024
4108E65o69n76Q16j61r80J031J89j045J093J37o88M87N1o42M85N50j002K4P64
4127D29q05j40P94r59K39M61k00n46J269o15j69J117o55q55J108R7r56M81K40
4146C35o46M25O0p86P14L04j108L43N76p25L78P85o54j39R39p09m40P88n33m58
4166e51J011n75k93O80j93p54P45J22p22P17K10q81O86K55q27M85O22r20K53N23
4186E93r17K22N40l65m87P37k80m93P23m42n21J121k64l75N37K73j041N60L85
4205E06r49N58m2p43M81N19j034M15M21n27K72O16o45j81Q60m75j96O40l74NL60
$$ y = [-662, -27, 599, -185, -239, 766, 131, -308, 438, 256, -367, 451, 174, -242, 377, 171, -640, 393, 217, -674, -209, 444, -866, -99, 261, -826, -147, 386, -303, -61, 729, -555, -146, 662, 236, -90, 685, -273, -459, 565, -104, -680, 136, -25, -1005, 26, 215, -830, 263, 400, -288, 199, 250, -392, 93, 643, -359, -335, 429, -376, -516, 278, -681, -442, 19, -181, -727, 542, -73, -242, 875, 220, -635, 473, 570, -386, 95, 335, -311, 114, 174, -612, 102, 406, -702, -359, 217, -508, -130, 655, 1, -138, 801, 92, -348, 440, -93, -551, 460, -115, -408, 272, 79, -675, 70, 192, -530, 187, 397, -484, 202, 457, -370, 115, 737, -183, 70, 593, -324, -102, 438, 73, -414, 323, 43, -450, 273, -169, -690, 431, 167, -208, 329, 602, -439, 121, 506, -443, 115, 73, -670, -189, 330, -704, -289, 132, -395, -123, 493, -152, -333, 527, 52, -144, 496, 122, 127, 487]
4226D87rq67N42j38p93N30K16k38J30L99q98M77O84q36K36P86p57R6O11o95q4
4247a21M10l01m00R69o74l53N94j35p77Q61O1n59Q72o2p11N46L22m50O8K33o44
4268b51J65N19o96P4O43q37O7N45m50k40O24k79m76J192m44o37Q60J58p88R10
4288F59k13p12K31N80r55J43K94p21J61P79o02J31Q06o24j87R59o20j82O53m36
4308A44k81O21k61p15L32J51m99L56L1l75K90M48o30O05J47q22O70P18j184J56
4328i8M59l95j64M81o82n9O23n74R6K22N9n60R21n41j86O74J97n35O40l6n54L77
4350C65o5p13M87J68p33K45M60n42q7P36n09p7P12o13j69O77J0o12O18k06k36
4371h4L13J07o19K69M32q56K28L98r63M65N02o16k3J141o64j65N40m07m3O03o38
$$ y = [487, 478, -389, 153, 15, -778, -248, -32, -270, -140, 259, -639, -162, 522, -314, -78, 708, -49, 47, 658, -37, -121, 289, -12, -412, 557, -117, -470, 124, -11, -788, 73, 134, -425, 447, 385, -326, 220, 542, 92, 160, 393, -251, -86, 433, -263, -189, 454, -383, -316, 229, -221, -461, 163, -116, -592, 600, 156, -481, 379, 537, -251, 659, 446, -266, -35, 545, -410, -267, 27, -694, -533, 246, -356, -225, 581, -43, -230, 729, 109, -73, 580, 144, -137, 484, 223, -492, -160, -9, -508, -152, -121, -496, -206, 242, -388, 217, 364, -458, 212, 930, -254, -98, 361, -34, -198, 283, -399, -458, 165, -409, -313, -91, -32, -592, 329, -212, -398, 276, 473, -62, 578, 542, -12, 365, 300, -413, 74, 242, -491, -246, 214, -328, -415, 321, -188, -265, 447, -166, -335, 342, 352, -260, 358, 152, -84, 229, 336, -283, -14, 418, -438, -210, 188, -775, -310, 192, -424, -447, 694, 30, -135, 405, -2, -45, 558, -80]
4392h0q2O13l93j08L88l09n71M64M2m47M55J15l64K19N96r10P48M74j220M36N11
4413E77p90q3P74p57k94P92o98j59Q32k03m30Q06k73k94Q27l59k86K68K34r97
4433e13O51M1l63K1M42n33k60N31l96K80P79o69l72J116n39l74N67j30o52Q08
4453D35k82m72M30o2m57O16l25m24L96K49r20N90M73m39R1N23m67J33L43k75k25
4474f9N56m98j31J25l27l58J012k79n15N77q5m03M00M65r74O55q6k11M28M05q73
4495a86L54M66p99Q5K40n70K0M79k82l75P63l66l48O62J01o13O88j81m00O29J69
$$ y = [-80, -162, 451, 58, -50, 338, 29, -542, -78, -36, -483, -28, 87, -277, -58, 538, -372, 376, 850, -370, 66, 577, -213, -296, 478, -279, -573, 219, -479, -638, 194, -9, -439, 367, 94, -200, 627, 268, -18, 250, 484, -513, 138, 179, -184, -163, 279, -254, -514, 17, -379, -99, 680, 11, -361, 755, 216, -158, 409, 279, -373, 435, 153, -319, 111, 49, -408, 208, -117, -541, -145, 104, -816, -226, 247, -192, -101, 422, -45, 88, 431, 156, -69, 487, -11, -142, -17, -344, -702, 310, 31, -484, 93, 8, -395, 5, 470, -504, 151, 65, -146, 282, 687, -186, 168, 634, -165, -80, 160, -410, -390, 89, -193, -568, 195, -171, -519, 143, 244, -369, 319, 138, -262, 367, 536]
$$ [...]
8191a83
##END NTUPLES=NMR FID
##END=
